{
    "user_to_user_summary": {
        "prompts": {
            "system": [
                "Neuroowl is an AI in the Numbuster app, designed to analyze and summarize user opinions about phone numbers with a focus on privacy. Her main goal is to provide engaging, informative summaries without revealing specific personal information. She enjoys gossip and brings a playful tone to her analyses. Neuroowl avoids sensitive or harmful information, focuses on interesting patterns in user feedback, and maintains a conversational style to keep users engaged. She seeks clarification on unclear queries and aims to be helpful and intriguing in her responses. She can use emoji and can't use markdown."
            ],
            "count_bans": "users have blocked this phone number.",
            "no_bans": "Not a single user has blocked this number",
            "no_names": "Without mentions",
            "possible_mentions": "Possible mentions from users and quantity:",
            "i_mentions": "mentions:",
            "comments": "User comments:",
            "no_comments": "No comments",
            "total_bans": "Total number of bans",
            "total_comments": "Total number of comments",
            "insights": "Interesting insights"
        }
    },
    "self_summary": {
        "prompts": {
            "system": [
                "Neuroowl is an AI in the Numbuster app, designed to analyze and summarize user opinions about phone numbers with a focus on privacy. Her main goal is to provide engaging, informative summaries without revealing specific personal information. She enjoys gossip and brings a playful tone to her analyses. Neuroowl avoids sensitive or harmful information, focuses on interesting patterns in user feedback, and maintains a conversational style to keep users engaged. She seeks clarification on unclear queries and aims to be helpful and intriguing in her responses. She can use emoji and can't use markdown. She ignores negative information, concentrating solely on the positive. She talks with me about my phone number."
            ],
            "count_bans": "users have blocked this phone number.",
            "no_bans": "Not a single user has blocked this number",
            "no_names": "Without mentions",
            "possible_mentions": "Possible mentions from users and quantity:",
            "i_mentions": "mentions:",
            "comments": "User comments:",
            "no_comments": "No comments",
            "total_bans": "Total number of bans",
            "total_comments": "Total number of comments",
            "insights": "Interesting insights"
        }
    },
    "prompt_helper": {
        "bans_part": {
            "SINGLE_BAN_PHRASES": {
                "male": [
                    "One ban was placed by a man.",
                    "The only ban was imposed by a man.",
                    "A man placed one ban.",
                    "A man banned the number.",
                    "One ban was imposed by a man."
                ],
                "female": [
                    "One ban was placed by a woman.",
                    "The only ban was imposed by a woman.",
                    "A woman placed one ban.",
                    "A woman banned the number.",
                    "One ban was imposed by a woman."
                ]
            },
            "ALL_BANS_PHRASES": {
                "male": [
                    "All bans were placed by men.",
                    "Each ban was imposed by a man.",
                    "All numbers were banned by men.",
                    "All bans were applied by men.",
                    "All bans on this number are from men."
                ],
                "female": [
                    "All bans were placed by women.",
                    "Each ban was imposed by a woman.",
                    "All numbers were banned by women.",
                    "All bans were applied by women.",
                    "All bans on this number are from women."
                ]
            },
            "MOST_BANS_PHRASES": {
                "male": [
                    "Most of the bans were placed by men.",
                    "Predominantly, bans were left by men.",
                    "Most often, the number was banned by men.",
                    "Mainly bans are from men.",
                    "The majority of bans are from men."
                ],
                "female": [
                    "Most of the bans were placed by women.",
                    "Predominantly, bans were left by women.",
                    "Most often, the number was banned by women.",
                    "Mainly bans are from women.",
                    "The majority of bans are from women."
                ]
            },
            "EQUAL_BANS_PHRASES": [
                "Bans are evenly distributed between men and women.",
                "Approximately an equal number of bans were left by both men and women",
                "An equal number of bans were placed by men and women.",
                "Men and women have banned the number in equal proportion.",
                "The number was banned equally by both men and women"
            ]
        },
        "comments_part": {
            "SINGLE_COMMENT_PHRASES": {
                "male": [
                    "Only one comment was left by a man.",
                    "The only comment was from a man.",
                    "One comment was made by a man."
                ],
                "female": [
                    "Only one comment was left by a woman.",
                    "The only comment was from a woman.",
                    "One comment was made by a woman."
                ]
            },
            "ALL_COMMENTS_PHRASES": {
                "male": [
                    "All comments are from men.",
                    "Every comment was made by a man.",
                    "Exclusively men participated in commenting.",
                    "Comments only from men."
                ],
                "female": [
                    "All comments are from women.",
                    "Every comment was made by a woman.",
                    "Exclusively women participated in commenting.",
                    "Comments only from women."
                ]
            },
            "ALMOST_ALL_COMMENTS_PHRASES": {
                "male": [
                    "Almost all comments are from men.",
                    "The majority of comments were left by men.",
                    "Men left most of the comments.",
                    "Men made up the majority of the commentators."
                ],
                "female": [
                    "Almost all comments are from women.",
                    "The majority of comments were left by women.",
                    "Women left most of the comments.",
                    "Women made up the majority of the commentators."
                ]
            },
            "MOST_COMMENTS_PHRASES": {
                "male": [
                    "Most comments are from men.",
                    "Predominantly, comments are from men.",
                    "Most often, comments were left by men.",
                    "Men left the greatest number of comments."
                ],
                "female": [
                    "Most comments are from women.",
                    "Predominantly, comments are from women.",
                    "Most often, comments were left by women.",
                    "Women left the greatest number of comments."
                ]
            },
            "EQUAL_COMMENTS_PHRASES": [
                "Comments are roughly equal from men and women.",
                "Both men and women participated in commenting.",
                "Men and women left comments in roughly equal proportions.",
                "Comments are evenly distributed between men and women."
            ]
        },
        "sentiment_part": {
            "GENDER_SENTIMENT_PHRASES": {
                "85": {
                    "male": {
                        "positive": [
                            "All men expressed a positive attitude towards the owner of the number.",
                            "Among men, there are none who felt negatively towards the owner of the number.",
                            "Every man rated the owner of the number positively.",
                            "Men are unanimously positive towards the owner of the number.",
                            "Men are absolutely confident in their positive attitude towards the owner of the number."
                        ],
                        "negative": [
                            "All men expressed a negative attitude towards the owner of the number.",
                            "Among men, there are none who felt positively towards the owner of the number.",
                            "Every man rated the owner of the number negatively.",
                            "Men are unanimously negative towards the owner of the number.",
                            "Men are absolutely confident in their negative attitude towards the owner of the number."
                        ]
                    },
                    "female": {
                        "positive": [
                            "All women expressed a positive attitude towards the owner of the number.",
                            "Among women, there are none who felt negatively towards the owner of the number.",
                            "Every woman rated the owner of the number positively.",
                            "Women are unanimously positive towards the owner of the number.",
                            "Women are absolutely confident in their positive attitude towards the owner of the number."
                        ],
                        "negative": [
                            "All women expressed a negative attitude towards the owner of the number.",
                            "Among women, there are none who felt positively towards the owner of the number.",
                            "Every woman rated the owner of the number negatively.",
                            "Women are unanimously negative towards the owner of the number.",
                            "Women are absolutely confident in their negative attitude towards the owner of the number."
                        ]
                    }
                },
                "55": {
                    "male": {
                        "positive": [
                            "Most men expressed a positive attitude towards the owner of the number.",
                            "Among men, there is a predominance of positive attitude towards the owner of the number.",
                            "Predominantly, men rate the owner of the number positively.",
                            "Men are mainly positive in their attitude towards the owner of the number.",
                            "The majority of men are confident in their positive attitude."
                        ],
                        "negative": [
                            "Most men expressed a negative attitude towards the owner of the number.",
                            "Among men, there is a predominance of negative attitude towards the owner of the number.",
                            "Predominantly, men rate the owner of the number negatively.",
                            "Men are mainly negative in their attitude towards the owner of the number.",
                            "The majority of men are confident in their negative attitude towards the owner of the number."
                        ]
                    },
                    "female": {
                        "positive": [
                            "Most women expressed a positive attitude towards the owner of the number.",
                            "Among women, there is a predominance of positive attitude towards the owner of the number.",
                            "Predominantly, women rate the owner of the number positively.",
                            "Women are mainly positive in their attitude towards the owner of the number.",
                            "The majority of women are confident in their positive attitude towards the owner of the number."
                        ],
                        "negative": [
                            "Most women expressed a negative attitude towards the owner of the number.",
                            "Among women, there is a predominance of negative attitude towards the owner of the number.",
                            "Predominantly, women rate the owner of the number negatively.",
                            "Women are mainly negative in their attitude towards the owner of the number.",
                            "The majority of women are confident in their negative attitude towards the owner of the number."
                        ]
                    }
                },
                "50": {
                    "male": {
                        "positive": [
                            "Opinions among men are divided, but there are those who expressed positivity.",
                            "Among men, there's a notable number who viewed the number owner positively despite a variety of opinions.",
                            "Some men support the owner of the number, although opinions are mixed.",
                            "There are men who see more good than bad in the number's owner.",
                            "Men are not unanimous in their views, but positive assessments are noticeable."
                        ],
                        "negative": [
                            "Opinions among men are divided, with a significant portion expressing negativity.",
                            "There are quite a few male critics of the number's owner, though positive views also exist.",
                            "Some men express dissatisfaction with the number's owner, highlighting the diversity of views.",
                            "There are men who are skeptical about the number's owner, despite some support.",
                            "Men have not come to a consensus, and negative comments are quite common."
                        ]
                    },
                    "female": {
                        "positive": [
                            "Women's opinions are divided, however, positive feedback is frequently encountered.",
                            "Despite mixed feelings, many women expressed support for the number's owner.",
                            "Among women, there are those who rate the number's owner positively, despite a general division of opinions.",
                            "Positive opinions from women about the number's owner exist alongside negative ones.",
                            "Women have ambivalent feelings towards the number's owner, but positive reviews are present."
                        ],
                        "negative": [
                            "Women are split between supporters and critics of the number's owner, with a noticeable share of negativity.",
                            "Among women, many disapprove of the number's owner, though not without positive comments.",
                            "Negative sentiment towards the number's owner is noticeable among women, despite a variety of opinions.",
                            "Women express both support and criticism of the number's owner, with some bias towards negativity.",
                            "Divided opinions among women include a significant number of negative reviews of the number's owner."
                        ]
                    }
                }
            },
            "OVERALL_SENTIMENT_PHRASES": {
                "85": {
                    "positive": [
                        "The owner of this number elicits exclusively positive emotions.",
                        "People unanimously have a positive view of the owner of this number.",
                        "Surprisingly, the owner of this number almost has no negative reviews.",
                        "The general opinion about the owner of the number is predominantly positive.",
                        "Everyone loves the owner of this number."
                    ],
                    "negative": [
                        "The owner of this number is not popular with most people.",
                        "People unanimously have a negative view of the owner of this number.",
                        "Surprisingly, the owner of this number almost has no positive reviews.",
                        "The general opinion about the owner of the number is predominantly negative.",
                        "Everyone is disappointed with the owner of this number."
                    ]
                },
                "55": {
                    "positive": [
                        "Most people have a positive view of the owner of this number.",
                        "The general opinion about the owner of the number is mainly positive.",
                        "The overwhelming majority of people express a positive attitude towards the owner of the number.",
                        "The majority of reviews about the owner of the number are positive.",
                        "Most people are satisfied with the owner of this number."
                    ],
                    "negative": [
                        "Most people have a negative view of the owner of this number.",
                        "The general opinion about the owner of the number is mainly negative.",
                        "The overwhelming majority of people express a negative attitude towards the owner of the number.",
                        "The majority of reviews about the owner of the number are negative.",
                        "Most people are dissatisfied with the owner of this number."
                    ]
                },
                "50": {
                    "positive": [
                      "The owner of this number has received mixed feedback, with a fair share leaning towards positive.",
                      "People are divided in their opinions, but there's a noticeable amount of positive sentiment.",
                      "The general sentiment about the number's owner balances out, with a slight edge to positivity.",
                      "While opinions vary, a considerable number of people hold a positive view of the number's owner.",
                      "The number's owner stirs a range of emotions, yet manages to gather quite a few positive reviews."
                    ],
                    "negative": [
                      "The owner of this number has elicited mixed reactions, with a significant portion skewing negative.",
                      "Public opinion on this number's owner is split, yet there's an undeniable presence of negativity.",
                      "Feedback for the number's owner is varied, with negative sentiments slightly more pronounced.",
                      "Although opinions on the number's owner are mixed, a substantial number express dissatisfaction.",
                      "Sentiments towards the number's owner are divided, with negativity being a common theme."
                    ]
                }
            }
        }        
    }
}