{
    "type": "array",
    "items": {
        "type": "object",
        "properties": {
            "city": {
                "type": "string",
                "pattern": "^[a-z]+$"
            },
            "latitude": {
                "type": "number"
            },
            "longitude": {
                "type": "number"
            }
        }
    }
}