{
  "data_asset_type": "Dataset",
  "expectation_suite_name": "spain_dairy_etl_output.pandas_s3_generator.products.BasicDatasetProfiler",
  "expectations": [
    {
      "expectation_type": "expect_table_row_count_to_be_between",
      "kwargs": {
        "max_value": null,
        "min_value": 0
      },
      "meta": {
        "BasicDatasetProfiler": {
          "confidence": "very low"
        }
      }
    },
    {
      "expectation_type": "expect_table_columns_to_match_ordered_list",
      "kwargs": {
        "column_list": null
      },
      "meta": {
        "BasicDatasetProfiler": {
          "confidence": "very low"
        }
      }
    },
    {
      "expectation_type": "expect_column_values_to_be_in_type_list",
      "kwargs": {
        "column": "mat_cod",
        "type_list": [
          "BIGINT",
          "BYTEINT",
          "DECIMAL",
          "INT",
          "INTEGER",
          "IntegerType",
          "LongType",
          "SMALLINT",
          "TINYINT",
          "int",
          "int16",
          "int32",
          "int64",
          "int8",
          "int_",
          "integer",
          "uint16",
          "uint32",
          "uint64",
          "uint8"
        ]
      },
      "meta": {
        "BasicDatasetProfiler": {
          "confidence": "very low"
        }
      }
    },
    {
      "expectation_type": "expect_column_unique_value_count_to_be_between",
      "kwargs": {
        "column": "mat_cod",
        "max_value": null,
        "min_value": null
      },
      "meta": {
        "BasicDatasetProfiler": {
          "confidence": "very low"
        }
      }
    },
    {
      "expectation_type": "expect_column_proportion_of_unique_values_to_be_between",
      "kwargs": {
        "column": "mat_cod",
        "max_value": null,
        "min_value": null
      },
      "meta": {
        "BasicDatasetProfiler": {
          "confidence": "very low"
        }
      }
    },
    {
      "expectation_type": "expect_column_values_to_not_be_null",
      "kwargs": {
        "column": "mat_cod",
        "mostly": 0.5
      },
      "meta": {
        "BasicDatasetProfiler": {
          "confidence": "very low"
        }
      }
    },
    {
      "expectation_type": "expect_column_values_to_be_in_set",
      "kwargs": {
        "column": "mat_cod",
        "value_set": []
      },
      "meta": {
        "BasicDatasetProfiler": {
          "confidence": "very low"
        }
      }
    },
    {
      "expectation_type": "expect_column_min_to_be_between",
      "kwargs": {
        "column": "mat_cod",
        "max_value": null,
        "min_value": null
      },
      "meta": {
        "BasicDatasetProfiler": {
          "confidence": "very low"
        }
      }
    },
    {
      "expectation_type": "expect_column_max_to_be_between",
      "kwargs": {
        "column": "mat_cod",
        "max_value": null,
        "min_value": null
      },
      "meta": {
        "BasicDatasetProfiler": {
          "confidence": "very low"
        }
      }
    },
    {
      "expectation_type": "expect_column_mean_to_be_between",
      "kwargs": {
        "column": "mat_cod",
        "max_value": null,
        "min_value": null
      },
      "meta": {
        "BasicDatasetProfiler": {
          "confidence": "very low"
        }
      }
    },
    {
      "expectation_type": "expect_column_median_to_be_between",
      "kwargs": {
        "column": "mat_cod",
        "max_value": null,
        "min_value": null
      },
      "meta": {
        "BasicDatasetProfiler": {
          "confidence": "very low"
        }
      }
    },
    {
      "expectation_type": "expect_column_stdev_to_be_between",
      "kwargs": {
        "column": "mat_cod",
        "max_value": null,
        "min_value": null
      },
      "meta": {
        "BasicDatasetProfiler": {
          "confidence": "very low"
        }
      }
    },
    {
      "expectation_type": "expect_column_quantile_values_to_be_between",
      "kwargs": {
        "column": "mat_cod",
        "quantile_ranges": {
          "quantiles": [
            0.05,
            0.25,
            0.5,
            0.75,
            0.95
          ],
          "value_ranges": [
            [
              null,
              null
            ],
            [
              null,
              null
            ],
            [
              null,
              null
            ],
            [
              null,
              null
            ],
            [
              null,
              null
            ]
          ]
        }
      },
      "meta": {
        "BasicDatasetProfiler": {
          "confidence": "very low"
        }
      }
    },
    {
      "expectation_type": "expect_column_kl_divergence_to_be_less_than",
      "kwargs": {
        "column": "mat_cod",
        "partition_object": null,
        "threshold": null
      },
      "meta": {
        "BasicDatasetProfiler": {
          "confidence": "very low"
        }
      }
    },
    {
      "expectation_type": "expect_column_values_to_be_in_type_list",
      "kwargs": {
        "column": "mat_length_value",
        "type_list": [
          "DOUBLE",
          "DOUBLE_PRECISION",
          "DoubleType",
          "FLOAT",
          "FLOAT4",
          "FLOAT8",
          "FloatType",
          "NUMERIC",
          "float16",
          "float32",
          "float64",
          "float_",
          "number"
        ]
      },
      "meta": {
        "BasicDatasetProfiler": {
          "confidence": "very low"
        }
      }
    },
    {
      "expectation_type": "expect_column_unique_value_count_to_be_between",
      "kwargs": {
        "column": "mat_length_value",
        "max_value": null,
        "min_value": null
      },
      "meta": {
        "BasicDatasetProfiler": {
          "confidence": "very low"
        }
      }
    },
    {
      "expectation_type": "expect_column_proportion_of_unique_values_to_be_between",
      "kwargs": {
        "column": "mat_length_value",
        "max_value": null,
        "min_value": null
      },
      "meta": {
        "BasicDatasetProfiler": {
          "confidence": "very low"
        }
      }
    },
    {
      "expectation_type": "expect_column_values_to_not_be_null",
      "kwargs": {
        "column": "mat_length_value",
        "mostly": 0.5
      },
      "meta": {
        "BasicDatasetProfiler": {
          "confidence": "very low"
        }
      }
    },
    {
      "expectation_type": "expect_column_values_to_be_in_set",
      "kwargs": {
        "column": "mat_length_value",
        "value_set": []
      },
      "meta": {
        "BasicDatasetProfiler": {
          "confidence": "very low"
        }
      }
    },
    {
      "expectation_type": "expect_column_min_to_be_between",
      "kwargs": {
        "column": "mat_length_value",
        "max_value": null,
        "min_value": null
      },
      "meta": {
        "BasicDatasetProfiler": {
          "confidence": "very low"
        }
      }
    },
    {
      "expectation_type": "expect_column_max_to_be_between",
      "kwargs": {
        "column": "mat_length_value",
        "max_value": null,
        "min_value": null
      },
      "meta": {
        "BasicDatasetProfiler": {
          "confidence": "very low"
        }
      }
    },
    {
      "expectation_type": "expect_column_mean_to_be_between",
      "kwargs": {
        "column": "mat_length_value",
        "max_value": null,
        "min_value": null
      },
      "meta": {
        "BasicDatasetProfiler": {
          "confidence": "very low"
        }
      }
    },
    {
      "expectation_type": "expect_column_median_to_be_between",
      "kwargs": {
        "column": "mat_length_value",
        "max_value": null,
        "min_value": null
      },
      "meta": {
        "BasicDatasetProfiler": {
          "confidence": "very low"
        }
      }
    },
    {
      "expectation_type": "expect_column_quantile_values_to_be_between",
      "kwargs": {
        "column": "mat_length_value",
        "quantile_ranges": {
          "quantiles": [
            0.05,
            0.25,
            0.5,
            0.75,
            0.95
          ],
          "value_ranges": [
            [
              null,
              null
            ],
            [
              null,
              null
            ],
            [
              null,
              null
            ],
            [
              null,
              null
            ],
            [
              null,
              null
            ]
          ]
        }
      },
      "meta": {
        "BasicDatasetProfiler": {
          "confidence": "very low"
        }
      }
    },
    {
      "expectation_type": "expect_column_kl_divergence_to_be_less_than",
      "kwargs": {
        "column": "mat_length_value",
        "partition_object": null,
        "threshold": null
      },
      "meta": {
        "BasicDatasetProfiler": {
          "confidence": "very low"
        }
      }
    },
    {
      "expectation_type": "expect_column_values_to_be_in_type_list",
      "kwargs": {
        "column": "mat_width_value",
        "type_list": [
          "DOUBLE",
          "DOUBLE_PRECISION",
          "DoubleType",
          "FLOAT",
          "FLOAT4",
          "FLOAT8",
          "FloatType",
          "NUMERIC",
          "float16",
          "float32",
          "float64",
          "float_",
          "number"
        ]
      },
      "meta": {
        "BasicDatasetProfiler": {
          "confidence": "very low"
        }
      }
    },
    {
      "expectation_type": "expect_column_unique_value_count_to_be_between",
      "kwargs": {
        "column": "mat_width_value",
        "max_value": null,
        "min_value": null
      },
      "meta": {
        "BasicDatasetProfiler": {
          "confidence": "very low"
        }
      }
    },
    {
      "expectation_type": "expect_column_proportion_of_unique_values_to_be_between",
      "kwargs": {
        "column": "mat_width_value",
        "max_value": null,
        "min_value": null
      },
      "meta": {
        "BasicDatasetProfiler": {
          "confidence": "very low"
        }
      }
    },
    {
      "expectation_type": "expect_column_values_to_not_be_null",
      "kwargs": {
        "column": "mat_width_value",
        "mostly": 0.5
      },
      "meta": {
        "BasicDatasetProfiler": {
          "confidence": "very low"
        }
      }
    },
    {
      "expectation_type": "expect_column_values_to_be_in_set",
      "kwargs": {
        "column": "mat_width_value",
        "value_set": []
      },
      "meta": {
        "BasicDatasetProfiler": {
          "confidence": "very low"
        }
      }
    },
    {
      "expectation_type": "expect_column_min_to_be_between",
      "kwargs": {
        "column": "mat_width_value",
        "max_value": null,
        "min_value": null
      },
      "meta": {
        "BasicDatasetProfiler": {
          "confidence": "very low"
        }
      }
    },
    {
      "expectation_type": "expect_column_max_to_be_between",
      "kwargs": {
        "column": "mat_width_value",
        "max_value": null,
        "min_value": null
      },
      "meta": {
        "BasicDatasetProfiler": {
          "confidence": "very low"
        }
      }
    },
    {
      "expectation_type": "expect_column_mean_to_be_between",
      "kwargs": {
        "column": "mat_width_value",
        "max_value": null,
        "min_value": null
      },
      "meta": {
        "BasicDatasetProfiler": {
          "confidence": "very low"
        }
      }
    },
    {
      "expectation_type": "expect_column_median_to_be_between",
      "kwargs": {
        "column": "mat_width_value",
        "max_value": null,
        "min_value": null
      },
      "meta": {
        "BasicDatasetProfiler": {
          "confidence": "very low"
        }
      }
    },
    {
      "expectation_type": "expect_column_quantile_values_to_be_between",
      "kwargs": {
        "column": "mat_width_value",
        "quantile_ranges": {
          "quantiles": [
            0.05,
            0.25,
            0.5,
            0.75,
            0.95
          ],
          "value_ranges": [
            [
              null,
              null
            ],
            [
              null,
              null
            ],
            [
              null,
              null
            ],
            [
              null,
              null
            ],
            [
              null,
              null
            ]
          ]
        }
      },
      "meta": {
        "BasicDatasetProfiler": {
          "confidence": "very low"
        }
      }
    },
    {
      "expectation_type": "expect_column_kl_divergence_to_be_less_than",
      "kwargs": {
        "column": "mat_width_value",
        "partition_object": null,
        "threshold": null
      },
      "meta": {
        "BasicDatasetProfiler": {
          "confidence": "very low"
        }
      }
    },
    {
      "expectation_type": "expect_column_values_to_be_in_type_list",
      "kwargs": {
        "column": "mat_height_value",
        "type_list": [
          "DOUBLE",
          "DOUBLE_PRECISION",
          "DoubleType",
          "FLOAT",
          "FLOAT4",
          "FLOAT8",
          "FloatType",
          "NUMERIC",
          "float16",
          "float32",
          "float64",
          "float_",
          "number"
        ]
      },
      "meta": {
        "BasicDatasetProfiler": {
          "confidence": "very low"
        }
      }
    },
    {
      "expectation_type": "expect_column_unique_value_count_to_be_between",
      "kwargs": {
        "column": "mat_height_value",
        "max_value": null,
        "min_value": null
      },
      "meta": {
        "BasicDatasetProfiler": {
          "confidence": "very low"
        }
      }
    },
    {
      "expectation_type": "expect_column_proportion_of_unique_values_to_be_between",
      "kwargs": {
        "column": "mat_height_value",
        "max_value": null,
        "min_value": null
      },
      "meta": {
        "BasicDatasetProfiler": {
          "confidence": "very low"
        }
      }
    },
    {
      "expectation_type": "expect_column_values_to_not_be_null",
      "kwargs": {
        "column": "mat_height_value",
        "mostly": 0.5
      },
      "meta": {
        "BasicDatasetProfiler": {
          "confidence": "very low"
        }
      }
    },
    {
      "expectation_type": "expect_column_values_to_be_in_set",
      "kwargs": {
        "column": "mat_height_value",
        "value_set": []
      },
      "meta": {
        "BasicDatasetProfiler": {
          "confidence": "very low"
        }
      }
    },
    {
      "expectation_type": "expect_column_min_to_be_between",
      "kwargs": {
        "column": "mat_height_value",
        "max_value": null,
        "min_value": null
      },
      "meta": {
        "BasicDatasetProfiler": {
          "confidence": "very low"
        }
      }
    },
    {
      "expectation_type": "expect_column_max_to_be_between",
      "kwargs": {
        "column": "mat_height_value",
        "max_value": null,
        "min_value": null
      },
      "meta": {
        "BasicDatasetProfiler": {
          "confidence": "very low"
        }
      }
    },
    {
      "expectation_type": "expect_column_mean_to_be_between",
      "kwargs": {
        "column": "mat_height_value",
        "max_value": null,
        "min_value": null
      },
      "meta": {
        "BasicDatasetProfiler": {
          "confidence": "very low"
        }
      }
    },
    {
      "expectation_type": "expect_column_median_to_be_between",
      "kwargs": {
        "column": "mat_height_value",
        "max_value": null,
        "min_value": null
      },
      "meta": {
        "BasicDatasetProfiler": {
          "confidence": "very low"
        }
      }
    },
    {
      "expectation_type": "expect_column_quantile_values_to_be_between",
      "kwargs": {
        "column": "mat_height_value",
        "quantile_ranges": {
          "quantiles": [
            0.05,
            0.25,
            0.5,
            0.75,
            0.95
          ],
          "value_ranges": [
            [
              null,
              null
            ],
            [
              null,
              null
            ],
            [
              null,
              null
            ],
            [
              null,
              null
            ],
            [
              null,
              null
            ]
          ]
        }
      },
      "meta": {
        "BasicDatasetProfiler": {
          "confidence": "very low"
        }
      }
    },
    {
      "expectation_type": "expect_column_kl_divergence_to_be_less_than",
      "kwargs": {
        "column": "mat_height_value",
        "partition_object": null,
        "threshold": null
      },
      "meta": {
        "BasicDatasetProfiler": {
          "confidence": "very low"
        }
      }
    },
    {
      "expectation_type": "expect_column_values_to_be_in_type_list",
      "kwargs": {
        "column": "total_shelf_life",
        "type_list": [
          "BIGINT",
          "BYTEINT",
          "DECIMAL",
          "INT",
          "INTEGER",
          "IntegerType",
          "LongType",
          "SMALLINT",
          "TINYINT",
          "int",
          "int16",
          "int32",
          "int64",
          "int8",
          "int_",
          "integer",
          "uint16",
          "uint32",
          "uint64",
          "uint8"
        ]
      },
      "meta": {
        "BasicDatasetProfiler": {
          "confidence": "very low"
        }
      }
    },
    {
      "expectation_type": "expect_column_unique_value_count_to_be_between",
      "kwargs": {
        "column": "total_shelf_life",
        "max_value": null,
        "min_value": null
      },
      "meta": {
        "BasicDatasetProfiler": {
          "confidence": "very low"
        }
      }
    },
    {
      "expectation_type": "expect_column_proportion_of_unique_values_to_be_between",
      "kwargs": {
        "column": "total_shelf_life",
        "max_value": null,
        "min_value": null
      },
      "meta": {
        "BasicDatasetProfiler": {
          "confidence": "very low"
        }
      }
    },
    {
      "expectation_type": "expect_column_values_to_not_be_null",
      "kwargs": {
        "column": "total_shelf_life",
        "mostly": 0.5
      },
      "meta": {
        "BasicDatasetProfiler": {
          "confidence": "very low"
        }
      }
    },
    {
      "expectation_type": "expect_column_values_to_be_in_set",
      "kwargs": {
        "column": "total_shelf_life",
        "value_set": []
      },
      "meta": {
        "BasicDatasetProfiler": {
          "confidence": "very low"
        }
      }
    },
    {
      "expectation_type": "expect_column_distinct_values_to_be_in_set",
      "kwargs": {
        "column": "total_shelf_life",
        "value_set": null
      },
      "meta": {
        "BasicDatasetProfiler": {
          "confidence": "very low"
        }
      }
    },
    {
      "expectation_type": "expect_column_values_to_be_in_type_list",
      "kwargs": {
        "column": "mat_weight",
        "type_list": [
          "DOUBLE",
          "DOUBLE_PRECISION",
          "DoubleType",
          "FLOAT",
          "FLOAT4",
          "FLOAT8",
          "FloatType",
          "NUMERIC",
          "float16",
          "float32",
          "float64",
          "float_",
          "number"
        ]
      },
      "meta": {
        "BasicDatasetProfiler": {
          "confidence": "very low"
        }
      }
    },
    {
      "expectation_type": "expect_column_unique_value_count_to_be_between",
      "kwargs": {
        "column": "mat_weight",
        "max_value": null,
        "min_value": null
      },
      "meta": {
        "BasicDatasetProfiler": {
          "confidence": "very low"
        }
      }
    },
    {
      "expectation_type": "expect_column_proportion_of_unique_values_to_be_between",
      "kwargs": {
        "column": "mat_weight",
        "max_value": null,
        "min_value": null
      },
      "meta": {
        "BasicDatasetProfiler": {
          "confidence": "very low"
        }
      }
    },
    {
      "expectation_type": "expect_column_values_to_not_be_null",
      "kwargs": {
        "column": "mat_weight",
        "mostly": 0.5
      },
      "meta": {
        "BasicDatasetProfiler": {
          "confidence": "very low"
        }
      }
    },
    {
      "expectation_type": "expect_column_values_to_be_in_set",
      "kwargs": {
        "column": "mat_weight",
        "value_set": []
      },
      "meta": {
        "BasicDatasetProfiler": {
          "confidence": "very low"
        }
      }
    },
    {
      "expectation_type": "expect_column_min_to_be_between",
      "kwargs": {
        "column": "mat_weight",
        "max_value": null,
        "min_value": null
      },
      "meta": {
        "BasicDatasetProfiler": {
          "confidence": "very low"
        }
      }
    },
    {
      "expectation_type": "expect_column_max_to_be_between",
      "kwargs": {
        "column": "mat_weight",
        "max_value": null,
        "min_value": null
      },
      "meta": {
        "BasicDatasetProfiler": {
          "confidence": "very low"
        }
      }
    },
    {
      "expectation_type": "expect_column_mean_to_be_between",
      "kwargs": {
        "column": "mat_weight",
        "max_value": null,
        "min_value": null
      },
      "meta": {
        "BasicDatasetProfiler": {
          "confidence": "very low"
        }
      }
    },
    {
      "expectation_type": "expect_column_median_to_be_between",
      "kwargs": {
        "column": "mat_weight",
        "max_value": null,
        "min_value": null
      },
      "meta": {
        "BasicDatasetProfiler": {
          "confidence": "very low"
        }
      }
    },
    {
      "expectation_type": "expect_column_quantile_values_to_be_between",
      "kwargs": {
        "column": "mat_weight",
        "quantile_ranges": {
          "quantiles": [
            0.05,
            0.25,
            0.5,
            0.75,
            0.95
          ],
          "value_ranges": [
            [
              null,
              null
            ],
            [
              null,
              null
            ],
            [
              null,
              null
            ],
            [
              null,
              null
            ],
            [
              null,
              null
            ]
          ]
        }
      },
      "meta": {
        "BasicDatasetProfiler": {
          "confidence": "very low"
        }
      }
    },
    {
      "expectation_type": "expect_column_kl_divergence_to_be_less_than",
      "kwargs": {
        "column": "mat_weight",
        "partition_object": null,
        "threshold": null
      },
      "meta": {
        "BasicDatasetProfiler": {
          "confidence": "very low"
        }
      }
    },
    {
      "expectation_type": "expect_column_values_to_be_in_type_list",
      "kwargs": {
        "column": "mat_units",
        "type_list": [
          "BIGINT",
          "BYTEINT",
          "DECIMAL",
          "INT",
          "INTEGER",
          "IntegerType",
          "LongType",
          "SMALLINT",
          "TINYINT",
          "int",
          "int16",
          "int32",
          "int64",
          "int8",
          "int_",
          "integer",
          "uint16",
          "uint32",
          "uint64",
          "uint8"
        ]
      },
      "meta": {
        "BasicDatasetProfiler": {
          "confidence": "very low"
        }
      }
    },
    {
      "expectation_type": "expect_column_unique_value_count_to_be_between",
      "kwargs": {
        "column": "mat_units",
        "max_value": null,
        "min_value": null
      },
      "meta": {
        "BasicDatasetProfiler": {
          "confidence": "very low"
        }
      }
    },
    {
      "expectation_type": "expect_column_proportion_of_unique_values_to_be_between",
      "kwargs": {
        "column": "mat_units",
        "max_value": null,
        "min_value": null
      },
      "meta": {
        "BasicDatasetProfiler": {
          "confidence": "very low"
        }
      }
    },
    {
      "expectation_type": "expect_column_values_to_not_be_null",
      "kwargs": {
        "column": "mat_units",
        "mostly": 0.5
      },
      "meta": {
        "BasicDatasetProfiler": {
          "confidence": "very low"
        }
      }
    },
    {
      "expectation_type": "expect_column_values_to_be_in_set",
      "kwargs": {
        "column": "mat_units",
        "value_set": []
      },
      "meta": {
        "BasicDatasetProfiler": {
          "confidence": "very low"
        }
      }
    },
    {
      "expectation_type": "expect_column_distinct_values_to_be_in_set",
      "kwargs": {
        "column": "mat_units",
        "value_set": null
      },
      "meta": {
        "BasicDatasetProfiler": {
          "confidence": "very low"
        }
      }
    },
    {
      "expectation_type": "expect_column_values_to_be_in_type_list",
      "kwargs": {
        "column": "mat_umbrella_cod",
        "type_list": [
          "CHAR",
          "NVARCHAR",
          "STRING",
          "StringType",
          "TEXT",
          "VARCHAR",
          "str",
          "string"
        ]
      },
      "meta": {
        "BasicDatasetProfiler": {
          "confidence": "very low"
        }
      }
    },
    {
      "expectation_type": "expect_column_unique_value_count_to_be_between",
      "kwargs": {
        "column": "mat_umbrella_cod",
        "max_value": null,
        "min_value": null
      },
      "meta": {
        "BasicDatasetProfiler": {
          "confidence": "very low"
        }
      }
    },
    {
      "expectation_type": "expect_column_proportion_of_unique_values_to_be_between",
      "kwargs": {
        "column": "mat_umbrella_cod",
        "max_value": null,
        "min_value": null
      },
      "meta": {
        "BasicDatasetProfiler": {
          "confidence": "very low"
        }
      }
    },
    {
      "expectation_type": "expect_column_values_to_not_be_null",
      "kwargs": {
        "column": "mat_umbrella_cod",
        "mostly": 0.5
      },
      "meta": {
        "BasicDatasetProfiler": {
          "confidence": "very low"
        }
      }
    },
    {
      "expectation_type": "expect_column_values_to_be_in_set",
      "kwargs": {
        "column": "mat_umbrella_cod",
        "value_set": []
      },
      "meta": {
        "BasicDatasetProfiler": {
          "confidence": "very low"
        }
      }
    },
    {
      "expectation_type": "expect_column_values_to_not_match_regex",
      "kwargs": {
        "column": "mat_umbrella_cod",
        "regex": "^\\s+|\\s+$"
      },
      "meta": {
        "BasicDatasetProfiler": {
          "confidence": "very low"
        }
      }
    },
    {
      "expectation_type": "expect_column_distinct_values_to_be_in_set",
      "kwargs": {
        "column": "mat_umbrella_cod",
        "value_set": null
      },
      "meta": {
        "BasicDatasetProfiler": {
          "confidence": "very low"
        }
      }
    },
    {
      "expectation_type": "expect_column_values_to_be_in_type_list",
      "kwargs": {
        "column": "mat_prodbrand_cod",
        "type_list": [
          "CHAR",
          "NVARCHAR",
          "STRING",
          "StringType",
          "TEXT",
          "VARCHAR",
          "str",
          "string"
        ]
      },
      "meta": {
        "BasicDatasetProfiler": {
          "confidence": "very low"
        }
      }
    },
    {
      "expectation_type": "expect_column_unique_value_count_to_be_between",
      "kwargs": {
        "column": "mat_prodbrand_cod",
        "max_value": null,
        "min_value": null
      },
      "meta": {
        "BasicDatasetProfiler": {
          "confidence": "very low"
        }
      }
    },
    {
      "expectation_type": "expect_column_proportion_of_unique_values_to_be_between",
      "kwargs": {
        "column": "mat_prodbrand_cod",
        "max_value": null,
        "min_value": null
      },
      "meta": {
        "BasicDatasetProfiler": {
          "confidence": "very low"
        }
      }
    },
    {
      "expectation_type": "expect_column_values_to_not_be_null",
      "kwargs": {
        "column": "mat_prodbrand_cod",
        "mostly": 0.5
      },
      "meta": {
        "BasicDatasetProfiler": {
          "confidence": "very low"
        }
      }
    },
    {
      "expectation_type": "expect_column_values_to_be_in_set",
      "kwargs": {
        "column": "mat_prodbrand_cod",
        "value_set": []
      },
      "meta": {
        "BasicDatasetProfiler": {
          "confidence": "very low"
        }
      }
    },
    {
      "expectation_type": "expect_column_values_to_not_match_regex",
      "kwargs": {
        "column": "mat_prodbrand_cod",
        "regex": "^\\s+|\\s+$"
      },
      "meta": {
        "BasicDatasetProfiler": {
          "confidence": "very low"
        }
      }
    },
    {
      "expectation_type": "expect_column_values_to_be_in_type_list",
      "kwargs": {
        "column": "mat_subfamily_cod",
        "type_list": [
          "CHAR",
          "NVARCHAR",
          "STRING",
          "StringType",
          "TEXT",
          "VARCHAR",
          "str",
          "string"
        ]
      },
      "meta": {
        "BasicDatasetProfiler": {
          "confidence": "very low"
        }
      }
    },
    {
      "expectation_type": "expect_column_unique_value_count_to_be_between",
      "kwargs": {
        "column": "mat_subfamily_cod",
        "max_value": null,
        "min_value": null
      },
      "meta": {
        "BasicDatasetProfiler": {
          "confidence": "very low"
        }
      }
    },
    {
      "expectation_type": "expect_column_proportion_of_unique_values_to_be_between",
      "kwargs": {
        "column": "mat_subfamily_cod",
        "max_value": null,
        "min_value": null
      },
      "meta": {
        "BasicDatasetProfiler": {
          "confidence": "very low"
        }
      }
    },
    {
      "expectation_type": "expect_column_values_to_not_be_null",
      "kwargs": {
        "column": "mat_subfamily_cod",
        "mostly": 0.5
      },
      "meta": {
        "BasicDatasetProfiler": {
          "confidence": "very low"
        }
      }
    },
    {
      "expectation_type": "expect_column_values_to_be_in_set",
      "kwargs": {
        "column": "mat_subfamily_cod",
        "value_set": []
      },
      "meta": {
        "BasicDatasetProfiler": {
          "confidence": "very low"
        }
      }
    },
    {
      "expectation_type": "expect_column_values_to_not_match_regex",
      "kwargs": {
        "column": "mat_subfamily_cod",
        "regex": "^\\s+|\\s+$"
      },
      "meta": {
        "BasicDatasetProfiler": {
          "confidence": "very low"
        }
      }
    },
    {
      "expectation_type": "expect_column_values_to_be_in_type_list",
      "kwargs": {
        "column": "product_type_cod",
        "type_list": [
          "CHAR",
          "NVARCHAR",
          "STRING",
          "StringType",
          "TEXT",
          "VARCHAR",
          "str",
          "string"
        ]
      },
      "meta": {
        "BasicDatasetProfiler": {
          "confidence": "very low"
        }
      }
    },
    {
      "expectation_type": "expect_column_unique_value_count_to_be_between",
      "kwargs": {
        "column": "product_type_cod",
        "max_value": null,
        "min_value": null
      },
      "meta": {
        "BasicDatasetProfiler": {
          "confidence": "very low"
        }
      }
    },
    {
      "expectation_type": "expect_column_proportion_of_unique_values_to_be_between",
      "kwargs": {
        "column": "product_type_cod",
        "max_value": null,
        "min_value": null
      },
      "meta": {
        "BasicDatasetProfiler": {
          "confidence": "very low"
        }
      }
    },
    {
      "expectation_type": "expect_column_values_to_not_be_null",
      "kwargs": {
        "column": "product_type_cod",
        "mostly": 0.5
      },
      "meta": {
        "BasicDatasetProfiler": {
          "confidence": "very low"
        }
      }
    },
    {
      "expectation_type": "expect_column_values_to_be_in_set",
      "kwargs": {
        "column": "product_type_cod",
        "value_set": []
      },
      "meta": {
        "BasicDatasetProfiler": {
          "confidence": "very low"
        }
      }
    },
    {
      "expectation_type": "expect_column_values_to_not_match_regex",
      "kwargs": {
        "column": "product_type_cod",
        "regex": "^\\s+|\\s+$"
      },
      "meta": {
        "BasicDatasetProfiler": {
          "confidence": "very low"
        }
      }
    },
    {
      "expectation_type": "expect_column_distinct_values_to_be_in_set",
      "kwargs": {
        "column": "product_type_cod",
        "value_set": null
      },
      "meta": {
        "BasicDatasetProfiler": {
          "confidence": "very low"
        }
      }
    },
    {
      "expectation_type": "expect_column_values_to_be_in_type_list",
      "kwargs": {
        "column": "flavour_cod",
        "type_list": [
          "CHAR",
          "NVARCHAR",
          "STRING",
          "StringType",
          "TEXT",
          "VARCHAR",
          "str",
          "string"
        ]
      },
      "meta": {
        "BasicDatasetProfiler": {
          "confidence": "very low"
        }
      }
    },
    {
      "expectation_type": "expect_column_unique_value_count_to_be_between",
      "kwargs": {
        "column": "flavour_cod",
        "max_value": null,
        "min_value": null
      },
      "meta": {
        "BasicDatasetProfiler": {
          "confidence": "very low"
        }
      }
    },
    {
      "expectation_type": "expect_column_proportion_of_unique_values_to_be_between",
      "kwargs": {
        "column": "flavour_cod",
        "max_value": null,
        "min_value": null
      },
      "meta": {
        "BasicDatasetProfiler": {
          "confidence": "very low"
        }
      }
    },
    {
      "expectation_type": "expect_column_values_to_not_be_null",
      "kwargs": {
        "column": "flavour_cod",
        "mostly": 0.5
      },
      "meta": {
        "BasicDatasetProfiler": {
          "confidence": "very low"
        }
      }
    },
    {
      "expectation_type": "expect_column_values_to_be_in_set",
      "kwargs": {
        "column": "flavour_cod",
        "value_set": []
      },
      "meta": {
        "BasicDatasetProfiler": {
          "confidence": "very low"
        }
      }
    },
    {
      "expectation_type": "expect_column_values_to_not_match_regex",
      "kwargs": {
        "column": "flavour_cod",
        "regex": "^\\s+|\\s+$"
      },
      "meta": {
        "BasicDatasetProfiler": {
          "confidence": "very low"
        }
      }
    },
    {
      "expectation_type": "expect_column_values_to_be_in_type_list",
      "kwargs": {
        "column": "mat_active_flag",
        "type_list": [
          "CHAR",
          "NVARCHAR",
          "STRING",
          "StringType",
          "TEXT",
          "VARCHAR",
          "str",
          "string"
        ]
      },
      "meta": {
        "BasicDatasetProfiler": {
          "confidence": "very low"
        }
      }
    },
    {
      "expectation_type": "expect_column_unique_value_count_to_be_between",
      "kwargs": {
        "column": "mat_active_flag",
        "max_value": null,
        "min_value": null
      },
      "meta": {
        "BasicDatasetProfiler": {
          "confidence": "very low"
        }
      }
    },
    {
      "expectation_type": "expect_column_proportion_of_unique_values_to_be_between",
      "kwargs": {
        "column": "mat_active_flag",
        "max_value": null,
        "min_value": null
      },
      "meta": {
        "BasicDatasetProfiler": {
          "confidence": "very low"
        }
      }
    },
    {
      "expectation_type": "expect_column_values_to_not_be_null",
      "kwargs": {
        "column": "mat_active_flag",
        "mostly": 0.5
      },
      "meta": {
        "BasicDatasetProfiler": {
          "confidence": "very low"
        }
      }
    },
    {
      "expectation_type": "expect_column_values_to_be_in_set",
      "kwargs": {
        "column": "mat_active_flag",
        "value_set": []
      },
      "meta": {
        "BasicDatasetProfiler": {
          "confidence": "very low"
        }
      }
    },
    {
      "expectation_type": "expect_column_values_to_not_match_regex",
      "kwargs": {
        "column": "mat_active_flag",
        "regex": "^\\s+|\\s+$"
      },
      "meta": {
        "BasicDatasetProfiler": {
          "confidence": "very low"
        }
      }
    },
    {
      "expectation_type": "expect_column_distinct_values_to_be_in_set",
      "kwargs": {
        "column": "mat_active_flag",
        "value_set": null
      },
      "meta": {
        "BasicDatasetProfiler": {
          "confidence": "very low"
        }
      }
    },
    {
      "expectation_type": "expect_column_values_to_be_in_type_list",
      "kwargs": {
        "column": "active",
        "type_list": [
          "CHAR",
          "NVARCHAR",
          "STRING",
          "StringType",
          "TEXT",
          "VARCHAR",
          "str",
          "string"
        ]
      },
      "meta": {
        "BasicDatasetProfiler": {
          "confidence": "very low"
        }
      }
    },
    {
      "expectation_type": "expect_column_unique_value_count_to_be_between",
      "kwargs": {
        "column": "active",
        "max_value": null,
        "min_value": null
      },
      "meta": {
        "BasicDatasetProfiler": {
          "confidence": "very low"
        }
      }
    },
    {
      "expectation_type": "expect_column_proportion_of_unique_values_to_be_between",
      "kwargs": {
        "column": "active",
        "max_value": null,
        "min_value": null
      },
      "meta": {
        "BasicDatasetProfiler": {
          "confidence": "very low"
        }
      }
    },
    {
      "expectation_type": "expect_column_values_to_not_be_null",
      "kwargs": {
        "column": "active",
        "mostly": 0.5
      },
      "meta": {
        "BasicDatasetProfiler": {
          "confidence": "very low"
        }
      }
    },
    {
      "expectation_type": "expect_column_values_to_be_in_set",
      "kwargs": {
        "column": "active",
        "value_set": []
      },
      "meta": {
        "BasicDatasetProfiler": {
          "confidence": "very low"
        }
      }
    },
    {
      "expectation_type": "expect_column_values_to_not_match_regex",
      "kwargs": {
        "column": "active",
        "regex": "^\\s+|\\s+$"
      },
      "meta": {
        "BasicDatasetProfiler": {
          "confidence": "very low"
        }
      }
    },
    {
      "expectation_type": "expect_column_distinct_values_to_be_in_set",
      "kwargs": {
        "column": "active",
        "value_set": null
      },
      "meta": {
        "BasicDatasetProfiler": {
          "confidence": "very low"
        }
      }
    }
  ],
  "meta": {
    "BasicDatasetProfiler": {
      "batch_kwargs": {
        "data_asset_name": "products",
        "datasource": "spain_dairy_etl_output",
        "reader_method": "read_parquet",
        "reader_options": {},
        "s3": "s3a://danone-artefact-2/prod/reports/data/spain/dairy/products/fa1b2246-9303-4b24-aee5-c987c929a926.parquet.gzip"
      },
      "created_at": 1605617634.0608797,
      "created_by": "BasicDatasetProfiler"
    },
    "citations": [
      {
        "batch_kwargs": {
          "data_asset_name": "products",
          "datasource": "spain_dairy_etl_output",
          "reader_method": "read_parquet",
          "reader_options": {},
          "s3": "s3a://danone-artefact-2/prod/reports/data/spain/dairy/products/fa1b2246-9303-4b24-aee5-c987c929a926.parquet.gzip"
        },
        "batch_markers": {
          "ge_load_time": "20201117T125353.765757Z",
          "pandas_data_fingerprint": "07905f9c2edb69ae8ef7e34fb8a8693f"
        },
        "batch_parameters": null,
        "citation_date": "20201117T125354.238166Z",
        "comment": "BasicDatasetProfiler added a citation based on the current batch."
      }
    ],
    "columns": {
      "active": {
        "description": ""
      },
      "flavour_cod": {
        "description": ""
      },
      "mat_active_flag": {
        "description": ""
      },
      "mat_cod": {
        "description": ""
      },
      "mat_height_value": {
        "description": ""
      },
      "mat_length_value": {
        "description": ""
      },
      "mat_prodbrand_cod": {
        "description": ""
      },
      "mat_subfamily_cod": {
        "description": ""
      },
      "mat_umbrella_cod": {
        "description": ""
      },
      "mat_units": {
        "description": ""
      },
      "mat_weight": {
        "description": ""
      },
      "mat_width_value": {
        "description": ""
      },
      "product_type_cod": {
        "description": ""
      },
      "total_shelf_life": {
        "description": ""
      }
    },
    "great_expectations_version": "0.12.8",
    "notes": {
      "content": [
        "_To add additional notes, edit the <code>meta.notes.content</code> field in the appropriate Expectation json file._"
      ],
      "format": "markdown"
    }
  }
}