{
    "scheduler": "spark",
    "method": "non-propagative",
    "models": [
        {
            "name": "week_0",
            "type": "CatBoost",
            "parameters": {
                "n_estimators": 200,
                "objective": "Tweedie:variance_power=1.7",
                "learning_rate": 0.05,
                "max_depth": 5,
                "allow_writing_files": false
            },
            "prediction_steps": [
                0
            ],
            "specific_features": [
                "total_uplifts",
                "total_uplifts_minus_1",
                "total_uplifts_minus_2",
                "delivered_volumes_minus_8",
                "future_delivered_volumes_until_previous_day_of_current_week",
                "rolling_mean_delivered_volumes_minus_1_to_6",
                "rolling_mean_delivered_volumes_minus_45_to_53",
                "precipintensity_minus_1",
                "apparenttemperaturemax_minus_1",
                "promo_mean_horizon_0",
                "promo_mean_horizon_0_minus_1",
                "promo_mean_horizon_0_minus_2"
            ],
            "id": "",
            "uncertainty_upper_id": "",
            "uncertainty_lower_id": ""
        },
        {
            "name": "week_1",
            "type": "CatBoost",
            "parameters": {
                "n_estimators": 200,
                "objective": "Tweedie:variance_power=1.7",
                "learning_rate": 0.05,
                "max_depth": 5,
                "allow_writing_files": false
            },
            "prediction_steps": [
                1
            ],
            "specific_features": [
                "total_uplifts",
                "total_uplifts_minus_1",
                "total_uplifts_minus_2",
                "delivered_volumes_minus_9",
                "future_delivered_volumes_until_previous_day_of_previous_week",
                "rolling_mean_delivered_volumes_minus_2_to_7",
                "rolling_mean_delivered_volumes_minus_7_to_12",
                "rolling_mean_delivered_volumes_minus_45_to_53",
                "delivered_volumes_quantile_median_minus_24",
                "precipintensity_minus_2",
                "apparenttemperaturemax_minus_2",
                "promo_mean_horizon_7",
                "promo_mean_horizon_7_minus_1",
                "promo_mean_horizon_7_minus_2",
                "delivered_volumes_evol_1_2",
                "delivered_volumes_evol_1_3"
            ],
            "id": "",
            "uncertainty_upper_id": "",
            "uncertainty_lower_id": ""
        },
        {
            "name": "week_2",
            "type": "CatBoost",
            "parameters": {
                "n_estimators": 200,
                "objective": "Tweedie:variance_power=1.7",
                "learning_rate": 0.05,
                "max_depth": 5,
                "allow_writing_files": false
            },
            "prediction_steps": [
                2
            ],
            "specific_features": [
                "delivered_volumes_minus_10",
                "future_delivered_volumes_until_previous_day_of_previous_week_minus_1",
                "future_delivered_volumes_until_previous_day_of_previous_2_weeks",
                "rolling_mean_delivered_volumes_minus_3_to_8",
                "rolling_mean_delivered_volumes_minus_8_to_13",
                "rolling_mean_delivered_volumes_minus_45_to_53",
                "delivered_volumes_quantile_median_minus_24",
                "precipintensity_minus_3",
                "apparenttemperaturemax_minus_3",
                "delivered_volumes_evol_1_2",
                "delivered_volumes_evol_1_3"
            ],
            "id": "",
            "uncertainty_upper_id": "",
            "uncertainty_lower_id": ""
        },
        {
            "name": "week_3",
            "type": "CatBoost",
            "parameters": {
                "n_estimators": 200,
                "objective": "Tweedie:variance_power=1.7",
                "learning_rate": 0.05,
                "max_depth": 5,
                "allow_writing_files": false
            },
            "prediction_steps": [
                3
            ],
            "specific_features": [
                "delivered_volumes_minus_11",
                "future_delivered_volumes_until_previous_day_of_previous_week_minus_2",
                "future_delivered_volumes_until_previous_day_of_previous_2_weeks_minus_1",
                "future_delivered_volumes_until_previous_day_of_previous_3_weeks",
                "rolling_mean_delivered_volumes_minus_4_to_9",
                "rolling_mean_delivered_volumes_minus_9_to_14",
                "rolling_mean_delivered_volumes_minus_45_to_53",
                "delivered_volumes_quantile_median_minus_24",
                "precipintensity_minus_4",
                "apparenttemperaturemax_minus_4",
                "delivered_volumes_evol_1_2",
                "delivered_volumes_evol_1_3"
            ],
            "id": "",
            "uncertainty_upper_id": "",
            "uncertainty_lower_id": ""
        },
        {
            "name": "week_4",
            "type": "CatBoost",
            "parameters": {
                "n_estimators": 200,
                "objective": "Tweedie:variance_power=1.7",
                "learning_rate": 0.05,
                "max_depth": 5,
                "allow_writing_files": false
            },
            "prediction_steps": [
                4
            ],
            "specific_features": [
                "delivered_volumes_minus_12",
                "future_delivered_volumes_until_previous_day_of_previous_week_minus_3",
                "future_delivered_volumes_until_previous_day_of_previous_2_weeks_minus_2",
                "future_delivered_volumes_until_previous_day_of_previous_3_weeks_minus_1",
                "rolling_mean_delivered_volumes_minus_5_to_10",
                "rolling_mean_delivered_volumes_minus_10_to_15",
                "rolling_mean_delivered_volumes_minus_45_to_53",
                "delivered_volumes_quantile_median_minus_24",
                "precipintensity_minus_5",
                "apparenttemperaturemax_minus_5",
                "delivered_volumes_evol_1_2",
                "delivered_volumes_evol_1_3"
            ],
            "id": "",
            "uncertainty_upper_id": "",
            "uncertainty_lower_id": ""
        },
        {
            "name": "week_5",
            "type": "CatBoost",
            "parameters": {
                "n_estimators": 200,
                "objective": "Tweedie:variance_power=1.7",
                "learning_rate": 0.05,
                "max_depth": 5,
                "allow_writing_files": false
            },
            "prediction_steps": [
                5
            ],
            "specific_features": [
                "delivered_volumes_minus_13",
                "future_delivered_volumes_until_previous_day_of_previous_week_minus_4",
                "future_delivered_volumes_until_previous_day_of_previous_2_weeks_minus_3",
                "future_delivered_volumes_until_previous_day_of_previous_3_weeks_minus_2",
                "rolling_mean_delivered_volumes_minus_6_to_11",
                "rolling_mean_delivered_volumes_minus_11_to_16",
                "rolling_mean_delivered_volumes_minus_45_to_53",
                "delivered_volumes_quantile_median_minus_24",
                "precipintensity_minus_6",
                "apparenttemperaturemax_minus_6",
                "delivered_volumes_evol_1_2",
                "delivered_volumes_evol_1_3"
            ],
            "id": "",
            "uncertainty_upper_id": "",
            "uncertainty_lower_id": ""
        },
        {
            "name": "week_6",
            "type": "CatBoost",
            "parameters": {
                "n_estimators": 200,
                "objective": "Tweedie:variance_power=1.7",
                "learning_rate": 0.05,
                "max_depth": 5,
                "allow_writing_files": false
            },
            "prediction_steps": [
                6
            ],
            "specific_features": [
                "delivered_volumes_minus_13",
                "future_delivered_volumes_until_previous_day_of_previous_week_minus_5",
                "future_delivered_volumes_until_previous_day_of_previous_2_weeks_minus_4",
                "future_delivered_volumes_until_previous_day_of_previous_3_weeks_minus_3",
                "rolling_mean_delivered_volumes_minus_7_to_12",
                "rolling_mean_delivered_volumes_minus_12_to_17",
                "rolling_mean_delivered_volumes_minus_45_to_53",
                "delivered_volumes_quantile_median_minus_24",
                "precipintensity_minus_7",
                "apparenttemperaturemax_minus_7",
                "delivered_volumes_evol_1_2",
                "delivered_volumes_evol_1_3"
            ],
            "id": "",
            "uncertainty_upper_id": "",
            "uncertainty_lower_id": ""
        },
        {
            "name": "week_7",
            "type": "CatBoost",
            "parameters": {
                "n_estimators": 200,
                "objective": "Tweedie:variance_power=1.7",
                "learning_rate": 0.05,
                "max_depth": 5,
                "allow_writing_files": false
            },
            "prediction_steps": [
                7
            ],
            "specific_features": [
                "delivered_volumes_minus_14",
                "future_delivered_volumes_until_previous_day_of_previous_week_minus_6",
                "future_delivered_volumes_until_previous_day_of_previous_2_weeks_minus_5",
                "future_delivered_volumes_until_previous_day_of_previous_3_weeks_minus_4",
                "rolling_mean_delivered_volumes_minus_8_to_13",
                "rolling_mean_delivered_volumes_minus_13_to_18",
                "rolling_mean_delivered_volumes_minus_45_to_53",
                "delivered_volumes_quantile_median_minus_24",
                "precipintensity_minus_8",
                "apparenttemperaturemax_minus_8",
                "delivered_volumes_evol_1_2",
                "delivered_volumes_evol_1_3"
            ],
            "id": "",
            "uncertainty_upper_id": "",
            "uncertainty_lower_id": ""
        },
        {
            "name": "week_8",
            "type": "CatBoost",
            "parameters": {
                "n_estimators": 200,
                "objective": "Tweedie:variance_power=1.7",
                "learning_rate": 0.05,
                "max_depth": 5,
                "allow_writing_files": false
            },
            "prediction_steps": [
                8
            ],
            "specific_features": [
                "delivered_volumes_minus_15",
                "future_delivered_volumes_until_previous_day_of_previous_week_minus_7",
                "future_delivered_volumes_until_previous_day_of_previous_2_weeks_minus_6",
                "future_delivered_volumes_until_previous_day_of_previous_3_weeks_minus_5",
                "rolling_mean_delivered_volumes_minus_9_to_14",
                "rolling_mean_delivered_volumes_minus_14_to_19",
                "rolling_mean_delivered_volumes_minus_45_to_53",
                "delivered_volumes_quantile_median_minus_24",
                "precipintensity_minus_9",
                "apparenttemperaturemax_minus_9",
                "delivered_volumes_evol_1_2",
                "delivered_volumes_evol_1_3"
            ],
            "id": "",
            "uncertainty_upper_id": "",
            "uncertainty_lower_id": ""
        },
        {
            "name": "week_9",
            "type": "CatBoost",
            "parameters": {
                "n_estimators": 200,
                "objective": "Tweedie:variance_power=1.7",
                "learning_rate": 0.05,
                "max_depth": 5,
                "allow_writing_files": false
            },
            "prediction_steps": [
                9
            ],
            "specific_features": [
                "delivered_volumes_minus_16",
                "future_delivered_volumes_until_previous_day_of_previous_week_minus_8",
                "future_delivered_volumes_until_previous_day_of_previous_2_weeks_minus_7",
                "future_delivered_volumes_until_previous_day_of_previous_3_weeks_minus_6",
                "rolling_mean_delivered_volumes_minus_10_to_15",
                "rolling_mean_delivered_volumes_minus_15_to_20",
                "rolling_mean_delivered_volumes_minus_45_to_53",
                "delivered_volumes_quantile_median_minus_24",
                "precipintensity_minus_10",
                "apparenttemperaturemax_minus_10",
                "delivered_volumes_evol_1_2",
                "delivered_volumes_evol_1_3"
            ],
            "id": "",
            "uncertainty_upper_id": "",
            "uncertainty_lower_id": ""
        },
        {
            "name": "week_10",
            "type": "CatBoost",
            "parameters": {
                "n_estimators": 200,
                "objective": "Tweedie:variance_power=1.7",
                "learning_rate": 0.05,
                "max_depth": 5,
                "allow_writing_files": false
            },
            "prediction_steps": [
                10
            ],
            "specific_features": [
                "delivered_volumes_minus_17",
                "future_delivered_volumes_until_previous_day_of_previous_week_minus_9",
                "future_delivered_volumes_until_previous_day_of_previous_2_weeks_minus_8",
                "future_delivered_volumes_until_previous_day_of_previous_3_weeks_minus_7",
                "rolling_mean_delivered_volumes_minus_11_to_16",
                "rolling_mean_delivered_volumes_minus_16_to_21",
                "rolling_mean_delivered_volumes_minus_45_to_53",
                "delivered_volumes_quantile_median_minus_24",
                "precipintensity_minus_11",
                "apparenttemperaturemax_minus_11",
                "delivered_volumes_evol_1_2",
                "delivered_volumes_evol_1_3"
            ],
            "id": "",
            "uncertainty_upper_id": "",
            "uncertainty_lower_id": ""
        },
        {
            "name": "week_11",
            "type": "CatBoost",
            "parameters": {
                "n_estimators": 200,
                "objective": "Tweedie:variance_power=1.7",
                "learning_rate": 0.05,
                "max_depth": 5,
                "allow_writing_files": false
            },
            "prediction_steps": [
                11
            ],
            "specific_features": [
                "delivered_volumes_minus_18",
                "future_delivered_volumes_until_previous_day_of_previous_week_minus_10",
                "future_delivered_volumes_until_previous_day_of_previous_2_weeks_minus_9",
                "future_delivered_volumes_until_previous_day_of_previous_3_weeks_minus_8",
                "rolling_mean_delivered_volumes_minus_12_to_17",
                "rolling_mean_delivered_volumes_minus_17_to_22",
                "rolling_mean_delivered_volumes_minus_45_to_53",
                "delivered_volumes_quantile_median_minus_24",
                "precipintensity_minus_12",
                "apparenttemperaturemax_minus_12",
                "delivered_volumes_evol_1_2",
                "delivered_volumes_evol_1_3"
            ],
            "id": "",
            "uncertainty_upper_id": "",
            "uncertainty_lower_id": ""
        },
        {
            "name": "week_12",
            "type": "CatBoost",
            "parameters": {
                "n_estimators": 200,
                "objective": "Tweedie:variance_power=1.7",
                "learning_rate": 0.05,
                "max_depth": 5,
                "allow_writing_files": false
            },
            "prediction_steps": [
                12
            ],
            "specific_features": [
                "delivered_volumes_minus_19",
                "future_delivered_volumes_until_previous_day_of_previous_week_minus_11",
                "future_delivered_volumes_until_previous_day_of_previous_2_weeks_minus_10",
                "future_delivered_volumes_until_previous_day_of_previous_3_weeks_minus_9",
                "rolling_mean_delivered_volumes_minus_13_to_18",
                "rolling_mean_delivered_volumes_minus_18_to_23",
                "rolling_mean_delivered_volumes_minus_45_to_53",
                "delivered_volumes_quantile_median_minus_24",
                "precipintensity_minus_13",
                "apparenttemperaturemax_minus_13",
                "delivered_volumes_evol_1_2",
                "delivered_volumes_evol_1_3"
            ],
            "id": "",
            "uncertainty_upper_id": "",
            "uncertainty_lower_id": ""
        },
        {
            "name": "week_13",
            "type": "CatBoost",
            "parameters": {
                "n_estimators": 200,
                "objective": "Tweedie:variance_power=1.7",
                "learning_rate": 0.05,
                "max_depth": 5,
                "allow_writing_files": false
            },
            "prediction_steps": [
                13
            ],
            "specific_features": [
                "delivered_volumes_minus_20",
                "future_delivered_volumes_until_previous_day_of_previous_week_minus_12",
                "future_delivered_volumes_until_previous_day_of_previous_2_weeks_minus_11",
                "future_delivered_volumes_until_previous_day_of_previous_3_weeks_minus_10",
                "rolling_mean_delivered_volumes_minus_14_to_19",
                "rolling_mean_delivered_volumes_minus_19_to_24",
                "rolling_mean_delivered_volumes_minus_45_to_53",
                "delivered_volumes_quantile_median_minus_24",
                "precipintensity_minus_14",
                "apparenttemperaturemax_minus_14",
                "delivered_volumes_evol_1_2",
                "delivered_volumes_evol_1_3"
            ],
            "id": "",
            "uncertainty_upper_id": "",
            "uncertainty_lower_id": ""
        },
        {
            "name": "week_14",
            "type": "CatBoost",
            "parameters": {
                "n_estimators": 200,
                "objective": "Tweedie:variance_power=1.7",
                "learning_rate": 0.05,
                "max_depth": 5,
                "allow_writing_files": false
            },
            "prediction_steps": [
                14
            ],
            "specific_features": [
                "delivered_volumes_minus_21",
                "future_delivered_volumes_until_previous_day_of_previous_week_minus_13",
                "future_delivered_volumes_until_previous_day_of_previous_2_weeks_minus_12",
                "future_delivered_volumes_until_previous_day_of_previous_3_weeks_minus_11",
                "rolling_mean_delivered_volumes_minus_15_to_20",
                "rolling_mean_delivered_volumes_minus_20_to_25",
                "rolling_mean_delivered_volumes_minus_45_to_53",
                "delivered_volumes_quantile_median_minus_24",
                "precipintensity_minus_15",
                "apparenttemperaturemax_minus_15",
                "delivered_volumes_evol_1_2",
                "delivered_volumes_evol_1_3"
            ],
            "id": "",
            "uncertainty_upper_id": "",
            "uncertainty_lower_id": ""
        }
    ],
    "learning": {
        "type": null,
        "parameters": {}
    },
    "uncertainty": {
        "lower_quantile": {
            "parameters": {
                "loss_function": "Quantile:alpha=0.05",
                "allow_writing_files": false
            }
        },
        "upper_quantile": {
            "parameters": {
                "loss_function": "Quantile:alpha=0.95",
                "allow_writing_files": false
            }
        }
    },
    "target": "delivered_volumes",
    "train_dates": [
        "2017-01-02"
    ],
    "common_features": [
        "fu_cod",
        "country_cod",
        "delivered_volumes",
        "mat_brand_desc",
        "mat_family_desc",
        "iso_week",
        "iso_week_of_month",
        "cos_iso_month",
        "sin_iso_month",
        "cos_iso_week",
        "sin_iso_week",
        "days_before_next_holiday",
        "holiday_day_of_week"
    ],
    "predict_from_dates": [],
    "updating_functions": []
}
