{
    "method": "non-propagative",
    "object_type": "koalas",
    "scheduler": "spark",
    "partitioned_on": ["rfa_cod"],
    "models": [
        {
            "name": "week_0",
            "type": "CatBoost",
            "parameters": {
                "cat_features": [
                    "rfa_cod"
                ],
                "allow_writing_files": false
            },
            "prediction_steps": [
                0
            ],
            "specific_features": [
                "ordered_units_minus_1",
                "ordered_units_minus_2",
                "ordered_units_minus_3",
                "ordered_units_minus_6",
                "ordered_units_minus_8",
                "ordered_units_minus_4",
                "ordered_units_minus_13",
                "ordered_units_minus_26",
                "ordered_units_minus_52",
                "rolling_mean_ordered_units_minus_5_to_10",
                "rolling_mean_ordered_units_minus_7_to_12",
                "rolling_mean_ordered_units_minus_1_to_6",
                "rolling_mean_ordered_units_minus_2_to_7",
                "rolling_mean_ordered_units_minus_3_to_8",
                "rolling_mean_ordered_units_minus_4_to_9",
                "future_ordered_units_until_sunday_of_previous_week",
                "promo_mean_horizon_0",
                "promo_mean_horizon_0_lot"
            ],
            "id": ""
        },
        {
            "name": "week_1",
            "type": "CatBoost",
            "parameters": {
                "cat_features": [
                    "rfa_cod"
                ],
                "allow_writing_files": false
            },
            "prediction_steps": [
                1
            ],
            "specific_features": [
                "ordered_units_minus_2",
                "ordered_units_minus_3",
                "ordered_units_minus_4",
                "ordered_units_minus_13",
                "ordered_units_minus_26",
                "ordered_units_minus_52",
                "rolling_mean_ordered_units_minus_5_to_10",
                "rolling_mean_ordered_units_minus_7_to_12",
                "rolling_mean_ordered_units_minus_2_to_4",
                "rolling_mean_ordered_units_minus_3_to_8",
                "future_ordered_units_until_sunday_of_previous_2_weeks",
                "future_ordered_units_until_sunday_of_previous_week_minus_1",
                "promo_mean_horizon_7",
                "promo_mean_horizon_7_minus_1",
                "promo_mean_horizon_7_lot",
                "promo_mean_horizon_0_lot_minus_1",
                "promo_mean_horizon_7_lot_minus_1"
            ],
            "id": ""
        },
        {
            "name": "week_2",
            "type": "CatBoost",
            "parameters": {
                "cat_features": [
                    "rfa_cod"
                ],
                "allow_writing_files": false
            },
            "prediction_steps": [
                2
            ],
            "specific_features": [
                "ordered_units_minus_3",
                "ordered_units_minus_6",
                "ordered_units_minus_8",
                "rolling_mean_ordered_units_minus_3_to_8",
                "rolling_mean_ordered_units_minus_4_to_9",
                "future_ordered_units_until_sunday_of_previous_3_weeks",
                "future_ordered_units_until_sunday_of_previous_week_minus_2",
                "promo_mean_horizon_14",
                "promo_mean_horizon_7_minus_1",
                "promo_mean_horizon_14_minus_1",
                "promo_mean_horizon_14_lot",
                "promo_mean_horizon_7_lot_minus_1",
                "promo_mean_horizon_14_lot_minus_1",
                "holidays_count_in_week_plus_1",
                "ordered_units_minus_4",
                "ordered_units_minus_13",
                "ordered_units_minus_26",
                "ordered_units_minus_52",
                "rolling_mean_ordered_units_minus_5_to_10",
                "rolling_mean_ordered_units_minus_7_to_12"
            ],
            "id": ""
        },
        {
            "name": "week_3",
            "type": "CatBoost",
            "parameters": {
                "cat_features": [
                    "rfa_cod"
                ],
                "allow_writing_files": false
            },
            "prediction_steps": [
                3
            ],
            "specific_features": [
                "ordered_units_minus_4",
                "ordered_units_minus_5",
                "ordered_units_minus_6",
                "rolling_mean_ordered_units_minus_4_to_9",
                "rolling_mean_ordered_units_minus_5_to_10",
                "rolling_mean_ordered_units_minus_7_to_12",
                "future_ordered_units_until_sunday_of_previous_4_weeks",
                "future_ordered_units_until_sunday_of_previous_2_weeks_minus_2",
                "future_ordered_units_until_sunday_of_previous_week_minus_3",
                "promo_mean_horizon_21",
                "promo_mean_horizon_14_minus_1",
                "promo_mean_horizon_7_minus_2",
                "promo_mean_horizon_21_lot",
                "promo_mean_horizon_14_lot_minus_1",
                "promo_mean_horizon_7_lot_minus_2",
                "holidays_count_in_week_plus_1"
            ],
            "id": ""
        },
        {
            "name": "week_4",
            "type": "CatBoost",
            "parameters": {
                "cat_features": [
                    "rfa_cod"
                ],
                "allow_writing_files": false
            },
            "prediction_steps": [
                4
            ],
            "specific_features": [
                "ordered_units_minus_5",
                "ordered_units_minus_6",
                "ordered_units_minus_7",
                "rolling_mean_ordered_units_minus_5_to_10",
                "rolling_mean_ordered_units_minus_7_to_12",
                "future_ordered_units_until_sunday_of_previous_5_weeks",
                "future_ordered_units_until_sunday_of_previous_2_weeks_minus_3",
                "future_ordered_units_until_sunday_of_previous_week_minus_4",
                "promo_mean_horizon_28",
                "promo_mean_horizon_21_minus_1",
                "promo_mean_horizon_14_minus_2",
                "promo_mean_horizon_28_lot",
                "promo_mean_horizon_21_lot_minus_1",
                "promo_mean_horizon_14_lot_minus_2",
                "holidays_count_in_week_plus_1"
            ],
            "id": ""
        },
        {
            "name": "week_5",
            "type": "CatBoost",
            "parameters": {
                "cat_features": [
                    "rfa_cod"
                ],
                "allow_writing_files": false
            },
            "prediction_steps": [
                5
            ],
            "specific_features": [
                "ordered_units_minus_6",
                "ordered_units_minus_7",
                "ordered_units_minus_8",
                "rolling_mean_ordered_units_minus_6_to_11",
                "rolling_mean_ordered_units_minus_8_to_13",
                "future_ordered_units_until_sunday_of_previous_6_weeks",
                "future_ordered_units_until_sunday_of_previous_2_weeks_minus_4",
                "future_ordered_units_until_sunday_of_previous_week_minus_5",
                "promo_mean_horizon_35",
                "promo_mean_horizon_28_minus_1",
                "promo_mean_horizon_21_minus_2",
                "promo_mean_horizon_35_lot",
                "promo_mean_horizon_28_lot_minus_1",
                "promo_mean_horizon_21_lot_minus_2",
                "holidays_count_in_week_plus_1"
            ],
            "id": ""
        },
        {
            "name": "week_6",
            "type": "CatBoost",
            "parameters": {
                "cat_features": [
                    "rfa_cod"
                ],
                "allow_writing_files": false
            },
            "prediction_steps": [
                6
            ],
            "specific_features": [
                "ordered_units_minus_7",
                "ordered_units_minus_8",
                "ordered_units_minus_9",
                "rolling_mean_ordered_units_minus_7_to_12",
                "rolling_mean_ordered_units_minus_9_to_14",
                "future_ordered_units_until_sunday_of_previous_7_weeks",
                "future_ordered_units_until_sunday_of_previous_2_weeks_minus_5",
                "promo_mean_horizon_42",
                "promo_mean_horizon_35_minus_1",
                "promo_mean_horizon_42_lot",
                "promo_mean_horizon_35_lot_minus_1",
                "holidays_count_in_week_plus_1"
            ],
            "id": ""
        },
        {
            "name": "week_7",
            "type": "CatBoost",
            "parameters": {
                "cat_features": [
                    "rfa_cod"
                ],
                "allow_writing_files": false
            },
            "prediction_steps": [
                7
            ],
            "specific_features": [
                "ordered_units_minus_8",
                "ordered_units_minus_9",
                "ordered_units_minus_10",
                "rolling_mean_ordered_units_minus_8_to_13",
                "rolling_mean_ordered_units_minus_9_to_14",
                "promo_mean_horizon_49",
                "promo_mean_horizon_49_lot",
                "holidays_count_in_week_plus_1"
            ],
            "id": ""
        },
        {
            "name": "week_8",
            "type": "CatBoost",
            "parameters": {
                "cat_features": [
                    "rfa_cod"
                ],
                "allow_writing_files": false
            },
            "prediction_steps": [
                8
            ],
            "specific_features": [
                "ordered_units_minus_9",
                "ordered_units_minus_10",
                "ordered_units_minus_11",
                "rolling_mean_ordered_units_minus_9_to_14",
                "rolling_mean_ordered_units_minus_10_to_15",
                "promo_mean_horizon_56",
                "promo_mean_horizon_56_lot",
                "holidays_count_in_week_plus_1"
            ],
            "id": ""
        },
        {
            "name": "week_9",
            "type": "CatBoost",
            "parameters": {
                "cat_features": [
                    "rfa_cod"
                ],
                "allow_writing_files": false
            },
            "prediction_steps": [
                9
            ],
            "specific_features": [
                "ordered_units_minus_10",
                "ordered_units_minus_11",
                "ordered_units_minus_12",
                "rolling_mean_ordered_units_minus_10_to_15",
                "holidays_count_in_week_plus_1"
            ],
            "id": ""
        },
        {
            "name": "week_10",
            "type": "CatBoost",
            "parameters": {
                "cat_features": [
                    "rfa_cod"
                ],
                "allow_writing_files": false
            },
            "prediction_steps": [
                10
            ],
            "specific_features": [
                "ordered_units_minus_11",
                "ordered_units_minus_12",
                "ordered_units_minus_13",
                "rolling_mean_ordered_units_minus_11_to_16",
                "holidays_count_in_week_plus_1"
            ],
            "id": ""
        },
        {
            "name": "week_11",
            "type": "CatBoost",
            "parameters": {
                "cat_features": [
                    "rfa_cod"
                ],
                "allow_writing_files": false
            },
            "prediction_steps": [
                11
            ],
            "specific_features": [
                "ordered_units_minus_12",
                "ordered_units_minus_13",
                "ordered_units_minus_14",
                "rolling_mean_ordered_units_minus_12_to_17",
                "holidays_count_in_week_plus_1"
            ],
            "id": ""
        },
        {
            "name": "week_12",
            "type": "CatBoost",
            "parameters": {
                "cat_features": [
                    "rfa_cod"
                ],
                "allow_writing_files": false
            },
            "prediction_steps": [
                12
            ],
            "specific_features": [
                "ordered_units_minus_13",
                "ordered_units_minus_14",
                "ordered_units_minus_15",
                "rolling_mean_ordered_units_minus_13_to_18",
                "holidays_count_in_week_plus_1"
            ],
            "id": ""
        },
        {
            "name": "week_13",
            "type": "CatBoost",
            "parameters": {
                "cat_features": [
                    "rfa_cod"
                ],
                "allow_writing_files": false
            },
            "prediction_steps": [
                13
            ],
            "specific_features": [
                "ordered_units_minus_14",
                "ordered_units_minus_15",
                "ordered_units_minus_16",
                "rolling_mean_ordered_units_minus_14_to_19",
                "holidays_count_in_week_plus_1"
            ],
            "id": ""
        },
        {
            "name": "week_14",
            "type": "CatBoost",
            "parameters": {
                "cat_features": [
                    "rfa_cod"
                ],
                "allow_writing_files": false
            },
            "prediction_steps": [
                14
            ],
            "specific_features": [
                "ordered_units_minus_15",
                "ordered_units_minus_16",
                "ordered_units_minus_17",
                "rolling_mean_ordered_units_minus_15_to_20",
                "holidays_count_in_week_plus_1"
            ],
            "id": ""
        }
    ],
    "learning": {
        "type": null,
        "parameters": {}
    },
    "target": "ordered_units",
    "train_dates": [],
    "common_features": [
        "ordered_units",
        "mat_cod",
        "rfa_cod",
        "lv2_pdt_cod",
        "cos_iso_week",
        "cos_iso_month",
        "days_before_next_holiday",
        "total_uplifts",
        "diff_downlift",
        "A_days_before_next_school_holiday",
        "A_daynum_school_holiday",
        "B_days_before_next_school_holiday",
        "B_daynum_school_holiday",
        "C_days_before_next_school_holiday",
        "C_daynum_school_holiday"
    ],
    "predict_from_dates": [],
    "updating_functions": []
}
