{
  "data_asset_type": "Dataset",
  "expectation_suite_name": "dach_dairy_extracts.pandas_s3_generator.products.DatasetProfiler",
  "expectations": [
    {
      "expectation_type": "expect_table_columns_to_match_set",
      "kwargs": {
        "column_set": [
          "LV1_PDT_COD",
          "LV1_PDT_DSC",
          "LV2_PDT_COD",
          "LV2_PDT_DSC",
          "LV3_PDT_COD",
          "LV3_PDT_DSC",
          "LV4_PDT_COD",
          "LV4_PDT_DSC",
          "LV5_PDT_COD",
          "LV5_PDT_DSC",
          "LV6_PDT_COD",
          "LV6_PDT_DSC",
          "MAT_FVR_DSC",
          "FRC_UNT_DSC",
          "MAT_BGN_VLD_DAT",
          "MAT_CRE_DAT",
          "MAT_END_VLD_DAT",
          "MAT_COD",
          "MAT_DSC",
          "MAT_TYP_COD",
          "SKU_EAN_COD",
          "WGH_UOM_COD",
          "SKU_NET_WGH_VAL",
          "VLM_UOM_COD",
          "SKU_VLM_VAL",
          "STD_DIM_UOM_COD",
          "SKU_LGT_STD_DIM_VAL",
          "SKU_WDT_STD_DIM_VAL",
          "SKU_HGT_STD_DIM_VAL",
          "SKU_UNT_NBR",
          "SKU_UOM_COD",
          "FVR_COD",
          "SAL_ORG_COD",
          "DIS_CHL_COD",
          "FRC_UNT_COD"
        ]
      },
      "meta": {}
    },
    {
      "expectation_type": "expect_compound_columns_to_be_unique",
      "kwargs": {
        "column_list": [
          "FRC_UNT_COD",
          "FRC_UNT_DSC",
          "DIS_CHL_COD",
          "SAL_ORG_COD"
        ]
      },
      "meta": {}
    },
    {
      "expectation_type": "expect_column_values_to_not_be_null",
      "kwargs": {
        "column": "MAT_COD"
      },
      "meta": {}
    },
    {
      "expectation_type": "expect_column_values_to_be_of_type",
      "kwargs": {
        "column": "MAT_COD",
        "type_": "int64"
      },
      "meta": {}
    },
    {
      "expectation_type": "expect_column_values_to_not_be_null",
      "kwargs": {
        "column": "MAT_DSC"
      },
      "meta": {}
    },
    {
      "expectation_type": "expect_column_values_to_be_of_type",
      "kwargs": {
        "column": "MAT_DSC",
        "type_": "object"
      },
      "meta": {}
    }
  ]
}