[
    {
        "city": "bialystok",
        "latitude": 53.132398,
        "longitude": 23.1591679
    },
    {
        "city": "bydgoszcz",
        "latitude": 53.1219648,
        "longitude": 18.0002529
    },
    {
        "city": "cracovie",
        "latitude": 50.0619474,
        "longitude": 19.9368564
    },
    {
        "city": "gdynia",
        "latitude": 54.5164982,
        "longitude": 18.5402738
    },
    {
        "city": "katowice",
        "latitude": 50.2598987,
        "longitude": 19.0215852
    },
    {
        "city": "kielce",
        "latitude": 50.8716657,
        "longitude": 20.6314728
    },
    {
        "city": "lublin",
        "latitude": 51.250559,
        "longitude": 22.5701022
    },
        {
        "city": "lodz",
        "latitude": 51.7687323,
        "longitude": 19.4569911
    },
    {
        "city": "olsztyn",
        "latitude": 53.7766839,
        "longitude": 20.476507
    },
    {
        "city": "poznan",
        "latitude": 52.4082663,
        "longitude": 16.9335199
    },
    {
        "city": "rzeszow",
        "latitude": 50.0374531,
        "longitude": 22.0047174
    },
    {
        "city": "szczecin",
        "latitude": 53.4301818,
        "longitude": 14.5509623
    },
    {
        "city": "varsovie",
        "latitude": 52.2319581,
        "longitude": 21.0067249
    },
    {
        "city": "vratislavie",
        "latitude": 51.1089776,
        "longitude": 17.0326689
    },
    {
        "city": "warsawairport",
        "latitude": 52.1630681,
        "longitude": 20.9708043
    }
]
