{
    "scheduler": "spark",
    "method": "non-propagative",
    "models": [
        {
            "name": "week_1",
            "type": "CatBoost",
            "parameters": {
                "objective": "Tweedie:variance_power=1.7",
                "n_estimators": 800,
                "learning_rate": 0.05,
                "max_depth": 5,
                "per_float_feature_quantization": "0:border_count=8000",
                "allow_writing_files": false
            },
            "prediction_steps": [
                1
            ],
            "specific_features": [
                "future_ordered_volumes_until_previous_day_of_previous_week"
            ],
            "id": "",
            "uncertainty_upper_id": "",
            "uncertainty_lower_id": ""
        },
        {
            "name": "week_2",
            "type": "CatBoost",
            "parameters": {
                "objective": "Tweedie:variance_power=1.7",
                "n_estimators": 800,
                "learning_rate": 0.05,
                "max_depth": 5,
                "allow_writing_files": false
            },
            "prediction_steps": [
                2
            ],
            "specific_features": [
                "fu_cod",
                "mat_net_weight_value_kg",
                "cos_iso_week",
                "days_before_next_holiday",
                "holiday_day_of_week",
                "cos_iso_month",
                "cos_iso_week_of_month",
                "ordered_volumes_minus_3",
                "ordered_volumes_minus_6",
                "ordered_volumes_minus_17",
                "ordered_volumes_minus_38",
                "ordered_volumes_minus_48",
                "ordered_volumes_minus_51",
                "future_ordered_volumes_until_previous_day_of_previous_2_weeks",
                "future_ordered_volumes_until_previous_day_of_previous_week_minus_1",
                "rolling_mean_ordered_volumes_minus_3_to_8",
                "rolling_mean_ordered_volumes_minus_7_to_12",
                "promo_uplift_coefficient",
                "promo_uplift_coefficient_minus_1",
                "promo_uplift_coefficient_minus_2",
                "promo_mean_horizon_14",
                "promo_mean_horizon_14_minus_1",
                "promo_mean_horizon_14_minus_2",
                "forecasted_volumes",
                "forecasted_volumes_minus_1",
                "forecasted_volumes_minus_2",
                "forecasted_volumes_minus_3",
                "forecasted_volumes_minus_4",
                "forecasted_volumes_minus_5",
                "forecasted_volumes_minus_6",
                "forecasted_volumes_minus_7",
                "forecasted_volumes_minus_8",
                "forecasted_volumes_minus_9",
                "forecasted_volumes_minus_10",
                "forecasted_volumes_minus_11",
                "forecasted_volumes_minus_12",
                "forecasted_volumes_plus_1",
                "forecasted_volumes_plus_2",
                "forecasted_volumes_plus_3",
                "forecasted_volumes_plus_4",
                "forecasted_volumes_plus_5",
                "forecasted_volumes_plus_6",
                "forecasted_volumes_plus_7",
                "forecasted_volumes_plus_8",
                "forecasted_volumes_plus_9",
                "forecasted_volumes_plus_10"
            ],
            "id": "",
            "uncertainty_upper_id": "",
            "uncertainty_lower_id": ""
        },
        {
            "name": "week_3",
            "type": "CatBoost",
            "parameters": {
                "objective": "Tweedie:variance_power=1.7",
                "n_estimators": 800,
                "learning_rate": 0.05,
                "max_depth": 5,
                "allow_writing_files": false
            },
            "prediction_steps": [
                3
            ],
            "specific_features": [
                "fu_cod",
                "mat_net_weight_value_kg",
                "cos_iso_week",
                "cos_iso_week_of_month",
                "holiday_day_of_week",
                "holidays_count_in_week",
                "future_ordered_volumes_until_previous_day_of_previous_3_weeks",
                "apparenttemperaturemax_minus_3",
                "precipintensity_minus_3",
                "rolling_mean_ordered_volumes_minus_7_to_12",
                "rolling_mean_ordered_volumes_minus_100_to_107",
                "ordered_volumes_minus_5",
                "ordered_volumes_minus_6",
                "ordered_volumes_minus_7",
                "ordered_volumes_minus_15",
                "ordered_volumes_minus_17",
                "ordered_volumes_minus_48",
                "ordered_volumes_minus_50",
                "ordered_volumes_minus_51",
                "ordered_volumes_minus_53",
                "ordered_volumes_minus_54",
                "ordered_volumes_minus_57",
                "ordered_volumes_minus_59",
                "ordered_volumes_minus_83",
                "ordered_volumes_minus_99",
                "ordered_volumes_minus_100",
                "ordered_volumes_minus_101",
                "ordered_volumes_minus_104",
                "ordered_volumes_minus_106",
                "ordered_volumes_minus_107",
                "promo_uplift_coefficient",
                "promo_uplift_coefficient_minus_1",
                "promo_uplift_coefficient_minus_2",
                "promo_mean_horizon_21",
                "promo_mean_horizon_21_minus_1",
                "promo_mean_horizon_21_minus_2",
                "forecasted_volumes",
                "forecasted_volumes_minus_1",
                "forecasted_volumes_minus_2",
                "forecasted_volumes_minus_3",
                "forecasted_volumes_minus_4",
                "forecasted_volumes_minus_5",
                "forecasted_volumes_minus_6",
                "forecasted_volumes_minus_7",
                "forecasted_volumes_minus_8",
                "forecasted_volumes_minus_9",
                "forecasted_volumes_minus_10",
                "forecasted_volumes_minus_11",
                "forecasted_volumes_minus_12",
                "forecasted_volumes_plus_1",
                "forecasted_volumes_plus_2",
                "forecasted_volumes_plus_3",
                "forecasted_volumes_plus_4",
                "forecasted_volumes_plus_5",
                "forecasted_volumes_plus_6",
                "forecasted_volumes_plus_7",
                "forecasted_volumes_plus_8",
                "forecasted_volumes_plus_9"
            ],
            "id": "",
            "uncertainty_upper_id": "",
            "uncertainty_lower_id": ""
        },
        {
            "name": "week_4",
            "type": "CatBoost",
            "parameters": {
                "objective": "Tweedie:variance_power=1.7",
                "n_estimators": 800,
                "learning_rate": 0.05,
                "max_depth": 5,
                "allow_writing_files": false
            },
            "prediction_steps": [
                4
            ],
            "specific_features": [
                "fu_cod",
                "mat_net_weight_value_kg",
                "cos_iso_week",
                "cos_iso_week_of_month",
                "holiday_day_of_week",
                "holidays_count_in_week",
                "future_ordered_volumes_until_previous_day_of_previous_4_weeks",
                "apparenttemperaturemax_minus_4",
                "precipintensity_minus_4",
                "rolling_mean_ordered_volumes_minus_7_to_12",
                "rolling_mean_ordered_volumes_minus_100_to_107",
                "ordered_volumes_minus_5",
                "ordered_volumes_minus_6",
                "ordered_volumes_minus_7",
                "ordered_volumes_minus_15",
                "ordered_volumes_minus_17",
                "ordered_volumes_minus_48",
                "ordered_volumes_minus_50",
                "ordered_volumes_minus_51",
                "ordered_volumes_minus_53",
                "ordered_volumes_minus_54",
                "ordered_volumes_minus_57",
                "ordered_volumes_minus_59",
                "ordered_volumes_minus_83",
                "ordered_volumes_minus_99",
                "ordered_volumes_minus_100",
                "ordered_volumes_minus_101",
                "ordered_volumes_minus_104",
                "ordered_volumes_minus_106",
                "ordered_volumes_minus_107",
                "promo_uplift_coefficient",
                "promo_uplift_coefficient_minus_1",
                "promo_uplift_coefficient_minus_2",
                "promo_mean_horizon_28",
                "promo_mean_horizon_28_minus_1",
                "promo_mean_horizon_28_minus_2",
                "forecasted_volumes",
                "forecasted_volumes_minus_1",
                "forecasted_volumes_minus_2",
                "forecasted_volumes_minus_3",
                "forecasted_volumes_minus_4",
                "forecasted_volumes_minus_5",
                "forecasted_volumes_minus_6",
                "forecasted_volumes_minus_7",
                "forecasted_volumes_minus_8",
                "forecasted_volumes_minus_9",
                "forecasted_volumes_minus_10",
                "forecasted_volumes_minus_11",
                "forecasted_volumes_minus_12",
                "forecasted_volumes_plus_1",
                "forecasted_volumes_plus_2",
                "forecasted_volumes_plus_3",
                "forecasted_volumes_plus_4",
                "forecasted_volumes_plus_5",
                "forecasted_volumes_plus_6",
                "forecasted_volumes_plus_7",
                "forecasted_volumes_plus_8"
            ],
            "id": "",
            "uncertainty_upper_id": "",
            "uncertainty_lower_id": ""
        },
        {
            "name": "week_5",
            "type": "CatBoost",
            "parameters": {
                "objective": "Tweedie:variance_power=1.7",
                "n_estimators": 800,
                "learning_rate": 0.05,
                "max_depth": 5,
                "allow_writing_files": false
            },
            "prediction_steps": [
                5
            ],
            "specific_features": [
                "fu_cod",
                "mat_net_weight_value_kg",
                "cos_iso_week",
                "cos_iso_week_of_month",
                "holiday_day_of_week",
                "holidays_count_in_week",
                "future_ordered_volumes_until_previous_day_of_previous_5_weeks",
                "apparenttemperaturemax_minus_5",
                "precipintensity_minus_5",
                "rolling_mean_ordered_volumes_minus_7_to_12",
                "rolling_mean_ordered_volumes_minus_100_to_107",
                "ordered_volumes_minus_5",
                "ordered_volumes_minus_6",
                "ordered_volumes_minus_7",
                "ordered_volumes_minus_15",
                "ordered_volumes_minus_17",
                "ordered_volumes_minus_48",
                "ordered_volumes_minus_50",
                "ordered_volumes_minus_51",
                "ordered_volumes_minus_53",
                "ordered_volumes_minus_54",
                "ordered_volumes_minus_57",
                "ordered_volumes_minus_59",
                "ordered_volumes_minus_83",
                "ordered_volumes_minus_99",
                "ordered_volumes_minus_100",
                "ordered_volumes_minus_101",
                "ordered_volumes_minus_104",
                "ordered_volumes_minus_106",
                "ordered_volumes_minus_107",
                "promo_uplift_coefficient",
                "promo_uplift_coefficient_minus_1",
                "promo_uplift_coefficient_minus_2",
                "promo_mean_horizon_35",
                "promo_mean_horizon_35_minus_1",
                "promo_mean_horizon_35_minus_2",
                "forecasted_volumes",
                "forecasted_volumes_minus_1",
                "forecasted_volumes_minus_2",
                "forecasted_volumes_minus_3",
                "forecasted_volumes_minus_4",
                "forecasted_volumes_minus_5",
                "forecasted_volumes_minus_6",
                "forecasted_volumes_minus_7",
                "forecasted_volumes_minus_8",
                "forecasted_volumes_minus_9",
                "forecasted_volumes_minus_10",
                "forecasted_volumes_minus_11",
                "forecasted_volumes_minus_12",
                "forecasted_volumes_plus_1",
                "forecasted_volumes_plus_2",
                "forecasted_volumes_plus_3",
                "forecasted_volumes_plus_4",
                "forecasted_volumes_plus_5",
                "forecasted_volumes_plus_6",
                "forecasted_volumes_plus_7"
            ],
            "id": "",
            "uncertainty_upper_id": "",
            "uncertainty_lower_id": ""
        },
        {
            "name": "week_6",
            "type": "CatBoost",
            "parameters": {
                "objective": "Tweedie:variance_power=1.7",
                "n_estimators": 2000,
                "learning_rate": 0.05,
                "max_depth": 5,
                "allow_writing_files": false
            },
            "prediction_steps": [
                6
            ],
            "specific_features": [
                "fu_cod",
                "mat_net_weight_value_kg",
                "cos_iso_week",
                "cos_iso_week_of_month",
                "holiday_day_of_week",
                "holidays_count_in_week",
                "future_ordered_volumes_until_previous_day_of_previous_6_weeks",
                "apparenttemperaturemax_minus_6",
                "precipintensity_minus_6",
                "rolling_mean_ordered_volumes_minus_7_to_12",
                "rolling_mean_ordered_volumes_minus_8_to_13",
                "rolling_mean_ordered_volumes_minus_100_to_107",
                "ordered_volumes_minus_6",
                "ordered_volumes_minus_7",
                "ordered_volumes_minus_15",
                "ordered_volumes_minus_17",
                "ordered_volumes_minus_48",
                "ordered_volumes_minus_50",
                "ordered_volumes_minus_51",
                "ordered_volumes_minus_53",
                "ordered_volumes_minus_54",
                "ordered_volumes_minus_57",
                "ordered_volumes_minus_59",
                "ordered_volumes_minus_83",
                "ordered_volumes_minus_99",
                "ordered_volumes_minus_100",
                "ordered_volumes_minus_101",
                "ordered_volumes_minus_104",
                "ordered_volumes_minus_106",
                "ordered_volumes_minus_107",
                "promo_uplift_coefficient",
                "promo_uplift_coefficient_minus_1",
                "promo_uplift_coefficient_minus_2",
                "promo_mean_horizon_42",
                "promo_mean_horizon_42_minus_1",
                "promo_mean_horizon_42_minus_2",
                "forecasted_volumes",
                "forecasted_volumes_minus_1",
                "forecasted_volumes_minus_2",
                "forecasted_volumes_minus_3",
                "forecasted_volumes_minus_4",
                "forecasted_volumes_minus_5",
                "forecasted_volumes_minus_6",
                "forecasted_volumes_minus_7",
                "forecasted_volumes_minus_8",
                "forecasted_volumes_minus_9",
                "forecasted_volumes_minus_10",
                "forecasted_volumes_minus_11",
                "forecasted_volumes_minus_12",
                "forecasted_volumes_plus_1",
                "forecasted_volumes_plus_2",
                "forecasted_volumes_plus_3",
                "forecasted_volumes_plus_4",
                "forecasted_volumes_plus_5",
                "forecasted_volumes_plus_6"
            ],
            "id": "",
            "uncertainty_upper_id": "",
            "uncertainty_lower_id": ""
        },
        {
            "name": "week_7",
            "type": "CatBoost",
            "parameters": {
                "objective": "Tweedie:variance_power=1.7",
                "n_estimators": 2000,
                "learning_rate": 0.05,
                "max_depth": 5,
                "allow_writing_files": false
            },
            "prediction_steps": [
                7
            ],
            "specific_features": [
                "fu_cod",
                "mat_net_weight_value_kg",
                "cos_iso_week",
                "cos_iso_week_of_month",
                "holiday_day_of_week",
                "holidays_count_in_week",
                "future_ordered_volumes_until_previous_day_of_previous_7_weeks",
                "apparenttemperaturemax_minus_7",
                "precipintensity_minus_7",
                "rolling_mean_ordered_volumes_minus_7_to_12",
                "rolling_mean_ordered_volumes_minus_8_to_13",
                "rolling_mean_ordered_volumes_minus_100_to_107",
                "ordered_volumes_minus_7",
                "ordered_volumes_minus_15",
                "ordered_volumes_minus_17",
                "ordered_volumes_minus_48",
                "ordered_volumes_minus_50",
                "ordered_volumes_minus_51",
                "ordered_volumes_minus_53",
                "ordered_volumes_minus_54",
                "ordered_volumes_minus_57",
                "ordered_volumes_minus_59",
                "ordered_volumes_minus_83",
                "ordered_volumes_minus_99",
                "ordered_volumes_minus_100",
                "ordered_volumes_minus_101",
                "ordered_volumes_minus_104",
                "ordered_volumes_minus_106",
                "ordered_volumes_minus_107",
                "promo_uplift_coefficient",
                "promo_uplift_coefficient_minus_1",
                "promo_uplift_coefficient_minus_2",
                "promo_mean_horizon_49",
                "promo_mean_horizon_49_minus_1",
                "promo_mean_horizon_49_minus_2",
                "forecasted_volumes",
                "forecasted_volumes_minus_1",
                "forecasted_volumes_minus_2",
                "forecasted_volumes_minus_3",
                "forecasted_volumes_minus_4",
                "forecasted_volumes_minus_5",
                "forecasted_volumes_minus_6",
                "forecasted_volumes_minus_7",
                "forecasted_volumes_minus_8",
                "forecasted_volumes_minus_9",
                "forecasted_volumes_minus_10",
                "forecasted_volumes_minus_11",
                "forecasted_volumes_minus_12",
                "forecasted_volumes_plus_1",
                "forecasted_volumes_plus_2",
                "forecasted_volumes_plus_3",
                "forecasted_volumes_plus_4",
                "forecasted_volumes_plus_5"
            ],
            "id": "",
            "uncertainty_upper_id": "",
            "uncertainty_lower_id": ""
        },
        {
            "name": "week_8",
            "type": "CatBoost",
            "parameters": {
                "objective": "Tweedie:variance_power=1.7",
                "n_estimators": 2000,
                "learning_rate": 0.05,
                "max_depth": 5,
                "allow_writing_files": false
            },
            "prediction_steps": [
                8
            ],
            "specific_features": [
                "fu_cod",
                "mat_net_weight_value_kg",
                "cos_iso_week",
                "cos_iso_week_of_month",
                "holiday_day_of_week",
                "holidays_count_in_week",
                "future_ordered_volumes_until_previous_day_of_previous_8_weeks",
                "apparenttemperaturemax_minus_8",
                "precipintensity_minus_8",
                "rolling_mean_ordered_volumes_minus_100_to_107",
                "ordered_volumes_minus_15",
                "ordered_volumes_minus_17",
                "ordered_volumes_minus_48",
                "ordered_volumes_minus_50",
                "ordered_volumes_minus_51",
                "ordered_volumes_minus_53",
                "ordered_volumes_minus_54",
                "ordered_volumes_minus_57",
                "ordered_volumes_minus_59",
                "ordered_volumes_minus_83",
                "ordered_volumes_minus_99",
                "ordered_volumes_minus_100",
                "ordered_volumes_minus_101",
                "ordered_volumes_minus_104",
                "ordered_volumes_minus_106",
                "ordered_volumes_minus_107",
                "promo_uplift_coefficient",
                "promo_uplift_coefficient_minus_1",
                "promo_uplift_coefficient_minus_2",
                "promo_mean_horizon_56",
                "promo_mean_horizon_56_minus_1",
                "promo_mean_horizon_56_minus_2",
                "forecasted_volumes",
                "forecasted_volumes_minus_1",
                "forecasted_volumes_minus_2",
                "forecasted_volumes_minus_3",
                "forecasted_volumes_minus_4",
                "forecasted_volumes_minus_5",
                "forecasted_volumes_minus_6",
                "forecasted_volumes_minus_7",
                "forecasted_volumes_minus_8",
                "forecasted_volumes_minus_9",
                "forecasted_volumes_minus_10",
                "forecasted_volumes_minus_11",
                "forecasted_volumes_minus_12",
                "forecasted_volumes_plus_1",
                "forecasted_volumes_plus_2",
                "forecasted_volumes_plus_3",
                "forecasted_volumes_plus_4"
            ],
            "id": "",
            "uncertainty_upper_id": "",
            "uncertainty_lower_id": ""
        },
        {
            "name": "week_9",
            "type": "CatBoost",
            "parameters": {
                "objective": "Tweedie:variance_power=1.7",
                "n_estimators": 2000,
                "learning_rate": 0.05,
                "max_depth": 5,
                "allow_writing_files": false
            },
            "prediction_steps": [
                9
            ],
            "specific_features": [
                "fu_cod",
                "mat_net_weight_value_kg",
                "cos_iso_week",
                "cos_iso_week_of_month",
                "holiday_day_of_week",
                "holidays_count_in_week",
                "future_ordered_volumes_until_previous_day_of_previous_9_weeks",
                "apparenttemperaturemax_minus_9",
                "precipintensity_minus_9",
                "rolling_mean_ordered_volumes_minus_100_to_107",
                "ordered_volumes_minus_15",
                "ordered_volumes_minus_17",
                "ordered_volumes_minus_48",
                "ordered_volumes_minus_50",
                "ordered_volumes_minus_51",
                "ordered_volumes_minus_53",
                "ordered_volumes_minus_54",
                "ordered_volumes_minus_57",
                "ordered_volumes_minus_59",
                "ordered_volumes_minus_83",
                "ordered_volumes_minus_99",
                "ordered_volumes_minus_100",
                "ordered_volumes_minus_101",
                "ordered_volumes_minus_104",
                "ordered_volumes_minus_106",
                "ordered_volumes_minus_107",
                "promo_uplift_coefficient",
                "promo_uplift_coefficient_minus_1",
                "promo_uplift_coefficient_minus_2",
                "promo_mean_horizon_63",
                "promo_mean_horizon_63_minus_1",
                "promo_mean_horizon_63_minus_2",
                "forecasted_volumes",
                "forecasted_volumes_minus_1",
                "forecasted_volumes_minus_2",
                "forecasted_volumes_minus_3",
                "forecasted_volumes_minus_4",
                "forecasted_volumes_minus_5",
                "forecasted_volumes_minus_6",
                "forecasted_volumes_minus_7",
                "forecasted_volumes_minus_8",
                "forecasted_volumes_minus_9",
                "forecasted_volumes_minus_10",
                "forecasted_volumes_minus_11",
                "forecasted_volumes_minus_12",
                "forecasted_volumes_plus_1",
                "forecasted_volumes_plus_2",
                "forecasted_volumes_plus_3"
            ],
            "id": "",
            "uncertainty_upper_id": "",
            "uncertainty_lower_id": ""
        },
        {
            "name": "week_10",
            "type": "CatBoost",
            "parameters": {
                "objective": "Tweedie:variance_power=1.7",
                "n_estimators": 2000,
                "learning_rate": 0.05,
                "max_depth": 5,
                "allow_writing_files": false
            },
            "prediction_steps": [
                10
            ],
            "specific_features": [
                "fu_cod",
                "mat_net_weight_value_kg",
                "cos_iso_week",
                "cos_iso_week_of_month",
                "holiday_day_of_week",
                "holidays_count_in_week",
                "future_ordered_volumes_until_previous_day_of_previous_10_weeks",
                "apparenttemperaturemax_minus_10",
                "precipintensity_minus_10",
                "rolling_mean_ordered_volumes_minus_100_to_107",
                "ordered_volumes_minus_15",
                "ordered_volumes_minus_17",
                "ordered_volumes_minus_48",
                "ordered_volumes_minus_50",
                "ordered_volumes_minus_51",
                "ordered_volumes_minus_53",
                "ordered_volumes_minus_54",
                "ordered_volumes_minus_57",
                "ordered_volumes_minus_59",
                "ordered_volumes_minus_83",
                "ordered_volumes_minus_99",
                "ordered_volumes_minus_100",
                "ordered_volumes_minus_101",
                "ordered_volumes_minus_104",
                "ordered_volumes_minus_106",
                "ordered_volumes_minus_107",
                "promo_uplift_coefficient",
                "promo_uplift_coefficient_minus_1",
                "promo_uplift_coefficient_minus_2",
                "promo_mean_horizon_70",
                "promo_mean_horizon_70_minus_1",
                "promo_mean_horizon_70_minus_2",
                "forecasted_volumes",
                "forecasted_volumes_minus_1",
                "forecasted_volumes_minus_2",
                "forecasted_volumes_minus_3",
                "forecasted_volumes_minus_4",
                "forecasted_volumes_minus_5",
                "forecasted_volumes_minus_6",
                "forecasted_volumes_minus_7",
                "forecasted_volumes_minus_8",
                "forecasted_volumes_minus_9",
                "forecasted_volumes_minus_10",
                "forecasted_volumes_minus_11",
                "forecasted_volumes_minus_12",
                "forecasted_volumes_plus_1",
                "forecasted_volumes_plus_2"
            ],
            "id": "",
            "uncertainty_upper_id": "",
            "uncertainty_lower_id": ""
        },
        {
            "name": "week_11",
            "type": "CatBoost",
            "parameters": {
                "objective": "Tweedie:variance_power=1.7",
                "n_estimators": 2000,
                "learning_rate": 0.05,
                "max_depth": 5,
                "allow_writing_files": false
            },
            "prediction_steps": [
                11
            ],
            "specific_features": [
                "fu_cod",
                "mat_net_weight_value_kg",
                "cos_iso_week",
                "cos_iso_week_of_month",
                "holiday_day_of_week",
                "holidays_count_in_week",
                "rolling_mean_ordered_volumes_minus_100_to_107",
                "ordered_volumes_minus_15",
                "ordered_volumes_minus_17",
                "ordered_volumes_minus_48",
                "ordered_volumes_minus_50",
                "ordered_volumes_minus_51",
                "ordered_volumes_minus_53",
                "ordered_volumes_minus_54",
                "ordered_volumes_minus_57",
                "ordered_volumes_minus_59",
                "ordered_volumes_minus_83",
                "ordered_volumes_minus_99",
                "ordered_volumes_minus_100",
                "ordered_volumes_minus_101",
                "ordered_volumes_minus_104",
                "ordered_volumes_minus_106",
                "ordered_volumes_minus_107",
                "promo_uplift_coefficient",
                "promo_uplift_coefficient_minus_1",
                "promo_uplift_coefficient_minus_2",
                "promo_mean_horizon_77",
                "promo_mean_horizon_77_minus_1",
                "promo_mean_horizon_77_minus_2",
                "forecasted_volumes",
                "forecasted_volumes_minus_1",
                "forecasted_volumes_minus_2",
                "forecasted_volumes_minus_3",
                "forecasted_volumes_minus_4",
                "forecasted_volumes_minus_5",
                "forecasted_volumes_minus_6",
                "forecasted_volumes_minus_7",
                "forecasted_volumes_minus_8",
                "forecasted_volumes_minus_9",
                "forecasted_volumes_minus_10",
                "forecasted_volumes_minus_11",
                "forecasted_volumes_minus_12",
                "forecasted_volumes_plus_1"
            ],
            "id": "",
            "uncertainty_upper_id": "",
            "uncertainty_lower_id": ""
        },
        {
            "name": "week_12",
            "type": "CatBoost",
            "parameters": {
                "objective": "Tweedie:variance_power=1.7",
                "n_estimators": 2000,
                "learning_rate": 0.05,
                "max_depth": 5,
                "allow_writing_files": false
            },
            "prediction_steps": [
                12
            ],
            "specific_features": [
                "fu_cod",
                "mat_net_weight_value_kg",
                "cos_iso_week",
                "cos_iso_week_of_month",
                "holiday_day_of_week",
                "holidays_count_in_week",
                "rolling_mean_ordered_volumes_minus_100_to_107",
                "ordered_volumes_minus_15",
                "ordered_volumes_minus_17",
                "ordered_volumes_minus_48",
                "ordered_volumes_minus_50",
                "ordered_volumes_minus_51",
                "ordered_volumes_minus_53",
                "ordered_volumes_minus_54",
                "ordered_volumes_minus_57",
                "ordered_volumes_minus_59",
                "ordered_volumes_minus_83",
                "ordered_volumes_minus_99",
                "ordered_volumes_minus_100",
                "ordered_volumes_minus_101",
                "ordered_volumes_minus_104",
                "ordered_volumes_minus_106",
                "ordered_volumes_minus_107",
                "promo_uplift_coefficient",
                "promo_uplift_coefficient_minus_1",
                "promo_uplift_coefficient_minus_2",
                "promo_mean_horizon_84",
                "promo_mean_horizon_84_minus_1",
                "promo_mean_horizon_84_minus_2",
                "forecasted_volumes",
                "forecasted_volumes_minus_1",
                "forecasted_volumes_minus_2",
                "forecasted_volumes_minus_3",
                "forecasted_volumes_minus_4",
                "forecasted_volumes_minus_5",
                "forecasted_volumes_minus_6",
                "forecasted_volumes_minus_7",
                "forecasted_volumes_minus_8",
                "forecasted_volumes_minus_9",
                "forecasted_volumes_minus_10",
                "forecasted_volumes_minus_11",
                "forecasted_volumes_minus_12"
            ],
            "id": "",
            "uncertainty_upper_id": "",
            "uncertainty_lower_id": ""
        },
        {
            "name": "week_13",
            "type": "CatBoost",
            "parameters": {
                "objective": "Tweedie:variance_power=1.7",
                "n_estimators": 2000,
                "learning_rate": 0.05,
                "max_depth": 5,
                "allow_writing_files": false
            },
            "prediction_steps": [
                13
            ],
            "specific_features": [
                "fu_cod",
                "mat_net_weight_value_kg",
                "cos_iso_week",
                "cos_iso_week_of_month",
                "holiday_day_of_week",
                "holidays_count_in_week",
                "rolling_mean_ordered_volumes_minus_100_to_107",
                "ordered_volumes_minus_15",
                "ordered_volumes_minus_17",
                "ordered_volumes_minus_48",
                "ordered_volumes_minus_50",
                "ordered_volumes_minus_51",
                "ordered_volumes_minus_53",
                "ordered_volumes_minus_54",
                "ordered_volumes_minus_57",
                "ordered_volumes_minus_59",
                "ordered_volumes_minus_83",
                "ordered_volumes_minus_99",
                "ordered_volumes_minus_100",
                "ordered_volumes_minus_101",
                "ordered_volumes_minus_104",
                "ordered_volumes_minus_106",
                "ordered_volumes_minus_107",
                "promo_uplift_coefficient",
                "promo_uplift_coefficient_minus_1",
                "promo_uplift_coefficient_minus_2",
                "forecasted_volumes_minus_1",
                "forecasted_volumes_minus_2",
                "forecasted_volumes_minus_3",
                "forecasted_volumes_minus_4",
                "forecasted_volumes_minus_5",
                "forecasted_volumes_minus_6",
                "forecasted_volumes_minus_7",
                "forecasted_volumes_minus_8",
                "forecasted_volumes_minus_9",
                "forecasted_volumes_minus_10",
                "forecasted_volumes_minus_11",
                "forecasted_volumes_minus_12"
            ],
            "id": "",
            "uncertainty_upper_id": "",
            "uncertainty_lower_id": ""
        },
        {
            "name": "week_14",
            "type": "CatBoost",
            "parameters": {
                "objective": "Tweedie:variance_power=1.7",
                "n_estimators": 2000,
                "learning_rate": 0.05,
                "max_depth": 5,
                "allow_writing_files": false
            },
            "prediction_steps": [
                14
            ],
            "specific_features": [
                "fu_cod",
                "mat_net_weight_value_kg",
                "cos_iso_week",
                "cos_iso_week_of_month",
                "holiday_day_of_week",
                "holidays_count_in_week",
                "rolling_mean_ordered_volumes_minus_100_to_107",
                "ordered_volumes_minus_15",
                "ordered_volumes_minus_17",
                "ordered_volumes_minus_48",
                "ordered_volumes_minus_50",
                "ordered_volumes_minus_51",
                "ordered_volumes_minus_53",
                "ordered_volumes_minus_54",
                "ordered_volumes_minus_57",
                "ordered_volumes_minus_59",
                "ordered_volumes_minus_83",
                "ordered_volumes_minus_99",
                "ordered_volumes_minus_100",
                "ordered_volumes_minus_101",
                "ordered_volumes_minus_104",
                "ordered_volumes_minus_106",
                "ordered_volumes_minus_107",
                "promo_uplift_coefficient",
                "promo_uplift_coefficient_minus_1",
                "promo_uplift_coefficient_minus_2",
                "forecasted_volumes_minus_2",
                "forecasted_volumes_minus_3",
                "forecasted_volumes_minus_4",
                "forecasted_volumes_minus_5",
                "forecasted_volumes_minus_6",
                "forecasted_volumes_minus_7",
                "forecasted_volumes_minus_8",
                "forecasted_volumes_minus_9",
                "forecasted_volumes_minus_10",
                "forecasted_volumes_minus_11",
                "forecasted_volumes_minus_12"
            ],
            "id": "",
            "uncertainty_upper_id": "",
            "uncertainty_lower_id": ""
        }
    ],
    "learning": {
        "type": null,
        "parameters": {}
    },
    "uncertainty": {
        "lower_quantile": {
            "parameters": {
                "loss_function": "Quantile:alpha=0.05",
                "allow_writing_files": false
            }
        },
        "upper_quantile": {
            "parameters": {
                "loss_function": "Quantile:alpha=0.95",
                "allow_writing_files": false
            }
        }
    },
    "target": "ordered_volumes",
    "train_dates": [
        "2014-04-14"
    ],
    "common_features": [
        "ordered_volumes"
    ],
    "predict_from_dates": [],
    "updating_functions": []
}
