{
    "tags": {
        "country": "dach",
        "division": "dairy_at"
    },
    "product": {
        "column": "mat_cod",
        "level": "sku"
    },
    "location": {
        "column": null,
        "level": "national"
    },
    "customer": {
        "column": "nfa_cod",
        "level": "cus_level_1"
    },
    "ground_truth": {
        "column": "ordered_units",
        "uom": "PC"
    },
    "time": {
        "column": "to_dt",
        "level": "day"
    },
    "object_type": "dask",
    "features": [
        "mat_cod",
        "nfa_cod",
        "ordered_units",
        "mat_area_cod",
        "mat_umbrella_cod",
        "mat_brand_cod",
        "mat_family_cod",
        "mat_subfamily_cod",
        "mat_nature_cod",
        "total_uplifts",
        "promo_mean_horizon_0",
        "promo_mean_horizon_7",
        "promo_mean_horizon_14",
        "is_holiday",
        "is_school_holiday",
        "future_ordered_units_until_current_day",
        "future_ordered_units_until_previous_day",
        "future_ordered_units_until_previous_2_days",
        "future_ordered_units_until_previous_3_days",
        "future_ordered_units_until_previous_4_days",
        "future_ordered_units_until_previous_5_days",
        "future_ordered_units_until_previous_6_days",
        "future_ordered_units_until_previous_7_days",
        "future_ordered_units_until_previous_8_days",
        "future_ordered_units_until_previous_9_days",
        "future_ordered_units_until_previous_10_days",
        "future_ordered_units_until_previous_11_days",
        "future_ordered_units_until_previous_12_days",
        "future_ordered_units_until_previous_13_days",
        "future_ordered_units_until_previous_14_days",
        "holiday_day_of_week",
        "holidays_count_in_week",
        "days_before_next_holiday",
        "days_before_next_school_holiday",
        "service_level",
        "uplift_prev_week",
        "non_delivered_ordered_units",
        "non_delivered_nfa_ordered_units"
    ],
    "na_value": null,
    "aggregation": {
        "sum": [],
        "mean": [],
        "min": [],
        "max": [],
        "first": []
    },
    "encoding": {
        "label": [
            "mat_cod",
            "nfa_cod",
            "mat_area_cod",
            "mat_umbrella_cod",
            "mat_brand_cod",
            "mat_family_cod",
            "mat_subfamily_cod",
            "mat_nature_cod"
        ],
        "target": []
    },
    "lags": [
        {
            "column": "ordered_units",
            "direction": "backward",
            "count": 64,
            "step": 1
        },
        {
            "column": "ordered_units",
            "direction": "backward",
            "count": 1,
            "step": 364
        },
        {
            "step": 1,
            "count": 4,
            "column": "is_holiday",
            "direction": "backward"
        },
        {
            "step": 1,
            "count": 4,
            "column": "is_holiday",
            "direction": "forward"
        },
        {
            "step": 1,
            "count": 4,
            "column": "is_school_holiday",
            "direction": "backward"
        },
        {
            "step": 1,
            "count": 4,
            "column": "is_school_holiday",
            "direction": "forward"
        },
        {
            "column": "holiday_day_of_week",
            "direction": "backward",
            "count": 2,
            "step": 1
        },
        {
            "column": "holiday_day_of_week",
            "direction": "forward",
            "count": 2,
            "step": 1
        },
        {
            "column": "holidays_count_in_week",
            "direction": "backward",
            "count": 2,
            "step": 1
        },
        {
            "column": "holidays_count_in_week",
            "direction": "forward",
            "count": 2,
            "step": 1
        },
        {
            "column": "service_level",
            "direction": "backward",
            "step": 1,
            "count": 18
        },
        {
            "column": "future_ordered_units_until_current_day",
            "direction": "backward",
            "count": 5,
            "step": 1
        },
        {
            "column": "future_ordered_units_until_previous_day",
            "direction": "backward",
            "count": 4,
            "step": 1
        },
        {
            "column": "future_ordered_units_until_previous_2_days",
            "direction": "backward",
            "count": 3,
            "step": 1
        },
        {
            "column": "future_ordered_units_until_previous_3_days",
            "direction": "backward",
            "count": 2,
            "step": 1
        },
        {
            "column": "future_ordered_units_until_previous_4_days",
            "direction": "backward",
            "count": 1,
            "step": 1
        },
        {
            "column": "uplift_prev_week",
            "direction": "backward",
            "step": 7,
            "count": 3
        },
        {
            "column": "uplift_prev_week",
            "direction": "forward",
            "step": 7,
            "count": 3
        },
        {
            "column": "non_delivered_ordered_units",
            "direction": "backward",
            "count": 28,
            "step": 1
        },
        {
            "column": "non_delivered_nfa_ordered_units",
            "direction": "backward",
            "count": 28,
            "step": 1
        }
    ],
    "generating_functions": [
        {
            "args": {
                "formats": [
                    "iso_month",
                    "iso_week",
                    "iso_week_of_month",
                    "iso_week_day",
                    "iso_day_of_year"
                ]
            },
            "function": "apply_iso"
        },
        {
            "args": {
                "x": "iso_month",
                "period": 12,
                "col_name": "cos_iso_month"
            },
            "function": "apply_cos"
        },
        {
            "args": {
                "x": "iso_week",
                "period": 12,
                "col_name": "cos_iso_week"
            },
            "function": "apply_cos"
        },
        {
            "function": "apply_cos",
            "args": {
                "x": "iso_week_of_month",
                "col_name": "cos_iso_week_of_month",
                "period": 5
            }
        },
        {
            "function": "apply_rolling_mean",
            "args": {
                "start": 1,
                "end": 7,
                "column": "ordered_units",
                "direction": "backward"
            }
        },
        {
            "function": "apply_rolling_mean",
            "args": {
                "start": 2,
                "end": 8,
                "column": "ordered_units",
                "direction": "backward"
            }
        },
        {
            "function": "apply_rolling_mean",
            "args": {
                "start": 3,
                "end": 9,
                "column": "ordered_units",
                "direction": "backward"
            }
        },
        {
            "function": "apply_rolling_mean",
            "args": {
                "start": 4,
                "end": 10,
                "column": "ordered_units",
                "direction": "backward"
            }
        },
        {
            "function": "apply_rolling_mean",
            "args": {
                "start": 5,
                "end": 11,
                "column": "ordered_units",
                "direction": "backward"
            }
        },
        {
            "function": "apply_rolling_mean",
            "args": {
                "start": 6,
                "end": 12,
                "column": "ordered_units",
                "direction": "backward"
            }
        },
        {
            "function": "apply_rolling_mean",
            "args": {
                "start": 7,
                "end": 13,
                "column": "ordered_units",
                "direction": "backward"
            }
        },
        {
            "function": "apply_rolling_mean",
            "args": {
                "start": 8,
                "end": 14,
                "column": "ordered_units",
                "direction": "backward"
            }
        },
        {
            "function": "apply_rolling_mean",
            "args": {
                "start": 9,
                "end": 15,
                "column": "ordered_units",
                "direction": "backward"
            }
        },
        {
            "function": "apply_rolling_mean",
            "args": {
                "start": 10,
                "end": 16,
                "column": "ordered_units",
                "direction": "backward"
            }
        },
        {
            "function": "apply_rolling_mean",
            "args": {
                "start": 11,
                "end": 17,
                "column": "ordered_units",
                "direction": "backward"
            }
        },
        {
            "function": "apply_rolling_mean",
            "args": {
                "start": 12,
                "end": 18,
                "column": "ordered_units",
                "direction": "backward"
            }
        },
        {
            "function": "apply_rolling_mean",
            "args": {
                "column": "ordered_units",
                "direction": "backward",
                "start": 1,
                "end": 42
            }
        },
        {
            "function": "apply_rolling_mean",
            "args": {
                "column": "ordered_units",
                "direction": "backward",
                "start": 2,
                "end": 43
            }
        },
        {
            "function": "apply_rolling_mean",
            "args": {
                "column": "ordered_units",
                "direction": "backward",
                "start": 3,
                "end": 44
            }
        },
        {
            "function": "apply_rolling_mean",
            "args": {
                "column": "ordered_units",
                "direction": "backward",
                "start": 4,
                "end": 45
            }
        },
        {
            "function": "apply_rolling_mean",
            "args": {
                "column": "ordered_units",
                "direction": "backward",
                "start": 5,
                "end": 46
            }
        },
        {
            "function": "apply_rolling_mean",
            "args": {
                "column": "ordered_units",
                "direction": "backward",
                "start": 6,
                "end": 47
            }
        },
        {
            "function": "apply_rolling_mean",
            "args": {
                "column": "ordered_units",
                "direction": "backward",
                "start": 7,
                "end": 49
            }
        },
        {
            "function": "apply_rolling_mean",
            "args": {
                "column": "ordered_units",
                "direction": "backward",
                "start": 8,
                "end": 50
            }
        },
        {
            "function": "apply_rolling_mean",
            "args": {
                "column": "ordered_units",
                "direction": "backward",
                "start": 9,
                "end": 51
            }
        },
        {
            "function": "apply_rolling_mean",
            "args": {
                "column": "ordered_units",
                "direction": "backward",
                "start": 10,
                "end": 52
            }
        },
        {
            "function": "apply_rolling_mean",
            "args": {
                "column": "ordered_units",
                "direction": "backward",
                "start": 11,
                "end": 53
            }
        },
        {
            "function": "apply_rolling_mean",
            "args": {
                "column": "ordered_units",
                "direction": "backward",
                "start": 12,
                "end": 54
            }
        },
        {
            "function": "apply_rolling_mean",
            "args": {
                "column": "ordered_units",
                "direction": "backward",
                "start": 13,
                "end": 55
            }
        },
        {
            "function": "apply_rolling_mean",
            "args": {
                "column": "ordered_units",
                "direction": "backward",
                "start": 357,
                "end": 365
            }
        },
        {
            "args": {
                "end": 3,
                "start": 1,
                "column": "service_level",
                "direction": "backward"
            },
            "function": "apply_rolling_mean"
        },
        {
            "args": {
                "end": 4,
                "start": 2,
                "column": "service_level",
                "direction": "backward"
            },
            "function": "apply_rolling_mean"
        },
        {
            "args": {
                "end": 5,
                "start": 3,
                "column": "service_level",
                "direction": "backward"
            },
            "function": "apply_rolling_mean"
        },
        {
            "args": {
                "end": 6,
                "start": 4,
                "column": "service_level",
                "direction": "backward"
            },
            "function": "apply_rolling_mean"
        },
        {
            "args": {
                "end": 7,
                "start": 5,
                "column": "service_level",
                "direction": "backward"
            },
            "function": "apply_rolling_mean"
        },
        {
            "args": {
                "end": 8,
                "start": 6,
                "column": "service_level",
                "direction": "backward"
            },
            "function": "apply_rolling_mean"
        },
        {
            "args": {
                "end": 9,
                "start": 7,
                "column": "service_level",
                "direction": "backward"
            },
            "function": "apply_rolling_mean"
        },
        {
            "args": {
                "end": 10,
                "start": 8,
                "column": "service_level",
                "direction": "backward"
            },
            "function": "apply_rolling_mean"
        },
        {
            "args": {
                "end": 11,
                "start": 9,
                "column": "service_level",
                "direction": "backward"
            },
            "function": "apply_rolling_mean"
        },
        {
            "args": {
                "end": 12,
                "start": 10,
                "column": "service_level",
                "direction": "backward"
            },
            "function": "apply_rolling_mean"
        },
        {
            "args": {
                "end": 13,
                "start": 11,
                "column": "service_level",
                "direction": "backward"
            },
            "function": "apply_rolling_mean"
        },
        {
            "args": {
                "end": 14,
                "start": 12,
                "column": "service_level",
                "direction": "backward"
            },
            "function": "apply_rolling_mean"
        },
        {
            "args": {
                "end": 15,
                "start": 13,
                "column": "service_level",
                "direction": "backward"
            },
            "function": "apply_rolling_mean"
        },
        {
            "args": {
                "end": 16,
                "start": 14,
                "column": "service_level",
                "direction": "backward"
            },
            "function": "apply_rolling_mean"
        },
        {
            "args": {
                "end": 17,
                "start": 15,
                "column": "service_level",
                "direction": "backward"
            },
            "function": "apply_rolling_mean"
        },
        {
            "args": {
                "end": 8,
                "start": 1,
                "column": "service_level",
                "direction": "backward"
            },
            "function": "apply_rolling_mean"
        },
        {
            "args": {
                "end": 9,
                "start": 2,
                "column": "service_level",
                "direction": "backward"
            },
            "function": "apply_rolling_mean"
        },
        {
            "args": {
                "end": 10,
                "start": 3,
                "column": "service_level",
                "direction": "backward"
            },
            "function": "apply_rolling_mean"
        },
        {
            "args": {
                "end": 11,
                "start": 4,
                "column": "service_level",
                "direction": "backward"
            },
            "function": "apply_rolling_mean"
        },
        {
            "args": {
                "end": 12,
                "start": 5,
                "column": "service_level",
                "direction": "backward"
            },
            "function": "apply_rolling_mean"
        },
        {
            "args": {
                "end": 13,
                "start": 6,
                "column": "service_level",
                "direction": "backward"
            },
            "function": "apply_rolling_mean"
        },
        {
            "args": {
                "end": 14,
                "start": 7,
                "column": "service_level",
                "direction": "backward"
            },
            "function": "apply_rolling_mean"
        },
        {
            "args": {
                "end": 15,
                "start": 8,
                "column": "service_level",
                "direction": "backward"
            },
            "function": "apply_rolling_mean"
        },
        {
            "args": {
                "end": 16,
                "start": 9,
                "column": "service_level",
                "direction": "backward"
            },
            "function": "apply_rolling_mean"
        },
        {
            "args": {
                "end": 17,
                "start": 10,
                "column": "service_level",
                "direction": "backward"
            },
            "function": "apply_rolling_mean"
        },
        {
            "args": {
                "end": 18,
                "start": 11,
                "column": "service_level",
                "direction": "backward"
            },
            "function": "apply_rolling_mean"
        },
        {
            "args": {
                "end": 19,
                "start": 12,
                "column": "service_level",
                "direction": "backward"
            },
            "function": "apply_rolling_mean"
        },
        {
            "args": {
                "end": 20,
                "start": 13,
                "column": "service_level",
                "direction": "backward"
            },
            "function": "apply_rolling_mean"
        },
        {
            "args": {
                "end": 21,
                "start": 14,
                "column": "service_level",
                "direction": "backward"
            },
            "function": "apply_rolling_mean"
        },
        {
            "args": {
                "end": 7,
                "start": 1,
                "column": "promo_mean_horizon_0",
                "direction": "backward"
            },
            "function": "apply_rolling_mean"
        },
        {
            "args": {
                "end": 14,
                "start": 7,
                "column": "promo_mean_horizon_0",
                "direction": "backward"
            },
            "function": "apply_rolling_mean"
        },
        {
            "args": {
                "end": 7,
                "start": 1,
                "column": "promo_mean_horizon_7",
                "direction": "backward"
            },
            "function": "apply_rolling_mean"
        },
        {
            "args": {
                "end": 14,
                "start": 7,
                "column": "promo_mean_horizon_7",
                "direction": "backward"
            },
            "function": "apply_rolling_mean"
        },
        {
            "args": {
                "x": "ordered_units_minus_1",
                "y": "ordered_units_minus_2",
                "col_name": "ordered_units_diff_minus_1_and_2"
            },
            "function": "apply_diff"
        },
        {
            "args": {
                "x": "ordered_units_minus_2",
                "y": "ordered_units_minus_3",
                "col_name": "ordered_units_diff_minus_2_and_3"
            },
            "function": "apply_diff"
        },
        {
            "args": {
                "x": "ordered_units_minus_3",
                "y": "ordered_units_minus_4",
                "col_name": "ordered_units_diff_minus_3_and_4"
            },
            "function": "apply_diff"
        },
        {
            "args": {
                "x": "ordered_units_minus_4",
                "y": "ordered_units_minus_5",
                "col_name": "ordered_units_diff_minus_4_and_5"
            },
            "function": "apply_diff"
        },
        {
            "args": {
                "x": "ordered_units_minus_5",
                "y": "ordered_units_minus_6",
                "col_name": "ordered_units_diff_minus_5_and_6"
            },
            "function": "apply_diff"
        },
        {
            "args": {
                "x": "ordered_units_minus_6",
                "y": "ordered_units_minus_7",
                "col_name": "ordered_units_diff_minus_6_and_7"
            },
            "function": "apply_diff"
        },
        {
            "args": {
                "x": "ordered_units_minus_7",
                "y": "ordered_units_minus_8",
                "col_name": "ordered_units_diff_minus_7_and_8"
            },
            "function": "apply_diff"
        },
        {
            "args": {
                "x": "ordered_units_minus_8",
                "y": "ordered_units_minus_9",
                "col_name": "ordered_units_diff_minus_8_and_9"
            },
            "function": "apply_diff"
        },
        {
            "args": {
                "x": "ordered_units_minus_9",
                "y": "ordered_units_minus_10",
                "col_name": "ordered_units_diff_minus_9_and_10"
            },
            "function": "apply_diff"
        },
        {
            "args": {
                "x": "ordered_units_minus_1",
                "y": "ordered_units_minus_3",
                "col_name": "ordered_units_diff_minus_1_and_3"
            },
            "function": "apply_diff"
        },
        {
            "args": {
                "x": "ordered_units_minus_2",
                "y": "ordered_units_minus_4",
                "col_name": "ordered_units_diff_minus_2_and_4"
            },
            "function": "apply_diff"
        },
        {
            "args": {
                "x": "ordered_units_minus_3",
                "y": "ordered_units_minus_5",
                "col_name": "ordered_units_diff_minus_3_and_5"
            },
            "function": "apply_diff"
        },
        {
            "args": {
                "x": "ordered_units_minus_4",
                "y": "ordered_units_minus_6",
                "col_name": "ordered_units_diff_minus_4_and_6"
            },
            "function": "apply_diff"
        },
        {
            "args": {
                "x": "ordered_units_minus_5",
                "y": "ordered_units_minus_7",
                "col_name": "ordered_units_diff_minus_5_and_7"
            },
            "function": "apply_diff"
        },
        {
            "args": {
                "x": "ordered_units_minus_6",
                "y": "ordered_units_minus_8",
                "col_name": "ordered_units_diff_minus_6_and_8"
            },
            "function": "apply_diff"
        },
        {
            "args": {
                "x": "ordered_units_minus_7",
                "y": "ordered_units_minus_9",
                "col_name": "ordered_units_diff_minus_7_and_9"
            },
            "function": "apply_diff"
        },
        {
            "args": {
                "x": "ordered_units_minus_8",
                "y": "ordered_units_minus_10",
                "col_name": "ordered_units_diff_minus_8_and_10"
            },
            "function": "apply_diff"
        },
        {
            "args": {
                "x": "ordered_units_minus_9",
                "y": "ordered_units_minus_11",
                "col_name": "ordered_units_diff_minus_9_and_11"
            },
            "function": "apply_diff"
        },
        {
            "args": {
                "x": "ordered_units_minus_1",
                "y": "ordered_units_minus_8",
                "col_name": "ordered_units_diff_minus_1_and_8"
            },
            "function": "apply_diff"
        },
        {
            "args": {
                "x": "ordered_units_minus_2",
                "y": "ordered_units_minus_9",
                "col_name": "ordered_units_diff_minus_2_and_9"
            },
            "function": "apply_diff"
        },
        {
            "args": {
                "x": "ordered_units_minus_3",
                "y": "ordered_units_minus_10",
                "col_name": "ordered_units_diff_minus_3_and_10"
            },
            "function": "apply_diff"
        },
        {
            "args": {
                "x": "ordered_units_minus_4",
                "y": "ordered_units_minus_11",
                "col_name": "ordered_units_diff_minus_4_and_11"
            },
            "function": "apply_diff"
        },
        {
            "args": {
                "x": "ordered_units_minus_5",
                "y": "ordered_units_minus_12",
                "col_name": "ordered_units_diff_minus_5_and_12"
            },
            "function": "apply_diff"
        },
        {
            "args": {
                "x": "ordered_units_minus_6",
                "y": "ordered_units_minus_13",
                "col_name": "ordered_units_diff_minus_6_and_13"
            },
            "function": "apply_diff"
        },
        {
            "args": {
                "x": "ordered_units_minus_7",
                "y": "ordered_units_minus_14",
                "col_name": "ordered_units_diff_minus_7_and_14"
            },
            "function": "apply_diff"
        },
        {
            "args": {
                "x": "ordered_units_minus_8",
                "y": "ordered_units_minus_15",
                "col_name": "ordered_units_diff_minus_8_and_15"
            },
            "function": "apply_diff"
        },
        {
            "args": {
                "x": "ordered_units_minus_9",
                "y": "ordered_units_minus_16",
                "col_name": "ordered_units_diff_minus_9_and_16"
            },
            "function": "apply_diff"
        },
        {
            "args": {
                "x": "ordered_units_minus_10",
                "y": "ordered_units_minus_17",
                "col_name": "ordered_units_diff_minus_10_and_17"
            },
            "function": "apply_diff"
        },
        {
            "args": {
                "x": "ordered_units_minus_11",
                "y": "ordered_units_minus_18",
                "col_name": "ordered_units_diff_minus_11_and_18"
            },
            "function": "apply_diff"
        },
        {
            "args": {
                "x": "ordered_units_minus_12",
                "y": "ordered_units_minus_19",
                "col_name": "ordered_units_diff_minus_12_and_19"
            },
            "function": "apply_diff"
        },
        {
            "args": {
                "x": "ordered_units_minus_13",
                "y": "ordered_units_minus_20",
                "col_name": "ordered_units_diff_minus_13_and_20"
            },
            "function": "apply_diff"
        },
        {
            "args": {
                "x": "ordered_units_minus_14",
                "y": "ordered_units_minus_21",
                "col_name": "ordered_units_diff_minus_14_and_21"
            },
            "function": "apply_diff"
        },
        {
            "args": {
                "x": "ordered_units_minus_15",
                "y": "ordered_units_minus_22",
                "col_name": "ordered_units_diff_minus_15_and_22"
            },
            "function": "apply_diff"
        },
        {
            "args": {
                "x": "ordered_units_minus_16",
                "y": "ordered_units_minus_23",
                "col_name": "ordered_units_diff_minus_16_and_23"
            },
            "function": "apply_diff"
        },
        {
            "args": {
                "x": "ordered_units_minus_17",
                "y": "ordered_units_minus_24",
                "col_name": "ordered_units_diff_minus_17_and_24"
            },
            "function": "apply_diff"
        },
        {
            "args": {
                "x": "ordered_units_minus_18",
                "y": "ordered_units_minus_25",
                "col_name": "ordered_units_diff_minus_18_and_25"
            },
            "function": "apply_diff"
        },
        {
            "args": {
                "x": "ordered_units_minus_19",
                "y": "ordered_units_minus_26",
                "col_name": "ordered_units_diff_minus_19_and_26"
            },
            "function": "apply_diff"
        },
        {
            "args": {
                "x": "ordered_units_minus_20",
                "y": "ordered_units_minus_27",
                "col_name": "ordered_units_diff_minus_20_and_27"
            },
            "function": "apply_diff"
        },
        {
            "args": {
                "x": "ordered_units_minus_21",
                "y": "ordered_units_minus_28",
                "col_name": "ordered_units_diff_minus_21_and_28"
            },
            "function": "apply_diff"
        },
        {
            "args": {
                "x": "service_level_minus_1",
                "y": "service_level_minus_2",
                "col_name": "service_level_diff_minus_1_and_2"
            },
            "function": "apply_diff"
        },
        {
            "args": {
                "x": "service_level_minus_2",
                "y": "service_level_minus_3",
                "col_name": "service_level_diff_minus_2_and_3"
            },
            "function": "apply_diff"
        },
        {
            "args": {
                "x": "service_level_minus_3",
                "y": "service_level_minus_4",
                "col_name": "service_level_diff_minus_3_and_4"
            },
            "function": "apply_diff"
        },
        {
            "args": {
                "x": "service_level_minus_4",
                "y": "service_level_minus_5",
                "col_name": "service_level_diff_minus_4_and_5"
            },
            "function": "apply_diff"
        },
        {
            "args": {
                "x": "service_level_minus_5",
                "y": "service_level_minus_6",
                "col_name": "service_level_diff_minus_5_and_6"
            },
            "function": "apply_diff"
        },
        {
            "args": {
                "x": "service_level_minus_6",
                "y": "service_level_minus_7",
                "col_name": "service_level_diff_minus_6_and_7"
            },
            "function": "apply_diff"
        },
        {
            "args": {
                "x": "service_level_minus_7",
                "y": "service_level_minus_8",
                "col_name": "service_level_diff_minus_7_and_8"
            },
            "function": "apply_diff"
        },
        {
            "args": {
                "x": "service_level_minus_8",
                "y": "service_level_minus_9",
                "col_name": "service_level_diff_minus_8_and_9"
            },
            "function": "apply_diff"
        },
        {
            "args": {
                "x": "service_level_minus_1",
                "y": "service_level_minus_8",
                "col_name": "service_level_diff_minus_1_and_8"
            },
            "function": "apply_diff"
        },
        {
            "args": {
                "x": "service_level_minus_2",
                "y": "service_level_minus_9",
                "col_name": "service_level_diff_minus_2_and_9"
            },
            "function": "apply_diff"
        },
        {
            "args": {
                "x": "service_level_minus_3",
                "y": "service_level_minus_10",
                "col_name": "service_level_diff_minus_3_and_10"
            },
            "function": "apply_diff"
        },
        {
            "args": {
                "x": "service_level_minus_4",
                "y": "service_level_minus_11",
                "col_name": "service_level_diff_minus_4_and_11"
            },
            "function": "apply_diff"
        },
        {
            "args": {
                "x": "service_level_minus_5",
                "y": "service_level_minus_12",
                "col_name": "service_level_diff_minus_5_and_12"
            },
            "function": "apply_diff"
        },
        {
            "args": {
                "x": "service_level_minus_6",
                "y": "service_level_minus_13",
                "col_name": "service_level_diff_minus_6_and_13"
            },
            "function": "apply_diff"
        },
        {
            "args": {
                "x": "service_level_minus_7",
                "y": "service_level_minus_14",
                "col_name": "service_level_diff_minus_7_and_14"
            },
            "function": "apply_diff"
        },
        {
            "args": {
                "x": "service_level_minus_8",
                "y": "service_level_minus_15",
                "col_name": "service_level_diff_minus_8_and_15"
            },
            "function": "apply_diff"
        },
        {
            "args": {
                "x": "service_level_minus_9",
                "y": "service_level_minus_16",
                "col_name": "service_level_diff_minus_9_and_16"
            },
            "function": "apply_diff"
        }
    ]
}