{
  "data_asset_type": "Dataset",
  "expectation_suite_name": "france_waters_raw.pandas_s3_generator_central.customers.DatasetProfiler",
  "expectations": [
    {
      "expectation_type": "expect_table_columns_to_match_set",
      "kwargs": {
        "column_set": [
          "SAL_ORG_COD",
          "DIS_CHL_COD",
          "DIS_CHL_DSC",
          "CUS_COD",
          "CUS_NAM_DSC",
          "CUS_CRY_COD",
          "CUS_ADR_COD",
          "CUS_LVL_NUM",
          "LV8_CUS_COD",
          "CUS_LV8_DSC",
          "LV7_CUS_COD",
          "CUS_LV7_DSC",
          "LV6_CUS_COD",
          "CUS_LV6_DSC",
          "LV5_CUS_COD",
          "CUS_LV5_DSC",
          "LV4_CUS_COD",
          "CUS_LV4_DSC",
          "LV3_CUS_COD",
          "CUS_LV3_DSC",
          "LV2_CUS_COD",
          "CUS_LV2_DSC",
          "LV1_CUS_COD",
          "CUS_LV1_DSC"
        ],
        "exact_match": false
      },
      "meta": {}
    },
     {
      "expectation_type": "expect_compound_columns_to_be_unique",
      "kwargs": {
        "column_list": [
          "SAL_ORG_COD",
          "DIS_CHL_COD",
          "CUS_COD"
        ]
      },
      "meta": {}
    },
    {
      "expectation_type": "expect_column_values_to_not_be_null",
      "kwargs": {
        "column": "SAL_ORG_COD"
      },
      "meta": {}
    },
    {
      "expectation_type": "expect_column_values_to_be_of_type",
      "kwargs": {
        "column": "SAL_ORG_COD",
        "type_": "str"
      },
      "meta": {}
    },
    {
      "expectation_type": "expect_column_values_to_not_be_null",
      "kwargs": {
        "column": "DIS_CHL_COD"
      },
      "meta": {}
    },
    {
      "expectation_type": "expect_column_values_to_be_of_type",
      "kwargs": {
        "column": "DIS_CHL_COD",
        "type_": "int"
      },
      "meta": {}
    },
    {
      "expectation_type": "expect_column_values_to_be_of_type",
      "kwargs": {
        "column": "DIS_CHL_DSC",
        "type_": "str"
      },
      "meta": {}
    },
    {
      "expectation_type": "expect_column_pair_map_values_to_have_nto1_relationship",
      "kwargs": {
        "column_A": "DIS_CHL_COD",
        "column_B": "DIS_CHL_DSC"
      },
      "meta": {}
    },
    {
      "expectation_type": "expect_column_values_to_not_be_null",
      "kwargs": {
        "column": "CUS_COD"
      },
      "meta": {}
    },
    {
      "expectation_type": "expect_column_values_to_be_of_type",
      "kwargs": {
        "column": "CUS_COD",
        "type_": "int"
      },
      "meta": {}
    },
    {
      "expectation_type": "expect_column_values_to_be_of_type",
      "kwargs": {
        "column": "CUS_NAM_DSC",
        "type_": "str"
      },
      "meta": {}
    },
    {
      "expectation_type": "expect_column_values_to_be_of_type",
      "kwargs": {
        "column": "CUS_CRY_COD",
        "type_": "str"
      },
      "meta": {}
    },
    {
      "expectation_type": "expect_column_values_to_not_be_null",
      "kwargs": {
        "column": "CUS_ADR_COD"
      },
      "meta": {}
    },
    {
      "expectation_type": "expect_column_values_to_be_of_type",
      "kwargs": {
        "column": "CUS_ADR_COD",
        "type_": "int"
      },
      "meta": {}
    },
    {
      "expectation_type": "expect_column_values_to_be_of_type",
      "kwargs": {
        "column": "CUS_LVL_NUM",
        "type_": "int"
      },
      "meta": {}
    },
    {
      "expectation_type": "expect_column_values_to_be_of_type",
      "kwargs": {
        "column": "LV8_CUS_COD",
        "type_": "str"
      },
      "meta": {}
    },
    {
      "expectation_type": "expect_column_values_to_be_of_type",
      "kwargs": {
        "column": "CUS_LV8_DSC",
        "type_": "str"
      },
      "meta": {}
    },
    {
      "expectation_type": "expect_column_pair_map_values_to_have_nto1_relationship",
      "kwargs": {
        "column_A": "LV8_CUS_COD",
        "column_B": "CUS_LV8_DSC"
      },
      "meta": {}
    },
    {
      "expectation_type": "expect_column_values_to_be_of_type",
      "kwargs": {
        "column": "LV7_CUS_COD",
        "type_": "str"
      },
      "meta": {}
    },
    {
      "expectation_type": "expect_column_values_to_be_of_type",
      "kwargs": {
        "column": "CUS_LV7_DSC",
        "type_": "str"
      },
      "meta": {}
    },
    {
      "expectation_type": "expect_column_pair_map_values_to_have_nto1_relationship",
      "kwargs": {
        "column_A": "LV7_CUS_COD",
        "column_B": "CUS_LV7_DSC"
      },
      "meta": {}
    },
    {
      "expectation_type": "expect_column_values_to_be_of_type",
      "kwargs": {
        "column": "LV6_CUS_COD",
        "type_": "str"
      },
      "meta": {}
    },
    {
      "expectation_type": "expect_column_values_to_be_of_type",
      "kwargs": {
        "column": "CUS_LV6_DSC",
        "type_": "str"
      },
      "meta": {}
    },
    {
      "expectation_type": "expect_column_pair_map_values_to_have_nto1_relationship",
      "kwargs": {
        "column_A": "LV6_CUS_COD",
        "column_B": "CUS_LV6_DSC"
      },
      "meta": {}
    },
    {
      "expectation_type": "expect_column_values_to_be_of_type",
      "kwargs": {
        "column": "LV5_CUS_COD",
        "type_": "str"
      },
      "meta": {}
    },
    {
      "expectation_type": "expect_column_values_to_be_of_type",
      "kwargs": {
        "column": "CUS_LV5_DSC",
        "type_": "str"
      },
      "meta": {}
    },
    {
      "expectation_type": "expect_column_pair_map_values_to_have_nto1_relationship",
      "kwargs": {
        "column_A": "LV5_CUS_COD",
        "column_B": "CUS_LV5_DSC"
      },
      "meta": {}
    },
    {
      "expectation_type": "expect_column_values_to_be_of_type",
      "kwargs": {
        "column": "LV4_CUS_COD",
        "type_": "str"
      },
      "meta": {}
    },
    {
      "expectation_type": "expect_column_values_to_be_of_type",
      "kwargs": {
        "column": "CUS_LV4_DSC",
        "type_": "str"
      },
      "meta": {}
    },
    {
      "expectation_type": "expect_column_pair_map_values_to_have_nto1_relationship",
      "kwargs": {
        "column_A": "LV4_CUS_COD",
        "column_B": "CUS_LV4_DSC"
      },
      "meta": {}
    },
    {
      "expectation_type": "expect_column_values_to_be_of_type",
      "kwargs": {
        "column": "LV3_CUS_COD",
        "type_": "str"
      },
      "meta": {}
    },
    {
      "expectation_type": "expect_column_values_to_be_of_type",
      "kwargs": {
        "column": "CUS_LV3_DSC",
        "type_": "str"
      },
      "meta": {}
    },
    {
      "expectation_type": "expect_column_pair_map_values_to_have_nto1_relationship",
      "kwargs": {
        "column_A": "LV3_CUS_COD",
        "column_B": "CUS_LV3_DSC"
      },
      "meta": {}
    },
    {
      "expectation_type": "expect_column_values_to_be_of_type",
      "kwargs": {
        "column": "LV2_CUS_COD",
        "type_": "str"
      },
      "meta": {}
    },
    {
      "expectation_type": "expect_column_values_to_be_of_type",
      "kwargs": {
        "column": "CUS_LV2_DSC",
        "type_": "str"
      },
      "meta": {}
    },
    {
      "expectation_type": "expect_column_pair_map_values_to_have_nto1_relationship",
      "kwargs": {
        "column_A": "LV2_CUS_COD",
        "column_B": "CUS_LV2_DSC"
      },
      "meta": {}
    },
    {
      "expectation_type": "expect_column_values_to_be_of_type",
      "kwargs": {
        "column": "LV1_CUS_COD",
        "type_": "str"
      },
      "meta": {}
    },
    {
      "expectation_type": "expect_column_values_to_be_of_type",
      "kwargs": {
        "column": "CUS_LV1_DSC",
        "type_": "str"
      },
      "meta": {}
    },
    {
      "expectation_type": "expect_column_pair_map_values_to_have_nto1_relationship",
      "kwargs": {
        "column_A": "LV1_CUS_COD",
        "column_B": "CUS_LV1_DSC"
      },
      "meta": {}
    }
  ]
}
