{
    "object_type": "koalas",
    "partitioned_on": ["mat_cod"],
    "method": "non-propagative",
    "scheduler": "spark",
    "models": [
        {
            "id": "",
            "name": "day_0",
            "type": "XGBoost",
            "parameters": {
                "n_jobs": -1,
                "max_depth": 5,
                "objective": "reg:squarederror",
                "subsample": 0.8,
                "n_estimators": 200,
                "learning_rate": 0.05,
                "min_split_loss": 0
            },
            "prediction_steps": [
                0
            ],
            "specific_features": [
                "adjusted_units_minus_1",
                "adjusted_units_minus_2",
                "adjusted_units_minus_3",
                "adjusted_units_minus_4",
                "adjusted_units_minus_5",
                "adjusted_units_minus_6",
                "adjusted_units_minus_7",
                "adjusted_units_minus_14",
                "adjusted_units_minus_21",
                "service_level_minus_1",
                "service_level_minus_2",
                "service_level_minus_3",
                "service_level_minus_4",
                "service_level_minus_5",
                "service_level_minus_6",
                "service_level_minus_7",
                "adjusted_units_diff_minus_1_and_8",
                "mat_umbrella_cod_adjusted_units_sum_with_diff_minus_1",
                "mat_prodbrand_cod_adjusted_units_sum_with_diff_minus_1",
                "rolling_mean_mat_umbrella_cod_adjusted_units_sum_with_diff_minus_1_to_7",
                "rolling_mean_mat_prodbrand_cod_adjusted_units_sum_with_diff_minus_1_to_7",
                "rolling_mean_adjusted_units_minus_1_to_7",
                "rolling_mean_adjusted_units_minus_1_to_28",
                "rolling_mean_adjusted_units_minus_0_to_5_1_week_before_old_promo_high",
                "rolling_mean_adjusted_units_minus_0_to_5_1_week_before_new_promo_high",
                "rolling_mean_adjusted_units_minus_0_to_5_1_week_before_old_promo_low",
                "rolling_mean_adjusted_units_minus_0_to_5_1_week_before_new_promo_low",
                "rolling_mean_adjusted_units_minus_0_to_12_1_week_before_old_promo_high",
                "rolling_mean_adjusted_units_minus_0_to_12_1_week_before_new_promo_high",
                "rolling_mean_adjusted_units_minus_0_to_12_1_week_before_old_promo_low",
                "rolling_mean_adjusted_units_minus_0_to_12_1_week_before_new_promo_low",
                "rolling_mean_adjusted_units_minus_0_to_12_2_week_before_old_promo_high",
                "rolling_mean_adjusted_units_minus_0_to_12_2_week_before_new_promo_high",
                "rolling_mean_adjusted_units_minus_0_to_12_2_week_before_old_promo_low",
                "rolling_mean_adjusted_units_minus_0_to_12_2_week_before_new_promo_low",
                "rolling_mean_adjusted_units_minus_0_to_5_2_week_before_old_promo_high",
                "rolling_mean_adjusted_units_minus_0_to_5_2_week_before_new_promo_high",
                "rolling_mean_adjusted_units_minus_0_to_5_2_week_before_old_promo_low",
                "rolling_mean_adjusted_units_minus_0_to_5_2_week_before_new_promo_low"
            ]
        },
        {
            "id": "",
            "name": "day_1",
            "type": "XGBoost",
            "parameters": {
                "n_jobs": -1,
                "max_depth": 5,
                "objective": "reg:squarederror",
                "subsample": 0.8,
                "n_estimators": 200,
                "learning_rate": 0.05,
                "min_split_loss": 0
            },
            "prediction_steps": [
                1
            ],
            "specific_features": [
                "adjusted_units_minus_2",
                "adjusted_units_minus_3",
                "adjusted_units_minus_4",
                "adjusted_units_minus_5",
                "adjusted_units_minus_6",
                "adjusted_units_minus_7",
                "adjusted_units_minus_8",
                "adjusted_units_minus_14",
                "adjusted_units_minus_21",
                "service_level_minus_2",
                "service_level_minus_3",
                "service_level_minus_4",
                "service_level_minus_5",
                "service_level_minus_6",
                "service_level_minus_7",
                "service_level_minus_8",
                "adjusted_units_diff_minus_2_and_9",
                "mat_umbrella_cod_adjusted_units_sum_with_diff_minus_2",
                "mat_prodbrand_cod_adjusted_units_sum_with_diff_minus_2",
                "rolling_mean_mat_umbrella_cod_adjusted_units_sum_with_diff_minus_2_to_8",
                "rolling_mean_mat_prodbrand_cod_adjusted_units_sum_with_diff_minus_2_to_8",
                "rolling_mean_adjusted_units_minus_2_to_8",
                "rolling_mean_adjusted_units_minus_2_to_29",
                "rolling_mean_adjusted_units_minus_0_to_5_1_week_before_old_promo_high",
                "rolling_mean_adjusted_units_minus_0_to_5_1_week_before_new_promo_high",
                "rolling_mean_adjusted_units_minus_0_to_5_1_week_before_old_promo_low",
                "rolling_mean_adjusted_units_minus_0_to_5_1_week_before_new_promo_low",
                "rolling_mean_adjusted_units_minus_0_to_12_1_week_before_old_promo_high",
                "rolling_mean_adjusted_units_minus_0_to_12_1_week_before_new_promo_high",
                "rolling_mean_adjusted_units_minus_0_to_12_1_week_before_old_promo_low",
                "rolling_mean_adjusted_units_minus_0_to_12_1_week_before_new_promo_low",
                "rolling_mean_adjusted_units_minus_0_to_12_2_week_before_old_promo_high",
                "rolling_mean_adjusted_units_minus_0_to_12_2_week_before_new_promo_high",
                "rolling_mean_adjusted_units_minus_0_to_12_2_week_before_old_promo_low",
                "rolling_mean_adjusted_units_minus_0_to_12_2_week_before_new_promo_low",
                "rolling_mean_adjusted_units_minus_0_to_5_2_week_before_old_promo_high",
                "rolling_mean_adjusted_units_minus_0_to_5_2_week_before_new_promo_high",
                "rolling_mean_adjusted_units_minus_0_to_5_2_week_before_old_promo_low",
                "rolling_mean_adjusted_units_minus_0_to_5_2_week_before_new_promo_low"
            ]
        },
        {
            "id": "",
            "name": "day_2",
            "type": "XGBoost",
            "parameters": {
                "n_jobs": -1,
                "max_depth": 5,
                "objective": "reg:squarederror",
                "subsample": 0.8,
                "n_estimators": 200,
                "learning_rate": 0.05,
                "min_split_loss": 0
            },
            "prediction_steps": [
                2
            ],
            "specific_features": [
                "adjusted_units_minus_3",
                "adjusted_units_minus_4",
                "adjusted_units_minus_5",
                "adjusted_units_minus_6",
                "adjusted_units_minus_7",
                "adjusted_units_minus_8",
                "adjusted_units_minus_9",
                "adjusted_units_minus_14",
                "adjusted_units_minus_21",
                "service_level_minus_3",
                "service_level_minus_4",
                "service_level_minus_5",
                "service_level_minus_6",
                "service_level_minus_7",
                "service_level_minus_8",
                "service_level_minus_9",
                "adjusted_units_diff_minus_3_and_10",
                "mat_umbrella_cod_adjusted_units_sum_with_diff_minus_3",
                "mat_prodbrand_cod_adjusted_units_sum_with_diff_minus_3",
                "rolling_mean_mat_umbrella_cod_adjusted_units_sum_with_diff_minus_3_to_9",
                "rolling_mean_mat_prodbrand_cod_adjusted_units_sum_with_diff_minus_3_to_9",
                "rolling_mean_adjusted_units_minus_3_to_9",
                "rolling_mean_adjusted_units_minus_3_to_30",
                "rolling_mean_adjusted_units_minus_0_to_5_1_week_before_old_promo_high",
                "rolling_mean_adjusted_units_minus_0_to_5_1_week_before_new_promo_high",
                "rolling_mean_adjusted_units_minus_0_to_5_1_week_before_old_promo_low",
                "rolling_mean_adjusted_units_minus_0_to_5_1_week_before_new_promo_low",
                "rolling_mean_adjusted_units_minus_0_to_12_1_week_before_old_promo_high",
                "rolling_mean_adjusted_units_minus_0_to_12_1_week_before_new_promo_high",
                "rolling_mean_adjusted_units_minus_0_to_12_1_week_before_old_promo_low",
                "rolling_mean_adjusted_units_minus_0_to_12_1_week_before_new_promo_low",
                "rolling_mean_adjusted_units_minus_0_to_12_2_week_before_old_promo_high",
                "rolling_mean_adjusted_units_minus_0_to_12_2_week_before_new_promo_high",
                "rolling_mean_adjusted_units_minus_0_to_12_2_week_before_old_promo_low",
                "rolling_mean_adjusted_units_minus_0_to_12_2_week_before_new_promo_low",
                "rolling_mean_adjusted_units_minus_0_to_5_2_week_before_old_promo_high",
                "rolling_mean_adjusted_units_minus_0_to_5_2_week_before_new_promo_high",
                "rolling_mean_adjusted_units_minus_0_to_5_2_week_before_old_promo_low",
                "rolling_mean_adjusted_units_minus_0_to_5_2_week_before_new_promo_low"
            ]
        },
        {
            "id": "",
            "name": "day_3",
            "type": "XGBoost",
            "parameters": {
                "n_jobs": -1,
                "max_depth": 5,
                "objective": "reg:squarederror",
                "subsample": 0.8,
                "n_estimators": 200,
                "learning_rate": 0.05,
                "min_split_loss": 0
            },
            "prediction_steps": [
                3
            ],
            "specific_features": [
                "adjusted_units_minus_4",
                "adjusted_units_minus_5",
                "adjusted_units_minus_6",
                "adjusted_units_minus_7",
                "adjusted_units_minus_8",
                "adjusted_units_minus_9",
                "adjusted_units_minus_10",
                "adjusted_units_minus_14",
                "adjusted_units_minus_21",
                "service_level_minus_4",
                "service_level_minus_5",
                "service_level_minus_6",
                "service_level_minus_7",
                "service_level_minus_8",
                "service_level_minus_9",
                "service_level_minus_10",
                "adjusted_units_diff_minus_4_and_11",
                "mat_umbrella_cod_adjusted_units_sum_with_diff_minus_4",
                "mat_prodbrand_cod_adjusted_units_sum_with_diff_minus_4",
                "rolling_mean_mat_umbrella_cod_adjusted_units_sum_with_diff_minus_4_to_10",
                "rolling_mean_mat_prodbrand_cod_adjusted_units_sum_with_diff_minus_4_to_10",
                "rolling_mean_adjusted_units_minus_4_to_10",
                "rolling_mean_adjusted_units_minus_4_to_31",
                "rolling_mean_adjusted_units_minus_0_to_5_1_week_before_old_promo_high",
                "rolling_mean_adjusted_units_minus_0_to_5_1_week_before_new_promo_high",
                "rolling_mean_adjusted_units_minus_0_to_5_1_week_before_old_promo_low",
                "rolling_mean_adjusted_units_minus_0_to_5_1_week_before_new_promo_low",
                "rolling_mean_adjusted_units_minus_0_to_12_1_week_before_old_promo_high",
                "rolling_mean_adjusted_units_minus_0_to_12_1_week_before_new_promo_high",
                "rolling_mean_adjusted_units_minus_0_to_12_1_week_before_old_promo_low",
                "rolling_mean_adjusted_units_minus_0_to_12_1_week_before_new_promo_low",
                "rolling_mean_adjusted_units_minus_0_to_12_2_week_before_old_promo_high",
                "rolling_mean_adjusted_units_minus_0_to_12_2_week_before_new_promo_high",
                "rolling_mean_adjusted_units_minus_0_to_12_2_week_before_old_promo_low",
                "rolling_mean_adjusted_units_minus_0_to_12_2_week_before_new_promo_low",
                "rolling_mean_adjusted_units_minus_0_to_5_2_week_before_old_promo_high",
                "rolling_mean_adjusted_units_minus_0_to_5_2_week_before_new_promo_high",
                "rolling_mean_adjusted_units_minus_0_to_5_2_week_before_old_promo_low",
                "rolling_mean_adjusted_units_minus_0_to_5_2_week_before_new_promo_low"
            ]
        },
        {
            "id": "",
            "name": "day_4",
            "type": "XGBoost",
            "parameters": {
                "n_jobs": -1,
                "max_depth": 5,
                "objective": "reg:squarederror",
                "subsample": 0.8,
                "n_estimators": 200,
                "learning_rate": 0.05,
                "min_split_loss": 0
            },
            "prediction_steps": [
                4
            ],
            "specific_features": [
                "adjusted_units_minus_5",
                "adjusted_units_minus_6",
                "adjusted_units_minus_7",
                "adjusted_units_minus_8",
                "adjusted_units_minus_9",
                "adjusted_units_minus_10",
                "adjusted_units_minus_11",
                "adjusted_units_minus_14",
                "adjusted_units_minus_21",
                "service_level_minus_5",
                "service_level_minus_6",
                "service_level_minus_7",
                "service_level_minus_8",
                "service_level_minus_9",
                "service_level_minus_10",
                "service_level_minus_11",
                "adjusted_units_diff_minus_5_and_12",
                "mat_umbrella_cod_adjusted_units_sum_with_diff_minus_5",
                "mat_prodbrand_cod_adjusted_units_sum_with_diff_minus_5",
                "rolling_mean_mat_umbrella_cod_adjusted_units_sum_with_diff_minus_5_to_11",
                "rolling_mean_mat_prodbrand_cod_adjusted_units_sum_with_diff_minus_5_to_11",
                "rolling_mean_adjusted_units_minus_5_to_11",
                "rolling_mean_adjusted_units_minus_5_to_32",
                "rolling_mean_adjusted_units_minus_0_to_5_1_week_before_old_promo_high",
                "rolling_mean_adjusted_units_minus_0_to_5_1_week_before_new_promo_high",
                "rolling_mean_adjusted_units_minus_0_to_5_1_week_before_old_promo_low",
                "rolling_mean_adjusted_units_minus_0_to_5_1_week_before_new_promo_low",
                "rolling_mean_adjusted_units_minus_0_to_12_1_week_before_old_promo_high",
                "rolling_mean_adjusted_units_minus_0_to_12_1_week_before_new_promo_high",
                "rolling_mean_adjusted_units_minus_0_to_12_1_week_before_old_promo_low",
                "rolling_mean_adjusted_units_minus_0_to_12_1_week_before_new_promo_low",
                "rolling_mean_adjusted_units_minus_0_to_12_2_week_before_old_promo_high",
                "rolling_mean_adjusted_units_minus_0_to_12_2_week_before_new_promo_high",
                "rolling_mean_adjusted_units_minus_0_to_12_2_week_before_old_promo_low",
                "rolling_mean_adjusted_units_minus_0_to_12_2_week_before_new_promo_low",
                "rolling_mean_adjusted_units_minus_0_to_5_2_week_before_old_promo_high",
                "rolling_mean_adjusted_units_minus_0_to_5_2_week_before_new_promo_high",
                "rolling_mean_adjusted_units_minus_0_to_5_2_week_before_old_promo_low",
                "rolling_mean_adjusted_units_minus_0_to_5_2_week_before_new_promo_low"
            ]
        },
        {
            "id": "",
            "name": "day_5",
            "type": "XGBoost",
            "parameters": {
                "n_jobs": -1,
                "max_depth": 5,
                "objective": "reg:squarederror",
                "subsample": 0.8,
                "n_estimators": 200,
                "learning_rate": 0.05,
                "min_split_loss": 0
            },
            "prediction_steps": [
                5
            ],
            "specific_features": [
                "adjusted_units_minus_6",
                "adjusted_units_minus_7",
                "adjusted_units_minus_8",
                "adjusted_units_minus_9",
                "adjusted_units_minus_10",
                "adjusted_units_minus_11",
                "adjusted_units_minus_12",
                "adjusted_units_minus_14",
                "adjusted_units_minus_21",
                "service_level_minus_6",
                "service_level_minus_7",
                "service_level_minus_8",
                "service_level_minus_9",
                "service_level_minus_10",
                "service_level_minus_11",
                "service_level_minus_12",
                "adjusted_units_diff_minus_6_and_13",
                "mat_umbrella_cod_adjusted_units_sum_with_diff_minus_6",
                "mat_prodbrand_cod_adjusted_units_sum_with_diff_minus_6",
                "rolling_mean_mat_umbrella_cod_adjusted_units_sum_with_diff_minus_6_to_12",
                "rolling_mean_mat_prodbrand_cod_adjusted_units_sum_with_diff_minus_6_to_12",
                "rolling_mean_adjusted_units_minus_6_to_12",
                "rolling_mean_adjusted_units_minus_6_to_33",
                "rolling_mean_adjusted_units_minus_0_to_5_1_week_before_old_promo_high",
                "rolling_mean_adjusted_units_minus_0_to_5_1_week_before_new_promo_high",
                "rolling_mean_adjusted_units_minus_0_to_5_1_week_before_old_promo_low",
                "rolling_mean_adjusted_units_minus_0_to_5_1_week_before_new_promo_low",
                "rolling_mean_adjusted_units_minus_0_to_12_1_week_before_old_promo_high",
                "rolling_mean_adjusted_units_minus_0_to_12_1_week_before_new_promo_high",
                "rolling_mean_adjusted_units_minus_0_to_12_1_week_before_old_promo_low",
                "rolling_mean_adjusted_units_minus_0_to_12_1_week_before_new_promo_low",
                "rolling_mean_adjusted_units_minus_0_to_12_2_week_before_old_promo_high",
                "rolling_mean_adjusted_units_minus_0_to_12_2_week_before_new_promo_high",
                "rolling_mean_adjusted_units_minus_0_to_12_2_week_before_old_promo_low",
                "rolling_mean_adjusted_units_minus_0_to_12_2_week_before_new_promo_low",
                "rolling_mean_adjusted_units_minus_0_to_5_2_week_before_old_promo_high",
                "rolling_mean_adjusted_units_minus_0_to_5_2_week_before_new_promo_high",
                "rolling_mean_adjusted_units_minus_0_to_5_2_week_before_old_promo_low",
                "rolling_mean_adjusted_units_minus_0_to_5_2_week_before_new_promo_low"
            ]
        },
        {
            "id": "",
            "name": "day_6",
            "type": "XGBoost",
            "parameters": {
                "n_jobs": -1,
                "max_depth": 5,
                "objective": "reg:squarederror",
                "subsample": 0.8,
                "n_estimators": 200,
                "learning_rate": 0.05,
                "min_split_loss": 0
            },
            "prediction_steps": [
                6
            ],
            "specific_features": [
                "adjusted_units_minus_7",
                "adjusted_units_minus_8",
                "adjusted_units_minus_9",
                "adjusted_units_minus_10",
                "adjusted_units_minus_11",
                "adjusted_units_minus_12",
                "adjusted_units_minus_13",
                "adjusted_units_minus_14",
                "adjusted_units_minus_21",
                "service_level_minus_7",
                "service_level_minus_8",
                "service_level_minus_9",
                "service_level_minus_10",
                "service_level_minus_11",
                "service_level_minus_12",
                "service_level_minus_13",
                "adjusted_units_diff_minus_7_and_14",
                "mat_umbrella_cod_adjusted_units_sum_with_diff_minus_7",
                "mat_prodbrand_cod_adjusted_units_sum_with_diff_minus_7",
                "rolling_mean_mat_umbrella_cod_adjusted_units_sum_with_diff_minus_7_to_13",
                "rolling_mean_mat_prodbrand_cod_adjusted_units_sum_with_diff_minus_7_to_13",
                "rolling_mean_adjusted_units_minus_7_to_13",
                "rolling_mean_adjusted_units_minus_7_to_34",
                "rolling_mean_adjusted_units_minus_0_to_5_1_week_before_old_promo_high",
                "rolling_mean_adjusted_units_minus_0_to_5_1_week_before_new_promo_high",
                "rolling_mean_adjusted_units_minus_0_to_5_1_week_before_old_promo_low",
                "rolling_mean_adjusted_units_minus_0_to_5_1_week_before_new_promo_low",
                "rolling_mean_adjusted_units_minus_0_to_12_1_week_before_old_promo_high",
                "rolling_mean_adjusted_units_minus_0_to_12_1_week_before_new_promo_high",
                "rolling_mean_adjusted_units_minus_0_to_12_1_week_before_old_promo_low",
                "rolling_mean_adjusted_units_minus_0_to_12_1_week_before_new_promo_low",
                "rolling_mean_adjusted_units_minus_0_to_12_2_week_before_old_promo_high",
                "rolling_mean_adjusted_units_minus_0_to_12_2_week_before_new_promo_high",
                "rolling_mean_adjusted_units_minus_0_to_12_2_week_before_old_promo_low",
                "rolling_mean_adjusted_units_minus_0_to_12_2_week_before_new_promo_low",
                "rolling_mean_adjusted_units_minus_0_to_5_2_week_before_old_promo_high",
                "rolling_mean_adjusted_units_minus_0_to_5_2_week_before_new_promo_high",
                "rolling_mean_adjusted_units_minus_0_to_5_2_week_before_old_promo_low",
                "rolling_mean_adjusted_units_minus_0_to_5_2_week_before_new_promo_low"
            ]
        },
        {
            "id": "",
            "name": "day_7",
            "type": "XGBoost",
            "parameters": {
                "n_jobs": -1,
                "max_depth": 5,
                "objective": "reg:squarederror",
                "subsample": 0.8,
                "n_estimators": 200,
                "learning_rate": 0.05,
                "min_split_loss": 0
            },
            "prediction_steps": [
                7
            ],
            "specific_features": [
                "adjusted_units_minus_8",
                "adjusted_units_minus_9",
                "adjusted_units_minus_10",
                "adjusted_units_minus_11",
                "adjusted_units_minus_12",
                "adjusted_units_minus_13",
                "adjusted_units_minus_14",
                "adjusted_units_minus_21",
                "adjusted_units_minus_28",
                "service_level_minus_8",
                "service_level_minus_9",
                "service_level_minus_10",
                "service_level_minus_11",
                "service_level_minus_12",
                "service_level_minus_13",
                "service_level_minus_14",
                "adjusted_units_diff_minus_8_and_15",
                "mat_umbrella_cod_adjusted_units_sum_with_diff_minus_8",
                "mat_prodbrand_cod_adjusted_units_sum_with_diff_minus_8",
                "rolling_mean_mat_umbrella_cod_adjusted_units_sum_with_diff_minus_8_to_14",
                "rolling_mean_mat_prodbrand_cod_adjusted_units_sum_with_diff_minus_8_to_14",
                "rolling_mean_adjusted_units_minus_8_to_14",
                "rolling_mean_adjusted_units_minus_8_to_35",
                "rolling_mean_adjusted_units_minus_0_to_5_2_week_before_old_promo_high",
                "rolling_mean_adjusted_units_minus_0_to_5_2_week_before_new_promo_high",
                "rolling_mean_adjusted_units_minus_0_to_5_2_week_before_old_promo_low",
                "rolling_mean_adjusted_units_minus_0_to_5_2_week_before_new_promo_low",
                "rolling_mean_adjusted_units_minus_0_to_12_2_week_before_old_promo_high",
                "rolling_mean_adjusted_units_minus_0_to_12_2_week_before_new_promo_high",
                "rolling_mean_adjusted_units_minus_0_to_12_2_week_before_old_promo_low",
                "rolling_mean_adjusted_units_minus_0_to_12_2_week_before_new_promo_low",
                "rolling_mean_adjusted_units_minus_0_to_12_3_week_before_old_promo_high",
                "rolling_mean_adjusted_units_minus_0_to_12_3_week_before_new_promo_high",
                "rolling_mean_adjusted_units_minus_0_to_12_3_week_before_old_promo_low",
                "rolling_mean_adjusted_units_minus_0_to_12_3_week_before_new_promo_low",
                "rolling_mean_adjusted_units_minus_0_to_5_3_week_before_old_promo_high",
                "rolling_mean_adjusted_units_minus_0_to_5_3_week_before_new_promo_high",
                "rolling_mean_adjusted_units_minus_0_to_5_3_week_before_old_promo_low",
                "rolling_mean_adjusted_units_minus_0_to_5_3_week_before_new_promo_low"
            ]
        },
        {
            "id": "",
            "name": "day_8",
            "type": "XGBoost",
            "parameters": {
                "n_jobs": -1,
                "max_depth": 5,
                "objective": "reg:squarederror",
                "subsample": 0.8,
                "n_estimators": 200,
                "learning_rate": 0.05,
                "min_split_loss": 0
            },
            "prediction_steps": [
                8
            ],
            "specific_features": [
                "adjusted_units_minus_9",
                "adjusted_units_minus_10",
                "adjusted_units_minus_11",
                "adjusted_units_minus_12",
                "adjusted_units_minus_13",
                "adjusted_units_minus_14",
                "adjusted_units_minus_15",
                "adjusted_units_minus_21",
                "adjusted_units_minus_28",
                "service_level_minus_9",
                "service_level_minus_10",
                "service_level_minus_11",
                "service_level_minus_12",
                "service_level_minus_13",
                "service_level_minus_14",
                "service_level_minus_15",
                "adjusted_units_diff_minus_9_and_16",
                "mat_umbrella_cod_adjusted_units_sum_with_diff_minus_9",
                "mat_prodbrand_cod_adjusted_units_sum_with_diff_minus_9",
                "rolling_mean_mat_umbrella_cod_adjusted_units_sum_with_diff_minus_9_to_15",
                "rolling_mean_mat_prodbrand_cod_adjusted_units_sum_with_diff_minus_9_to_15",
                "rolling_mean_adjusted_units_minus_9_to_15",
                "rolling_mean_adjusted_units_minus_9_to_36",
                "rolling_mean_adjusted_units_minus_0_to_5_2_week_before_old_promo_high",
                "rolling_mean_adjusted_units_minus_0_to_5_2_week_before_new_promo_high",
                "rolling_mean_adjusted_units_minus_0_to_5_2_week_before_old_promo_low",
                "rolling_mean_adjusted_units_minus_0_to_5_2_week_before_new_promo_low",
                "rolling_mean_adjusted_units_minus_0_to_12_2_week_before_old_promo_high",
                "rolling_mean_adjusted_units_minus_0_to_12_2_week_before_new_promo_high",
                "rolling_mean_adjusted_units_minus_0_to_12_2_week_before_old_promo_low",
                "rolling_mean_adjusted_units_minus_0_to_12_2_week_before_new_promo_low",
                "rolling_mean_adjusted_units_minus_0_to_12_3_week_before_old_promo_high",
                "rolling_mean_adjusted_units_minus_0_to_12_3_week_before_new_promo_high",
                "rolling_mean_adjusted_units_minus_0_to_12_3_week_before_old_promo_low",
                "rolling_mean_adjusted_units_minus_0_to_12_3_week_before_new_promo_low",
                "rolling_mean_adjusted_units_minus_0_to_5_3_week_before_old_promo_high",
                "rolling_mean_adjusted_units_minus_0_to_5_3_week_before_new_promo_high",
                "rolling_mean_adjusted_units_minus_0_to_5_3_week_before_old_promo_low",
                "rolling_mean_adjusted_units_minus_0_to_5_3_week_before_new_promo_low"
            ]
        },
        {
            "id": "",
            "name": "day_9",
            "type": "XGBoost",
            "parameters": {
                "n_jobs": -1,
                "max_depth": 5,
                "objective": "reg:squarederror",
                "subsample": 0.8,
                "n_estimators": 200,
                "learning_rate": 0.05,
                "min_split_loss": 0
            },
            "prediction_steps": [
                9
            ],
            "specific_features": [
                "adjusted_units_minus_10",
                "adjusted_units_minus_11",
                "adjusted_units_minus_12",
                "adjusted_units_minus_13",
                "adjusted_units_minus_14",
                "adjusted_units_minus_15",
                "adjusted_units_minus_16",
                "adjusted_units_minus_21",
                "adjusted_units_minus_28",
                "service_level_minus_10",
                "service_level_minus_11",
                "service_level_minus_12",
                "service_level_minus_13",
                "service_level_minus_14",
                "service_level_minus_15",
                "service_level_minus_16",
                "adjusted_units_diff_minus_10_and_17",
                "mat_umbrella_cod_adjusted_units_sum_with_diff_minus_10",
                "mat_prodbrand_cod_adjusted_units_sum_with_diff_minus_10",
                "rolling_mean_mat_umbrella_cod_adjusted_units_sum_with_diff_minus_10_to_16",
                "rolling_mean_mat_prodbrand_cod_adjusted_units_sum_with_diff_minus_10_to_16",
                "rolling_mean_adjusted_units_minus_10_to_16",
                "rolling_mean_adjusted_units_minus_10_to_37",
                "rolling_mean_adjusted_units_minus_0_to_5_2_week_before_old_promo_high",
                "rolling_mean_adjusted_units_minus_0_to_5_2_week_before_new_promo_high",
                "rolling_mean_adjusted_units_minus_0_to_5_2_week_before_old_promo_low",
                "rolling_mean_adjusted_units_minus_0_to_5_2_week_before_new_promo_low",
                "rolling_mean_adjusted_units_minus_0_to_12_2_week_before_old_promo_high",
                "rolling_mean_adjusted_units_minus_0_to_12_2_week_before_new_promo_high",
                "rolling_mean_adjusted_units_minus_0_to_12_2_week_before_old_promo_low",
                "rolling_mean_adjusted_units_minus_0_to_12_2_week_before_new_promo_low",
                "rolling_mean_adjusted_units_minus_0_to_12_3_week_before_old_promo_high",
                "rolling_mean_adjusted_units_minus_0_to_12_3_week_before_new_promo_high",
                "rolling_mean_adjusted_units_minus_0_to_12_3_week_before_old_promo_low",
                "rolling_mean_adjusted_units_minus_0_to_12_3_week_before_new_promo_low",
                "rolling_mean_adjusted_units_minus_0_to_5_3_week_before_old_promo_high",
                "rolling_mean_adjusted_units_minus_0_to_5_3_week_before_new_promo_high",
                "rolling_mean_adjusted_units_minus_0_to_5_3_week_before_old_promo_low",
                "rolling_mean_adjusted_units_minus_0_to_5_3_week_before_new_promo_low"
            ]
        },
        {
            "id": "",
            "name": "day_10",
            "type": "XGBoost",
            "parameters": {
                "n_jobs": -1,
                "max_depth": 5,
                "objective": "reg:squarederror",
                "subsample": 0.8,
                "n_estimators": 200,
                "learning_rate": 0.05,
                "min_split_loss": 0
            },
            "prediction_steps": [
                10
            ],
            "specific_features": [
                "adjusted_units_minus_11",
                "adjusted_units_minus_12",
                "adjusted_units_minus_13",
                "adjusted_units_minus_14",
                "adjusted_units_minus_15",
                "adjusted_units_minus_16",
                "adjusted_units_minus_17",
                "adjusted_units_minus_21",
                "adjusted_units_minus_28",
                "service_level_minus_11",
                "service_level_minus_12",
                "service_level_minus_13",
                "service_level_minus_14",
                "service_level_minus_15",
                "service_level_minus_16",
                "service_level_minus_17",
                "adjusted_units_diff_minus_11_and_18",
                "mat_umbrella_cod_adjusted_units_sum_with_diff_minus_11",
                "mat_prodbrand_cod_adjusted_units_sum_with_diff_minus_11",
                "rolling_mean_mat_umbrella_cod_adjusted_units_sum_with_diff_minus_11_to_17",
                "rolling_mean_mat_prodbrand_cod_adjusted_units_sum_with_diff_minus_11_to_17",
                "rolling_mean_adjusted_units_minus_11_to_17",
                "rolling_mean_adjusted_units_minus_11_to_38",
                "rolling_mean_adjusted_units_minus_0_to_5_2_week_before_old_promo_high",
                "rolling_mean_adjusted_units_minus_0_to_5_2_week_before_new_promo_high",
                "rolling_mean_adjusted_units_minus_0_to_5_2_week_before_old_promo_low",
                "rolling_mean_adjusted_units_minus_0_to_5_2_week_before_new_promo_low",
                "rolling_mean_adjusted_units_minus_0_to_12_2_week_before_old_promo_high",
                "rolling_mean_adjusted_units_minus_0_to_12_2_week_before_new_promo_high",
                "rolling_mean_adjusted_units_minus_0_to_12_2_week_before_old_promo_low",
                "rolling_mean_adjusted_units_minus_0_to_12_2_week_before_new_promo_low",
                "rolling_mean_adjusted_units_minus_0_to_12_3_week_before_old_promo_high",
                "rolling_mean_adjusted_units_minus_0_to_12_3_week_before_new_promo_high",
                "rolling_mean_adjusted_units_minus_0_to_12_3_week_before_old_promo_low",
                "rolling_mean_adjusted_units_minus_0_to_12_3_week_before_new_promo_low",
                "rolling_mean_adjusted_units_minus_0_to_5_3_week_before_old_promo_high",
                "rolling_mean_adjusted_units_minus_0_to_5_3_week_before_new_promo_high",
                "rolling_mean_adjusted_units_minus_0_to_5_3_week_before_old_promo_low",
                "rolling_mean_adjusted_units_minus_0_to_5_3_week_before_new_promo_low"
            ]
        },
        {
            "id": "",
            "name": "day_11",
            "type": "XGBoost",
            "parameters": {
                "n_jobs": -1,
                "max_depth": 5,
                "objective": "reg:squarederror",
                "subsample": 0.8,
                "n_estimators": 200,
                "learning_rate": 0.05,
                "min_split_loss": 0
            },
            "prediction_steps": [
                11
            ],
            "specific_features": [
                "adjusted_units_minus_12",
                "adjusted_units_minus_13",
                "adjusted_units_minus_14",
                "adjusted_units_minus_15",
                "adjusted_units_minus_16",
                "adjusted_units_minus_17",
                "adjusted_units_minus_18",
                "adjusted_units_minus_21",
                "adjusted_units_minus_28",
                "service_level_minus_12",
                "service_level_minus_13",
                "service_level_minus_14",
                "service_level_minus_15",
                "service_level_minus_16",
                "service_level_minus_17",
                "service_level_minus_18",
                "adjusted_units_diff_minus_12_and_19",
                "mat_umbrella_cod_adjusted_units_sum_with_diff_minus_12",
                "mat_prodbrand_cod_adjusted_units_sum_with_diff_minus_12",
                "rolling_mean_mat_umbrella_cod_adjusted_units_sum_with_diff_minus_12_to_18",
                "rolling_mean_mat_prodbrand_cod_adjusted_units_sum_with_diff_minus_12_to_18",
                "rolling_mean_adjusted_units_minus_12_to_18",
                "rolling_mean_adjusted_units_minus_12_to_39",
                "rolling_mean_adjusted_units_minus_0_to_5_2_week_before_old_promo_high",
                "rolling_mean_adjusted_units_minus_0_to_5_2_week_before_new_promo_high",
                "rolling_mean_adjusted_units_minus_0_to_5_2_week_before_old_promo_low",
                "rolling_mean_adjusted_units_minus_0_to_5_2_week_before_new_promo_low",
                "rolling_mean_adjusted_units_minus_0_to_12_2_week_before_old_promo_high",
                "rolling_mean_adjusted_units_minus_0_to_12_2_week_before_new_promo_high",
                "rolling_mean_adjusted_units_minus_0_to_12_2_week_before_old_promo_low",
                "rolling_mean_adjusted_units_minus_0_to_12_2_week_before_new_promo_low",
                "rolling_mean_adjusted_units_minus_0_to_12_3_week_before_old_promo_high",
                "rolling_mean_adjusted_units_minus_0_to_12_3_week_before_new_promo_high",
                "rolling_mean_adjusted_units_minus_0_to_12_3_week_before_old_promo_low",
                "rolling_mean_adjusted_units_minus_0_to_12_3_week_before_new_promo_low",
                "rolling_mean_adjusted_units_minus_0_to_5_3_week_before_old_promo_high",
                "rolling_mean_adjusted_units_minus_0_to_5_3_week_before_new_promo_high",
                "rolling_mean_adjusted_units_minus_0_to_5_3_week_before_old_promo_low",
                "rolling_mean_adjusted_units_minus_0_to_5_3_week_before_new_promo_low"
            ]
        },
        {
            "id": "",
            "name": "day_12",
            "type": "XGBoost",
            "parameters": {
                "n_jobs": -1,
                "max_depth": 5,
                "objective": "reg:squarederror",
                "subsample": 0.8,
                "n_estimators": 200,
                "learning_rate": 0.05,
                "min_split_loss": 0
            },
            "prediction_steps": [
                12
            ],
            "specific_features": [
                "adjusted_units_minus_13",
                "adjusted_units_minus_14",
                "adjusted_units_minus_15",
                "adjusted_units_minus_16",
                "adjusted_units_minus_17",
                "adjusted_units_minus_18",
                "adjusted_units_minus_19",
                "adjusted_units_minus_21",
                "adjusted_units_minus_28",
                "service_level_minus_13",
                "service_level_minus_14",
                "service_level_minus_15",
                "service_level_minus_16",
                "service_level_minus_17",
                "service_level_minus_18",
                "service_level_minus_19",
                "adjusted_units_diff_minus_13_and_20",
                "mat_umbrella_cod_adjusted_units_sum_with_diff_minus_13",
                "mat_prodbrand_cod_adjusted_units_sum_with_diff_minus_13",
                "rolling_mean_mat_umbrella_cod_adjusted_units_sum_with_diff_minus_13_to_19",
                "rolling_mean_mat_prodbrand_cod_adjusted_units_sum_with_diff_minus_13_to_19",
                "rolling_mean_adjusted_units_minus_13_to_19",
                "rolling_mean_adjusted_units_minus_13_to_40",
                "rolling_mean_adjusted_units_minus_0_to_5_2_week_before_old_promo_high",
                "rolling_mean_adjusted_units_minus_0_to_5_2_week_before_new_promo_high",
                "rolling_mean_adjusted_units_minus_0_to_5_2_week_before_old_promo_low",
                "rolling_mean_adjusted_units_minus_0_to_5_2_week_before_new_promo_low",
                "rolling_mean_adjusted_units_minus_0_to_12_2_week_before_old_promo_high",
                "rolling_mean_adjusted_units_minus_0_to_12_2_week_before_new_promo_high",
                "rolling_mean_adjusted_units_minus_0_to_12_2_week_before_old_promo_low",
                "rolling_mean_adjusted_units_minus_0_to_12_2_week_before_new_promo_low",
                "rolling_mean_adjusted_units_minus_0_to_12_3_week_before_old_promo_high",
                "rolling_mean_adjusted_units_minus_0_to_12_3_week_before_new_promo_high",
                "rolling_mean_adjusted_units_minus_0_to_12_3_week_before_old_promo_low",
                "rolling_mean_adjusted_units_minus_0_to_12_3_week_before_new_promo_low",
                "rolling_mean_adjusted_units_minus_0_to_5_3_week_before_old_promo_high",
                "rolling_mean_adjusted_units_minus_0_to_5_3_week_before_new_promo_high",
                "rolling_mean_adjusted_units_minus_0_to_5_3_week_before_old_promo_low",
                "rolling_mean_adjusted_units_minus_0_to_5_3_week_before_new_promo_low"
            ]
        },
        {
            "id": "",
            "name": "day_13",
            "type": "XGBoost",
            "parameters": {
                "n_jobs": -1,
                "max_depth": 5,
                "objective": "reg:squarederror",
                "subsample": 0.8,
                "n_estimators": 200,
                "learning_rate": 0.05,
                "min_split_loss": 0
            },
            "prediction_steps": [
                13
            ],
            "specific_features": [
                "adjusted_units_minus_14",
                "adjusted_units_minus_15",
                "adjusted_units_minus_16",
                "adjusted_units_minus_17",
                "adjusted_units_minus_18",
                "adjusted_units_minus_19",
                "adjusted_units_minus_20",
                "adjusted_units_minus_21",
                "adjusted_units_minus_28",
                "service_level_minus_14",
                "service_level_minus_15",
                "service_level_minus_16",
                "service_level_minus_17",
                "service_level_minus_18",
                "service_level_minus_19",
                "service_level_minus_20",
                "adjusted_units_diff_minus_14_and_21",
                "mat_umbrella_cod_adjusted_units_sum_with_diff_minus_14",
                "mat_prodbrand_cod_adjusted_units_sum_with_diff_minus_14",
                "rolling_mean_mat_umbrella_cod_adjusted_units_sum_with_diff_minus_14_to_20",
                "rolling_mean_mat_prodbrand_cod_adjusted_units_sum_with_diff_minus_14_to_20",
                "rolling_mean_adjusted_units_minus_14_to_20",
                "rolling_mean_adjusted_units_minus_14_to_41",
                "rolling_mean_adjusted_units_minus_0_to_5_2_week_before_old_promo_high",
                "rolling_mean_adjusted_units_minus_0_to_5_2_week_before_new_promo_high",
                "rolling_mean_adjusted_units_minus_0_to_5_2_week_before_old_promo_low",
                "rolling_mean_adjusted_units_minus_0_to_5_2_week_before_new_promo_low",
                "rolling_mean_adjusted_units_minus_0_to_12_2_week_before_old_promo_high",
                "rolling_mean_adjusted_units_minus_0_to_12_2_week_before_new_promo_high",
                "rolling_mean_adjusted_units_minus_0_to_12_2_week_before_old_promo_low",
                "rolling_mean_adjusted_units_minus_0_to_12_2_week_before_new_promo_low",
                "rolling_mean_adjusted_units_minus_0_to_12_3_week_before_old_promo_high",
                "rolling_mean_adjusted_units_minus_0_to_12_3_week_before_new_promo_high",
                "rolling_mean_adjusted_units_minus_0_to_12_3_week_before_old_promo_low",
                "rolling_mean_adjusted_units_minus_0_to_12_3_week_before_new_promo_low",
                "rolling_mean_adjusted_units_minus_0_to_5_3_week_before_old_promo_high",
                "rolling_mean_adjusted_units_minus_0_to_5_3_week_before_new_promo_high",
                "rolling_mean_adjusted_units_minus_0_to_5_3_week_before_old_promo_low",
                "rolling_mean_adjusted_units_minus_0_to_5_3_week_before_new_promo_low"
            ]
        },
        {
            "id": "",
            "name": "day_14",
            "type": "XGBoost",
            "parameters": {
                "n_jobs": -1,
                "max_depth": 5,
                "objective": "reg:squarederror",
                "subsample": 0.8,
                "n_estimators": 200,
                "learning_rate": 0.05,
                "min_split_loss": 0
            },
            "prediction_steps": [
                14
            ],
            "specific_features": [
                "adjusted_units_minus_15",
                "adjusted_units_minus_16",
                "adjusted_units_minus_17",
                "adjusted_units_minus_18",
                "adjusted_units_minus_19",
                "adjusted_units_minus_20",
                "adjusted_units_minus_21",
                "adjusted_units_minus_28",
                "adjusted_units_minus_35",
                "service_level_minus_15",
                "service_level_minus_16",
                "service_level_minus_17",
                "service_level_minus_18",
                "service_level_minus_19",
                "service_level_minus_20",
                "service_level_minus_21",
                "adjusted_units_diff_minus_15_and_22",
                "mat_umbrella_cod_adjusted_units_sum_with_diff_minus_15",
                "mat_prodbrand_cod_adjusted_units_sum_with_diff_minus_15",
                "rolling_mean_mat_umbrella_cod_adjusted_units_sum_with_diff_minus_15_to_21",
                "rolling_mean_mat_prodbrand_cod_adjusted_units_sum_with_diff_minus_15_to_21",
                "rolling_mean_adjusted_units_minus_15_to_21",
                "rolling_mean_adjusted_units_minus_15_to_42",
                "rolling_mean_adjusted_units_minus_0_to_5_3_week_before_old_promo_high",
                "rolling_mean_adjusted_units_minus_0_to_5_3_week_before_new_promo_high",
                "rolling_mean_adjusted_units_minus_0_to_5_3_week_before_old_promo_low",
                "rolling_mean_adjusted_units_minus_0_to_5_3_week_before_new_promo_low",
                "rolling_mean_adjusted_units_minus_0_to_12_3_week_before_old_promo_high",
                "rolling_mean_adjusted_units_minus_0_to_12_3_week_before_new_promo_high",
                "rolling_mean_adjusted_units_minus_0_to_12_3_week_before_old_promo_low",
                "rolling_mean_adjusted_units_minus_0_to_12_3_week_before_new_promo_low",
                "rolling_mean_adjusted_units_minus_0_to_12_4_week_before_old_promo_high",
                "rolling_mean_adjusted_units_minus_0_to_12_4_week_before_new_promo_high",
                "rolling_mean_adjusted_units_minus_0_to_12_4_week_before_old_promo_low",
                "rolling_mean_adjusted_units_minus_0_to_12_4_week_before_new_promo_low",
                "rolling_mean_adjusted_units_minus_0_to_5_4_week_before_old_promo_high",
                "rolling_mean_adjusted_units_minus_0_to_5_4_week_before_new_promo_high",
                "rolling_mean_adjusted_units_minus_0_to_5_4_week_before_old_promo_low",
                "rolling_mean_adjusted_units_minus_0_to_5_4_week_before_new_promo_low"
            ]
        },
        {
            "id": "",
            "name": "day_15",
            "type": "XGBoost",
            "parameters": {
                "n_jobs": -1,
                "max_depth": 5,
                "objective": "reg:squarederror",
                "subsample": 0.8,
                "n_estimators": 200,
                "learning_rate": 0.05,
                "min_split_loss": 0
            },
            "prediction_steps": [
                15
            ],
            "specific_features": [
                "adjusted_units_minus_16",
                "adjusted_units_minus_17",
                "adjusted_units_minus_18",
                "adjusted_units_minus_19",
                "adjusted_units_minus_20",
                "adjusted_units_minus_21",
                "adjusted_units_minus_22",
                "adjusted_units_minus_28",
                "adjusted_units_minus_35",
                "service_level_minus_16",
                "service_level_minus_17",
                "service_level_minus_18",
                "service_level_minus_19",
                "service_level_minus_20",
                "service_level_minus_21",
                "service_level_minus_22",
                "adjusted_units_diff_minus_16_and_23",
                "mat_umbrella_cod_adjusted_units_sum_with_diff_minus_16",
                "mat_prodbrand_cod_adjusted_units_sum_with_diff_minus_16",
                "rolling_mean_mat_umbrella_cod_adjusted_units_sum_with_diff_minus_16_to_22",
                "rolling_mean_mat_prodbrand_cod_adjusted_units_sum_with_diff_minus_16_to_22",
                "rolling_mean_adjusted_units_minus_16_to_22",
                "rolling_mean_adjusted_units_minus_16_to_43",
                "rolling_mean_adjusted_units_minus_0_to_5_3_week_before_old_promo_high",
                "rolling_mean_adjusted_units_minus_0_to_5_3_week_before_new_promo_high",
                "rolling_mean_adjusted_units_minus_0_to_5_3_week_before_old_promo_low",
                "rolling_mean_adjusted_units_minus_0_to_5_3_week_before_new_promo_low",
                "rolling_mean_adjusted_units_minus_0_to_12_3_week_before_old_promo_high",
                "rolling_mean_adjusted_units_minus_0_to_12_3_week_before_new_promo_high",
                "rolling_mean_adjusted_units_minus_0_to_12_3_week_before_old_promo_low",
                "rolling_mean_adjusted_units_minus_0_to_12_3_week_before_new_promo_low",
                "rolling_mean_adjusted_units_minus_0_to_12_4_week_before_old_promo_high",
                "rolling_mean_adjusted_units_minus_0_to_12_4_week_before_new_promo_high",
                "rolling_mean_adjusted_units_minus_0_to_12_4_week_before_old_promo_low",
                "rolling_mean_adjusted_units_minus_0_to_12_4_week_before_new_promo_low",
                "rolling_mean_adjusted_units_minus_0_to_5_4_week_before_old_promo_high",
                "rolling_mean_adjusted_units_minus_0_to_5_4_week_before_new_promo_high",
                "rolling_mean_adjusted_units_minus_0_to_5_4_week_before_old_promo_low",
                "rolling_mean_adjusted_units_minus_0_to_5_4_week_before_new_promo_low"
            ]
        },
        {
            "id": "",
            "name": "day_16",
            "type": "XGBoost",
            "parameters": {
                "n_jobs": -1,
                "max_depth": 5,
                "objective": "reg:squarederror",
                "subsample": 0.8,
                "n_estimators": 200,
                "learning_rate": 0.05,
                "min_split_loss": 0
            },
            "prediction_steps": [
                16
            ],
            "specific_features": [
                "adjusted_units_minus_17",
                "adjusted_units_minus_18",
                "adjusted_units_minus_19",
                "adjusted_units_minus_20",
                "adjusted_units_minus_21",
                "adjusted_units_minus_22",
                "adjusted_units_minus_23",
                "adjusted_units_minus_28",
                "adjusted_units_minus_35",
                "service_level_minus_17",
                "service_level_minus_18",
                "service_level_minus_19",
                "service_level_minus_20",
                "service_level_minus_21",
                "service_level_minus_22",
                "service_level_minus_23",
                "adjusted_units_diff_minus_17_and_24",
                "mat_umbrella_cod_adjusted_units_sum_with_diff_minus_17",
                "mat_prodbrand_cod_adjusted_units_sum_with_diff_minus_17",
                "rolling_mean_mat_umbrella_cod_adjusted_units_sum_with_diff_minus_17_to_23",
                "rolling_mean_mat_prodbrand_cod_adjusted_units_sum_with_diff_minus_17_to_23",
                "rolling_mean_adjusted_units_minus_17_to_23",
                "rolling_mean_adjusted_units_minus_17_to_44",
                "rolling_mean_adjusted_units_minus_0_to_5_3_week_before_old_promo_high",
                "rolling_mean_adjusted_units_minus_0_to_5_3_week_before_new_promo_high",
                "rolling_mean_adjusted_units_minus_0_to_5_3_week_before_old_promo_low",
                "rolling_mean_adjusted_units_minus_0_to_5_3_week_before_new_promo_low",
                "rolling_mean_adjusted_units_minus_0_to_12_3_week_before_old_promo_high",
                "rolling_mean_adjusted_units_minus_0_to_12_3_week_before_new_promo_high",
                "rolling_mean_adjusted_units_minus_0_to_12_3_week_before_old_promo_low",
                "rolling_mean_adjusted_units_minus_0_to_12_3_week_before_new_promo_low",
                "rolling_mean_adjusted_units_minus_0_to_12_4_week_before_old_promo_high",
                "rolling_mean_adjusted_units_minus_0_to_12_4_week_before_new_promo_high",
                "rolling_mean_adjusted_units_minus_0_to_12_4_week_before_old_promo_low",
                "rolling_mean_adjusted_units_minus_0_to_12_4_week_before_new_promo_low",
                "rolling_mean_adjusted_units_minus_0_to_5_4_week_before_old_promo_high",
                "rolling_mean_adjusted_units_minus_0_to_5_4_week_before_new_promo_high",
                "rolling_mean_adjusted_units_minus_0_to_5_4_week_before_old_promo_low",
                "rolling_mean_adjusted_units_minus_0_to_5_4_week_before_new_promo_low"
            ]
        },
        {
            "id": "",
            "name": "day_17",
            "type": "XGBoost",
            "parameters": {
                "n_jobs": -1,
                "max_depth": 5,
                "objective": "reg:squarederror",
                "subsample": 0.8,
                "n_estimators": 200,
                "learning_rate": 0.05,
                "min_split_loss": 0
            },
            "prediction_steps": [
                17
            ],
            "specific_features": [
                "adjusted_units_minus_18",
                "adjusted_units_minus_19",
                "adjusted_units_minus_20",
                "adjusted_units_minus_21",
                "adjusted_units_minus_22",
                "adjusted_units_minus_23",
                "adjusted_units_minus_24",
                "adjusted_units_minus_28",
                "adjusted_units_minus_35",
                "service_level_minus_18",
                "service_level_minus_19",
                "service_level_minus_20",
                "service_level_minus_21",
                "service_level_minus_22",
                "service_level_minus_23",
                "service_level_minus_24",
                "adjusted_units_diff_minus_18_and_25",
                "mat_umbrella_cod_adjusted_units_sum_with_diff_minus_18",
                "mat_prodbrand_cod_adjusted_units_sum_with_diff_minus_18",
                "rolling_mean_mat_umbrella_cod_adjusted_units_sum_with_diff_minus_18_to_24",
                "rolling_mean_mat_prodbrand_cod_adjusted_units_sum_with_diff_minus_18_to_24",
                "rolling_mean_adjusted_units_minus_18_to_24",
                "rolling_mean_adjusted_units_minus_18_to_45",
                "rolling_mean_adjusted_units_minus_0_to_5_3_week_before_old_promo_high",
                "rolling_mean_adjusted_units_minus_0_to_5_3_week_before_new_promo_high",
                "rolling_mean_adjusted_units_minus_0_to_5_3_week_before_old_promo_low",
                "rolling_mean_adjusted_units_minus_0_to_5_3_week_before_new_promo_low",
                "rolling_mean_adjusted_units_minus_0_to_12_3_week_before_old_promo_high",
                "rolling_mean_adjusted_units_minus_0_to_12_3_week_before_new_promo_high",
                "rolling_mean_adjusted_units_minus_0_to_12_3_week_before_old_promo_low",
                "rolling_mean_adjusted_units_minus_0_to_12_3_week_before_new_promo_low",
                "rolling_mean_adjusted_units_minus_0_to_12_4_week_before_old_promo_high",
                "rolling_mean_adjusted_units_minus_0_to_12_4_week_before_new_promo_high",
                "rolling_mean_adjusted_units_minus_0_to_12_4_week_before_old_promo_low",
                "rolling_mean_adjusted_units_minus_0_to_12_4_week_before_new_promo_low",
                "rolling_mean_adjusted_units_minus_0_to_5_4_week_before_old_promo_high",
                "rolling_mean_adjusted_units_minus_0_to_5_4_week_before_new_promo_high",
                "rolling_mean_adjusted_units_minus_0_to_5_4_week_before_old_promo_low",
                "rolling_mean_adjusted_units_minus_0_to_5_4_week_before_new_promo_low"
            ]
        },
        {
            "id": "",
            "name": "day_18",
            "type": "XGBoost",
            "parameters": {
                "n_jobs": -1,
                "max_depth": 5,
                "objective": "reg:squarederror",
                "subsample": 0.8,
                "n_estimators": 200,
                "learning_rate": 0.05,
                "min_split_loss": 0
            },
            "prediction_steps": [
                18
            ],
            "specific_features": [
                "adjusted_units_minus_19",
                "adjusted_units_minus_20",
                "adjusted_units_minus_21",
                "adjusted_units_minus_22",
                "adjusted_units_minus_23",
                "adjusted_units_minus_24",
                "adjusted_units_minus_25",
                "adjusted_units_minus_28",
                "adjusted_units_minus_35",
                "service_level_minus_19",
                "service_level_minus_20",
                "service_level_minus_21",
                "service_level_minus_22",
                "service_level_minus_23",
                "service_level_minus_24",
                "service_level_minus_25",
                "adjusted_units_diff_minus_19_and_26",
                "mat_umbrella_cod_adjusted_units_sum_with_diff_minus_19",
                "mat_prodbrand_cod_adjusted_units_sum_with_diff_minus_19",
                "rolling_mean_mat_umbrella_cod_adjusted_units_sum_with_diff_minus_19_to_25",
                "rolling_mean_mat_prodbrand_cod_adjusted_units_sum_with_diff_minus_19_to_25",
                "rolling_mean_adjusted_units_minus_19_to_25",
                "rolling_mean_adjusted_units_minus_19_to_46",
                "rolling_mean_adjusted_units_minus_0_to_5_3_week_before_old_promo_high",
                "rolling_mean_adjusted_units_minus_0_to_5_3_week_before_new_promo_high",
                "rolling_mean_adjusted_units_minus_0_to_5_3_week_before_old_promo_low",
                "rolling_mean_adjusted_units_minus_0_to_5_3_week_before_new_promo_low",
                "rolling_mean_adjusted_units_minus_0_to_12_3_week_before_old_promo_high",
                "rolling_mean_adjusted_units_minus_0_to_12_3_week_before_new_promo_high",
                "rolling_mean_adjusted_units_minus_0_to_12_3_week_before_old_promo_low",
                "rolling_mean_adjusted_units_minus_0_to_12_3_week_before_new_promo_low",
                "rolling_mean_adjusted_units_minus_0_to_12_4_week_before_old_promo_high",
                "rolling_mean_adjusted_units_minus_0_to_12_4_week_before_new_promo_high",
                "rolling_mean_adjusted_units_minus_0_to_12_4_week_before_old_promo_low",
                "rolling_mean_adjusted_units_minus_0_to_12_4_week_before_new_promo_low",
                "rolling_mean_adjusted_units_minus_0_to_5_4_week_before_old_promo_high",
                "rolling_mean_adjusted_units_minus_0_to_5_4_week_before_new_promo_high",
                "rolling_mean_adjusted_units_minus_0_to_5_4_week_before_old_promo_low",
                "rolling_mean_adjusted_units_minus_0_to_5_4_week_before_new_promo_low"
            ]
        },
        {
            "id": "",
            "name": "day_19",
            "type": "XGBoost",
            "parameters": {
                "n_jobs": -1,
                "max_depth": 5,
                "objective": "reg:squarederror",
                "subsample": 0.8,
                "n_estimators": 200,
                "learning_rate": 0.05,
                "min_split_loss": 0
            },
            "prediction_steps": [
                19
            ],
            "specific_features": [
                "adjusted_units_minus_20",
                "adjusted_units_minus_21",
                "adjusted_units_minus_22",
                "adjusted_units_minus_23",
                "adjusted_units_minus_24",
                "adjusted_units_minus_25",
                "adjusted_units_minus_26",
                "adjusted_units_minus_28",
                "adjusted_units_minus_35",
                "service_level_minus_20",
                "service_level_minus_21",
                "service_level_minus_22",
                "service_level_minus_23",
                "service_level_minus_24",
                "service_level_minus_25",
                "service_level_minus_26",
                "adjusted_units_diff_minus_20_and_27",
                "mat_umbrella_cod_adjusted_units_sum_with_diff_minus_20",
                "mat_prodbrand_cod_adjusted_units_sum_with_diff_minus_20",
                "rolling_mean_mat_umbrella_cod_adjusted_units_sum_with_diff_minus_20_to_26",
                "rolling_mean_mat_prodbrand_cod_adjusted_units_sum_with_diff_minus_20_to_26",
                "rolling_mean_adjusted_units_minus_20_to_26",
                "rolling_mean_adjusted_units_minus_20_to_47",
                "rolling_mean_adjusted_units_minus_0_to_5_3_week_before_old_promo_high",
                "rolling_mean_adjusted_units_minus_0_to_5_3_week_before_new_promo_high",
                "rolling_mean_adjusted_units_minus_0_to_5_3_week_before_old_promo_low",
                "rolling_mean_adjusted_units_minus_0_to_5_3_week_before_new_promo_low",
                "rolling_mean_adjusted_units_minus_0_to_12_3_week_before_old_promo_high",
                "rolling_mean_adjusted_units_minus_0_to_12_3_week_before_new_promo_high",
                "rolling_mean_adjusted_units_minus_0_to_12_3_week_before_old_promo_low",
                "rolling_mean_adjusted_units_minus_0_to_12_3_week_before_new_promo_low",
                "rolling_mean_adjusted_units_minus_0_to_12_4_week_before_old_promo_high",
                "rolling_mean_adjusted_units_minus_0_to_12_4_week_before_new_promo_high",
                "rolling_mean_adjusted_units_minus_0_to_12_4_week_before_old_promo_low",
                "rolling_mean_adjusted_units_minus_0_to_12_4_week_before_new_promo_low",
                "rolling_mean_adjusted_units_minus_0_to_5_4_week_before_old_promo_high",
                "rolling_mean_adjusted_units_minus_0_to_5_4_week_before_new_promo_high",
                "rolling_mean_adjusted_units_minus_0_to_5_4_week_before_old_promo_low",
                "rolling_mean_adjusted_units_minus_0_to_5_4_week_before_new_promo_low"
            ]
        },
        {
            "id": "",
            "name": "day_20",
            "type": "XGBoost",
            "parameters": {
                "n_jobs": -1,
                "max_depth": 5,
                "objective": "reg:squarederror",
                "subsample": 0.8,
                "n_estimators": 200,
                "learning_rate": 0.05,
                "min_split_loss": 0
            },
            "prediction_steps": [
                20
            ],
            "specific_features": [
                "adjusted_units_minus_21",
                "adjusted_units_minus_22",
                "adjusted_units_minus_23",
                "adjusted_units_minus_24",
                "adjusted_units_minus_25",
                "adjusted_units_minus_26",
                "adjusted_units_minus_27",
                "adjusted_units_minus_28",
                "adjusted_units_minus_35",
                "service_level_minus_21",
                "service_level_minus_22",
                "service_level_minus_23",
                "service_level_minus_24",
                "service_level_minus_25",
                "service_level_minus_26",
                "service_level_minus_27",
                "adjusted_units_diff_minus_21_and_28",
                "mat_umbrella_cod_adjusted_units_sum_with_diff_minus_21",
                "mat_prodbrand_cod_adjusted_units_sum_with_diff_minus_21",
                "rolling_mean_mat_umbrella_cod_adjusted_units_sum_with_diff_minus_21_to_27",
                "rolling_mean_mat_prodbrand_cod_adjusted_units_sum_with_diff_minus_21_to_27",
                "rolling_mean_adjusted_units_minus_21_to_27",
                "rolling_mean_adjusted_units_minus_21_to_48",
                "rolling_mean_adjusted_units_minus_0_to_5_3_week_before_old_promo_high",
                "rolling_mean_adjusted_units_minus_0_to_5_3_week_before_new_promo_high",
                "rolling_mean_adjusted_units_minus_0_to_5_3_week_before_old_promo_low",
                "rolling_mean_adjusted_units_minus_0_to_5_3_week_before_new_promo_low",
                "rolling_mean_adjusted_units_minus_0_to_12_3_week_before_old_promo_high",
                "rolling_mean_adjusted_units_minus_0_to_12_3_week_before_new_promo_high",
                "rolling_mean_adjusted_units_minus_0_to_12_3_week_before_old_promo_low",
                "rolling_mean_adjusted_units_minus_0_to_12_3_week_before_new_promo_low",
                "rolling_mean_adjusted_units_minus_0_to_12_4_week_before_old_promo_high",
                "rolling_mean_adjusted_units_minus_0_to_12_4_week_before_new_promo_high",
                "rolling_mean_adjusted_units_minus_0_to_12_4_week_before_old_promo_low",
                "rolling_mean_adjusted_units_minus_0_to_12_4_week_before_new_promo_low",
                "rolling_mean_adjusted_units_minus_0_to_5_4_week_before_old_promo_high",
                "rolling_mean_adjusted_units_minus_0_to_5_4_week_before_new_promo_high",
                "rolling_mean_adjusted_units_minus_0_to_5_4_week_before_old_promo_low",
                "rolling_mean_adjusted_units_minus_0_to_5_4_week_before_new_promo_low"
            ]
        }
    ],
    "target": "adjusted_units",
    "learning": {
        "type": null,
        "parameters": {}
    },
    "train_dates": [
        "2017-02-06"
    ],
    "predict_from_dates": [],
    "common_features": [
        "adjusted_units",
        "warehouse_cod",
        "mat_cod",
        "mat_weight",
        "mat_volume",
        "mat_units",
        "mat_umbrella_cod",
        "mat_prodbrand_cod",
        "adjusted_units_minus_42",
        "adjusted_units_minus_63",
        "adjusted_units_minus_364",
        "is_holiday",
        "is_holiday_minus_1",
        "is_holiday_plus_1",
        "iso_month",
        "iso_week_of_month",
        "iso_week_day",
        "cos_iso_week",
        "sin_iso_week",
        "warehouse_opening",
        "total_uplift"
    ],
    "updating_functions": []
}
