{
  "texto": "Problema 11. Escriu un programa que donat un nombre enter s’imprimeixi la suma de tots els enters fins a arribar a aquest.",
  "inputPublico": "3",
  "outputPublico": 6,
  "inputPrivado": "5",
  "outputPrivado": 15,
  "solucion": false,
  "intentos": 0,
  "listaDeIntentos": ""
}