{
  "texto": "Problema 3. Calcula el area del triangulo",
  "inputPublico": "3(base) y 6(altura)",
  "outputPublico": 9,
  "inputPrivado": "12(base) y 12(altura)",
  "outputPrivado": 72,
  "solucion": false,
  "intentos": 0,
  "listaDeIntentos": ""
}