<svg width="24" height="24" viewBox="0 0 24 24" fill="none" xmlns="http://www.w3.org/2000/svg">
<g clip-path="url(#clip0_1513_2832)">
<rect x="5" y="3" width="15" height="18" rx="3" fill="white"/>
<path d="M12.0395 0C5.40058 0 0 5.39198 0 12.0309C0.657013 27.9918 23.4246 27.9875 24.079 12.0309C24.079 5.39198 18.6784 0 12.0395 0ZM18.2398 11.7299C17.8959 12.0653 17.3541 12.0653 17.0187 11.7299L12.8995 7.61929V19.504C12.884 20.6306 11.1967 20.6392 11.1795 19.504V7.61929L7.06031 11.7385C6.25796 12.5228 5.04541 11.318 5.83916 10.5174L11.4289 4.9362C11.7488 4.61113 12.3302 4.61027 12.6501 4.9362L18.2313 10.5174C18.5752 10.8528 18.5752 11.3945 18.2398 11.7299Z" fill="url(#paint0_linear_1513_2832)"/>
</g>
<defs>
<linearGradient id="paint0_linear_1513_2832" x1="-8.5" y1="4" x2="25.5" y2="22" gradientUnits="userSpaceOnUse">
<stop stop-color="#594DA0"/>
<stop offset="1" stop-color="#9277F7"/>
</linearGradient>
<clipPath id="clip0_1513_2832">
<rect width="24" height="24" rx="12" fill="white"/>
</clipPath>
</defs>
</svg>
