[
  {
    "id": 1,
    "title": "1TB SSD",
    "description": "1TB Solid State Drive",
    "price": 25
  },
  {
    "id": 2,
    "title": "USB Stick (64GB)",
    "description": "64GB USB Stick",
    "price": 5.63
  },
  {
    "id": 3,
    "title": "USB Stick (32GB)",
    "description": "32GB USB Stick",
    "price": 3.52
  }
]
