# animation: num_cycles, first_frame_repeats, animation_file
animation: 3 2 charger/battery_scale

# fail: fail_file
fail: charger/battery_fail

# percent_display: text_percent_pos_x, text_percent_pos_y, color_r, color_g, color_b, color_a, font_file
percent_display: c 1000 255 255 255 255 charger/font

# frame: disp_time min_level max_level
frame:  750 0 0
frame:  750 0 1
frame:  750 0 2
frame:  750 0 3
frame:  750 0 4
frame:  750 0 5
frame:  750 0 6
frame:  750 0 7
frame:  750 0 8
frame:  750 0 9
frame:  750 0 10
frame:  750 0 11
frame:  750 0 12
frame:  750 0 13
frame:  750 0 14
frame:  750 0 15
frame:  750 0 16
frame:  750 0 17
frame:  750 0 18
frame:  750 0 19
frame:  750 0 20
frame:  750 0 21
frame:  750 0 22
frame:  750 0 23
frame:  750 0 24
frame:  750 0 25
frame:  750 0 26
frame:  750 0 27
frame:  750 0 28
frame:  750 0 29
frame:  750 0 30
frame:  750 0 31
frame:  750 0 32
frame:  750 0 33
frame:  750 0 34
frame:  750 0 35
frame:  750 0 36
frame:  750 0 37
frame:  750 0 38
frame:  750 0 39
frame:  750 0 40
frame:  750 0 41
frame:  750 0 42
frame:  750 0 43
frame:  750 0 44
frame:  750 0 45
frame:  750 0 46
frame:  750 0 47
frame:  750 0 48
frame:  750 0 49
frame:  750 0 50
frame:  750 0 51
frame:  750 0 52
frame:  750 0 53
frame:  750 0 54
frame:  750 0 55
frame:  750 0 56
frame:  750 0 57
frame:  750 0 58
frame:  750 0 59
frame:  750 0 60
frame:  750 0 61
frame:  750 0 62
frame:  750 0 63
frame:  750 0 64
frame:  750 0 65
frame:  750 0 66
frame:  750 0 67
frame:  750 0 68
frame:  750 0 69
frame:  750 0 70
frame:  750 0 71
frame:  750 0 72
frame:  750 0 73
frame:  750 0 74
frame:  750 0 75
frame:  750 0 76
frame:  750 0 77
frame:  750 0 78
frame:  750 0 79
frame:  750 0 80
frame:  750 0 81
frame:  750 0 82
frame:  750 0 83
frame:  750 0 84
frame:  750 0 85
frame:  750 0 86
frame:  750 0 87
frame:  750 0 88
frame:  750 0 89
frame:  750 0 90
frame:  750 0 91
frame:  750 0 92
frame:  750 0 93
frame:  750 0 94
frame:  750 0 95
frame:  750 0 96
frame:  750 0 97
frame:  750 0 98
frame:  750 0 99
frame:  750 0 100
