{
  "data": [
    {
      "active": true,
      "createdAt": "2020-10-19T15:26:49.281Z",
      "id": 4,
      "inputSource": "SIM 2",
      "max": 35,
      "metadata": null,
      "min": 10,
      "parameterName": "coba",
      "parameterValue": [
        {
          "id": 3,
          "shift": "shift 3",
          "value": 20,
          "shiftDate": "2020-10-19T00:00:00.000Z"
        }
      ],
      "shift": "shift 3",
      "shiftDate": "2020-10-19T00:00:00.000Z",
      "value": 20,
      "stream": "SAFETY",
      "target": 0,
      "targetRule": ">",
      "unit": "unit",
      "updatedAt": "2020-10-19T15:26:49.281Z"
    }
  ]
}
