<svg width="60" height="60" viewBox="0 0 60 60" fill="none" xmlns="http://www.w3.org/2000/svg">
<path d="M5 22.5V16.25C5 10.025 10.025 5 16.25 5H22.5" stroke="#FCFCFC" stroke-width="1.5" stroke-linecap="round" stroke-linejoin="round"/>
<path d="M37.5 5H43.75C49.975 5 55 10.025 55 16.25V22.5" stroke="#FCFCFC" stroke-width="1.5" stroke-linecap="round" stroke-linejoin="round"/>
<path d="M55 40V43.75C55 49.975 49.975 55 43.75 55H40" stroke="#FCFCFC" stroke-width="1.5" stroke-linecap="round" stroke-linejoin="round"/>
<path d="M22.5 55H16.25C10.025 55 5 49.975 5 43.75V37.5" stroke="#FCFCFC" stroke-width="1.5" stroke-linecap="round" stroke-linejoin="round"/>
<path d="M26.25 17.5V22.5C26.25 25 25 26.25 22.5 26.25H17.5C15 26.25 13.75 25 13.75 22.5V17.5C13.75 15 15 13.75 17.5 13.75H22.5C25 13.75 26.25 15 26.25 17.5Z" stroke="#FCFCFC" stroke-width="1.5" stroke-linecap="round" stroke-linejoin="round"/>
<path d="M46.25 17.5V22.5C46.25 25 45 26.25 42.5 26.25H37.5C35 26.25 33.75 25 33.75 22.5V17.5C33.75 15 35 13.75 37.5 13.75H42.5C45 13.75 46.25 15 46.25 17.5Z" stroke="#FCFCFC" stroke-width="1.5" stroke-linecap="round" stroke-linejoin="round"/>
<path d="M26.25 37.5V42.5C26.25 45 25 46.25 22.5 46.25H17.5C15 46.25 13.75 45 13.75 42.5V37.5C13.75 35 15 33.75 17.5 33.75H22.5C25 33.75 26.25 35 26.25 37.5Z" stroke="#FCFCFC" stroke-width="1.5" stroke-linecap="round" stroke-linejoin="round"/>
<path d="M46.25 37.5V42.5C46.25 45 45 46.25 42.5 46.25H37.5C35 46.25 33.75 45 33.75 42.5V37.5C33.75 35 35 33.75 37.5 33.75H42.5C45 33.75 46.25 35 46.25 37.5Z" stroke="#FCFCFC" stroke-width="1.5" stroke-linecap="round" stroke-linejoin="round"/>
</svg>
