<svg width="60" height="60" viewBox="0 0 60 60" fill="none" xmlns="http://www.w3.org/2000/svg">
<path d="M38.95 29.9998C38.95 34.9498 34.95 38.9498 30 38.9498C25.05 38.9498 21.05 34.9498 21.05 29.9998C21.05 25.0498 25.05 21.0498 30 21.0498C34.95 21.0498 38.95 25.0498 38.95 29.9998Z" stroke="#FCFCFC" stroke-width="1.5" stroke-linecap="round" stroke-linejoin="round"/>
<path d="M30 50.6748C38.825 50.6748 47.05 45.4748 52.775 36.4748C55.025 32.9498 55.025 27.0248 52.775 23.4998C47.05 14.4998 38.825 9.2998 30 9.2998C21.175 9.2998 12.95 14.4998 7.22501 23.4998C4.97501 27.0248 4.97501 32.9498 7.22501 36.4748C12.95 45.4748 21.175 50.6748 30 50.6748Z" stroke="#FCFCFC" stroke-width="1.5" stroke-linecap="round" stroke-linejoin="round"/>
</svg>
