<svg width="60" height="60" viewBox="0 0 60 60" fill="none" xmlns="http://www.w3.org/2000/svg">
<path d="M55 32.5V22.5C55 10 50 5 37.5 5H22.5C10 5 5 10 5 22.5V37.5C5 50 10 55 22.5 55H32.5" stroke="#FCFCFC" stroke-width="1.5" stroke-linecap="round" stroke-linejoin="round"/>
<path d="M18.325 36.2254L24.275 28.5004C25.125 27.4004 26.7 27.2004 27.8 28.0504L32.375 31.6504C33.475 32.5004 35.05 32.3004 35.9 31.2254L41.675 23.7754" stroke="#FCFCFC" stroke-width="1.5" stroke-linecap="round" stroke-linejoin="round"/>
<path d="M48.7 39.5496L49.4 40.9746C49.75 41.6746 50.625 42.3246 51.4 42.4746L52.35 42.6246C55.2 43.0996 55.875 45.1996 53.825 47.2746L52.95 48.1496C52.375 48.7496 52.05 49.8996 52.225 50.6996L52.35 51.2246C53.125 54.6746 51.3 55.9996 48.3 54.1996L47.65 53.8246C46.875 53.3746 45.625 53.3746 44.85 53.8246L44.2 54.1996C41.175 56.0246 39.35 54.6746 40.15 51.2246L40.275 50.6996C40.45 49.8996 40.125 48.7496 39.55 48.1496L38.675 47.2746C36.625 45.1996 37.3 43.0996 40.15 42.6246L41.1 42.4746C41.85 42.3496 42.75 41.6746 43.1 40.9746L43.8 39.5496C45.15 36.8246 47.35 36.8246 48.7 39.5496Z" stroke="#FCFCFC" stroke-width="1.5" stroke-linecap="round" stroke-linejoin="round"/>
</svg>
