<svg width="120" height="32" viewBox="0 0 120 32" fill="none" xmlns="http://www.w3.org/2000/svg">
<g clip-path="url(#clip0_2280_10801)">
<path d="M51.1386 5.14326V8.34349L27.1748 4.59618V0.765271L51.1386 5.14326Z" fill="#5151BC" stroke="#5151BC"/>
<path d="M51.1386 13.2188V16.0647L27.1748 13.1055V9.77725L51.1386 13.2188Z" fill="#5151BC" stroke="#5151BC"/>
<path d="M51.1386 20.9625V23.8986L27.1748 22.3457V18.781L51.1386 20.9625Z" fill="#5151BC" stroke="#5151BC"/>
<path d="M27.1748 31.5V27.7908L51.1386 28.7519V31.5H27.1748Z" fill="#5151BC" stroke="#5151BC"/>
<path fill-rule="evenodd" clip-rule="evenodd" d="M0.16748 16.6304L15.5994 14.7247L15.5992 10.5693L0.16748 12.7856V16.6304Z" fill="#3A3A87"/>
<path fill-rule="evenodd" clip-rule="evenodd" d="M0.167509 24.4321L15.5992 23.4321L15.5995 19.1012L0.16748 20.506L0.167509 24.4321Z" fill="#3A3A87"/>
<path fill-rule="evenodd" clip-rule="evenodd" d="M15.5995 32V27.6527L0.16748 28.2716V32H15.5995Z" fill="#3A3A87"/>
<path fill-rule="evenodd" clip-rule="evenodd" d="M64.5727 17.836H62.8963V6.23838H57.7022V17.836H56.0352V4.82985H64.5727V17.836ZM73.8971 11.836H69.2038V16.4275H74.6716V17.836H67.5367V4.82985H74.5814V6.23838H69.2038V10.4274H73.8971V11.836ZM78.466 12.7506V17.836H76.7989V4.82985H81.0289C82.2605 4.82985 83.2309 5.19268 83.9338 5.91523C84.6398 6.64085 84.9913 7.60425 84.9913 8.80851C84.9913 10.0586 84.6554 11.025 83.9835 11.6988C83.3117 12.3756 82.3662 12.7262 81.147 12.7506H78.466ZM78.466 11.3421H81.0289C81.7691 11.3421 82.3382 11.1256 82.7332 10.6896C83.1251 10.2537 83.3242 9.63172 83.3242 8.82072C83.3242 8.04024 83.122 7.41522 82.7146 6.94571C82.3071 6.47317 81.7473 6.23838 81.0382 6.23838H78.466V11.3421ZM87.1435 17.836V4.82985H90.9256C92.1323 4.82985 93.0436 5.11948 93.6532 5.69878C94.2659 6.275 94.5707 7.14387 94.5707 8.30244C94.5707 8.90916 94.4152 9.44575 94.1042 9.9122C93.7963 10.3787 93.3764 10.7384 92.8477 10.9945C93.4542 11.1713 93.9362 11.5372 94.2908 12.0921C94.6485 12.6439 94.8258 13.3116 94.8258 14.089C94.8258 15.2567 94.4992 16.1714 93.8461 16.836C93.1929 17.5037 92.2598 17.836 91.0531 17.836H87.1435ZM88.8106 11.7811V16.4275H91.0904C91.7218 16.4275 92.2225 16.2263 92.5926 15.8208C92.9628 15.4153 93.1494 14.8452 93.1494 14.1135C93.1494 12.5586 92.4745 11.7811 91.1246 11.7811H88.8106ZM88.8106 10.3726H90.9536C91.5289 10.3726 91.9955 10.1835 92.3501 9.80246C92.7077 9.42133 92.885 8.91524 92.885 8.28414C92.885 7.56766 92.7233 7.04936 92.3998 6.72623C92.0795 6.39997 91.588 6.23838 90.9256 6.23838H88.8106V10.3726ZM99.0743 10.1347H101.755C102.947 10.1409 103.877 10.4823 104.551 11.1592C105.226 11.8329 105.562 12.7659 105.562 13.9488C105.562 15.1409 105.22 16.086 104.539 16.7872C103.855 17.4854 102.909 17.836 101.699 17.836H97.4073V4.82985H99.0743V10.1347ZM108.396 17.836H106.729V4.82985H108.396V17.836ZM99.0743 11.5433V16.4275H101.737C102.418 16.4275 102.943 16.1988 103.323 15.7385C103.699 15.2812 103.886 14.6775 103.886 13.9274C103.886 13.1897 103.699 12.6074 103.326 12.1805C102.953 11.7567 102.424 11.5433 101.746 11.5433H99.0743ZM118.333 4.82985H120V17.836H118.333V7.81463L113.164 17.836H111.487V4.82985H113.164V14.8512L118.333 4.82985ZM118.507 1.57373C118.507 2.29935 118.255 2.88474 117.754 3.3268C117.254 3.76887 116.594 3.9884 115.782 3.9884C114.968 3.9884 114.308 3.76582 113.804 3.32072C113.301 2.87865 113.049 2.29327 113.049 1.57373H114.423C114.423 1.99144 114.538 2.31764 114.769 2.55546C115.002 2.79021 115.338 2.9091 115.782 2.9091C116.205 2.9091 116.538 2.79327 116.778 2.55853C117.02 2.32679 117.139 1.99752 117.139 1.57373H118.507Z" fill="#F9F9F9"/>
<path fill-rule="evenodd" clip-rule="evenodd" d="M62.3484 29.0159H63.368L63.3578 32H62.2649V29.9277H57.1382V32H56.0413L56.0352 29.0159H56.6722C56.951 28.6724 57.1789 28.1573 57.356 27.4665C57.5331 26.7778 57.645 26.0061 57.6918 25.1554L57.8587 21.5082H62.3484V29.0159ZM57.8363 29.0159H61.2514V22.42H58.9211L58.7949 25.1377C58.7481 26.0278 58.6382 26.7955 58.4672 27.4409C58.2963 28.0863 58.0867 28.6113 57.8363 29.0159ZM68.8488 27.7251H65.9161L65.2425 29.9277H64.1211L66.9174 21.5082H67.8536L70.6561 29.9277H69.5347L68.8488 27.7251ZM66.2011 26.8133H68.5701L67.3835 22.9884L66.2011 26.8133ZM76.141 22.42H73.8575V29.9277H72.7667V22.42H70.4892V21.5082H76.141V22.42ZM81.0011 27.7251H78.0684L77.3947 29.9277H76.2733L79.0697 21.5082H80.0059L82.8084 29.9277H81.687L81.0011 27.7251ZM78.3533 26.8133H80.7223L79.5358 22.9884L78.3533 26.8133ZM85.7961 26.7896H83.3335V25.9133H85.7961V26.7896ZM87.0701 21.5082H88.1671V29.0159H91.5598V21.5082H92.6527V28.9922H93.4383L93.3325 31.9526H92.3535V29.9277H87.0701V21.5082ZM98.9843 26.0436H95.9131V29.0159H99.491V29.9277H94.8222V21.5082H99.432V22.42H95.9131V25.1318H98.9843V26.0436ZM106.567 29.9277H105.47V26.0436H101.976V29.9277H100.885V21.5082H101.976V25.1318H105.47V21.5082H106.567V29.9277ZM113.359 22.42H111.075V29.9277H109.985V22.42H107.707V21.5082H113.359V22.42ZM115.73 26.6357V29.9277H114.639V21.5082H117.407C118.213 21.5082 118.848 21.743 119.308 22.2108C119.77 22.6805 120 23.3042 120 24.0838C120 24.8929 119.78 25.5186 119.341 25.9548C118.901 26.3929 118.282 26.6199 117.484 26.6357H115.73ZM115.73 25.7238H117.407C117.891 25.7238 118.264 25.5837 118.522 25.3015C118.779 25.0193 118.909 24.6166 118.909 24.0916C118.909 23.5864 118.777 23.1818 118.51 22.8779C118.243 22.572 117.877 22.42 117.413 22.42H115.73V25.7238Z" fill="#F9F9F9"/>
<path fill-rule="evenodd" clip-rule="evenodd" d="M0.16748 4.72633L25.1313 0.165649V32H20.3654V5.76937L0.16748 8.92775V4.72633Z" fill="#3A3A87"/>
</g>
<defs>
<clipPath id="clip0_2280_10801">
<rect width="120" height="32" fill="white"/>
</clipPath>
</defs>
</svg>
