id;name;num_of_cars
1;mobile Fish;77969
2;Savings Account Dam;9997
3;Trace;33370
4;Metal deposit;5641
5;transmitter Implementation Electronics;99221
6;Money Market Account;61165
7;Grocery Home;52477
8;enable Gorgeous Frozen Pants;23277
9;Licensed Savings Account;38246
10;Planner Canyon;85994
