<svg width="250" height="125" viewBox="0 0 250 125" version="1.1"
	xmlns:dc="http://purl.org/dc/elements/1.1/"
	xmlns:cc="http://creativecommons.org/ns#"
	xmlns:rdf="http://www.w3.org/1999/02/22-rdf-syntax-ns#"
	xmlns:svg="http://www.w3.org/2000/svg"
	xmlns="http://www.w3.org/2000/svg" id="h-o-l-ds">
	<defs>
		<pattern
			xmlns="http://www.w3.org/2000/svg" id="g34r76i4d" patternUnits="userSpaceOnUse" width="15" height="15">
			<line stroke="#cccccc" x1="7.5" y1="0" x2="7.5" y2="15"></line>
			<line stroke="#cccccc" x1="0" y1="7.5" x2="15" y2="7.5"></line>
		</pattern>
	</defs>
	<rect class="Rect" x="2" y="2" width="246" height="121" fill="none" stroke="#c10000" stroke-width="13" id="Rect0" layer="0"></rect>
	<text x="123" y="65.5" fill="#c10000" stroke="none" font-size="44" font-family="Arial" font-style="normal" font-weight="bold" id="Text1" layer="1">
		<tspan dy="13.40" text-anchor="middle">REVOKED</tspan>
	</text>
	<text x="125" y="23" id="Text2" layer="2" fill="#c10000" stroke="none" font-size="11" font-family="Arial" font-style="normal" font-weight="normal">
		<tspan dy="3.24" text-anchor="middle">• • • • • • • D e f e n c e  F i r s t • • • • • • • •</tspan>
	</text>
	<text x="125" y="104" id="Text3" layer="3" fill="#c10000" stroke="none" font-size="11" font-family="Arial" font-style="normal" font-weight="normal">
		<tspan dy="3.24" text-anchor="middle">• • • • • • • D e f e n c e  F i r s t • • • • • • • •</tspan>
	</text>
</svg>