{
  "files": {
    "main.css": "/static/css/main.c70dc7d7.css",
    "main.js": "/static/js/main.3483f06a.js",
    "static/media/logo.svg": "/static/media/logo.88b96657917d8cad8bf5097ac5475d1b.svg",
    "static/media/main-image.svg": "/static/media/main-image.767dc9b12e49b042b2b4f4573e12d568.svg",
    "static/media/search-icon.svg": "/static/media/search-icon.c77a50f238257623b5e066b03e852c00.svg",
    "index.html": "/index.html",
    "static/media/arrow.svg": "/static/media/arrow.0e372e6375851ae03ae505c225784b71.svg",
    "main.c70dc7d7.css.map": "/static/css/main.c70dc7d7.css.map",
    "main.3483f06a.js.map": "/static/js/main.3483f06a.js.map"
  },
  "entrypoints": [
    "static/css/main.c70dc7d7.css",
    "static/js/main.3483f06a.js"
  ]
}