<?xml version="1.0" ?><svg style="enable-background:new 0 0 48 48;" version="1.1" viewBox="0 0 48 48" xml:space="preserve" xmlns="http://www.w3.org/2000/svg" xmlns:xlink="http://www.w3.org/1999/xlink"><style type="text/css">
	.st0{display:none;}
	.st1{fill:none;stroke:#303030;stroke-width:0.7;stroke-linecap:round;stroke-linejoin:round;stroke-miterlimit:10;}
	.st2{fill:#303030;}
</style><g class="st0" id="Padding__x26__Artboard"/><g id="Icons"><g><path class="st2" d="M25.50959,14.80969c0.33734,0.02512,0.64798,0.02537,0.82457,0.33823    c0.03452,0.06116,0.66671,0.61576,0.65096,0.61577c-0.00348,0-1.72836,0-1.72836,0l-0.35813,0.31142l1.57392,0.94015    c-0.34256,0.09343-1.24693,0.38338-1.24693,0.38338l-0.87197,0.65398L23.775,18.87786l0.84335,0.62283    c0,0,0.98096,0.7474,1.02768,0.77854c0.04671,0.03114,0.24913-0.62283,0.24913-0.62283    c-0.02076-0.50347-0.04152-1.00693-0.06231-1.5104c0.15571,0.05194,0.31143,0.10382,0.46715,0.15573l0.68512-0.06228    c0,0,0.68512,0.52941,0.76297,0.59169c0.07785,0.06228,0.38927,0.73183,0.38927,0.73183    c-0.0095,0.1047-0.08276,0.67691,0.05039,0.69792c0.02584,0.00408,0.0513-0.0075,0.07482-0.01892    c0.23599-0.11462,0.46111-0.24852,0.68667-0.3821c0.10673-0.0632,0.33542-0.26575,0.46493-0.26575    c0.04671,0-0.20242,0.56055-0.23356,0.60726s-0.96539,1.6038-0.96539,1.6038l-0.96539,0.98096l0.28028,0.4827l-0.76297,0.90311    l-0.82526,0.73183c0,0-0.79411,0.18685-0.84083,0.18685s-0.63841,0.14014-0.63841,0.14014s-1.1211-0.109-1.27681,0.4827    c-0.15571,0.59169,0.29585,1.4948,0.35813,1.68165c0.06228,0.18685-0.4827,0.73183-0.52941,0.76297    c-0.04671,0.03114-1.05882-0.52941-1.2301-0.60726s-0.56055-1.33909-0.56055-1.33909l-0.3737-0.35813    c0,0-0.8564-0.63841-0.93425-0.66955s-0.23356-1.2301-0.28344-1.33909s-0.38611-0.45156-0.47953-0.51384    c-0.09342-0.06228-0.14014-1.1211-0.14014-1.1211s0.04671-0.60726,0.35813-1.05882s0.29585-1.2301,0.20242-1.38581    s-0.70398,0.07001-0.70398,0.07001s-0.4722-0.23419-0.51891-0.20305l-0.31586-0.58659c0,0-1.88116-0.13378-1.85002-0.18049    c0,0,2.99656-4.7692,9.21616-4.05559H25.50959z"/><path class="st2" d="M26.39092,26.66179c-0.03303-0.04955,0.16516-0.26425,0.16516-0.26425s1.569-0.23122,1.71765-0.21471    c0.14864,0.01652,0.39638,0.47896,0.39638,0.47896s-0.54502,0.71018-0.7267,0.71018c-0.18167,0-1.13959-0.0991-1.13959-0.0991    L26.39092,26.66179z"/><path class="st2" d="M32.45222,28.19776c0.16006-0.28895-0.89186-0.01652-0.89186-0.01652l-1.22217,0.03303l-1.18914,0.11561    l-1.09004,0.64412l0.26425,0.52851c0,0-0.85882,0.97443-1.02398,1.20565c-0.16516,0.23122-0.71018,0.67715-0.77624,0.75973    c-0.06606,0.08258,0.14864,0.51199,1.00561,0.89185C27.52865,32.35975,30.04017,32.5521,32.45222,28.19776z"/><path class="st2" d="M24.57781,28.3933c-0.04041-0.09093,0.15734-0.36188,0.1888-0.50348s-0.01573-0.56368,0.07867-0.51785    c0.0944,0.04584,0.29894-0.0773,0.50348,0c0.20454,0.0773,0.51921,0.23464,0.58215,0.36051s0.22027,0.40908,0.39334,0.51921    c0.17307,0.11014,0.48775,0.23601,0.47201,0.44054c-0.01573,0.20454,0.23601,0.47201,0.23601,0.47201l0.1888,0.25174    c0,0-0.1888,0.07867-0.37761,0.17307s-0.42479,0.17307-0.45627,0.11014c-0.03148-0.06293-0.17308-0.15734-0.42482-0.34614    s-0.58215-0.36188-0.75522-0.44054S24.64075,28.5349,24.57781,28.3933z"/><path class="st2" d="M30.20608,24.63294c0.23601-0.01573,1.46765-0.0944,1.60925-0.12587    c0.14161-0.03147-0.37761,0.66082-0.40908,0.77095s-0.56641,0.66082-0.56641,0.66082l-0.88109,0.11014L30.20608,24.63294z"/><circle class="st1" cx="24" cy="24" r="10.695"/></g></g></svg>