name="Titles&Additions (MNR)"
version="1.9.0.0"
tags={
	"Translation"
	"Alternative History"
	"Historical"
}
supported_version="1.*.*"
path="C:/Users/nekto/Documents/Paradox Interactive/Crusader Kings III/mod/Titles&AdditionsMNR"
remote_file_id="2427340224"