name="Titles&Additions"
version="1.9.0.3"
tags={
	"Translation"
	"Alternative History"
	"Historical"
}
supported_version="1.12.*"
path="C:/Users/nekto/Documents/Paradox Interactive/Crusader Kings III/mod/Titles&Additions"
remote_file_id="2427339718"