{
  "name": "nekonaq-sysprep",
  "version": "1.2401.1",
  "source": "https://gitlab.com/nekonaq.ex/sysprep.git",
  "author": "nekonaq.com",
  "license": "Apache-2.0",
  "dependencies": [],
  "requirements": [
    {
      "name": "puppet",
      "version_requirement": ">= 4.9.0 < 9.0.0"
    }
  ]
}
