{
  "profiles": {
    "16.LINQ and Lambda expression": {
      "commandName": "Project",
      "launchBrowser": true,
      "environmentVariables": {
        "ASPNETCORE_ENVIRONMENT": "Development"
      },
      "applicationUrl": "https://localhost:64183;http://localhost:64190"
    }
  }
}