{
  "profiles": {
    "4.WorkingWithString": {
      "commandName": "Project",
      "launchBrowser": true,
      "environmentVariables": {
        "ASPNETCORE_ENVIRONMENT": "Development"
      },
      "applicationUrl": "https://localhost:64182;http://localhost:64192"
    }
  }
}