{
  "id": "360710121002",
  "type": "Feature",
  "properties": {
    "area_land":348590,
    "area_water":0,
    "geoid":"360710121002",
    "name":"Block Group 2",
    "state":"ny"
},
  "bbox": [
    -74.326763,
    41.400055,
    -74.316412,
    41.40881
],
  "geometry": {"coordinates":[[[-74.326531,41.402576],[-74.32584,41.403217],[-74.32612399999999,41.403387],[-74.324009,41.40535],[-74.32304600000001,41.406249],[-74.322658,41.40657],[-74.322447,41.406738],[-74.32191400000001,41.407119],[-74.32096300000001,41.407774],[-74.32016,41.408348],[-74.319475,41.40881],[-74.318866,41.408445],[-74.31797299999999,41.407911],[-74.316412,41.406985],[-74.316557,41.406859],[-74.316768,41.406675],[-74.317911,41.405594],[-74.318499,41.405051],[-74.318783,41.404788],[-74.31916099999999,41.404438],[-74.320398,41.403282],[-74.320795,41.402961],[-74.321003,41.402833],[-74.320988,41.40274],[-74.320992,41.40264],[-74.32101299999999,41.402473],[-74.321264,41.401852],[-74.32145,41.401443],[-74.32149,41.40136],[-74.321595,41.40114],[-74.321618,41.40109],[-74.321805,41.400836],[-74.321967,41.400936],[-74.322782,41.400183],[-74.322923,41.400055],[-74.32316899999999,41.400463],[-74.323345,41.40069],[-74.323459,41.400809],[-74.32368200000001,41.401006],[-74.323932,41.401188],[-74.324516,41.401538],[-74.32471700000001,41.401648],[-74.32525699999999,41.401824],[-74.325484,41.401904],[-74.325789,41.401887],[-74.32556200000001,41.401932],[-74.32597699999999,41.402057],[-74.32626999999999,41.402165],[-74.32646200000001,41.402246],[-74.326763,41.402363],[-74.326531,41.402576]]],"type":"Polygon"}
}