{
  "id": "360670017021",
  "type": "Feature",
  "properties": {
    "area_land":246888,
    "area_water":0,
    "geoid":"360670017021",
    "name":"Block Group 1",
    "state":"ny"
},
  "bbox": [
    -76.122686,
    43.06144,
    -76.113467,
    43.068474
],
  "geometry": {"coordinates":[[[-76.122686,43.065024],[-76.121618,43.065538],[-76.120169,43.066239],[-76.11892899999999,43.066843],[-76.11881700000001,43.066898],[-76.11794999999999,43.067323],[-76.117756,43.067418],[-76.11698,43.0678],[-76.11653699999999,43.068017],[-76.11615,43.068205],[-76.11582199999999,43.068317],[-76.115627,43.068373],[-76.11543500000001,43.068404],[-76.11476399999999,43.068435],[-76.114104,43.068474],[-76.113883,43.065995],[-76.113794,43.065136],[-76.11367,43.063733],[-76.113533,43.062095],[-76.113467,43.061455],[-76.11404400000001,43.06144],[-76.114177,43.061459],[-76.114384,43.061522],[-76.114574,43.061593],[-76.114749,43.061691],[-76.114853,43.061793],[-76.114907,43.061937],[-76.114923,43.062059],[-76.114929,43.062242],[-76.114946,43.062464],[-76.114957,43.062616],[-76.11504100000001,43.063574],[-76.115116,43.064606],[-76.115481,43.064589],[-76.11555300000001,43.064581],[-76.11560900000001,43.06458],[-76.11568800000001,43.064523],[-76.11666099999999,43.064475],[-76.117678,43.064447],[-76.11872700000001,43.064407],[-76.119145,43.064399],[-76.12019100000001,43.064355],[-76.120546,43.064341],[-76.122632,43.064261],[-76.12266200000001,43.064687],[-76.122686,43.065024]]],"type":"Polygon"}
}