{
  "id": "360550022001",
  "type": "Feature",
  "properties": {
    "area_land":160211,
    "area_water":0,
    "geoid":"360550022001",
    "name":"Block Group 1",
    "state":"ny"
},
  "bbox": [
    -77.638877,
    43.181672,
    -77.631591,
    43.185296
],
  "geometry": {"coordinates":[[[-77.638875,43.185284],[-77.637016,43.185289],[-77.634871,43.185296],[-77.634895,43.184804],[-77.63488700000001,43.182725],[-77.63391799999999,43.182721],[-77.631591,43.182725],[-77.631603,43.182584],[-77.631682,43.181687],[-77.63701500000001,43.181672],[-77.638532,43.181676],[-77.638604,43.181681],[-77.638831,43.181713],[-77.638847,43.182599],[-77.63887,43.183503],[-77.63887699999999,43.184423],[-77.638875,43.185284]]],"type":"Polygon"}
}