{
  "id": "360550002003",
  "type": "Feature",
  "properties": {
    "area_land":166477,
    "area_water":0,
    "geoid":"360550002003",
    "name":"Block Group 3",
    "state":"ny"
},
  "bbox": [
    -77.630462,
    43.16462,
    -77.622885,
    43.170263
],
  "geometry": {"coordinates":[[[-77.63046199999999,43.170259],[-77.630009,43.170257],[-77.62971400000001,43.170255],[-77.62900399999999,43.170263],[-77.62802000000001,43.168924],[-77.62746300000001,43.169164],[-77.626845,43.169416],[-77.62535,43.167409],[-77.624762,43.166635],[-77.623576,43.167137],[-77.6232,43.167294],[-77.623166,43.167304],[-77.62310600000001,43.166707],[-77.622885,43.166394],[-77.62342700000001,43.166165],[-77.624182,43.165857],[-77.62645999999999,43.164881],[-77.62627500000001,43.16462],[-77.627745,43.16462],[-77.628079,43.164621],[-77.62896600000001,43.164621],[-77.62928599999999,43.164624],[-77.629622,43.165078],[-77.629912,43.165468],[-77.62763099999999,43.166448],[-77.627921,43.166841],[-77.62821099999999,43.167237],[-77.629103,43.168454],[-77.629386,43.16882],[-77.629668,43.169187],[-77.630202,43.169919],[-77.63046199999999,43.170259]]],"type":"Polygon"}
}