{
  "id": "360050059022",
  "type": "Feature",
  "properties": {
    "area_land":47520,
    "area_water":0,
    "geoid":"360050059022",
    "name":"Block Group 2",
    "state":"ny"
},
  "bbox": [
    -73.925645,
    40.821021,
    -73.922274,
    40.825425
],
  "geometry": {"coordinates":[[[-73.925149,40.821894],[-73.92473699999999,40.822641],[-73.92456,40.823083],[-73.92443400000001,40.823458],[-73.924373,40.823712],[-73.92430400000001,40.823909],[-73.924127,40.824262],[-73.923473,40.825425],[-73.922274,40.82497],[-73.92237799999999,40.824794],[-73.92302100000001,40.823711],[-73.923073,40.823624],[-73.923371,40.8231],[-73.924644,40.821021],[-73.925645,40.821131],[-73.925149,40.821894]]],"type":"Polygon"}
}