{
  "id": "360810183001",
  "type": "Feature",
  "properties": {
    "area_land":70406,
    "area_water":0,
    "geoid":"360810183001",
    "name":"Block Group 1",
    "state":"ny"
},
  "bbox": [
    -73.920798,
    40.746568,
    -73.917456,
    40.749488
],
  "geometry": {"coordinates":[[[-73.92034200000001,40.749159],[-73.919359,40.749345],[-73.918676,40.749488],[-73.91855700000001,40.749482],[-73.91838,40.749473],[-73.918019,40.749427],[-73.917456,40.749356],[-73.917607,40.748599],[-73.91770099999999,40.748129],[-73.91776,40.747837],[-73.917908,40.74714],[-73.918014,40.746568],[-73.918942,40.746676],[-73.91986900000001,40.746784],[-73.920798,40.746891],[-73.92034200000001,40.749159]]],"type":"Polygon"}
}