{
  "id": "360510312004",
  "type": "Feature",
  "properties": {
    "area_land":53776209,
    "area_water":97670,
    "geoid":"360510312004",
    "name":"Block Group 4",
    "state":"ny"
},
  "bbox": [
    -78.043418,
    42.517767,
    -77.840694,
    42.562329
],
  "geometry": {"coordinates":[[[-78.043418,42.518464],[-78.04284,42.518632],[-78.042326,42.518871],[-78.04219500000001,42.518933],[-78.041304,42.519471],[-78.039901,42.520443],[-78.03956100000001,42.520646],[-78.039374,42.520757],[-78.038966,42.521002],[-78.038372,42.521358],[-78.038352,42.521386],[-78.03829500000001,42.52147],[-78.038276,42.521499],[-78.03826100000001,42.521522],[-78.038293,42.521533],[-78.038465,42.521625],[-78.03858099999999,42.521744],[-78.038679,42.521891],[-78.038735,42.522083],[-78.038741,42.52233],[-78.038712,42.522486],[-78.038674,42.522638],[-78.038663,42.52273],[-78.038635,42.52282],[-78.03864,42.522864],[-78.03872,42.523165],[-78.039007,42.523236],[-78.039736,42.523508],[-78.04020199999999,42.523737],[-78.040571,42.523983],[-78.039456,42.525995],[-78.040539,42.52823],[-78.040117,42.527839],[-78.03817100000001,42.5254],[-78.03817100000001,42.525541],[-78.038066,42.5259],[-78.038167,42.52614],[-78.038242,42.526399],[-78.038445,42.526588],[-78.038605,42.526785],[-78.038669,42.527005],[-78.03873299999999,42.527115],[-78.038939,42.527322],[-78.03880100000001,42.527337],[-78.03868,42.527313],[-78.038571,42.527264],[-78.03842,42.527168],[-78.03831700000001,42.527071],[-78.03823800000001,42.526956],[-78.037887,42.526273],[-78.03783900000001,42.526213],[-78.03774199999999,42.526176],[-78.037621,42.526182],[-78.037524,42.526213],[-78.037385,42.526273],[-78.037058,42.526382],[-78.036919,42.5264],[-78.03683599999999,42.52639],[-78.036856,42.526853],[-78.03687499999999,42.527258],[-78.03693199999999,42.528242],[-78.036959,42.528705],[-78.036995,42.52932],[-78.03696100000001,42.529554],[-78.036895,42.529754],[-78.036821,42.52993],[-78.03644300000001,42.530599],[-78.03640300000001,42.530736],[-78.0364,42.530793],[-78.03639800000001,42.530879],[-78.03644300000001,42.531206],[-78.036652,42.531704],[-78.036682,42.531858],[-78.036674,42.532028],[-78.036614,42.532153],[-78.03623399999999,42.532697],[-78.036157,42.53276],[-78.03607599999999,42.532784],[-78.03597000000001,42.532787],[-78.035905,42.532768],[-78.03586,42.532739],[-78.035696,42.532568],[-78.03553100000001,42.532296],[-78.035304,42.531891],[-78.03521000000001,42.531743],[-78.035049,42.53152],[-78.03490600000001,42.53135],[-78.034803,42.53125],[-78.034357,42.530743],[-78.03406,42.530382],[-78.03349300000001,42.529782],[-78.033367,42.529628],[-78.033271,42.529528],[-78.03324499999999,42.529509],[-78.033215,42.529487],[-78.033007,42.529421],[-78.03277,42.529362],[-78.032489,42.529255],[-78.03222,42.529116],[-78.031847,42.528989],[-78.031757,42.528968],[-78.031634,42.528972],[-78.03150100000001,42.52901],[-78.031341,42.529081],[-78.031173,42.529184],[-78.031238,42.529218],[-78.031353,42.529278],[-78.031426,42.529334],[-78.031485,42.529379],[-78.03154000000001,42.529428],[-78.0317,42.529636],[-78.03180399999999,42.529805],[-78.03194499999999,42.529959],[-78.031966,42.529982],[-78.03223699999999,42.530311],[-78.032507,42.530584],[-78.03282,42.53094],[-78.032948,42.531136],[-78.033008,42.531299],[-78.033114,42.531799],[-78.03312099999999,42.531832],[-78.03313199999999,42.53209],[-78.03310500000001,42.532397],[-78.03306600000001,42.532536],[-78.03304,42.532633],[-78.032972,42.532889],[-78.032951,42.533003],[-78.032948,42.533298],[-78.032983,42.533567],[-78.03306000000001,42.533725],[-78.03313,42.533816],[-78.033267,42.533935],[-78.033708,42.534206],[-78.033906,42.534346],[-78.034037,42.53447],[-78.03415699999999,42.534636],[-78.034184,42.53473],[-78.034178,42.534789],[-78.03413399999999,42.534863],[-78.034047,42.534936],[-78.03350500000001,42.535287],[-78.033165,42.535571],[-78.032644,42.536069],[-78.032563,42.536176],[-78.03251299999999,42.536294],[-78.032462,42.536701],[-78.032437,42.536772],[-78.03234999999999,42.536913],[-78.032128,42.537223],[-78.031868,42.537764],[-78.031741,42.53793],[-78.03168100000001,42.537993],[-78.031505,42.538123],[-78.03120199999999,42.538287],[-78.03092100000001,42.538398],[-78.03064000000001,42.538481],[-78.030557,42.538514],[-78.030445,42.538597],[-78.030306,42.538761],[-78.03023899999999,42.53889],[-78.03019,42.539121],[-78.030182,42.53936],[-78.030225,42.539972],[-78.030215,42.540228],[-78.030174,42.540399],[-78.03010500000001,42.540545],[-78.030016,42.540669],[-78.029841,42.540829],[-78.029263,42.541439],[-78.028418,42.542375],[-78.027033,42.543927],[-78.026376,42.54462],[-78.026134,42.544846],[-78.025784,42.545102],[-78.02549,42.545296],[-78.025384,42.54534],[-78.025193,42.545365],[-78.025049,42.545375],[-78.024564,42.54538],[-78.023702,42.545389],[-78.02014800000001,42.545393],[-78.019701,42.545396],[-78.018675,42.545405],[-78.01687200000001,42.545411],[-78.016412,42.54544],[-78.015979,42.545501],[-78.015314,42.545616],[-78.014686,42.545692],[-78.014026,42.545742],[-78.01327000000001,42.545791],[-78.01293099999999,42.545795],[-78.01261100000001,42.545776],[-78.01058999999999,42.545526],[-78.01004,42.545489],[-78.00817000000001,42.545497],[-78.005152,42.545538],[-78.003854,42.545556],[-78.002701,42.545579],[-78.00029000000001,42.545593],[-78.000294,42.545794],[-78.000308,42.5464],[-78.00031300000001,42.546602],[-77.999837,42.546613],[-77.99916899999999,42.546629],[-77.999083,42.546632],[-77.997845,42.54669],[-77.996741,42.546762],[-77.995401,42.546851],[-77.994604,42.546903],[-77.994175,42.546932],[-77.993962,42.546949],[-77.99332200000001,42.547001],[-77.99311,42.547019],[-77.992795,42.547046],[-77.99231399999999,42.547089],[-77.991851,42.547118],[-77.991536,42.547138],[-77.991214,42.547162],[-77.99073300000001,42.5472],[-77.990251,42.547253],[-77.99021,42.547258],[-77.990065,42.547287],[-77.98993900000001,42.54733],[-77.989891,42.547344],[-77.989829,42.547364],[-77.98974699999999,42.547384],[-77.989699,42.547397],[-77.98901600000001,42.547543],[-77.987357,42.54793],[-77.987026,42.548008],[-77.986733,42.548077],[-77.985557,42.548369],[-77.985344,42.548427],[-77.985032,42.548529],[-77.984268,42.548819],[-77.98397300000001,42.548948],[-77.983245,42.549305],[-77.981837,42.550069],[-77.981244,42.550428],[-77.980774,42.550731],[-77.97897500000001,42.551893],[-77.978763,42.552043],[-77.978584,42.55216],[-77.978049,42.552511],[-77.97787099999999,42.552629],[-77.977817,42.552668],[-77.977656,42.552784],[-77.977603,42.552824],[-77.977177,42.553121],[-77.97694199999999,42.553255],[-77.976832,42.553303],[-77.97672,42.553331],[-77.97644099999999,42.553366],[-77.97623900000001,42.553378],[-77.97575999999999,42.553382],[-77.974592,42.553296],[-77.97430199999999,42.553275],[-77.973919,42.553269],[-77.973804,42.553272],[-77.973561,42.5533],[-77.97302999999999,42.553419],[-77.972584,42.553527],[-77.972154,42.553609],[-77.97163999999999,42.553719],[-77.970474,42.553969],[-77.969785,42.554131],[-77.96803300000001,42.554571],[-77.966055,42.555061],[-77.96526900000001,42.555246],[-77.965191,42.555265],[-77.963838,42.555611],[-77.963359,42.555729],[-77.963043,42.555786],[-77.962281,42.555914],[-77.961207,42.556066],[-77.96025299999999,42.556185],[-77.959344,42.556283],[-77.95854300000001,42.556341],[-77.95813099999999,42.556364],[-77.95644900000001,42.556402],[-77.95602599999999,42.556422],[-77.954931,42.556431],[-77.95405700000001,42.556431],[-77.95328499999999,42.556441],[-77.953033,42.556445],[-77.95243600000001,42.556437],[-77.951801,42.556456],[-77.95001499999999,42.556462],[-77.94834899999999,42.55648],[-77.948291,42.556481],[-77.947365,42.556473],[-77.946704,42.556489],[-77.94576600000001,42.5565],[-77.944777,42.556513],[-77.94386799999999,42.556518],[-77.942953,42.556529],[-77.942016,42.556541],[-77.941931,42.556542],[-77.941676,42.556547],[-77.941592,42.556549],[-77.94137000000001,42.556552],[-77.941233,42.556554],[-77.940703,42.556553],[-77.939469,42.556551],[-77.938039,42.556567],[-77.937152,42.556578],[-77.936969,42.556579],[-77.936423,42.556584],[-77.93624199999999,42.556586],[-77.935661,42.556587],[-77.934055,42.556592],[-77.933921,42.55659],[-77.933342,42.556582],[-77.933182,42.55658],[-77.932705,42.556577],[-77.932546,42.556577],[-77.930995,42.556578],[-77.93025799999999,42.556579],[-77.928487,42.556591],[-77.927595,42.55662],[-77.927204,42.556611],[-77.92686399999999,42.55657],[-77.926598,42.556512],[-77.926455,42.556469],[-77.926366,42.556428],[-77.9263,42.556397],[-77.92615499999999,42.556306],[-77.92599,42.556178],[-77.92585099999999,42.556034],[-77.925738,42.555878],[-77.925651,42.555737],[-77.925511,42.555418],[-77.925462,42.555234],[-77.925332,42.555519],[-77.92532,42.555555],[-77.925275,42.555701],[-77.925213,42.556051],[-77.925189,42.556284],[-77.925185,42.556594],[-77.92518200000001,42.556946],[-77.92517700000001,42.55733],[-77.92515400000001,42.557514],[-77.92513700000001,42.557666],[-77.92508599999999,42.557864],[-77.924871,42.558473],[-77.92465300000001,42.559146],[-77.924589,42.559348],[-77.924505,42.559697],[-77.92448899999999,42.559762],[-77.924441,42.559958],[-77.924426,42.560024],[-77.924314,42.560485],[-77.924136,42.561225],[-77.924013,42.561793],[-77.92398900000001,42.561873],[-77.923855,42.562329],[-77.9237,42.562174],[-77.923647,42.562121],[-77.923209,42.561742],[-77.923044,42.5616],[-77.922145,42.560823],[-77.920672,42.55955],[-77.920338,42.559288],[-77.92003200000001,42.559108],[-77.91984600000001,42.55904],[-77.91961499999999,42.558977],[-77.919225,42.558891],[-77.919016,42.558845],[-77.918781,42.558741],[-77.918255,42.558521],[-77.918116,42.558476],[-77.917996,42.558455],[-77.91763400000001,42.558437],[-77.917514,42.558431],[-77.915671,42.558346],[-77.91529,42.558305],[-77.915171,42.558275],[-77.915153,42.558271],[-77.91500000000001,42.558218],[-77.91457699999999,42.558012],[-77.91431900000001,42.557858],[-77.91299600000001,42.557108],[-77.911985,42.556564],[-77.911866,42.556484],[-77.911771,42.556407],[-77.911691,42.556316],[-77.91163,42.556227],[-77.91157800000001,42.556121],[-77.911534,42.555999],[-77.91136,42.555096],[-77.91127,42.554777],[-77.911074,42.554298],[-77.91088499999999,42.553904],[-77.910758,42.553684],[-77.91062700000001,42.553516],[-77.910617,42.553505],[-77.910494,42.553372],[-77.91023,42.553154],[-77.91010199999999,42.553083],[-77.909209,42.552683],[-77.908957,42.552609],[-77.908776,42.552586],[-77.908537,42.552573],[-77.90852,42.552573],[-77.908233,42.552571],[-77.907371,42.552567],[-77.907085,42.552566],[-77.906812,42.552567],[-77.90625300000001,42.552511],[-77.90511100000001,42.552315],[-77.901689,42.55173],[-77.900108,42.551443],[-77.89937999999999,42.551281],[-77.899232,42.551239],[-77.898422,42.551013],[-77.897713,42.550779],[-77.897462,42.550709],[-77.897327,42.55066],[-77.896258,42.550269],[-77.895527,42.550012],[-77.89543999999999,42.549982],[-77.894801,42.549741],[-77.894333,42.549588],[-77.89406099999999,42.549514],[-77.893659,42.549431],[-77.893314,42.549379],[-77.892258,42.549197],[-77.891046,42.549014],[-77.89036299999999,42.548913],[-77.88992399999999,42.548873],[-77.889855,42.548867],[-77.88824700000001,42.54881],[-77.888014,42.548795],[-77.887748,42.548778],[-77.887094,42.548717],[-77.88676700000001,42.548684],[-77.886014,42.548591],[-77.885707,42.548519],[-77.88553,42.548459],[-77.885131,42.548296],[-77.88467199999999,42.548066],[-77.884576,42.548018],[-77.88451000000001,42.547981],[-77.88403,42.547719],[-77.88387,42.547632],[-77.883782,42.547584],[-77.883518,42.547444],[-77.88343,42.547397],[-77.883331,42.547344],[-77.88303500000001,42.547185],[-77.882937,42.547133],[-77.88270799999999,42.54701],[-77.882026,42.546681],[-77.88194900000001,42.546644],[-77.881525,42.546453],[-77.88118900000001,42.54634],[-77.880788,42.546305],[-77.88059,42.546305],[-77.88004100000001,42.546341],[-77.879051,42.546396],[-77.87803700000001,42.546454],[-77.877934,42.546387],[-77.877279,42.546052],[-77.87682700000001,42.545836],[-77.87542999999999,42.54517],[-77.874893,42.544947],[-77.87424300000001,42.544708],[-77.87306100000001,42.54429],[-77.87178,42.543838],[-77.87059000000001,42.543429],[-77.870441,42.543378],[-77.86702699999999,42.542183],[-77.866258,42.541915],[-77.865995,42.541798],[-77.865861,42.541719],[-77.865487,42.541498],[-77.864983,42.541173],[-77.864756,42.541027],[-77.86400500000001,42.540563],[-77.86251799999999,42.539624],[-77.862358,42.539525],[-77.861479,42.538983],[-77.86101499999999,42.538697],[-77.860699,42.538503],[-77.859289,42.537639],[-77.858358,42.537069],[-77.857578,42.536591],[-77.857439,42.536506],[-77.857023,42.536251],[-77.85688500000001,42.536166],[-77.856841,42.536137],[-77.856709,42.536053],[-77.85666500000001,42.536025],[-77.85644000000001,42.535877],[-77.855768,42.535434],[-77.855673,42.535371],[-77.855543,42.535289],[-77.854927,42.534901],[-77.854223,42.534468],[-77.85324900000001,42.533869],[-77.851513,42.532813],[-77.850252,42.532026],[-77.84963,42.531638],[-77.848923,42.531223],[-77.84832299999999,42.530838],[-77.847308,42.530222],[-77.847257,42.530191],[-77.84676399999999,42.529868],[-77.84529499999999,42.528986],[-77.844273,42.528341],[-77.84246400000001,42.52722],[-77.84085,42.52622],[-77.840818,42.52453],[-77.84072500000001,42.51946],[-77.840694,42.517771],[-77.840735,42.51777],[-77.84085899999999,42.517767],[-77.840901,42.517767],[-77.84205799999999,42.517779],[-77.84553200000001,42.517815],[-77.84669,42.517828],[-77.84872900000001,42.517848],[-77.854849,42.51791],[-77.856889,42.517931],[-77.85878099999999,42.51795],[-77.864457,42.518009],[-77.866349,42.518029],[-77.87472200000001,42.518115],[-77.877945,42.518041],[-77.882902,42.518038],[-77.888565,42.518108],[-77.890338,42.518101],[-77.89124099999999,42.518099],[-77.891254,42.518096],[-77.89182099999999,42.518096],[-77.892275,42.518096],[-77.89256899999999,42.518084],[-77.892894,42.518064],[-77.895061,42.518082],[-77.896193,42.51808],[-77.89796800000001,42.518071],[-77.898946,42.518107],[-77.89904300000001,42.518111],[-77.901607,42.518313],[-77.902508,42.51828],[-77.90322399999999,42.518283],[-77.90362399999999,42.518182],[-77.903767,42.518182],[-77.90425500000001,42.518148],[-77.90493499999999,42.518103],[-77.905205,42.518098],[-77.906147,42.518158],[-77.906181,42.518161],[-77.90678,42.518172],[-77.90722599999999,42.51818],[-77.907625,42.518182],[-77.90842499999999,42.518151],[-77.908584,42.518149],[-77.908727,42.518149],[-77.90898900000001,42.518164],[-77.909035,42.518166],[-77.90942800000001,42.518179],[-77.91060899999999,42.518221],[-77.910759,42.518227],[-77.91100299999999,42.518229],[-77.911204,42.518233],[-77.911807,42.518245],[-77.912009,42.51825],[-77.91207,42.51825],[-77.91225300000001,42.518251],[-77.91231399999999,42.518252],[-77.91246,42.518252],[-77.912898,42.518254],[-77.91295100000001,42.518255],[-77.913045,42.518256],[-77.91371100000001,42.518266],[-77.915712,42.518296],[-77.916359,42.518306],[-77.91637900000001,42.518306],[-77.916501,42.518276],[-77.917085,42.51819],[-77.917367,42.518197],[-77.91842,42.518226],[-77.92021099999999,42.51825],[-77.920362,42.518251],[-77.921249,42.518263],[-77.921361,42.518263],[-77.924386,42.518272],[-77.93346099999999,42.518301],[-77.936486,42.518311],[-77.937777,42.518315],[-77.94165,42.518327],[-77.942942,42.518331],[-77.94417799999999,42.518335],[-77.947889,42.518347],[-77.949127,42.518351],[-77.95021699999999,42.518354],[-77.953487,42.518364],[-77.954578,42.518368],[-77.95465299999999,42.518368],[-77.95488,42.518368],[-77.954956,42.518369],[-77.95514300000001,42.518369],[-77.955708,42.518372],[-77.955896,42.518373],[-77.957594,42.518378],[-77.962688,42.518393],[-77.964386,42.518399],[-77.96449200000001,42.518399],[-77.964811,42.518401],[-77.964918,42.518402],[-77.968935,42.518414],[-77.980986,42.518453],[-77.985004,42.518466],[-77.987948,42.518475],[-77.996781,42.518504],[-77.999726,42.518514],[-77.99981699999999,42.518514],[-78.000092,42.518514],[-78.000184,42.518514],[-78.004216,42.518508],[-78.016312,42.518492],[-78.02034500000001,42.518488],[-78.020658,42.518487],[-78.021596,42.518486],[-78.02191000000001,42.518486],[-78.023169,42.518484],[-78.026946,42.51848],[-78.028206,42.518479],[-78.03022,42.518476],[-78.036264,42.518469],[-78.038279,42.518467],[-78.03864,42.518465],[-78.039726,42.518459],[-78.040088,42.518458],[-78.04059100000001,42.518458],[-78.0421,42.518461],[-78.04256700000001,42.518462],[-78.042604,42.518462],[-78.042766,42.518462],[-78.042992,42.518463],[-78.043255,42.518463],[-78.043418,42.518464]]],"type":"Polygon"}
}