{
  "id": "360050050022",
  "type": "Feature",
  "properties": {
    "area_land":23491,
    "area_water":0,
    "geoid":"360050050022",
    "name":"Block Group 2",
    "state":"ny"
},
  "bbox": [
    -73.881046,
    40.82578,
    -73.879501,
    40.828511
],
  "geometry": {"coordinates":[[[-73.881046,40.828432],[-73.880112,40.828511],[-73.879501,40.825905],[-73.880427,40.82578],[-73.881046,40.828432]]],"type":"Polygon"}
}