{
  "id": "360070126002",
  "type": "Feature",
  "properties": {
    "area_land":19444089,
    "area_water":0,
    "geoid":"360070126002",
    "name":"Block Group 2",
    "state":"ny"
},
  "bbox": [
    -75.830072,
    42.066037,
    -75.766482,
    42.127188
],
  "geometry": {"coordinates":[[[-75.830072,42.104976],[-75.82977200000001,42.105102],[-75.82967499999999,42.105146],[-75.829268,42.105324],[-75.82911199999999,42.105367],[-75.82884,42.105483],[-75.828371,42.105707],[-75.827623,42.106119],[-75.82530800000001,42.107431],[-75.82514,42.107525],[-75.824597,42.107828],[-75.82452000000001,42.107874],[-75.82426100000001,42.10803],[-75.824082,42.108153],[-75.823786,42.108395],[-75.823474,42.108665],[-75.821186,42.110651],[-75.817324,42.114165],[-75.816231,42.115102],[-75.81536199999999,42.115794],[-75.81477,42.116251],[-75.811509,42.118671],[-75.810971,42.119129],[-75.810627,42.119433],[-75.81044900000001,42.119576],[-75.810427,42.119592],[-75.810216,42.119741],[-75.810033,42.119847],[-75.80983999999999,42.11994],[-75.809566,42.120041],[-75.80951,42.120057],[-75.809111,42.120149],[-75.807024,42.120496],[-75.806043,42.120655],[-75.80313099999999,42.121125],[-75.801772,42.121348],[-75.800248,42.121606],[-75.79942699999999,42.121755],[-75.797775,42.122091],[-75.79499800000001,42.122657],[-75.794495,42.122774],[-75.794141,42.122878],[-75.79386,42.122979],[-75.793792,42.123004],[-75.793323,42.12321],[-75.793234,42.123258],[-75.793092,42.123335],[-75.792891,42.123444],[-75.79187899999999,42.124022],[-75.791208,42.12438],[-75.790008,42.125002],[-75.78944300000001,42.125165],[-75.789159,42.125228],[-75.78898100000001,42.125253],[-75.788265,42.125311],[-75.786445,42.125423],[-75.785901,42.125481],[-75.785528,42.125555],[-75.783805,42.125929],[-75.78342499999999,42.126003],[-75.782408,42.126113],[-75.782051,42.126188],[-75.78148400000001,42.126337],[-75.78092599999999,42.126568],[-75.78083100000001,42.126611],[-75.77998700000001,42.126988],[-75.779685,42.127129],[-75.779544,42.127188],[-75.779128,42.124792],[-75.778345,42.121236],[-75.780029,42.117924],[-75.782967,42.115765],[-75.783858,42.113876],[-75.783495,42.112502],[-75.782009,42.111987],[-75.777652,42.112428],[-75.777126,42.108106],[-75.776037,42.100728],[-75.773201,42.09791],[-75.77318,42.097811],[-75.77304100000001,42.097169],[-75.772779,42.096104],[-75.769426,42.080561],[-75.766547,42.068112],[-75.766482,42.067889],[-75.766496,42.06789],[-75.76675400000001,42.067915],[-75.76701199999999,42.067927],[-75.76736200000001,42.067917],[-75.768901,42.067811],[-75.769717,42.067765],[-75.771259,42.067679],[-75.772712,42.067582],[-75.77355900000001,42.067526],[-75.773932,42.067485],[-75.77437399999999,42.067402],[-75.775931,42.067083],[-75.776205,42.067034],[-75.77664,42.066975],[-75.777294,42.06692],[-75.777902,42.066879],[-75.781182,42.066689],[-75.782841,42.066577],[-75.783871,42.06653],[-75.78523199999999,42.06645],[-75.786654,42.066339],[-75.788256,42.066232],[-75.78904799999999,42.06619],[-75.79112600000001,42.066049],[-75.79156,42.066037],[-75.79177199999999,42.066039],[-75.79190800000001,42.066052],[-75.791984,42.066068],[-75.79208800000001,42.066109],[-75.792158,42.066147],[-75.792231,42.066229],[-75.792326,42.066418],[-75.792575,42.067083],[-75.79275800000001,42.067574],[-75.79456,42.067456],[-75.798799,42.067186],[-75.79998500000001,42.071226],[-75.800754,42.073809],[-75.800954,42.07437],[-75.801209,42.075008],[-75.801389,42.075403],[-75.801745,42.076076],[-75.80202199999999,42.07656],[-75.802232,42.076897],[-75.802317,42.077034],[-75.80262399999999,42.077473],[-75.803456,42.078573],[-75.805869,42.081755],[-75.807968,42.084536],[-75.808333,42.085002],[-75.808719,42.085527],[-75.80913,42.086146],[-75.80933,42.086502],[-75.809653,42.087154],[-75.810236,42.088583],[-75.81213700000001,42.093245],[-75.81235,42.093696],[-75.812637,42.094194],[-75.812941,42.094667],[-75.813236,42.095044],[-75.813453,42.095282],[-75.813569,42.09541],[-75.813301,42.095549],[-75.812348,42.096031],[-75.812281,42.096058],[-75.812398,42.096776],[-75.811995,42.096806],[-75.811211,42.096895],[-75.81056700000001,42.096969],[-75.810338,42.096991],[-75.810551,42.098137],[-75.810717,42.098873],[-75.811081,42.09886],[-75.81168700000001,42.098824],[-75.812012,42.098815],[-75.812184,42.098828],[-75.811961,42.098908],[-75.81166899999999,42.099052],[-75.810524,42.099677],[-75.81002700000001,42.099926],[-75.80945199999999,42.100089],[-75.80907999999999,42.100136],[-75.80859700000001,42.100214],[-75.808302,42.100271],[-75.80767400000001,42.100434],[-75.80735799999999,42.100505],[-75.806883,42.100671],[-75.806347,42.100903],[-75.80615,42.100897],[-75.805942,42.100875],[-75.805623,42.100809],[-75.80535999999999,42.10072],[-75.80519700000001,42.100655],[-75.804912,42.100524],[-75.80475,42.10045],[-75.804112,42.10014],[-75.803833,42.100018],[-75.8035,42.099872],[-75.80316000000001,42.099763],[-75.803033,42.099731],[-75.802739,42.099684],[-75.802646,42.099675],[-75.80170099999999,42.099579],[-75.80008100000001,42.099441],[-75.799813,42.09943],[-75.798782,42.099435],[-75.798406,42.099411],[-75.797258,42.099241],[-75.79695599999999,42.099222],[-75.79415400000001,42.09915],[-75.79414800000001,42.09944],[-75.79411500000001,42.099799],[-75.79410900000001,42.100005],[-75.79414199999999,42.100009],[-75.794887,42.100115],[-75.795733,42.100252],[-75.796148,42.100323],[-75.799533,42.10094],[-75.800566,42.101127],[-75.80164000000001,42.10131],[-75.802429,42.101411],[-75.803084,42.101468],[-75.803856,42.101501],[-75.804638,42.101504],[-75.80537,42.101481],[-75.806275,42.101411],[-75.806999,42.101326],[-75.807518,42.101238],[-75.807821,42.101182],[-75.808514,42.10104],[-75.81023500000001,42.100587],[-75.81065099999999,42.100455],[-75.811508,42.100231],[-75.8125,42.100118],[-75.813115,42.100095],[-75.814357,42.100114],[-75.815121,42.100157],[-75.81598099999999,42.10022],[-75.816672,42.100289],[-75.817662,42.1004],[-75.818438,42.100511],[-75.81979200000001,42.100725],[-75.82069799999999,42.100913],[-75.821539,42.101107],[-75.822276,42.101322],[-75.822818,42.101516],[-75.823729,42.101874],[-75.825941,42.102953],[-75.82631499999999,42.103137],[-75.82839800000001,42.104164],[-75.82921399999999,42.104545],[-75.829463,42.104675],[-75.829808,42.10485],[-75.830072,42.104976]]],"type":"Polygon"}
}