{
  "id": "360010139022",
  "type": "Feature",
  "properties": {
    "area_land":626511,
    "area_water":0,
    "geoid":"360010139022",
    "name":"Block Group 2",
    "state":"ny"
},
  "bbox": [
    -73.840558,
    42.720124,
    -73.826513,
    42.729851
],
  "geometry": {"coordinates":[[[-73.840558,42.724336],[-73.840453,42.7244],[-73.840234,42.724563],[-73.838815,42.725565],[-73.838048,42.726049],[-73.837343,42.726479],[-73.83593399999999,42.727387],[-73.83497199999999,42.727957],[-73.83446499999999,42.728276],[-73.834181,42.728412],[-73.833861,42.728502],[-73.833725,42.728575],[-73.83365000000001,42.728638],[-73.83354,42.728792],[-73.83345300000001,42.729047],[-73.83335599999999,42.729231],[-73.833128,42.729851],[-73.83284,42.729772],[-73.83137600000001,42.729385],[-73.830415,42.729145],[-73.82980999999999,42.728983],[-73.828847,42.72861],[-73.828514,42.728502],[-73.828292,42.728438],[-73.82808199999999,42.728401],[-73.827861,42.72833],[-73.827787,42.728276],[-73.827713,42.728167],[-73.827699,42.728111],[-73.827713,42.72784],[-73.827748,42.727593],[-73.827754,42.7272],[-73.827742,42.727035],[-73.82772199999999,42.727003],[-73.827641,42.726924],[-73.827322,42.726694],[-73.826832,42.726409],[-73.826571,42.726213],[-73.82652899999999,42.726144],[-73.82651300000001,42.726089],[-73.826514,42.726028],[-73.82655099999999,42.725963],[-73.826607,42.725891],[-73.826719,42.725795],[-73.82753599999999,42.725344],[-73.82860100000001,42.724707],[-73.828789,42.724574],[-73.829161,42.724236],[-73.830248,42.723535],[-73.831017,42.723084],[-73.83216899999999,42.722351],[-73.832976,42.721864],[-73.833118,42.721768],[-73.835658,42.720189],[-73.835757,42.720124],[-73.836156,42.720479],[-73.836279,42.720589],[-73.83726900000001,42.721457],[-73.83803899999999,42.722135],[-73.838504,42.722537],[-73.839091,42.723059],[-73.83973899999999,42.723622],[-73.84047099999999,42.724262],[-73.840558,42.724336]]],"type":"Polygon"}
}