{
  "id": "360810693001",
  "type": "Feature",
  "properties": {
    "area_land":81428,
    "area_water":0,
    "geoid":"360810693001",
    "name":"Block Group 1",
    "state":"ny"
},
  "bbox": [
    -73.865487,
    40.727893,
    -73.860115,
    40.731089
],
  "geometry": {"coordinates":[[[-73.865081,40.730113],[-73.86469,40.730746],[-73.864479,40.731089],[-73.8626,40.73042],[-73.862188,40.730276],[-73.861259,40.729937],[-73.860527,40.729679],[-73.86011499999999,40.729522],[-73.860339,40.729177],[-73.860755,40.728536],[-73.861161,40.727893],[-73.86326200000001,40.728659],[-73.865487,40.729472],[-73.865081,40.730113]]],"type":"Polygon"}
}