{
  "id": "360710141023",
  "type": "Feature",
  "properties": {
    "area_land":791370,
    "area_water":0,
    "geoid":"360710141023",
    "name":"Block Group 3",
    "state":"ny"
},
  "bbox": [
    -74.177983,
    41.314203,
    -74.160106,
    41.324481
],
  "geometry": {"coordinates":[[[-74.1778,41.319977],[-74.177634,41.320055],[-74.17746699999999,41.320104],[-74.176861,41.320227],[-74.176765,41.320255],[-74.176569,41.320323],[-74.17636400000001,41.320437],[-74.176289,41.32049],[-74.17610500000001,41.320648],[-74.175605,41.321098],[-74.175309,41.321358],[-74.175117,41.321528],[-74.174943,41.321683],[-74.174781,41.321812],[-74.17455200000001,41.321999],[-74.173525,41.322846],[-74.173365,41.322979],[-74.172276,41.323863],[-74.171514,41.324481],[-74.171353,41.324432],[-74.17069499999999,41.324212],[-74.169855,41.323871],[-74.169405,41.323656],[-74.169056,41.323474],[-74.168679,41.323245],[-74.16845499999999,41.323106],[-74.16809499999999,41.322871],[-74.16774100000001,41.322607],[-74.167416,41.322345],[-74.16671700000001,41.321723],[-74.16623300000001,41.321277],[-74.16524099999999,41.320425],[-74.164041,41.319338],[-74.163405,41.318779],[-74.16139,41.316985],[-74.16059,41.316284],[-74.16022599999999,41.315972],[-74.160106,41.315883],[-74.16024899999999,41.315738],[-74.16147100000001,41.314493],[-74.16176400000001,41.314203],[-74.162215,41.31424],[-74.163067,41.314286],[-74.163433,41.314305],[-74.163775,41.314323],[-74.164461,41.314378],[-74.16477399999999,41.31442],[-74.16524,41.314521],[-74.166432,41.314864],[-74.16697499999999,41.315038],[-74.167261,41.315157],[-74.16762300000001,41.315341],[-74.167754,41.315416],[-74.167846,41.315471],[-74.168204,41.315693],[-74.169185,41.316288],[-74.16935100000001,41.316389],[-74.169371,41.316401],[-74.169572,41.316523],[-74.170478,41.31706],[-74.170824,41.317223],[-74.171094,41.317325],[-74.171227,41.317367],[-74.171581,41.317463],[-74.171899,41.31752],[-74.17221499999999,41.317558],[-74.172994,41.317628],[-74.17357,41.317703],[-74.17388099999999,41.317767],[-74.174183,41.317859],[-74.174684,41.318054],[-74.174763,41.318092],[-74.175262,41.318334],[-74.17576699999999,41.31861],[-74.175983,41.318729],[-74.176216,41.318859],[-74.176688,41.319146],[-74.177566,41.319631],[-74.177983,41.319874],[-74.1778,41.319977]]],"type":"Polygon"}
}