{
  "id": "360070133012",
  "type": "Feature",
  "properties": {
    "area_land":613254,
    "area_water":34284,
    "geoid":"360070133012",
    "name":"Block Group 2",
    "state":"ny"
},
  "bbox": [
    -76.084831,
    42.100186,
    -76.066592,
    42.114208
],
  "geometry": {"coordinates":[[[-76.084665,42.102058],[-76.084492,42.102188],[-76.084301,42.102312],[-76.083973,42.102474],[-76.083651,42.10259],[-76.083347,42.102667],[-76.082973,42.102724],[-76.082768,42.102742],[-76.081851,42.102774],[-76.081549,42.102801],[-76.081177,42.102865],[-76.08082899999999,42.102948],[-76.080637,42.103004],[-76.08023900000001,42.103156],[-76.079874,42.103335],[-76.079667,42.103461],[-76.079464,42.103603],[-76.079235,42.103795],[-76.078959,42.104069],[-76.078732,42.104367],[-76.078479,42.104732],[-76.077871,42.105632],[-76.07750299999999,42.106171],[-76.07696199999999,42.106953],[-76.075838,42.108545],[-76.07532399999999,42.109281],[-76.07531899999999,42.109335],[-76.07422200000001,42.109367],[-76.07256,42.10942],[-76.072236,42.109432],[-76.071202,42.109482],[-76.071048,42.109504],[-76.070994,42.109517],[-76.07107600000001,42.109774],[-76.07111999999999,42.11006],[-76.071123,42.110149],[-76.071094,42.110481],[-76.071061,42.11062],[-76.070913,42.111207],[-76.070733,42.112051],[-76.070669,42.112353],[-76.07044,42.112396],[-76.07037,42.112427],[-76.070324,42.112461],[-76.070301,42.112492],[-76.070297,42.112542],[-76.07037,42.113084],[-76.07026999999999,42.113825],[-76.070251,42.113894],[-76.070185,42.113979],[-76.07013499999999,42.114013],[-76.06998900000001,42.114075],[-76.069858,42.114102],[-76.069643,42.114128],[-76.069096,42.114208],[-76.068415,42.1142],[-76.06814900000001,42.114154],[-76.06761400000001,42.113954],[-76.067581,42.113771],[-76.067555,42.113479],[-76.067443,42.113187],[-76.06725400000001,42.112925],[-76.06712,42.112714],[-76.06707299999999,42.112614],[-76.067046,42.112498],[-76.06707299999999,42.112333],[-76.06722000000001,42.111956],[-76.06728099999999,42.111718],[-76.06732,42.111421],[-76.067362,42.110427],[-76.067362,42.110213],[-76.066973,42.110047],[-76.067065,42.109546],[-76.06709600000001,42.109166],[-76.067094,42.109094],[-76.06708,42.10866],[-76.06700499999999,42.108013],[-76.06697,42.107607],[-76.066883,42.106755],[-76.06674,42.105868],[-76.066675,42.105671],[-76.066592,42.105517],[-76.066638,42.105514],[-76.066784,42.105657],[-76.06721,42.106072],[-76.06796199999999,42.106079],[-76.069006,42.106091],[-76.069012,42.105269],[-76.069048,42.105254],[-76.06922900000001,42.105204],[-76.072028,42.104791],[-76.073629,42.104508],[-76.07371000000001,42.104494],[-76.07466599999999,42.104339],[-76.07620799999999,42.104081],[-76.076694,42.103962],[-76.07792499999999,42.103493],[-76.078183,42.103435],[-76.078422,42.103435],[-76.078965,42.103462],[-76.0792,42.103427],[-76.079273,42.103404],[-76.079454,42.103262],[-76.079958,42.102804],[-76.08072799999999,42.101868],[-76.081305,42.100935],[-76.081416,42.10063],[-76.081521,42.100343],[-76.08156700000001,42.100246],[-76.08161,42.100186],[-76.082409,42.100616],[-76.08301299999999,42.100943],[-76.08483099999999,42.101901],[-76.084665,42.102058]]],"type":"Polygon"}
}