{
  "id": "360810499002",
  "type": "Feature",
  "properties": {
    "area_land":203766,
    "area_water":0,
    "geoid":"360810499002",
    "name":"Block Group 2",
    "state":"ny"
},
  "bbox": [
    -73.88756,
    40.727869,
    -73.877965,
    40.733095
],
  "geometry": {"coordinates":[[[-73.88755999999999,40.730197],[-73.88728999999999,40.730245],[-73.88702600000001,40.73031],[-73.886769,40.730392],[-73.886523,40.73049],[-73.886289,40.730602],[-73.885595,40.73093],[-73.88538699999999,40.731055],[-73.885223,40.731301],[-73.884775,40.731971],[-73.884522,40.732393],[-73.884109,40.733095],[-73.882391,40.731648],[-73.88007899999999,40.729715],[-73.879434,40.730193],[-73.87903900000001,40.73048],[-73.87836799999999,40.729996],[-73.87809,40.729875],[-73.877965,40.72977],[-73.878433,40.729588],[-73.878979,40.729375],[-73.879723,40.729089],[-73.880053,40.728991],[-73.88039000000001,40.728905],[-73.88073300000001,40.728833],[-73.88093000000001,40.7288],[-73.88108099999999,40.728774],[-73.881433,40.728729],[-73.88178600000001,40.728698],[-73.88214000000001,40.72868],[-73.883931,40.728538],[-73.884458,40.728494],[-73.884591,40.728483],[-73.884902,40.728455],[-73.885165,40.728424],[-73.88561199999999,40.728342],[-73.885882,40.728283],[-73.88629,40.72818],[-73.886331,40.728168],[-73.88663200000001,40.72808],[-73.886763,40.728037],[-73.886949,40.727979],[-73.88720499999999,40.727869],[-73.887204,40.728011],[-73.887201,40.728092],[-73.887198,40.728184],[-73.887201,40.728612],[-73.887236,40.728933],[-73.887289,40.729253],[-73.887361,40.729571],[-73.887451,40.729886],[-73.88755999999999,40.730197]]],"type":"Polygon"}
}