{
  "id": "360595200012",
  "type": "Feature",
  "properties": {
    "area_land":583477,
    "area_water":0,
    "geoid":"360595200012",
    "name":"Block Group 2",
    "state":"ny"
},
  "bbox": [
    -73.492584,
    40.731794,
    -73.481117,
    40.739431
],
  "geometry": {"coordinates":[[[-73.49258399999999,40.739431],[-73.49241600000001,40.739426],[-73.492349,40.73942],[-73.49229099999999,40.739422],[-73.49220800000001,40.739414],[-73.491516,40.739396],[-73.491192,40.739385],[-73.49062000000001,40.739358],[-73.48972000000001,40.739318],[-73.488958,40.73928],[-73.488861,40.738241],[-73.488731,40.73705],[-73.487939,40.737095],[-73.487888,40.737106],[-73.487832,40.737104],[-73.486931,40.737158],[-73.486029,40.737213],[-73.48398299999999,40.737335],[-73.48320200000001,40.737381],[-73.483102,40.73743],[-73.482792,40.737168],[-73.48263799999999,40.737006],[-73.48253099999999,40.736928],[-73.48247000000001,40.736901],[-73.48239700000001,40.736895],[-73.482163,40.736902],[-73.481241,40.73691],[-73.481167,40.736247],[-73.48115300000001,40.735984],[-73.481117,40.73539],[-73.481123,40.735149],[-73.481246,40.734276],[-73.481264,40.734227],[-73.481268,40.734154],[-73.481348,40.733632],[-73.481453,40.73295],[-73.481483,40.732856],[-73.481475,40.732822],[-73.481559,40.732271],[-73.481606,40.731968],[-73.481633,40.731794],[-73.48415199999999,40.731813],[-73.488944,40.73201],[-73.489469,40.732032],[-73.491069,40.732099],[-73.49128899999999,40.732826],[-73.49135,40.732901],[-73.49142399999999,40.733204],[-73.491575,40.733426],[-73.491648,40.733739],[-73.491609,40.73395],[-73.49163799999999,40.734198],[-73.491579,40.734266],[-73.491722,40.734965],[-73.491868,40.73562],[-73.491888,40.736044],[-73.491997,40.736104],[-73.492107,40.736847],[-73.492299,40.737524],[-73.49247,40.737998],[-73.492486,40.738199],[-73.49252199999999,40.738818],[-73.49247800000001,40.738873],[-73.492321,40.738911],[-73.49236500000001,40.739098],[-73.49237599999999,40.739303],[-73.49239900000001,40.739346],[-73.492532,40.739369],[-73.49258399999999,40.739431]]],"type":"Polygon"}
}