{
  "id": "360610146013",
  "type": "Feature",
  "properties": {
    "area_land":17426,
    "area_water":0,
    "geoid":"360610146013",
    "name":"Block Group 3",
    "state":"ny"
},
  "bbox": [
    -73.954945,
    40.776561,
    -73.95224,
    40.778139
],
  "geometry": {"coordinates":[[[-73.954482,40.778139],[-73.95224,40.777194],[-73.95270499999999,40.776561],[-73.954945,40.777504],[-73.954482,40.778139]]],"type":"Polygon"}
}