{
  "id": "360595184002",
  "type": "Feature",
  "properties": {
    "area_land":961247,
    "area_water":0,
    "geoid":"360595184002",
    "name":"Block Group 2",
    "state":"ny"
},
  "bbox": [
    -73.502315,
    40.82044,
    -73.479772,
    40.827645
],
  "geometry": {"coordinates":[[[-73.502315,40.82385],[-73.50169099999999,40.824249],[-73.50067,40.824779],[-73.499908,40.825058],[-73.498558,40.825363],[-73.49771,40.825469],[-73.496482,40.825601],[-73.48995499999999,40.82634],[-73.48871,40.82654],[-73.488298,40.826598],[-73.48094399999999,40.827645],[-73.480752,40.826263],[-73.480749,40.826208],[-73.480735,40.826112],[-73.48059499999999,40.825115],[-73.480501,40.82462],[-73.480465,40.824431],[-73.48038099999999,40.824214],[-73.480293,40.823928],[-73.480205,40.823686],[-73.479772,40.822599],[-73.481872,40.822115],[-73.483378,40.821757],[-73.483812,40.821676],[-73.485186,40.821496],[-73.48549,40.821431],[-73.48578000000001,40.821348],[-73.48605499999999,40.821242],[-73.486897,40.820856],[-73.48733199999999,40.820679],[-73.487607,40.820595],[-73.487853,40.820536],[-73.488113,40.820488],[-73.488547,40.820443],[-73.488995,40.82044],[-73.48939300000001,40.820474],[-73.489638,40.820511],[-73.48976999999999,40.820542],[-73.49008499999999,40.820617],[-73.49041699999999,40.820685],[-73.49103599999999,40.820782],[-73.49152100000001,40.82086],[-73.491722,40.820901],[-73.492301,40.821018],[-73.492441,40.821053],[-73.493213,40.82121],[-73.494198,40.821415],[-73.494343,40.821437],[-73.494483,40.821468],[-73.495187,40.821564],[-73.496385,40.821727],[-73.4971,40.821812],[-73.497227,40.821833],[-73.497968,40.821892],[-73.498783,40.821943],[-73.499611,40.822006],[-73.499787,40.822016],[-73.500287,40.822043],[-73.500722,40.822066],[-73.500856,40.822084],[-73.502156,40.822172],[-73.502205,40.822646],[-73.502259,40.823235],[-73.502289,40.823503],[-73.502304,40.82371],[-73.502315,40.82385]]],"type":"Polygon"}
}