{
  "id": "360470517002",
  "type": "Feature",
  "properties": {
    "area_land":83059,
    "area_water":0,
    "geoid":"360470517002",
    "name":"Block Group 2",
    "state":"ny"
},
  "bbox": [
    -73.958416,
    40.718388,
    -73.951646,
    40.723486
],
  "geometry": {"coordinates":[[[-73.95782,40.71974],[-73.95722499999999,40.720293],[-73.95663,40.720846],[-73.95603800000001,40.721397],[-73.955443,40.721946],[-73.954776,40.72246],[-73.954183,40.722636],[-73.95382499999999,40.72276],[-73.953321,40.722933],[-73.952494,40.723205],[-73.951646,40.723486],[-73.95475399999999,40.720601],[-73.955348,40.720049],[-73.95594199999999,40.719493],[-73.956535,40.718941],[-73.957131,40.718388],[-73.958416,40.719189],[-73.95782,40.71974]]],"type":"Polygon"}
}