{
  "id": "360790118001",
  "type": "Feature",
  "properties": {
    "area_land":12950458,
    "area_water":140364,
    "geoid":"360790118001",
    "name":"Block Group 1",
    "state":"ny"
},
  "bbox": [
    -73.65559,
    41.398879,
    -73.605429,
    41.444309
],
  "geometry": {"coordinates":[[[-73.65559,41.414354],[-73.654661,41.423884],[-73.65454800000001,41.425147],[-73.653738,41.431435],[-73.653727,41.43154],[-73.65368700000001,41.431945],[-73.65343799999999,41.43421],[-73.65343,41.434278],[-73.653487,41.434809],[-73.65323100000001,41.438984],[-73.653187,41.439702],[-73.65121000000001,41.439899],[-73.650718,41.439948],[-73.65058500000001,41.439961],[-73.64785500000001,41.440205],[-73.64729699999999,41.440248],[-73.641086,41.440788],[-73.632926,41.441562],[-73.632481,41.441628],[-73.630126,41.441828],[-73.62205899999999,41.442667],[-73.61806900000001,41.4431],[-73.615189,41.443393],[-73.614839,41.443427],[-73.610068,41.443856],[-73.60605700000001,41.444309],[-73.606127,41.443996],[-73.606151,41.443694],[-73.60614,41.442947],[-73.606171,41.442641],[-73.606182,41.442591],[-73.60624,41.442335],[-73.606512,41.441411],[-73.606645,41.440635],[-73.606692,41.440347],[-73.606762,41.439816],[-73.60680000000001,41.439363],[-73.606804,41.438838],[-73.60678,41.438447],[-73.606725,41.438064],[-73.606658,41.437813],[-73.606392,41.437038],[-73.606139,41.436384],[-73.60591700000001,41.435798],[-73.60584900000001,41.435619],[-73.605733,41.435234],[-73.605636,41.434868],[-73.605526,41.434455],[-73.605429,41.434049],[-73.605779,41.434019],[-73.60736900000001,41.433861],[-73.608402,41.433758],[-73.608808,41.433697],[-73.610996,41.433318],[-73.611462,41.433239],[-73.611788,41.43321],[-73.612669,41.433216],[-73.614041,41.433234],[-73.614847,41.433243],[-73.61494399999999,41.433245],[-73.61476999999999,41.433041],[-73.61439900000001,41.432534],[-73.614361,41.432473],[-73.61426299999999,41.432316],[-73.614132,41.432036],[-73.614071,41.431869],[-73.614023,41.431715],[-73.613947,41.431377],[-73.613794,41.429881],[-73.613193,41.422565],[-73.613,41.420347],[-73.61299200000001,41.419799],[-73.613024,41.419362],[-73.613072,41.419003],[-73.613153,41.418578],[-73.613237,41.418244],[-73.613259,41.418156],[-73.613328,41.417934],[-73.61351999999999,41.41743],[-73.613437,41.417366],[-73.613384,41.417273],[-73.613331,41.417127],[-73.613265,41.416815],[-73.61324399999999,41.416714],[-73.613224,41.416629],[-73.613056,41.415898],[-73.613045,41.415814],[-73.61304,41.415566],[-73.613043,41.415504],[-73.613049,41.415381],[-73.612999,41.414961],[-73.612861,41.413938],[-73.612815,41.413673],[-73.612702,41.412943],[-73.612579,41.412207],[-73.612573,41.412156],[-73.612533,41.411827],[-73.612531,41.411652],[-73.612601,41.411115],[-73.61269900000001,41.411099],[-73.61297,41.411023],[-73.613592,41.410796],[-73.614003,41.410633],[-73.614195,41.410547],[-73.614723,41.410338],[-73.61484900000001,41.410301],[-73.614991,41.410284],[-73.61503999999999,41.410284],[-73.615544,41.410328],[-73.615827,41.410331],[-73.616106,41.410299],[-73.61646,41.410212],[-73.61650299999999,41.410201],[-73.617276,41.409999],[-73.61751700000001,41.409936],[-73.618004,41.409816],[-73.61840599999999,41.409717],[-73.61850699999999,41.409694],[-73.618869,41.409638],[-73.619055,41.409612],[-73.61918900000001,41.409595],[-73.619579,41.409531],[-73.620177,41.409426],[-73.6203,41.409372],[-73.620364,41.409306],[-73.620531,41.409433],[-73.62134,41.410112],[-73.621461,41.410201],[-73.621619,41.410293],[-73.6217,41.410325],[-73.621785,41.410347],[-73.621925,41.410378],[-73.62209799999999,41.410399],[-73.622192,41.410409],[-73.62226,41.410413],[-73.62245299999999,41.410429],[-73.622484,41.410431],[-73.622595,41.41044],[-73.62262200000001,41.410442],[-73.622665,41.410066],[-73.622666,41.409836],[-73.622653,41.409722],[-73.622626,41.409579],[-73.62259400000001,41.409459],[-73.622587,41.409403],[-73.62255999999999,41.409162],[-73.622563,41.409063],[-73.622573,41.408847],[-73.62271,41.407885],[-73.62271,41.40774],[-73.62269499999999,41.407621],[-73.62259299999999,41.407348],[-73.621848,41.405849],[-73.621697,41.405636],[-73.621566,41.405472],[-73.62132099999999,41.405184],[-73.621172,41.404944],[-73.621146,41.404891],[-73.621043,41.404629],[-73.62099600000001,41.404461],[-73.62097,41.40425],[-73.620947,41.403523],[-73.620794,41.402861],[-73.62071899999999,41.402562],[-73.621515,41.40233],[-73.624593,41.401435],[-73.624745,41.401392],[-73.624613,41.401158],[-73.623334,41.398879],[-73.623435,41.398902],[-73.62495199999999,41.399234],[-73.625001,41.399245],[-73.62620099999999,41.399482],[-73.626508,41.399526],[-73.62677600000001,41.399549],[-73.627132,41.399551],[-73.627824,41.399502],[-73.628553,41.39942],[-73.631364,41.399051],[-73.631868,41.399002],[-73.632154,41.398994],[-73.632448,41.399006],[-73.632814,41.399043],[-73.633167,41.399115],[-73.633461,41.399198],[-73.633673,41.39928],[-73.633746,41.399316],[-73.633977,41.399447],[-73.634214,41.399614],[-73.634602,41.399974],[-73.634905,41.400324],[-73.63500000000001,41.400451],[-73.63642299999999,41.402355],[-73.637038,41.403167],[-73.637139,41.403304],[-73.637793,41.404198],[-73.638087,41.404613],[-73.638288,41.404971],[-73.638434,41.405303],[-73.638538,41.405597],[-73.638603,41.405858],[-73.63863499999999,41.406156],[-73.63864599999999,41.406329],[-73.638792,41.408694],[-73.638825,41.409446],[-73.63883199999999,41.410089],[-73.638772,41.411518],[-73.63876500000001,41.412463],[-73.638795,41.412838],[-73.638869,41.413176],[-73.63899600000001,41.413496],[-73.639157,41.413776],[-73.639314,41.413986],[-73.63951299999999,41.414207],[-73.639822,41.414502],[-73.640214,41.41483],[-73.64062199999999,41.415124],[-73.64109500000001,41.415412],[-73.641347,41.415549],[-73.641649,41.415699],[-73.64186100000001,41.41579],[-73.642605,41.416067],[-73.64342600000001,41.416286],[-73.643806,41.41636],[-73.64436600000001,41.416442],[-73.644537,41.416459],[-73.644764,41.41648],[-73.645216,41.416505],[-73.645769,41.416497],[-73.64716199999999,41.416449],[-73.64771399999999,41.416426],[-73.647856,41.416411],[-73.648302,41.416366],[-73.648639,41.416318],[-73.649124,41.416235],[-73.64971799999999,41.416079],[-73.649945,41.41602],[-73.65016900000001,41.415943],[-73.65040399999999,41.415863],[-73.650705,41.415745],[-73.65136800000001,41.415484],[-73.65179500000001,41.415305],[-73.65228500000001,41.415123],[-73.652815,41.414957],[-73.653172,41.414866],[-73.65399499999999,41.414682],[-73.654842,41.414508],[-73.65559,41.414354]],[[-73.634,41.407141],[-73.633533,41.40565],[-73.63309,41.404308],[-73.633081,41.403865],[-73.633047,41.403667],[-73.63267999999999,41.402845],[-73.632531,41.402552],[-73.63244899999999,41.402483],[-73.632339,41.402432],[-73.632206,41.402405],[-73.63203799999999,41.402415],[-73.631783,41.402486],[-73.631592,41.40259],[-73.63121599999999,41.402866],[-73.63018099999999,41.403681],[-73.629969,41.403843],[-73.629904,41.40394],[-73.629884,41.404057],[-73.629884,41.404314],[-73.628287,41.40432],[-73.628304,41.40446],[-73.6283,41.40514],[-73.628297,41.405954],[-73.628297,41.406786],[-73.62830200000001,41.407003],[-73.628353,41.407129],[-73.62852100000001,41.407338],[-73.628815,41.40764],[-73.62892100000001,41.407734],[-73.62898199999999,41.407821],[-73.62901100000001,41.407928],[-73.629034,41.408183],[-73.629037,41.408427],[-73.630883,41.408427],[-73.632352,41.408433],[-73.633302,41.40843],[-73.63364300000001,41.408437],[-73.633832,41.408426],[-73.633938,41.408395],[-73.634338,41.408194],[-73.634,41.407141]]],"type":"Polygon"}
}