{
  "id": "361190021013",
  "type": "Feature",
  "properties": {
    "area_land":494761,
    "area_water":0,
    "geoid":"361190021013",
    "name":"Block Group 3",
    "state":"ny"
},
  "bbox": [
    -73.842545,
    40.962311,
    -73.832616,
    40.981466
],
  "geometry": {"coordinates":[[[-73.842545,40.962779],[-73.842241,40.96431],[-73.84177200000001,40.96468],[-73.84002599999999,40.966192],[-73.839523,40.967293],[-73.839862,40.968605],[-73.83920999999999,40.969533],[-73.838283,40.970857],[-73.837673,40.972649],[-73.83747700000001,40.974072],[-73.837884,40.977324],[-73.837801,40.977337],[-73.837086,40.97742],[-73.837198,40.978117],[-73.837312,40.978773],[-73.837525,40.979967],[-73.837636,40.980684],[-73.83769700000001,40.981466],[-73.837237,40.981457],[-73.83714000000001,40.981432],[-73.83703199999999,40.981378],[-73.835949,40.98061],[-73.83528699999999,40.980148],[-73.83461699999999,40.979681],[-73.833952,40.979218],[-73.832616,40.978278],[-73.83323300000001,40.977791],[-73.833141,40.977711],[-73.833062,40.977625],[-73.833033,40.97755],[-73.833029,40.977353],[-73.833044,40.977274],[-73.833263,40.976905],[-73.83362099999999,40.976441],[-73.834034,40.975957],[-73.835224,40.974639],[-73.835155,40.97457],[-73.834827,40.9743],[-73.834682,40.974189],[-73.834445,40.974042],[-73.834226,40.973927],[-73.834064,40.973861],[-73.834577,40.973141],[-73.834852,40.972747],[-73.835067,40.972457],[-73.83526999999999,40.972143],[-73.83542,40.971862],[-73.83544999999999,40.971798],[-73.835583,40.971511],[-73.835758,40.971078],[-73.83588399999999,40.97075],[-73.836102,40.970189],[-73.836217,40.969964],[-73.836319,40.969794],[-73.836575,40.96943],[-73.83677299999999,40.969159],[-73.837147,40.968642],[-73.837687,40.967626],[-73.83804499999999,40.966884],[-73.838069,40.966816],[-73.838463,40.965689],[-73.838622,40.965311],[-73.838768,40.965033],[-73.838846,40.964914],[-73.838897,40.964838],[-73.839077,40.964499],[-73.839775,40.962913],[-73.839921,40.962618],[-73.84008799999999,40.962311],[-73.842276,40.962728],[-73.842545,40.962779]]],"type":"Polygon"}
}