{
  "id": "360810711002",
  "type": "Feature",
  "properties": {
    "area_land":162891,
    "area_water":0,
    "geoid":"360810711002",
    "name":"Block Group 2",
    "state":"ny"
},
  "bbox": [
    -73.856701,
    40.719441,
    -73.844789,
    40.724112
],
  "geometry": {"coordinates":[[[-73.85629299999999,40.723041],[-73.85602799999999,40.723465],[-73.855842,40.723625],[-73.855695,40.72385],[-73.855586,40.724112],[-73.854542,40.723726],[-73.853437,40.723323],[-73.852559,40.723003],[-73.851354,40.722575],[-73.84807499999999,40.721366],[-73.846964,40.720959],[-73.845895,40.720567],[-73.84478900000001,40.720164],[-73.84518,40.719714],[-73.845254,40.719441],[-73.846592,40.719936],[-73.849433,40.720963],[-73.850039,40.720757],[-73.850432,40.720109],[-73.852341,40.720805],[-73.85457,40.721618],[-73.856701,40.722399],[-73.85629299999999,40.723041]]],"type":"Polygon"}
}