{
  "id": "360830519023",
  "type": "Feature",
  "properties": {
    "area_land":21355666,
    "area_water":926336,
    "geoid":"360830519023",
    "name":"Block Group 3",
    "state":"ny"
},
  "bbox": [
    -73.672355,
    42.793416,
    -73.589419,
    42.859175
],
  "geometry": {"coordinates":[[[-73.672162,42.796177],[-73.667362,42.800177],[-73.664862,42.800477],[-73.663562,42.800877],[-73.662262,42.801977],[-73.661362,42.802977],[-73.658462,42.809077],[-73.65952799999999,42.81276],[-73.65956199999999,42.812877],[-73.660162,42.816777],[-73.65966299999999,42.818978],[-73.66117,42.821941],[-73.66224200000001,42.824048],[-73.663021,42.82544],[-73.66423899999999,42.828979],[-73.66439099999999,42.830344],[-73.66474599999999,42.831218],[-73.66575899999999,42.833373],[-73.663653,42.83335],[-73.66339600000001,42.833295],[-73.66327200000001,42.833233],[-73.66316399999999,42.833213],[-73.663006,42.833208],[-73.66258500000001,42.833233],[-73.66225799999999,42.833287],[-73.6621,42.833308],[-73.661794,42.833308],[-73.661632,42.833291],[-73.661474,42.833254],[-73.660656,42.832997],[-73.660374,42.832931],[-73.66015400000001,42.832894],[-73.659897,42.832873],[-73.659657,42.832865],[-73.6593,42.832881],[-73.658979,42.83291],[-73.658378,42.832981],[-73.657793,42.833068],[-73.657223,42.833175],[-73.65575,42.833333],[-73.655244,42.833353],[-73.65501999999999,42.833337],[-73.65480599999999,42.833295],[-73.654326,42.833171],[-73.653944,42.833047],[-73.65362500000001,42.832902],[-73.65302200000001,42.832567],[-73.65090600000001,42.831283],[-73.649556,42.830438],[-73.64769099999999,42.829341],[-73.64749999999999,42.829246],[-73.647335,42.829188],[-73.64694900000001,42.829109],[-73.64680199999999,42.829092],[-73.64656600000001,42.829084],[-73.64612200000001,42.829126],[-73.64569899999999,42.829196],[-73.644735,42.829424],[-73.644308,42.829536],[-73.64425,42.829547],[-73.643998,42.829598],[-73.643631,42.829643],[-73.643316,42.829656],[-73.64302499999999,42.829627],[-73.64100000000001,42.829316],[-73.63931700000001,42.829163],[-73.63878699999999,42.829084],[-73.638459,42.829021],[-73.638341,42.828996],[-73.63559100000001,42.833349],[-73.63264100000001,42.838024],[-73.632138,42.838794],[-73.63136799999999,42.839622],[-73.626305,42.843585],[-73.626492,42.843665],[-73.626606,42.84371],[-73.62700100000001,42.843867],[-73.62713599999999,42.84394],[-73.627195,42.843983],[-73.627224,42.844021],[-73.62726499999999,42.84412],[-73.62728799999999,42.844215],[-73.62728199999999,42.844356],[-73.627236,42.844507],[-73.62712399999999,42.84467],[-73.62689,42.844932],[-73.626755,42.84506],[-73.626632,42.845206],[-73.626615,42.845241],[-73.626603,42.845318],[-73.626609,42.845352],[-73.626632,42.845425],[-73.62672600000001,42.845554],[-73.62705699999999,42.845852],[-73.626789,42.845888],[-73.62657299999999,42.845929],[-73.626287,42.845996],[-73.625902,42.846112],[-73.624523,42.846568],[-73.623997,42.846725],[-73.623639,42.846805],[-73.623498,42.846827],[-73.623228,42.846838],[-73.622958,42.84683],[-73.622647,42.84678],[-73.622758,42.846293],[-73.622798,42.846108],[-73.618303,42.849508],[-73.61335,42.853459],[-73.609673,42.856633],[-73.60831,42.857956],[-73.60824700000001,42.858023],[-73.606916,42.859175],[-73.60675500000001,42.858981],[-73.606585,42.858737],[-73.60645700000001,42.858504],[-73.606374,42.858261],[-73.606353,42.858126],[-73.606353,42.85778],[-73.60642300000001,42.856543],[-73.60650099999999,42.855733],[-73.606494,42.855534],[-73.60646,42.855412],[-73.606435,42.855349],[-73.606381,42.855264],[-73.606228,42.855023],[-73.605897,42.854572],[-73.60576399999999,42.854391],[-73.605608,42.854162],[-73.60539900000001,42.853859],[-73.6053,42.853684],[-73.60522400000001,42.853449],[-73.605189,42.853192],[-73.605197,42.853071],[-73.605215,42.852968],[-73.605288,42.852749],[-73.605524,42.852267],[-73.605631,42.852092],[-73.60569599999999,42.852011],[-73.605777,42.851919],[-73.606354,42.851384],[-73.606402,42.851322],[-73.606421,42.851281],[-73.606447,42.851141],[-73.60599499999999,42.851298],[-73.605059,42.851544],[-73.60473,42.85162],[-73.60458,42.851666],[-73.60422800000001,42.8518],[-73.60381700000001,42.851985],[-73.60254399999999,42.852654],[-73.60200500000001,42.852932],[-73.601361,42.853283],[-73.60109,42.853414],[-73.60102500000001,42.853445],[-73.60065899999999,42.853622],[-73.59980400000001,42.854076],[-73.599018,42.854484],[-73.598806,42.854568],[-73.59847600000001,42.854666],[-73.598319,42.854699],[-73.597201,42.854874],[-73.59380400000001,42.855368],[-73.593434,42.855427],[-73.59271699999999,42.855541],[-73.591509,42.855719],[-73.589822,42.855959],[-73.58941900000001,42.856027],[-73.590813,42.852475],[-73.59546,42.84061],[-73.59667899999999,42.837497],[-73.59730999999999,42.83589],[-73.59854900000001,42.832727],[-73.59936500000001,42.830646],[-73.60249,42.822672],[-73.6028,42.821923],[-73.60494799999999,42.816729],[-73.60500999999999,42.816599],[-73.6053,42.815627],[-73.60583800000001,42.814391],[-73.605908,42.814269],[-73.606853,42.812142],[-73.60720600000001,42.811291],[-73.61059299999999,42.803119],[-73.61170300000001,42.80044],[-73.612729,42.798613],[-73.620746,42.797143],[-73.624556,42.796388],[-73.63532600000001,42.795407],[-73.640249,42.794734],[-73.640815,42.794657],[-73.64445499999999,42.794159],[-73.648606,42.793416],[-73.64819199999999,42.79387],[-73.647977,42.794071],[-73.64766299999999,42.794324],[-73.64643700000001,42.795207],[-73.646044,42.795484],[-73.645355,42.795946],[-73.645093,42.796104],[-73.644267,42.796612],[-73.643715,42.797007],[-73.642816,42.797669],[-73.641375,42.798741],[-73.64109999999999,42.798951],[-73.640615,42.798449],[-73.640353,42.798195],[-73.640046,42.797842],[-73.63997999999999,42.79773],[-73.63900700000001,42.797906],[-73.638694,42.797972],[-73.638538,42.798021],[-73.63831399999999,42.798131],[-73.637396,42.798633],[-73.63693499999999,42.798926],[-73.636707,42.7991],[-73.636188,42.79957],[-73.63566299999999,42.800102],[-73.635304,42.800494],[-73.634315,42.799835],[-73.633396,42.800818],[-73.633366,42.800879],[-73.633351,42.801001],[-73.633414,42.801909],[-73.633627,42.801928],[-73.634114,42.801906],[-73.63426,42.801904],[-73.635209,42.801856],[-73.63582100000001,42.801815],[-73.635953,42.80187],[-73.63614200000001,42.801979],[-73.63679999999999,42.80241],[-73.63538699999999,42.803564],[-73.63490299999999,42.803967],[-73.63474100000001,42.804091],[-73.634552,42.804256],[-73.63434100000001,42.804464],[-73.63426200000001,42.804566],[-73.634185,42.804692],[-73.634135,42.804834],[-73.63410399999999,42.805022],[-73.63409900000001,42.80512],[-73.63419500000001,42.806722],[-73.634238,42.807326],[-73.63428,42.808118],[-73.634479,42.808137],[-73.634603,42.808162],[-73.634726,42.808199],[-73.634962,42.808298],[-73.635172,42.808415],[-73.635744,42.808745],[-73.635937,42.808823],[-73.636072,42.808858],[-73.636214,42.808884],[-73.63677300000001,42.80892],[-73.637004,42.808939],[-73.637204,42.808969],[-73.63776300000001,42.809068],[-73.638277,42.809177],[-73.638502,42.809238],[-73.638662,42.809295],[-73.639112,42.809512],[-73.639556,42.809748],[-73.63988999999999,42.809908],[-73.64018,42.810021],[-73.640417,42.810092],[-73.640642,42.810144],[-73.642777,42.810534],[-73.643677,42.810658],[-73.643914,42.810694],[-73.64473099999999,42.810887],[-73.64487200000001,42.810911],[-73.644993,42.810911],[-73.645655,42.81084],[-73.646047,42.810812],[-73.64660000000001,42.810798],[-73.646754,42.810784],[-73.646888,42.810744],[-73.646968,42.810691],[-73.647198,42.810444],[-73.647409,42.810204],[-73.647886,42.809743],[-73.648005,42.80964],[-73.648084,42.809554],[-73.648116,42.809471],[-73.648112,42.809391],[-73.64806,42.809267],[-73.64791200000001,42.809026],[-73.647828,42.808891],[-73.647772,42.808758],[-73.64775299999999,42.808606],[-73.64776500000001,42.808355],[-73.647809,42.80821],[-73.647868,42.808103],[-73.648014,42.807922],[-73.64812499999999,42.807813],[-73.64864900000001,42.807366],[-73.650254,42.805932],[-73.650565,42.805647],[-73.65133,42.804965],[-73.65186300000001,42.804431],[-73.652244,42.804005],[-73.65270200000001,42.80353],[-73.65294400000001,42.80332],[-73.653623,42.802889],[-73.653762,42.802811],[-73.653823,42.802777],[-73.65463699999999,42.802289],[-73.655671,42.801656],[-73.656097,42.801359],[-73.65648899999999,42.801073],[-73.65673,42.800887],[-73.65740099999999,42.800434],[-73.657664,42.800293],[-73.657735,42.800269],[-73.658006,42.800197],[-73.658114,42.80018],[-73.65881400000001,42.800113],[-73.659115,42.800053],[-73.659374,42.799973],[-73.659488,42.799932],[-73.65978200000001,42.799804],[-73.660366,42.799531],[-73.660307,42.799676],[-73.660248,42.799956],[-73.660185,42.800512],[-73.66018,42.80078],[-73.660217,42.800802],[-73.660314,42.800827],[-73.66051299999999,42.800835],[-73.660661,42.800809],[-73.660749,42.800756],[-73.66136299999999,42.800123],[-73.66152700000001,42.799977],[-73.66171300000001,42.799845],[-73.661857,42.799762],[-73.662037,42.799669],[-73.662407,42.799517],[-73.662769,42.799396],[-73.66345,42.799213],[-73.66375499999999,42.799145],[-73.66404,42.799112],[-73.665087,42.799029],[-73.66534900000001,42.799001],[-73.666026,42.798948],[-73.66613,42.798912],[-73.66617100000001,42.79888],[-73.666186,42.798869],[-73.666224,42.798741],[-73.666245,42.798474],[-73.666275,42.798257],[-73.666298,42.798166],[-73.666493,42.797546],[-73.66745899999999,42.797657],[-73.667557,42.797653],[-73.667632,42.797629],[-73.667681,42.797597],[-73.667782,42.797531],[-73.66799899999999,42.797338],[-73.66825900000001,42.797087],[-73.66852400000001,42.796866],[-73.668606,42.796772],[-73.668752,42.796562],[-73.668938,42.796523],[-73.669049,42.796485],[-73.66963800000001,42.796194],[-73.670344,42.795796],[-73.670525,42.795676],[-73.670601,42.795607],[-73.670659,42.79553],[-73.670688,42.79547],[-73.670694,42.795415],[-73.67066199999999,42.795347],[-73.671255,42.795355],[-73.672355,42.795791],[-73.672162,42.796177]]],"type":"Polygon"}
}