{
  "id": "360670054003",
  "type": "Feature",
  "properties": {
    "area_land":162950,
    "area_water":0,
    "geoid":"360670054003",
    "name":"Block Group 3",
    "state":"ny"
},
  "bbox": [
    -76.147649,
    43.022281,
    -76.14169,
    43.027499
],
  "geometry": {"coordinates":[[[-76.147649,43.024948],[-76.146406,43.025239],[-76.14549599999999,43.025455],[-76.145386,43.025488],[-76.145281,43.025544],[-76.14535600000001,43.0257],[-76.145567,43.026144],[-76.14598100000001,43.027024],[-76.14530600000001,43.02717],[-76.14503000000001,43.027243],[-76.144111,43.027499],[-76.14367,43.026584],[-76.143334,43.025893],[-76.14294200000001,43.025034],[-76.142495,43.024112],[-76.14210199999999,43.023284],[-76.14169,43.022404],[-76.142186,43.022379],[-76.14374100000001,43.022281],[-76.143822,43.02245],[-76.145275,43.022367],[-76.14639099999999,43.022315],[-76.146638,43.02229],[-76.14671199999999,43.022678],[-76.146811,43.023109],[-76.14688099999999,43.023318],[-76.147149,43.023887],[-76.147649,43.024948]]],"type":"Polygon"}
}