{
  "id": "360811139002",
  "type": "Feature",
  "properties": {
    "area_land":108107,
    "area_water":0,
    "geoid":"360811139002",
    "name":"Block Group 2",
    "state":"ny"
},
  "bbox": [
    -73.793345,
    40.762295,
    -73.785707,
    40.764621
],
  "geometry": {"coordinates":[[[-73.79322500000001,40.763142],[-73.793025,40.764621],[-73.792072,40.764546],[-73.791122,40.764471],[-73.79019,40.764397],[-73.78851899999999,40.76426],[-73.78807500000001,40.764199],[-73.787532,40.7639],[-73.785853,40.763014],[-73.785707,40.762937],[-73.787379,40.762777],[-73.788275,40.762704],[-73.789174,40.762632],[-73.790071,40.762559],[-73.79096800000001,40.762487],[-73.791865,40.762414],[-73.793345,40.762295],[-73.79322500000001,40.763142]]],"type":"Polygon"}
}