{
  "id": "361031246023",
  "type": "Feature",
  "properties": {
    "area_land":699370,
    "area_water":522819,
    "geoid":"361031246023",
    "name":"Block Group 3",
    "state":"ny"
},
  "bbox": [
    -73.33052,
    40.678399,
    -73.313763,
    40.689518
],
  "geometry": {"coordinates":[[[-73.33052000000001,40.684659],[-73.330062,40.684201],[-73.32928,40.683939],[-73.32886499999999,40.683801],[-73.32766700000001,40.686002],[-73.32796399999999,40.686398],[-73.327567,40.6876],[-73.327361,40.6871],[-73.32672700000001,40.68684],[-73.323734,40.687608],[-73.32309100000001,40.68776],[-73.321883,40.688044],[-73.321736,40.688062],[-73.321583,40.688091],[-73.320275,40.688393],[-73.320123,40.688433],[-73.318994,40.688706],[-73.31831699999999,40.688801],[-73.31824,40.688663],[-73.317899,40.688911],[-73.31688699999999,40.689518],[-73.316695,40.689367],[-73.316557,40.689206],[-73.316518,40.689162],[-73.316424,40.689159],[-73.316428,40.688994],[-73.316502,40.688707],[-73.31656099999999,40.68866],[-73.31666300000001,40.68866],[-73.316655,40.688448],[-73.316518,40.688448],[-73.316557,40.688075],[-73.316581,40.687907],[-73.31658899999999,40.687789],[-73.316667,40.687789],[-73.316659,40.687612],[-73.316608,40.687538],[-73.316428,40.687471],[-73.31631,40.687424],[-73.316322,40.687502],[-73.31614500000001,40.687502],[-73.316137,40.687397],[-73.315957,40.687408],[-73.31579499999999,40.687234],[-73.31557599999999,40.687179],[-73.314779,40.687173],[-73.315085,40.686372],[-73.313957,40.685797],[-73.31376299999999,40.679499],[-73.328564,40.678399],[-73.328863,40.681998],[-73.330505,40.684506],[-73.33052000000001,40.684659]]],"type":"Polygon"}
}