{
  "id": "360470385001",
  "type": "Feature",
  "properties": {
    "area_land":43649,
    "area_water":0,
    "geoid":"360470385001",
    "name":"Block Group 1",
    "state":"ny"
},
  "bbox": [
    -73.93018,
    40.687833,
    -73.923834,
    40.689275
],
  "geometry": {"coordinates":[[[-73.93017999999999,40.688565],[-73.927254,40.688901],[-73.923979,40.689275],[-73.923834,40.688541],[-73.92711300000001,40.688167],[-73.930035,40.687833],[-73.93017999999999,40.688565]]],"type":"Polygon"}
}