{
  "id": "361019629002",
  "type": "Feature",
  "properties": {
    "area_land":19893859,
    "area_water":358863,
    "geoid":"361019629002",
    "name":"Block Group 2",
    "state":"ny"
},
  "bbox": [
    -77.041901,
    42.091621,
    -76.965613,
    42.134328
],
  "geometry": {"coordinates":[[[-77.041901,42.096252],[-77.04185200000001,42.096623],[-77.041775,42.096937],[-77.041391,42.098119],[-77.041223,42.098705],[-77.04115899999999,42.098971],[-77.04114300000001,42.099085],[-77.041117,42.099622],[-77.040655,42.103825],[-77.04047199999999,42.105373],[-77.040464,42.105439],[-77.040353,42.106168],[-77.040252,42.106679],[-77.040055,42.107476],[-77.039625,42.109038],[-77.038948,42.11149],[-77.038794,42.111987],[-77.038341,42.113223],[-77.03824400000001,42.113564],[-77.03810799999999,42.114324],[-77.03807999999999,42.114402],[-77.03800099999999,42.114508],[-77.037823,42.114791],[-77.037164,42.115635],[-77.037077,42.115774],[-77.03695500000001,42.116039],[-77.036897,42.116281],[-77.036871,42.116504],[-77.036889,42.116808],[-77.036945,42.117219],[-77.03709499999999,42.118255],[-77.037144,42.118637],[-77.037246,42.119342],[-77.03738300000001,42.120324],[-77.037486,42.121037],[-77.037502,42.121144],[-77.037553,42.121496],[-77.03761,42.121896],[-77.037615,42.122022],[-77.037612,42.122201],[-77.037567,42.122447],[-77.037464,42.122683],[-77.037251,42.122998],[-77.03709600000001,42.123182],[-77.03692100000001,42.123334],[-77.03686399999999,42.123375],[-77.036726,42.123456],[-77.03652200000001,42.123552],[-77.03622,42.123657],[-77.035704,42.123826],[-77.03458999999999,42.124203],[-77.034295,42.124306],[-77.03377500000001,42.12449],[-77.033387,42.124634],[-77.033354,42.124719],[-77.0334,42.12482],[-77.034665,42.126636],[-77.03495599999999,42.127105],[-77.034981,42.127156],[-77.03498999999999,42.127173],[-77.035641,42.128514],[-77.03578400000001,42.128915],[-77.03605,42.12978],[-77.036119,42.130046],[-77.036265,42.130645],[-77.036338,42.131001],[-77.036491,42.131659],[-77.036563,42.131907],[-77.036889,42.133302],[-77.03700600000001,42.133696],[-77.037128,42.134093],[-77.033812,42.134184],[-77.03008,42.134324],[-77.030021,42.134325],[-77.029932,42.134328],[-77.029591,42.134119],[-77.02908499999999,42.133726],[-77.028803,42.133493],[-77.028617,42.133212],[-77.028741,42.132333],[-77.028981,42.131204],[-77.029106,42.130592],[-77.028991,42.12973],[-77.028637,42.128636],[-77.028049,42.127889],[-77.026994,42.126935],[-77.025724,42.126102],[-77.023816,42.125074],[-77.022183,42.12344],[-77.018096,42.12161],[-77.015882,42.120069],[-77.013221,42.118522],[-77.01077600000001,42.117525],[-77.007676,42.116823],[-77.00463000000001,42.116316],[-77.002126,42.116221],[-76.99968699999999,42.11641],[-76.996574,42.117264],[-76.992816,42.118857],[-76.990838,42.119818],[-76.990133,42.120222],[-76.98926899999999,42.120912],[-76.989158,42.12208],[-76.988457,42.122998],[-76.98797500000001,42.123196],[-76.986611,42.123387],[-76.985501,42.123221],[-76.98493499999999,42.122975],[-76.983356,42.121357],[-76.982336,42.120509],[-76.979859,42.11965],[-76.97590599999999,42.120619],[-76.97319400000001,42.121566],[-76.971238,42.121735],[-76.96920900000001,42.121808],[-76.967377,42.122389],[-76.96683,42.122908],[-76.965901,42.123861],[-76.96589400000001,42.123746],[-76.965852,42.123155],[-76.965811,42.122564],[-76.965689,42.120813],[-76.965705,42.11981],[-76.965632,42.118856],[-76.96561699999999,42.118521],[-76.965613,42.118432],[-76.965695,42.114218],[-76.965712,42.113984],[-76.965721,42.111683],[-76.965721,42.111632],[-76.96571900000001,42.111462],[-76.96568600000001,42.108574],[-76.965688,42.108169],[-76.965735,42.100528],[-76.96578599999999,42.092274],[-76.97563100000001,42.092143],[-76.975712,42.092169],[-76.975792,42.09218],[-76.976287,42.092192],[-76.977518,42.092182],[-76.97811400000001,42.092163],[-76.97938000000001,42.092152],[-76.98142900000001,42.092148],[-76.982017,42.092127],[-76.98213,42.092113],[-76.98216499999999,42.092098],[-76.982204,42.092065],[-76.982885,42.092079],[-76.989839,42.092062],[-76.990516,42.092075],[-76.999306,42.092166],[-76.999466,42.092167],[-77.021213,42.091825],[-77.033956,42.091687],[-77.034801,42.091676],[-77.039185,42.09163],[-77.041185,42.091621],[-77.041121,42.091924],[-77.04110300000001,42.09216],[-77.04109,42.092305],[-77.041077,42.092488],[-77.04110900000001,42.092959],[-77.04113700000001,42.093284],[-77.041186,42.093561],[-77.041265,42.0938],[-77.04140599999999,42.09418],[-77.04174999999999,42.095111],[-77.04185099999999,42.095494],[-77.041895,42.095822],[-77.041901,42.096252]]],"type":"Polygon"}
}