{
  "id": "360594148003",
  "type": "Feature",
  "properties": {
    "area_land":472563,
    "area_water":0,
    "geoid":"360594148003",
    "name":"Block Group 3",
    "state":"ny"
},
  "bbox": [
    -73.550723,
    40.685672,
    -73.541283,
    40.694161
],
  "geometry": {"coordinates":[[[-73.550723,40.692442],[-73.550355,40.692714],[-73.550256,40.692775],[-73.54991699999999,40.692982],[-73.549696,40.693096],[-73.549497,40.693186],[-73.549138,40.693316],[-73.54901599999999,40.69336],[-73.548615,40.693468],[-73.548193,40.693549],[-73.546328,40.693794],[-73.54607799999999,40.693809],[-73.545417,40.693896],[-73.54514,40.693932],[-73.544597,40.694021],[-73.543727,40.694161],[-73.543633,40.693865],[-73.543516,40.693521],[-73.543469,40.693307],[-73.543436,40.693151],[-73.543272,40.692555],[-73.543138,40.692313],[-73.543097,40.692211],[-73.543015,40.691972],[-73.54289,40.691686],[-73.542586,40.691154],[-73.542509,40.691031],[-73.542413,40.690833],[-73.5423,40.690481],[-73.542236,40.690202],[-73.54213900000001,40.689772],[-73.54207,40.689428],[-73.541968,40.688915],[-73.54182299999999,40.688472],[-73.54161000000001,40.687902],[-73.54128300000001,40.687068],[-73.541763,40.686896],[-73.541955,40.687208],[-73.54205,40.687439],[-73.54208199999999,40.687489],[-73.542158,40.687549],[-73.54221200000001,40.687566],[-73.542342,40.687542],[-73.542891,40.687398],[-73.543007,40.687336],[-73.543325,40.687128],[-73.54345600000001,40.687077],[-73.54368700000001,40.687004],[-73.543948,40.686851],[-73.544026,40.686903],[-73.54445,40.687233],[-73.54446,40.687254],[-73.544569,40.687321],[-73.546744,40.685878],[-73.54699100000001,40.68571],[-73.54703499999999,40.685686],[-73.54709200000001,40.685672],[-73.547263,40.685676],[-73.54795300000001,40.685692],[-73.548626,40.685712],[-73.549194,40.685728],[-73.549164,40.686424],[-73.549145,40.686467],[-73.549147,40.686792],[-73.549082,40.688059],[-73.549052,40.688727],[-73.548959,40.690539],[-73.54882000000001,40.690549],[-73.548901,40.690639],[-73.54899399999999,40.690788],[-73.549376,40.691332],[-73.549582,40.69151],[-73.549954,40.691823],[-73.55048499999999,40.692246],[-73.550723,40.692442]]],"type":"Polygon"}
}