{
  "id": "360050185005",
  "type": "Feature",
  "properties": {
    "area_land":70247,
    "area_water":0,
    "geoid":"360050185005",
    "name":"Block Group 5",
    "state":"ny"
},
  "bbox": [
    -73.908418,
    40.821715,
    -73.904293,
    40.827114
],
  "geometry": {"coordinates":[[[-73.907741,40.823815],[-73.906747,40.823581],[-73.90624099999999,40.824821],[-73.90593699999999,40.825531],[-73.90537999999999,40.826875],[-73.90508,40.827114],[-73.904293,40.82692],[-73.904922,40.825287],[-73.90544199999999,40.824033],[-73.905732,40.823337],[-73.906457,40.821715],[-73.907427,40.821945],[-73.908418,40.822181],[-73.907741,40.823815]]],"type":"Polygon"}
}