{
  "id": "360811155001",
  "type": "Feature",
  "properties": {
    "area_land":135628,
    "area_water":0,
    "geoid":"360811155001",
    "name":"Block Group 1",
    "state":"ny"
},
  "bbox": [
    -73.813227,
    40.766027,
    -73.810061,
    40.771597
],
  "geometry": {"coordinates":[[[-73.813227,40.771573],[-73.811987,40.771586],[-73.81103899999999,40.771597],[-73.810061,40.771589],[-73.810287,40.769932],[-73.810472,40.768557],[-73.810817,40.766027],[-73.811786,40.766104],[-73.812985,40.766201],[-73.81300400000001,40.767287],[-73.813031,40.768036],[-73.813057,40.768755],[-73.813123,40.770156],[-73.813227,40.771573]]],"type":"Polygon"}
}