{
  "id": "361031470013",
  "type": "Feature",
  "properties": {
    "area_land":995375,
    "area_water":0,
    "geoid":"361031470013",
    "name":"Block Group 3",
    "state":"ny"
},
  "bbox": [
    -73.288784,
    40.696692,
    -73.281507,
    40.714748
],
  "geometry": {"coordinates":[[[-73.28878400000001,40.700122],[-73.28876200000001,40.70057],[-73.288726,40.70093],[-73.288706,40.701131],[-73.28864400000001,40.701532],[-73.288521,40.70286],[-73.288383,40.704095],[-73.288329,40.704643],[-73.28824299999999,40.706228],[-73.288284,40.708726],[-73.288348,40.709676],[-73.28849599999999,40.712405],[-73.28851299999999,40.71257],[-73.284634,40.713869],[-73.28431999999999,40.713974],[-73.28261999999999,40.714549],[-73.282027,40.714748],[-73.28209099999999,40.714538],[-73.282104,40.71187],[-73.282595,40.710092],[-73.28263200000001,40.708832],[-73.282526,40.708263],[-73.282479,40.707849],[-73.282563,40.707729],[-73.28265,40.707624],[-73.28269400000001,40.707494],[-73.282803,40.707214],[-73.282804,40.705727],[-73.282686,40.705633],[-73.282628,40.705416],[-73.28255900000001,40.705263],[-73.282426,40.705154],[-73.282251,40.705094],[-73.282053,40.704983],[-73.281848,40.704803],[-73.281699,40.704527],[-73.28152300000001,40.703741],[-73.281507,40.703513],[-73.281555,40.703299],[-73.281651,40.703102],[-73.28184,40.701067],[-73.28165799999999,40.700881],[-73.281676,40.700366],[-73.281724,40.69766],[-73.28223800000001,40.697374],[-73.28238399999999,40.697305],[-73.28247399999999,40.697268],[-73.282663,40.697221],[-73.282841,40.697178],[-73.283277,40.697128],[-73.283726,40.697085],[-73.284136,40.69704],[-73.28447300000001,40.697011],[-73.284581,40.697],[-73.285912,40.696882],[-73.28622300000001,40.696851],[-73.286309,40.696867],[-73.28645899999999,40.696861],[-73.287066,40.696807],[-73.287171,40.696794],[-73.287758,40.696725],[-73.288106,40.696702],[-73.288292,40.696692],[-73.288426,40.697057],[-73.288512,40.697277],[-73.288612,40.697705],[-73.288718,40.698515],[-73.288758,40.698986],[-73.288781,40.699532],[-73.28878400000001,40.700122]]],"type":"Polygon"}
}