{
  "id": "360610018002",
  "type": "Feature",
  "properties": {
    "area_land":32631,
    "area_water":0,
    "geoid":"360610018002",
    "name":"Block Group 2",
    "state":"ny"
},
  "bbox": [
    -73.990974,
    40.717409,
    -73.98736,
    40.719318
],
  "geometry": {"coordinates":[[[-73.99097399999999,40.718348],[-73.990529,40.71916],[-73.990436,40.719318],[-73.99021,40.719243],[-73.989733,40.719096],[-73.98897100000001,40.718873],[-73.988173,40.718612],[-73.98736,40.71837],[-73.98743399999999,40.718213],[-73.98751,40.718074],[-73.98787900000001,40.717409],[-73.988671,40.71765],[-73.989473,40.717893],[-73.990233,40.718124],[-73.99071600000001,40.718269],[-73.99097399999999,40.718348]]],"type":"Polygon"}
}