{
  "id": "360470938001",
  "type": "Feature",
  "properties": {
    "area_land":61676,
    "area_water":0,
    "geoid":"360470938001",
    "name":"Block Group 1",
    "state":"ny"
},
  "bbox": [
    -73.926547,
    40.65035,
    -73.922849,
    40.652538
],
  "geometry": {"coordinates":[[[-73.926547,40.652392],[-73.92561000000001,40.652446],[-73.92464,40.6525],[-73.923666,40.652538],[-73.922849,40.652463],[-73.923081,40.651855],[-73.923467,40.650834],[-73.923585,40.65052],[-73.924421,40.650469],[-73.925392,40.650407],[-73.926326,40.65035],[-73.926547,40.652392]]],"type":"Polygon"}
}