{
  "id": "361190013034",
  "type": "Feature",
  "properties": {
    "area_land":86400,
    "area_water":0,
    "geoid":"361190013034",
    "name":"Block Group 4",
    "state":"ny"
},
  "bbox": [
    -73.896944,
    40.911517,
    -73.89372,
    40.916151
],
  "geometry": {"coordinates":[[[-73.896933,40.915622],[-73.896884,40.916151],[-73.895787,40.91593],[-73.895623,40.915899],[-73.895366,40.915869],[-73.89504700000001,40.91588],[-73.89484299999999,40.915916],[-73.894586,40.915962],[-73.89448400000001,40.915907],[-73.89414600000001,40.915804],[-73.89387000000001,40.915754],[-73.893835,40.915719],[-73.89372,40.915376],[-73.894166,40.915236],[-73.894228,40.915232],[-73.894571,40.915333],[-73.894688,40.915355],[-73.894908,40.915312],[-73.89498500000001,40.915277],[-73.89512000000001,40.915139],[-73.894543,40.914781],[-73.894431,40.914702],[-73.894385,40.914656],[-73.894341,40.914592],[-73.89423499999999,40.914347],[-73.89479,40.914219],[-73.894935,40.914162],[-73.894992,40.914116],[-73.89501,40.914067],[-73.895003,40.913989],[-73.894797,40.913419],[-73.89478699999999,40.913302],[-73.89480399999999,40.913213],[-73.89484299999999,40.91315],[-73.895077,40.91292],[-73.895123,40.912845],[-73.895123,40.912767],[-73.895056,40.912686],[-73.894541,40.912357],[-73.894943,40.912001],[-73.89510199999999,40.911848],[-73.89518700000001,40.911718],[-73.895269,40.911517],[-73.895428,40.911543],[-73.895549,40.91155],[-73.89568800000001,40.911552],[-73.895858,40.911566],[-73.89596899999999,40.911582],[-73.896158,40.911632],[-73.89666200000001,40.911795],[-73.896734,40.912765],[-73.896897,40.914511],[-73.896928,40.914996],[-73.896944,40.915414],[-73.896933,40.915622]]],"type":"Polygon"}
}