{
  "id": "360550109023",
  "type": "Feature",
  "properties": {
    "area_land":788529,
    "area_water":0,
    "geoid":"360550109023",
    "name":"Block Group 3",
    "state":"ny"
},
  "bbox": [
    -77.561407,
    43.188305,
    -77.545005,
    43.198169
],
  "geometry": {"coordinates":[[[-77.561407,43.19603],[-77.561263,43.196033],[-77.560952,43.196044],[-77.56061099999999,43.196063],[-77.55900699999999,43.196135],[-77.55774099999999,43.196295],[-77.55825299999999,43.195925],[-77.557497,43.196027],[-77.55592,43.196208],[-77.55507299999999,43.196311],[-77.55423399999999,43.196434],[-77.552189,43.196728],[-77.551524,43.196806],[-77.55040099999999,43.196986],[-77.54985499999999,43.197109],[-77.54939299999999,43.197257],[-77.549042,43.19741],[-77.54874700000001,43.197578],[-77.548433,43.197799],[-77.548227,43.197948],[-77.54804,43.198122],[-77.54784100000001,43.198144],[-77.54762100000001,43.198169],[-77.54635399999999,43.195207],[-77.54629300000001,43.195035],[-77.546256,43.19493],[-77.546002,43.194267],[-77.545813,43.193811],[-77.54532,43.192625],[-77.545141,43.19216],[-77.545035,43.191885],[-77.545005,43.19182],[-77.545196,43.191723],[-77.545447,43.191601],[-77.545462,43.191579],[-77.545492,43.191579],[-77.545635,43.191513],[-77.54564999999999,43.191491],[-77.54568,43.191491],[-77.54586,43.191409],[-77.54589,43.191409],[-77.54590899999999,43.191397],[-77.54601700000001,43.191381],[-77.54606200000001,43.191381],[-77.546086,43.191375],[-77.54625,43.191359],[-77.546272,43.191343],[-77.546302,43.191343],[-77.546347,43.191332],[-77.546385,43.191321],[-77.546553,43.191303],[-77.5467,43.191277],[-77.546865,43.191277],[-77.546992,43.191293],[-77.547015,43.191304],[-77.54704,43.191306],[-77.547067,43.191326],[-77.54732199999999,43.19137],[-77.547347,43.191368],[-77.547517,43.191266],[-77.547545,43.191236],[-77.547622,43.191129],[-77.547629,43.191102],[-77.547659,43.19108],[-77.54777900000001,43.190953],[-77.547802,43.190937],[-77.547832,43.190926],[-77.54785699999999,43.190923],[-77.547892,43.19091],[-77.547944,43.19091],[-77.548042,43.190899],[-77.548064,43.190882],[-77.548147,43.190871],[-77.54816700000001,43.190856],[-77.548192,43.190855],[-77.548215,43.190848],[-77.54825200000001,43.190827],[-77.548327,43.190816],[-77.54834200000001,43.1908],[-77.54843200000001,43.190783],[-77.548469,43.190772],[-77.548489,43.190761],[-77.548514,43.190761],[-77.548537,43.190745],[-77.548672,43.190696],[-77.548807,43.190624],[-77.548851,43.19059],[-77.549099,43.190405],[-77.549182,43.190295],[-77.549189,43.190268],[-77.549212,43.190257],[-77.54921299999999,43.190239],[-77.549234,43.190229],[-77.549249,43.190185],[-77.54928700000001,43.190114],[-77.54928700000001,43.190092],[-77.54930899999999,43.190076],[-77.54942200000001,43.189928],[-77.549452,43.189911],[-77.54953399999999,43.189911],[-77.54957899999999,43.189928],[-77.54971399999999,43.189928],[-77.54975899999999,43.189917],[-77.549774,43.1899],[-77.54979899999999,43.189899],[-77.549842,43.189873],[-77.54991699999999,43.189807],[-77.549924,43.189779],[-77.549947,43.189741],[-77.549948,43.189723],[-77.54996199999999,43.189686],[-77.550044,43.189626],[-77.55009699999999,43.189615],[-77.550164,43.189615],[-77.55027699999999,43.189587],[-77.550434,43.189505],[-77.550494,43.189461],[-77.55064400000001,43.189401],[-77.550696,43.189368],[-77.55086900000001,43.189313],[-77.550906,43.189308],[-77.550921,43.189291],[-77.55107099999999,43.18928],[-77.55114399999999,43.189269],[-77.551169,43.189269],[-77.551356,43.18922],[-77.551371,43.189203],[-77.55140900000001,43.189209],[-77.55143099999999,43.189193],[-77.551596,43.189165],[-77.551626,43.189165],[-77.55176899999999,43.189138],[-77.551806,43.189138],[-77.551896,43.189129],[-77.55197099999999,43.189127],[-77.552076,43.18911],[-77.552623,43.18911],[-77.552643,43.189121],[-77.55282,43.189143],[-77.55305799999999,43.189132],[-77.553276,43.18911],[-77.553298,43.189099],[-77.55332199999999,43.189105],[-77.55341799999999,43.189105],[-77.55353100000001,43.189088],[-77.55386799999999,43.189072],[-77.554033,43.18905],[-77.554056,43.189039],[-77.55409299999999,43.189039],[-77.55411599999999,43.189031],[-77.554157,43.189024],[-77.554176,43.189012],[-77.55420100000001,43.18901],[-77.554258,43.188962],[-77.554311,43.188902],[-77.55431799999999,43.188874],[-77.55434099999999,43.188858],[-77.55434099999999,43.188825],[-77.554356,43.188787],[-77.554378,43.18877],[-77.554378,43.188748],[-77.554393,43.188704],[-77.554416,43.188688],[-77.554416,43.188666],[-77.55443099999999,43.188622],[-77.554453,43.188606],[-77.554468,43.188518],[-77.554468,43.18849],[-77.554498,43.188468],[-77.554557,43.188369],[-77.55549499999999,43.188338],[-77.556498,43.188305],[-77.556595,43.189761],[-77.556754,43.192321],[-77.55633899999999,43.19234],[-77.556383,43.193143],[-77.556427,43.19395],[-77.56115,43.193798],[-77.56127600000001,43.193795],[-77.561333,43.194516],[-77.561357,43.195012],[-77.56138,43.195535],[-77.561397,43.195842],[-77.561407,43.19603]]],"type":"Polygon"}
}