{
  "id": "360050295003",
  "type": "Feature",
  "properties": {
    "area_land":40584,
    "area_water":0,
    "geoid":"360050295003",
    "name":"Block Group 3",
    "state":"ny"
},
  "bbox": [
    -73.909566,
    40.882455,
    -73.907226,
    40.885484
],
  "geometry": {"coordinates":[[[-73.909566,40.883732],[-73.90903299999999,40.885484],[-73.90812,40.885314],[-73.90722599999999,40.885157],[-73.907465,40.884434],[-73.907853,40.883451],[-73.907989,40.883162],[-73.90819,40.882897],[-73.908439,40.882672],[-73.90862300000001,40.882455],[-73.908734,40.882507],[-73.90882999999999,40.882554],[-73.908945,40.882628],[-73.90903299999999,40.882703],[-73.909116,40.882802],[-73.90917899999999,40.882908],[-73.909216,40.88301],[-73.909235,40.883136],[-73.909307,40.883669],[-73.909566,40.883732]]],"type":"Polygon"}
}