{
  "id": "360810309024",
  "type": "Feature",
  "properties": {
    "area_land":75409,
    "area_water":0,
    "geoid":"360810309024",
    "name":"Block Group 4",
    "state":"ny"
},
  "bbox": [
    -73.896908,
    40.754389,
    -73.892803,
    40.756898
],
  "geometry": {"coordinates":[[[-73.896908,40.756511],[-73.895976,40.756608],[-73.89505200000001,40.756711],[-73.89412400000001,40.756795],[-73.89318799999999,40.756898],[-73.892803,40.754778],[-73.89373399999999,40.754681],[-73.894661,40.754583],[-73.89559,40.754485],[-73.896522,40.754389],[-73.896908,40.756511]]],"type":"Polygon"}
}