{
  "id": "360550093011",
  "type": "Feature",
  "properties": {
    "area_land":470026,
    "area_water":0,
    "geoid":"360550093011",
    "name":"Block Group 1",
    "state":"ny"
},
  "bbox": [
    -77.610556,
    43.161199,
    -77.59876,
    43.168847
],
  "geometry": {"coordinates":[[[-77.610556,43.167226],[-77.60723400000001,43.167372],[-77.603346,43.16752],[-77.60204899999999,43.167566],[-77.601919,43.167976],[-77.601697,43.168775],[-77.59876,43.168847],[-77.59919499999999,43.168054],[-77.59926400000001,43.167932],[-77.59965,43.167245],[-77.599812,43.166965],[-77.599857,43.166883],[-77.600111,43.16644],[-77.600298,43.166098],[-77.600623,43.165527],[-77.60108,43.164712],[-77.601553,43.163877],[-77.601944,43.163175],[-77.602014,43.16305],[-77.602074,43.162938],[-77.602378,43.162399],[-77.602452,43.162261],[-77.60279800000001,43.162213],[-77.60311400000001,43.162151],[-77.603449,43.16207],[-77.602906,43.162031],[-77.603106,43.161991],[-77.60341200000001,43.161917],[-77.603765,43.161806],[-77.604157,43.161662],[-77.60462699999999,43.161471],[-77.605203,43.161322],[-77.605598,43.161247],[-77.605898,43.16121],[-77.606122,43.1612],[-77.606296,43.161199],[-77.606459,43.161211],[-77.606718,43.16124],[-77.60696,43.161279],[-77.607195,43.161331],[-77.60753200000001,43.16142],[-77.60822400000001,43.161562],[-77.608276,43.161687],[-77.60829200000001,43.161724],[-77.608323,43.161806],[-77.60851099999999,43.162298],[-77.608689,43.162737],[-77.608957,43.163358],[-77.608977,43.163405],[-77.609083,43.163648],[-77.60915900000001,43.163862],[-77.609472,43.164617],[-77.610556,43.167226]]],"type":"Polygon"}
}