{
  "id": "360070135002",
  "type": "Feature",
  "properties": {
    "area_land":403134,
    "area_water":0,
    "geoid":"360070135002",
    "name":"Block Group 2",
    "state":"ny"
},
  "bbox": [
    -76.050728,
    42.097714,
    -76.044257,
    42.10694
],
  "geometry": {"coordinates":[[[-76.05072800000001,42.104324],[-76.049896,42.104468],[-76.049629,42.104516],[-76.04978199999999,42.104635],[-76.04982,42.104716],[-76.04983799999999,42.104858],[-76.049953,42.106125],[-76.04932100000001,42.106276],[-76.048303,42.106486],[-76.047568,42.106601],[-76.04644399999999,42.106752],[-76.044918,42.10694],[-76.044822,42.105931],[-76.044758,42.105377],[-76.04472,42.104961],[-76.044664,42.104355],[-76.04451,42.102661],[-76.04444100000001,42.101966],[-76.044391,42.101907],[-76.044375,42.101707],[-76.044308,42.100993],[-76.044263,42.100428],[-76.044257,42.100355],[-76.044358,42.100308],[-76.04441799999999,42.100281],[-76.04446900000001,42.100258],[-76.044524,42.100232],[-76.04492,42.10005],[-76.045456,42.099812],[-76.04561200000001,42.099743],[-76.04676499999999,42.09922],[-76.04751899999999,42.098876],[-76.047883,42.098727],[-76.048483,42.098461],[-76.04925,42.098112],[-76.050145,42.097714],[-76.050196,42.098368],[-76.05037900000001,42.100561],[-76.05054199999999,42.102364],[-76.05072800000001,42.104324]]],"type":"Polygon"}
}