{
  "id": "361190148112",
  "type": "Feature",
  "properties": {
    "area_land":1308917,
    "area_water":0,
    "geoid":"361190148112",
    "name":"Block Group 2",
    "state":"ny"
},
  "bbox": [
    -73.79208,
    41.312678,
    -73.781458,
    41.335744
],
  "geometry": {"coordinates":[[[-73.79208,41.31625],[-73.79180700000001,41.318141],[-73.791652,41.318969],[-73.79147399999999,41.319912],[-73.791307,41.321032],[-73.791309,41.321245],[-73.791381,41.321959],[-73.791377,41.322042],[-73.791325,41.322928],[-73.791259,41.323385],[-73.791162,41.323873],[-73.79097899999999,41.324539],[-73.79095700000001,41.324707],[-73.790925,41.324936],[-73.79091099999999,41.325041],[-73.790747,41.325768],[-73.790452,41.327178],[-73.790335,41.327785],[-73.790313,41.328179],[-73.790301,41.329048],[-73.79032100000001,41.329638],[-73.790353,41.329878],[-73.79036600000001,41.329944],[-73.790392,41.330072],[-73.79057,41.330572],[-73.790633,41.330687],[-73.79106400000001,41.33155],[-73.791217,41.331874],[-73.791347,41.332219],[-73.79140700000001,41.33238],[-73.791488,41.332815],[-73.79151899999999,41.333186],[-73.79151299999999,41.333444],[-73.79146799999999,41.333982],[-73.79141799999999,41.334265],[-73.791355,41.33445],[-73.791262,41.33464],[-73.791158,41.334805],[-73.791022,41.334948],[-73.79086100000001,41.335087],[-73.790543,41.335272],[-73.790008,41.335469],[-73.78946999999999,41.335584],[-73.788303,41.335643],[-73.787811,41.335679],[-73.786981,41.335702],[-73.78609,41.335744],[-73.786096,41.335159],[-73.786096,41.334712],[-73.786086,41.334515],[-73.786069,41.33444],[-73.785982,41.334128],[-73.78591,41.333945],[-73.785808,41.333757],[-73.785743,41.333603],[-73.785709,41.333469],[-73.785669,41.333196],[-73.785647,41.332685],[-73.785641,41.332562],[-73.78555299999999,41.332119],[-73.785284,41.331083],[-73.785104,41.3303],[-73.7846,41.328322],[-73.78452,41.327825],[-73.784504,41.327528],[-73.784498,41.327417],[-73.784507,41.327187],[-73.784457,41.326841],[-73.784367,41.326486],[-73.78416799999999,41.325581],[-73.783947,41.324475],[-73.783728,41.323283],[-73.783686,41.323017],[-73.783609,41.32228],[-73.783602,41.322133],[-73.783478,41.321748],[-73.78345299999999,41.321544],[-73.783506,41.321239],[-73.78360000000001,41.320936],[-73.78368,41.320624],[-73.783784,41.320338],[-73.78388099999999,41.320115],[-73.78397099999999,41.319954],[-73.784177,41.319522],[-73.78424200000001,41.319339],[-73.784249,41.319246],[-73.78424099999999,41.318388],[-73.78424,41.318101],[-73.78420199999999,41.317382],[-73.78418000000001,41.317333],[-73.784156,41.317279],[-73.784019,41.31716],[-73.783731,41.316947],[-73.78347100000001,41.316803],[-73.782617,41.316269],[-73.78233299999999,41.316092],[-73.782054,41.315895],[-73.781935,41.315777],[-73.781824,41.315641],[-73.781763,41.315511],[-73.781716,41.31535],[-73.781564,41.314644],[-73.781513,41.314404],[-73.78148899999999,41.314291],[-73.781465,41.314031],[-73.781458,41.313587],[-73.781475,41.313405],[-73.781502,41.312678],[-73.782158,41.312708],[-73.783046,41.31271],[-73.78333600000001,41.312718],[-73.78407900000001,41.312732],[-73.784311,41.312733],[-73.78466299999999,41.312782],[-73.78502899999999,41.312908],[-73.785366,41.31309],[-73.785517,41.313205],[-73.78560299999999,41.313301],[-73.785732,41.313506],[-73.785804,41.313693],[-73.78587400000001,41.313981],[-73.78594200000001,41.31439],[-73.786001,41.314836],[-73.786055,41.315072],[-73.78618400000001,41.315377],[-73.786328,41.315592],[-73.786536,41.315843],[-73.786599,41.31592],[-73.786839,41.316135],[-73.787029,41.316304],[-73.787226,41.31644],[-73.787431,41.316562],[-73.787544,41.316617],[-73.78787699999999,41.316764],[-73.788056,41.316826],[-73.788336,41.316879],[-73.788584,41.316904],[-73.788797,41.316902],[-73.789113,41.316881],[-73.78942499999999,41.316848],[-73.78969600000001,41.316792],[-73.789852,41.316752],[-73.79077100000001,41.31648],[-73.791332,41.316302],[-73.791561,41.316252],[-73.791735,41.316239],[-73.791983,41.316239],[-73.79208,41.31625]]],"type":"Polygon"}
}