{
  "id": "360050264001",
  "type": "Feature",
  "properties": {
    "area_land":127871,
    "area_water":0,
    "geoid":"360050264001",
    "name":"Block Group 1",
    "state":"ny"
},
  "bbox": [
    -73.830432,
    40.840609,
    -73.826084,
    40.845339
],
  "geometry": {"coordinates":[[[-73.830432,40.843858],[-73.829655,40.844089],[-73.82931499999999,40.844192],[-73.82871,40.844374],[-73.828453,40.844451],[-73.827575,40.844732],[-73.82674799999999,40.845079],[-73.82611300000001,40.845339],[-73.826193,40.843861],[-73.826241,40.842994],[-73.82608399999999,40.841372],[-73.827032,40.841318],[-73.827913,40.841259],[-73.828767,40.840965],[-73.829674,40.840609],[-73.830034,40.842177],[-73.830202,40.84287],[-73.830432,40.843858]]],"type":"Polygon"}
}