{
  "id": "360593012002",
  "type": "Feature",
  "properties": {
    "area_land":600431,
    "area_water":2178083,
    "geoid":"360593012002",
    "name":"Block Group 2",
    "state":"ny"
},
  "bbox": [
    -73.721775,
    40.8171,
    -73.697786,
    40.8367
],
  "geometry": {"coordinates":[[[-73.72177499999999,40.8364],[-73.71516,40.836631],[-73.71317500000001,40.8367],[-73.710375,40.8314],[-73.707474,40.8314],[-73.702974,40.8357],[-73.702055,40.834381],[-73.700806,40.834927],[-73.700694,40.834974],[-73.70005999999999,40.834354],[-73.69981900000001,40.833966],[-73.69981900000001,40.833645],[-73.700512,40.832468],[-73.700093,40.832592],[-73.69989,40.832621],[-73.699692,40.832607],[-73.699107,40.832509],[-73.698864,40.832465],[-73.698352,40.832373],[-73.698156,40.832332],[-73.69848500000001,40.830348],[-73.698499,40.830263],[-73.69855099999999,40.829953],[-73.698562,40.829854],[-73.698555,40.829786],[-73.69855200000001,40.829132],[-73.69853000000001,40.828221],[-73.698514,40.828138],[-73.698466,40.827893],[-73.698357,40.827298],[-73.698334,40.827259],[-73.69823599999999,40.826821],[-73.698178,40.826558],[-73.69800499999999,40.825867],[-73.69778599999999,40.825062],[-73.700796,40.824568],[-73.700687,40.824145],[-73.700512,40.823533],[-73.70056,40.823481],[-73.700604,40.823404],[-73.700716,40.823261],[-73.700858,40.82313],[-73.70103899999999,40.823007],[-73.701217,40.82292],[-73.701335,40.822873],[-73.701832,40.822652],[-73.701971,40.822599],[-73.70199700000001,40.822237],[-73.70199100000001,40.821836],[-73.701983,40.821599],[-73.701965,40.820586],[-73.70196199999999,40.820272],[-73.704729,40.819327],[-73.70520999999999,40.819237],[-73.705105,40.818807],[-73.711575,40.8171],[-73.71705300000001,40.824279],[-73.718334,40.825957],[-73.720275,40.8285],[-73.720339,40.828838],[-73.72177499999999,40.8364]]],"type":"Polygon"}
}