{
  "id": "360550111002",
  "type": "Feature",
  "properties": {
    "area_land":922718,
    "area_water":262815,
    "geoid":"360550111002",
    "name":"Block Group 2",
    "state":"ny"
},
  "bbox": [
    -77.548131,
    43.167055,
    -77.526593,
    43.177301
],
  "geometry": {"coordinates":[[[-77.548131,43.167324],[-77.54809400000001,43.168015],[-77.54805500000001,43.168707],[-77.54801999999999,43.169415],[-77.548069,43.17022],[-77.544515,43.170344],[-77.54182900000001,43.170425],[-77.541403,43.171208],[-77.540961,43.172033],[-77.54055099999999,43.172806],[-77.540464,43.172956],[-77.54127699999999,43.173939],[-77.541355,43.174048],[-77.541511,43.174266],[-77.541737,43.174639],[-77.5419,43.174955],[-77.542137,43.175532],[-77.542153,43.17557],[-77.542207,43.175697],[-77.542357,43.176078],[-77.542446,43.176314],[-77.54251499999999,43.17662],[-77.542545,43.176859],[-77.54251600000001,43.17686],[-77.541633,43.176901],[-77.54155799999999,43.176904],[-77.541529,43.176905],[-77.541501,43.176906],[-77.541138,43.176921],[-77.540941,43.176929],[-77.540626,43.176942],[-77.539357,43.176993],[-77.538269,43.177037],[-77.53823300000001,43.177038],[-77.538217,43.177039],[-77.53816,43.177042],[-77.538106,43.177044],[-77.537327,43.177089],[-77.537071,43.177088],[-77.536596,43.177041],[-77.53519799999999,43.176903],[-77.53494600000001,43.176898],[-77.534756,43.176895],[-77.533497,43.17711],[-77.533047,43.177205],[-77.532678,43.177268],[-77.532332,43.177296],[-77.53197,43.177301],[-77.531572,43.17728],[-77.531299,43.177243],[-77.53109499999999,43.177196],[-77.53076,43.177099],[-77.530643,43.177063],[-77.53030200000001,43.17696],[-77.52968300000001,43.176797],[-77.52953100000001,43.176758],[-77.528052,43.17638],[-77.52680599999999,43.176087],[-77.52659300000001,43.176042],[-77.526653,43.175701],[-77.526848,43.174842],[-77.527716,43.173807],[-77.527997,43.173481],[-77.52871399999999,43.172536],[-77.529168,43.17223],[-77.529641,43.172145],[-77.530551,43.172396],[-77.53132600000001,43.172113],[-77.531786,43.17155],[-77.53209,43.171064],[-77.53156300000001,43.170932],[-77.530576,43.170805],[-77.52920899999999,43.170716],[-77.52821900000001,43.170697],[-77.527991,43.170501],[-77.528147,43.169854],[-77.528147,43.168955],[-77.528339,43.168723],[-77.528879,43.168939],[-77.529766,43.169134],[-77.530097,43.16914],[-77.530135,43.168737],[-77.530072,43.168108],[-77.53034100000001,43.167968],[-77.53103900000001,43.168006],[-77.53174,43.168111],[-77.53226600000001,43.167992],[-77.532566,43.167837],[-77.532787,43.167724],[-77.532792,43.167654],[-77.532794,43.167624],[-77.53279499999999,43.167615],[-77.532882,43.167611],[-77.533545,43.167607],[-77.533575,43.167607],[-77.53384800000001,43.167612],[-77.53431399999999,43.167623],[-77.534454,43.16762],[-77.534494,43.16762],[-77.53440000000001,43.168607],[-77.534042,43.168871],[-77.53386399999999,43.169007],[-77.53360000000001,43.169075],[-77.533429,43.169663],[-77.533681,43.169959],[-77.53569,43.170827],[-77.535741,43.171712],[-77.536079,43.171033],[-77.537852,43.167473],[-77.538321,43.167469],[-77.538631,43.167469],[-77.53871100000001,43.167465],[-77.538877,43.167458],[-77.53892399999999,43.167456],[-77.543554,43.167247],[-77.546075,43.167133],[-77.548112,43.167055],[-77.548131,43.167324]]],"type":"Polygon"}
}