{
  "id": "360550118002",
  "type": "Feature",
  "properties": {
    "area_land":574720,
    "area_water":28095,
    "geoid":"360550118002",
    "name":"Block Group 2",
    "state":"ny"
},
  "bbox": [
    -77.442011,
    43.094199,
    -77.432109,
    43.103699
],
  "geometry": {"coordinates":[[[-77.442003,43.095619],[-77.44198799999999,43.096253],[-77.441986,43.096378],[-77.441974,43.0972],[-77.44198299999999,43.098552],[-77.441964,43.099544],[-77.441958,43.099861],[-77.441953,43.100159],[-77.441941,43.10078],[-77.441935,43.10117],[-77.441931,43.101408],[-77.44193,43.101478],[-77.44193,43.101505],[-77.441929,43.101544],[-77.441926,43.101657],[-77.441923,43.101788],[-77.441912,43.102347],[-77.44189799999999,43.102821],[-77.441895,43.103254],[-77.44189299999999,43.103361],[-77.441891,43.103469],[-77.44189,43.103536],[-77.44172500000001,43.10355],[-77.441545,43.1036],[-77.441485,43.103622],[-77.44138100000001,43.103644],[-77.441321,43.103666],[-77.44129700000001,43.103671],[-77.440969,43.103699],[-77.440834,43.103644],[-77.440809,43.103642],[-77.440782,43.103622],[-77.440757,43.103621],[-77.440699,43.103594],[-77.440535,43.103561],[-77.44045199999999,43.103512],[-77.440422,43.103512],[-77.4404,43.103496],[-77.44034000000001,43.103474],[-77.440287,43.103446],[-77.440262,43.103444],[-77.440078,43.103336],[-77.440003,43.103282],[-77.439853,43.103161],[-77.439683,43.10308],[-77.43965799999999,43.103079],[-77.439639,43.103067],[-77.439531,43.10304],[-77.43934400000001,43.102974],[-77.439187,43.102892],[-77.43911300000001,43.102837],[-77.43902199999999,43.102771],[-77.439021,43.102753],[-77.43891000000001,43.102618],[-77.43886500000001,43.102579],[-77.43879699999999,43.102546],[-77.43861699999999,43.102508],[-77.438453,43.102486],[-77.43834,43.102448],[-77.438288,43.102442],[-77.438266,43.10242],[-77.438241,43.102419],[-77.438191,43.102393],[-77.438063,43.102365],[-77.437726,43.102343],[-77.437592,43.102316],[-77.437472,43.10225],[-77.437382,43.10219],[-77.437285,43.102053],[-77.437262,43.101987],[-77.437225,43.101948],[-77.437223,43.10193],[-77.43718699999999,43.101894],[-77.43718699999999,43.101866],[-77.437135,43.101811],[-77.437112,43.101795],[-77.437111,43.101777],[-77.43709,43.101756],[-77.437037,43.101685],[-77.437037,43.101663],[-77.437015,43.101647],[-77.436978,43.101603],[-77.436955,43.101553],[-77.43689500000001,43.101493],[-77.436843,43.101416],[-77.43684,43.101398],[-77.43682,43.101383],[-77.43680500000001,43.101356],[-77.43680500000001,43.101318],[-77.43680500000001,43.101235],[-77.43682200000001,43.101221],[-77.43576299999999,43.100794],[-77.43504299999999,43.100504],[-77.43487,43.100443],[-77.434534,43.100309],[-77.43437,43.100236],[-77.43405199999999,43.10008],[-77.43374799999999,43.099909],[-77.433643,43.099842],[-77.43346099999999,43.099743],[-77.433322,43.09966],[-77.43305700000001,43.099485],[-77.432931,43.099394],[-77.43268999999999,43.099201],[-77.43242100000001,43.099018],[-77.432481,43.098564],[-77.43259999999999,43.097852],[-77.432688,43.097591],[-77.43303899999999,43.097241],[-77.43307900000001,43.09704],[-77.433066,43.096862],[-77.43312400000001,43.09678],[-77.432789,43.096462],[-77.43264499999999,43.096259],[-77.432581,43.096167],[-77.432393,43.095834],[-77.43227400000001,43.095558],[-77.432118,43.095042],[-77.432109,43.094199],[-77.43365,43.094328],[-77.43480599999999,43.094428],[-77.435953,43.094532],[-77.43628200000001,43.094561],[-77.44201099999999,43.095079],[-77.442003,43.095619]]],"type":"Polygon"}
}