{
  "id": "360550081004",
  "type": "Feature",
  "properties": {
    "area_land":483718,
    "area_water":0,
    "geoid":"360550081004",
    "name":"Block Group 4",
    "state":"ny"
},
  "bbox": [
    -77.600097,
    43.186132,
    -77.591794,
    43.19639
],
  "geometry": {"coordinates":[[[-77.60009700000001,43.19516],[-77.595253,43.195923],[-77.594672,43.195906],[-77.592388,43.19639],[-77.592376,43.196159],[-77.592313,43.194657],[-77.592271,43.193839],[-77.59224500000001,43.193518],[-77.592242,43.193483],[-77.592226,43.19331],[-77.59222,43.193247],[-77.59220000000001,43.192896],[-77.592191,43.192679],[-77.592186,43.192605],[-77.592096,43.191144],[-77.592046,43.19037],[-77.59184,43.187082],[-77.59179399999999,43.186261],[-77.59567800000001,43.186132],[-77.595724,43.186948],[-77.595342,43.186959],[-77.59539599999999,43.187711],[-77.59544099999999,43.188344],[-77.59545900000001,43.188581],[-77.59548700000001,43.188978],[-77.59552499999999,43.189614],[-77.595564,43.190256],[-77.595617,43.191018],[-77.595625,43.191182],[-77.59657300000001,43.19114],[-77.599836,43.191026],[-77.599868,43.191578],[-77.599884,43.19189],[-77.599896,43.192071],[-77.59990500000001,43.192394],[-77.599998,43.193728],[-77.60009700000001,43.19516]]],"type":"Polygon"}
}