{
  "id": "360670029012",
  "type": "Feature",
  "properties": {
    "area_land":1357991,
    "area_water":0,
    "geoid":"360670029012",
    "name":"Block Group 2",
    "state":"ny"
},
  "bbox": [
    -76.18969,
    43.036386,
    -76.170824,
    43.052362
],
  "geometry": {"coordinates":[[[-76.18969,43.042596],[-76.189639,43.042609],[-76.18946,43.04263],[-76.18894299999999,43.042669],[-76.18879200000001,43.04269],[-76.188587,43.042683],[-76.188078,43.042709],[-76.187935,43.042727],[-76.187569,43.042214],[-76.18751399999999,43.042163],[-76.187442,43.042149],[-76.187352,43.042154],[-76.187029,43.04228],[-76.18385000000001,43.043485],[-76.180651,43.044694],[-76.180513,43.044768],[-76.180468,43.044806],[-76.18042800000001,43.044857],[-76.180223,43.045255],[-76.18016,43.045354],[-76.18004999999999,43.045445],[-76.179892,43.04554],[-76.180167,43.045939],[-76.180665,43.046641],[-76.181145,43.047323],[-76.181646,43.048031],[-76.181989,43.047903],[-76.18337,43.047381],[-76.184099,43.048406],[-76.184224,43.048597],[-76.18504900000001,43.049822],[-76.18540299999999,43.050349],[-76.18572500000001,43.050796],[-76.186266,43.051554],[-76.186452,43.051821],[-76.18649600000001,43.051962],[-76.186482,43.052362],[-76.18511700000001,43.052257],[-76.184235,43.052182],[-76.18348899999999,43.052113],[-76.18294400000001,43.052059],[-76.182856,43.052053],[-76.182607,43.052055],[-76.18239800000001,43.052079],[-76.182209,43.052112],[-76.181926,43.051868],[-76.180747,43.050978],[-76.18035,43.050691],[-76.179209,43.050013],[-76.176993,43.048684],[-76.176502,43.048399],[-76.176266,43.048295],[-76.17601000000001,43.048207],[-76.175746,43.048145],[-76.175426,43.048102],[-76.17488400000001,43.048095],[-76.174294,43.048094],[-76.173117,43.048084],[-76.171886,43.04809],[-76.170824,43.048107],[-76.170878,43.047125],[-76.17088699999999,43.046884],[-76.17090899999999,43.046357],[-76.170935,43.045869],[-76.17094899999999,43.0456],[-76.17101700000001,43.044733],[-76.171041,43.044345],[-76.171076,43.043661],[-76.17109499999999,43.043373],[-76.17114599999999,43.043171],[-76.171283,43.042829],[-76.172573,43.042858],[-76.17402300000001,43.042958],[-76.174008,43.042846],[-76.174024,43.042762],[-76.174077,43.042714],[-76.174263,43.042646],[-76.174054,43.04241],[-76.17397699999999,43.042295],[-76.17394,43.042143],[-76.173931,43.041795],[-76.17398900000001,43.041555],[-76.174109,43.041266],[-76.1742,43.041115],[-76.17435399999999,43.04093],[-76.174532,43.040756],[-76.174612,43.040621],[-76.174632,43.040557],[-76.174637,43.040412],[-76.17462999999999,43.040377],[-76.174626,43.040355],[-76.17455699999999,43.040249],[-76.174325,43.040023],[-76.173937,43.039699],[-76.17386,43.039658],[-76.17395500000001,43.039614],[-76.174494,43.03941],[-76.17477599999999,43.039321],[-76.17525000000001,43.039217],[-76.175684,43.039157],[-76.177232,43.038944],[-76.17751800000001,43.038906],[-76.178641,43.03875],[-76.179372,43.03865],[-76.179856,43.038585],[-76.18104,43.038425],[-76.182196,43.038266],[-76.182767,43.038187],[-76.182936,43.038145],[-76.183716,43.037894],[-76.18616400000001,43.036805],[-76.18660300000001,43.036627],[-76.18683299999999,43.036529],[-76.18720399999999,43.036433],[-76.18732900000001,43.036413],[-76.1875,43.036395],[-76.187729,43.036394],[-76.18812,43.036426],[-76.188311,43.036445],[-76.188633,43.036452],[-76.188901,43.036435],[-76.189223,43.036386],[-76.18902799999999,43.037427],[-76.188033,43.037428],[-76.188158,43.037779],[-76.188354,43.038315],[-76.189055,43.040311],[-76.18967600000001,43.042465],[-76.18969,43.042596]]],"type":"Polygon"}
}