{
  "id": "361031584081",
  "type": "Feature",
  "properties": {
    "area_land":1073979,
    "area_water":940339,
    "geoid":"361031584081",
    "name":"Block Group 1",
    "state":"ny"
},
  "bbox": [
    -72.927595,
    40.952598,
    -72.912564,
    40.972238
],
  "geometry": {"coordinates":[[[-72.92728200000001,40.959198],[-72.92706800000001,40.959263],[-72.926777,40.959377],[-72.92620599999999,40.959553],[-72.926069,40.959591],[-72.92593100000001,40.959613],[-72.92577900000001,40.959614],[-72.925586,40.959606],[-72.925557,40.95972],[-72.92551899999999,40.959903],[-72.92543499999999,40.960251],[-72.925389,40.960456],[-72.925359,40.960742],[-72.92532,40.96088],[-72.92528299999999,40.960934],[-72.92509099999999,40.961166],[-72.92487,40.961448],[-72.924701,40.961707],[-72.924711,40.96191],[-72.924588,40.962374],[-72.924922,40.962883],[-72.924526,40.972238],[-72.913477,40.9713],[-72.913837,40.962467],[-72.913792,40.96173],[-72.913802,40.961601],[-72.913917,40.961523],[-72.913549,40.961033],[-72.913402,40.960342],[-72.913174,40.959685],[-72.913104,40.959022],[-72.91299100000001,40.958355],[-72.912831,40.957683],[-72.912633,40.95702],[-72.912564,40.956341],[-72.913152,40.956379],[-72.913526,40.956116],[-72.913847,40.955913],[-72.913937,40.95586],[-72.91461700000001,40.955439],[-72.91478499999999,40.95533],[-72.91505100000001,40.955219],[-72.915272,40.955142],[-72.916089,40.954848],[-72.91672199999999,40.954654],[-72.91708800000001,40.954513],[-72.917226,40.954441],[-72.917463,40.954264],[-72.917531,40.954116],[-72.917737,40.953914],[-72.917958,40.953754],[-72.91815699999999,40.953655],[-72.91830899999999,40.95359],[-72.91849999999999,40.953541],[-72.919408,40.953403],[-72.920034,40.953322],[-72.923475,40.952862],[-72.924947,40.952628],[-72.925252,40.952598],[-72.92582400000001,40.952694],[-72.925923,40.952724],[-72.92603800000001,40.952792],[-72.926198,40.952907],[-72.926259,40.953132],[-72.92626,40.953335],[-72.92620700000001,40.953491],[-72.926,40.953857],[-72.925802,40.954162],[-72.92575600000001,40.954261],[-72.92574,40.95438],[-72.925764,40.954483],[-72.92582299999999,40.954634],[-72.92629700000001,40.955203],[-72.926451,40.95541],[-72.92670200000001,40.955906],[-72.926717,40.955994],[-72.92670099999999,40.956093],[-72.926625,40.956301],[-72.926648,40.956669],[-72.926693,40.956913],[-72.92677,40.957111],[-72.926862,40.957312],[-72.927595,40.958377],[-72.92728200000001,40.959198]]],"type":"Polygon"}
}