{
  "id": "361031595111",
  "type": "Feature",
  "properties": {
    "area_land":892691,
    "area_water":0,
    "geoid":"361031595111",
    "name":"Block Group 1",
    "state":"ny"
},
  "bbox": [
    -72.858381,
    40.794158,
    -72.840497,
    40.801673
],
  "geometry": {"coordinates":[[[-72.85838099999999,40.799545],[-72.857505,40.799646],[-72.856612,40.79975],[-72.855711,40.799855],[-72.85482,40.799958],[-72.853921,40.800062],[-72.853143,40.800154],[-72.853032,40.800182],[-72.852934,40.800176],[-72.852237,40.800255],[-72.85213899999999,40.80028],[-72.85203300000001,40.800279],[-72.851399,40.800353],[-72.85044499999999,40.800419],[-72.850345,40.80043],[-72.849458,40.800531],[-72.84856600000001,40.800632],[-72.847674,40.800732],[-72.846746,40.800837],[-72.845951,40.80107],[-72.844998,40.801166],[-72.840497,40.801673],[-72.840541,40.801063],[-72.840543,40.800369],[-72.840558,40.799671],[-72.840543,40.798961],[-72.840551,40.79826],[-72.84058899999999,40.798018],[-72.840627,40.797862],[-72.840718,40.797539],[-72.840816,40.797199],[-72.841069,40.79668],[-72.841314,40.796245],[-72.841526,40.795926],[-72.842152,40.795867],[-72.843052,40.795761],[-72.84394500000001,40.79565],[-72.84528899999999,40.795505],[-72.84662299999999,40.795352],[-72.847943,40.795208],[-72.849301,40.795059],[-72.85063700000001,40.794914],[-72.85153699999999,40.794811],[-72.851995,40.794753],[-72.85332200000001,40.794617],[-72.85468,40.794467],[-72.856008,40.794311],[-72.857365,40.794158],[-72.857771,40.796341],[-72.85790799999999,40.797047],[-72.85803,40.797733],[-72.858144,40.798411],[-72.85829699999999,40.799087],[-72.85838099999999,40.799545]]],"type":"Polygon"}
}