{
  "id": "360810446011",
  "type": "Feature",
  "properties": {
    "area_land":97766,
    "area_water":0,
    "geoid":"360810446011",
    "name":"Block Group 1",
    "state":"ny"
},
  "bbox": [
    -73.801657,
    40.702474,
    -73.797124,
    40.706685
],
  "geometry": {"coordinates":[[[-73.80165700000001,40.705761],[-73.79997,40.70638],[-73.799144,40.706685],[-73.797704,40.704327],[-73.797962,40.704223],[-73.797124,40.703035],[-73.79841500000001,40.702741],[-73.799179,40.702596],[-73.79992,40.702474],[-73.800201,40.703341],[-73.80110999999999,40.704848],[-73.80165700000001,40.705761]]],"type":"Polygon"}
}