{
  "id": "360850114021",
  "type": "Feature",
  "properties": {
    "area_land":200691,
    "area_water":0,
    "geoid":"360850114021",
    "name":"Block Group 1",
    "state":"ny"
},
  "bbox": [
    -74.106399,
    40.578623,
    -74.09844,
    40.584016
],
  "geometry": {"coordinates":[[[-74.105688,40.581628],[-74.10503300000001,40.582153],[-74.103843,40.58303],[-74.103157,40.583522],[-74.102497,40.584016],[-74.100612,40.582712],[-74.09844,40.581242],[-74.09908900000001,40.580725],[-74.09974099999999,40.580208],[-74.100391,40.579689],[-74.101052,40.579169],[-74.10167,40.578623],[-74.103797,40.579767],[-74.105135,40.580479],[-74.106399,40.581159],[-74.105688,40.581628]]],"type":"Polygon"}
}