{
  "id": "360499503004",
  "type": "Feature",
  "properties": {
    "area_land":55810635,
    "area_water":225415,
    "geoid":"360499503004",
    "name":"Block Group 4",
    "state":"ny"
},
  "bbox": [
    -75.585069,
    43.786111,
    -75.463036,
    43.867719
],
  "geometry": {"coordinates":[[[-75.58466900000001,43.834245],[-75.58402,43.840926],[-75.58394199999999,43.841706],[-75.583336,43.847964],[-75.58214,43.85916],[-75.58211300000001,43.85934],[-75.581497,43.865403],[-75.58125800000001,43.867719],[-75.5809,43.867699],[-75.57774499999999,43.867528],[-75.564564,43.866772],[-75.555539,43.866286],[-75.54828000000001,43.86589],[-75.527254,43.864741],[-75.50852500000001,43.863706],[-75.50551,43.863517],[-75.499773,43.863187],[-75.495999,43.862924],[-75.48392,43.862566],[-75.48317400000001,43.862539],[-75.483052,43.862536],[-75.480108,43.861252],[-75.47870899999999,43.858642],[-75.47821,43.855323],[-75.47693200000001,43.853413],[-75.47475,43.851],[-75.47430799999999,43.849462],[-75.47461,43.847157],[-75.475836,43.844475],[-75.47694,43.842661],[-75.478067,43.841635],[-75.478787,43.840835],[-75.47938499999999,43.839202],[-75.47958199999999,43.837652],[-75.47860900000001,43.835697],[-75.47672,43.833907],[-75.47523099999999,43.833158],[-75.470401,43.829952],[-75.46634299999999,43.82707],[-75.465335,43.825511],[-75.46451500000001,43.824617],[-75.463369,43.823331],[-75.463173,43.822763],[-75.463036,43.822429],[-75.463562,43.822269],[-75.464393,43.822005],[-75.469652,43.820321],[-75.474448,43.81876],[-75.476665,43.818041],[-75.477779,43.817662],[-75.478385,43.817456],[-75.478915,43.817275],[-75.479952,43.816942],[-75.483784,43.815686],[-75.48455,43.81545],[-75.48569500000001,43.815098],[-75.486907,43.81471],[-75.487318,43.814569],[-75.48754700000001,43.814475],[-75.48773199999999,43.81438],[-75.48791799999999,43.814265],[-75.488159,43.8141],[-75.488297,43.813985],[-75.48852599999999,43.813761],[-75.488747,43.813476],[-75.488877,43.813271],[-75.489008,43.81296],[-75.489063,43.812699],[-75.48911200000001,43.812287],[-75.48910600000001,43.812086],[-75.489054,43.811727],[-75.488884,43.810998],[-75.48843100000001,43.808832],[-75.48816100000001,43.807468],[-75.487998,43.806715],[-75.487898,43.806078],[-75.487863,43.805611],[-75.487865,43.805398],[-75.488208,43.805867],[-75.48837,43.8061],[-75.488581,43.806327],[-75.489296,43.80702],[-75.489436,43.807139],[-75.48970799999999,43.807423],[-75.489897,43.807657],[-75.489985,43.807796],[-75.490222,43.808174],[-75.490419,43.808486],[-75.491056,43.809499],[-75.493801,43.813731],[-75.495991,43.81708],[-75.49621399999999,43.817458],[-75.496509,43.81803],[-75.49831399999999,43.821898],[-75.5,43.825528],[-75.500484,43.82637],[-75.501198,43.827646],[-75.501661,43.828453],[-75.502325,43.829579],[-75.503068,43.830878],[-75.503782,43.832158],[-75.504898,43.834087],[-75.505225,43.834644],[-75.505475,43.835032],[-75.50564300000001,43.835256],[-75.50595199999999,43.835629],[-75.506387,43.836135],[-75.50671800000001,43.836535],[-75.507099,43.836969],[-75.507498,43.837451],[-75.508815,43.838992],[-75.509241,43.839435],[-75.51002200000001,43.840178],[-75.510413,43.840532],[-75.510766,43.840865],[-75.511109,43.841231],[-75.511529,43.841769],[-75.512265,43.842739],[-75.512744,43.843521],[-75.513122,43.844209],[-75.513256,43.844514],[-75.51449700000001,43.84411],[-75.51531,43.843807],[-75.516321,43.843474],[-75.51786,43.842954],[-75.51828399999999,43.84278],[-75.519147,43.842377],[-75.519492,43.842257],[-75.519794,43.842169],[-75.52091299999999,43.841947],[-75.521322,43.841875],[-75.522192,43.841659],[-75.52366499999999,43.841135],[-75.523867,43.841055],[-75.524069,43.841],[-75.523973,43.840879],[-75.522806,43.839266],[-75.52257,43.838918],[-75.522105,43.838108],[-75.520792,43.835638],[-75.52007500000001,43.834258],[-75.51916,43.832526],[-75.518754,43.83176],[-75.517444,43.829245],[-75.51682700000001,43.828101],[-75.515867,43.82629],[-75.51496,43.824615],[-75.51390600000001,43.822546],[-75.510964,43.816822],[-75.510768,43.816418],[-75.510379,43.815685],[-75.509213,43.813371],[-75.508957,43.812913],[-75.508679,43.812497],[-75.50818,43.811943],[-75.507758,43.811543],[-75.505324,43.809466],[-75.50491,43.809071],[-75.50452300000001,43.808626],[-75.50408299999999,43.808079],[-75.503659,43.807503],[-75.503467,43.807165],[-75.5033,43.806797],[-75.503141,43.806306],[-75.503034,43.805824],[-75.50295300000001,43.805195],[-75.502819,43.804196],[-75.502751,43.803793],[-75.502681,43.803552],[-75.50245700000001,43.802993],[-75.502308,43.802704],[-75.502163,43.802472],[-75.50108899999999,43.800865],[-75.49999699999999,43.799061],[-75.499149,43.797593],[-75.49873100000001,43.796881],[-75.498239,43.795993],[-75.498116,43.795763],[-75.49744699999999,43.794579],[-75.496945,43.793731],[-75.496208,43.792426],[-75.49593900000001,43.791965],[-75.495671,43.79154],[-75.495509,43.79125],[-75.49522399999999,43.790733],[-75.494996,43.79038],[-75.494789,43.790053],[-75.49447600000001,43.789615],[-75.49408699999999,43.789095],[-75.49359699999999,43.788443],[-75.493504,43.788319],[-75.49298400000001,43.787635],[-75.492243,43.786667],[-75.492886,43.786565],[-75.49350200000001,43.786479],[-75.494226,43.786378],[-75.494812,43.786296],[-75.495347,43.786208],[-75.49612399999999,43.786116],[-75.496295,43.786111],[-75.496475,43.786138],[-75.49686199999999,43.786262],[-75.497333,43.786426],[-75.497775,43.786563],[-75.499173,43.787029],[-75.499495,43.787127],[-75.49999699999999,43.787241],[-75.50132600000001,43.787461],[-75.501634,43.787518],[-75.50215799999999,43.787614],[-75.50260900000001,43.787681],[-75.502703,43.787692],[-75.503208,43.787732],[-75.503399,43.787735],[-75.503559,43.787738],[-75.503748,43.787735],[-75.504125,43.787706],[-75.505032,43.787582],[-75.50605899999999,43.787439],[-75.506511,43.787376],[-75.508081,43.787162],[-75.508691,43.787116],[-75.50896899999999,43.787112],[-75.50948699999999,43.787142],[-75.509905,43.787189],[-75.51054499999999,43.787306],[-75.511858,43.787621],[-75.51332499999999,43.787999],[-75.51487,43.788436],[-75.515181,43.78852],[-75.516356,43.78884],[-75.51673099999999,43.788935],[-75.51853699999999,43.789392],[-75.524477,43.790863],[-75.527801,43.791686],[-75.52832600000001,43.791782],[-75.528749,43.791834],[-75.530693,43.791952],[-75.531397,43.791983],[-75.53485999999999,43.792198],[-75.536022,43.79228],[-75.538523,43.792499],[-75.539805,43.792609],[-75.5408,43.792694],[-75.543916,43.79298],[-75.545474,43.793131],[-75.546052,43.793222],[-75.546767,43.793378],[-75.546955,43.793428],[-75.547528,43.793346],[-75.54777300000001,43.79333],[-75.548249,43.793906],[-75.548619,43.794086],[-75.549139,43.794394],[-75.552341,43.796698],[-75.552764,43.796995],[-75.55309800000001,43.797233],[-75.553432,43.797529],[-75.553601,43.797714],[-75.554788,43.79942],[-75.556225,43.801521],[-75.556912,43.802506],[-75.557586,43.803495],[-75.558064,43.804181],[-75.558318,43.804545],[-75.559247,43.805879],[-75.55929,43.80594],[-75.559702,43.806534],[-75.56041,43.807436],[-75.561201,43.808392],[-75.56355600000001,43.81105],[-75.56399399999999,43.811535],[-75.56587399999999,43.813684],[-75.569917,43.818256],[-75.57105900000001,43.819547],[-75.57119,43.819695],[-75.57205,43.820564],[-75.572397,43.820891],[-75.573094,43.821517],[-75.57377,43.822142],[-75.574472,43.822767],[-75.576998,43.824971],[-75.577428,43.825313],[-75.577635,43.825458],[-75.577915,43.825653],[-75.57846000000001,43.826],[-75.580232,43.827108],[-75.582167,43.828296],[-75.583119,43.828899],[-75.583777,43.829353],[-75.585069,43.830325],[-75.58466900000001,43.834245]]],"type":"Polygon"}
}