{
  "id": "361119534003",
  "type": "Feature",
  "properties": {
    "area_land":4638401,
    "area_water":151435,
    "geoid":"361119534003",
    "name":"Block Group 3",
    "state":"ny"
},
  "bbox": [
    -74.097434,
    41.741404,
    -74.057844,
    41.776518
],
  "geometry": {"coordinates":[[[-74.09743400000001,41.756995],[-74.09675900000001,41.758092],[-74.094486,41.761254],[-74.093823,41.762745],[-74.093171,41.7651],[-74.092777,41.766591],[-74.09209199999999,41.768373],[-74.091741,41.770236],[-74.091475,41.771953],[-74.09110099999999,41.773162],[-74.090137,41.774864],[-74.089108,41.776518],[-74.088807,41.776383],[-74.08847400000001,41.776217],[-74.08765099999999,41.775713],[-74.087025,41.775154],[-74.086187,41.774407],[-74.085336,41.772827],[-74.083634,41.769118],[-74.083119,41.767402],[-74.082942,41.764977],[-74.08300699999999,41.763787],[-74.083072,41.763453],[-74.08309199999999,41.763356],[-74.08310299999999,41.763292],[-74.082358,41.763243],[-74.082176,41.763246],[-74.081973,41.763274],[-74.08169700000001,41.763332],[-74.081614,41.763334],[-74.081525,41.763299],[-74.08146600000001,41.763416],[-74.081292,41.763642],[-74.081211,41.763733],[-74.080084,41.763327],[-74.080473,41.762718],[-74.08048599999999,41.762698],[-74.08071200000001,41.762318],[-74.080938,41.761876],[-74.080994,41.761766],[-74.081149,41.761424],[-74.081501,41.760581],[-74.081569,41.760425],[-74.081722,41.759979],[-74.08147700000001,41.759821],[-74.08123500000001,41.759157],[-74.08098699999999,41.759025],[-74.080151,41.758756],[-74.079885,41.758789],[-74.07898400000001,41.758356],[-74.07807099999999,41.758019],[-74.07766100000001,41.757856],[-74.07728299999999,41.758458],[-74.07619699999999,41.758087],[-74.07603899999999,41.758412],[-74.076409,41.758529],[-74.07632599999999,41.758681],[-74.076263,41.758797],[-74.07593,41.758692],[-74.07577000000001,41.758642],[-74.073927,41.758077],[-74.073235,41.76093],[-74.07621899999999,41.761848],[-74.07611900000001,41.76197],[-74.077557,41.762488],[-74.07723799999999,41.763386],[-74.070685,41.761335],[-74.067488,41.760329],[-74.067395,41.761459],[-74.05961000000001,41.758891],[-74.05929399999999,41.759727],[-74.058145,41.756948],[-74.057844,41.756189],[-74.058223,41.755469],[-74.058993,41.754079],[-74.0603,41.751764],[-74.062547,41.747756],[-74.062971,41.746956],[-74.063306,41.746246],[-74.063692,41.745291],[-74.063867,41.744816],[-74.064092,41.744105],[-74.06428699999999,41.743402],[-74.064453,41.742688],[-74.064548,41.742168],[-74.064582,41.741984],[-74.064678,41.741404],[-74.064919,41.741424],[-74.065646,41.741498],[-74.066002,41.741542],[-74.066621,41.74166],[-74.067215,41.741811],[-74.066855,41.742233],[-74.06566599999999,41.74367],[-74.06518699999999,41.744196],[-74.06498000000001,41.744522],[-74.06492299999999,41.744636],[-74.06473099999999,41.745116],[-74.06462000000001,41.745423],[-74.065241,41.745656],[-74.067931,41.74668],[-74.068118,41.74675],[-74.06894699999999,41.747064],[-74.069361,41.747223],[-74.07083,41.747768],[-74.07142,41.747998],[-74.072115,41.748278],[-74.07257300000001,41.74846],[-74.073071,41.74865],[-74.073477,41.748801],[-74.07356900000001,41.74894],[-74.074057,41.74913],[-74.074168,41.749063],[-74.074547,41.749212],[-74.074958,41.749361],[-74.075401,41.749532],[-74.076108,41.749804],[-74.077063,41.750176],[-74.07748599999999,41.750334],[-74.077915,41.750477],[-74.079532,41.751061],[-74.079795,41.751157],[-74.08030100000001,41.751335],[-74.08139799999999,41.751732],[-74.08200600000001,41.751967],[-74.083381,41.752608],[-74.083583,41.752686],[-74.08365000000001,41.752704],[-74.08391399999999,41.75276],[-74.084924,41.752952],[-74.08447700000001,41.753705],[-74.084986,41.75372],[-74.08528200000001,41.753723],[-74.08538900000001,41.75372],[-74.08619899999999,41.753698],[-74.086423,41.753709],[-74.086523,41.753723],[-74.086657,41.753617],[-74.086848,41.753509],[-74.08707,41.753415],[-74.087411,41.753302],[-74.087694,41.753236],[-74.088188,41.753165],[-74.08832099999999,41.753132],[-74.08839399999999,41.75307],[-74.088416,41.753021],[-74.08842,41.752972],[-74.08835000000001,41.752439],[-74.08834299999999,41.752397],[-74.088285,41.752043],[-74.088123,41.751005],[-74.088117,41.750872],[-74.088129,41.750787],[-74.088185,41.75076],[-74.08836599999999,41.750653],[-74.088514,41.750553],[-74.08884,41.750258],[-74.088919,41.750211],[-74.088989,41.750175],[-74.089079,41.750078],[-74.089327,41.749793],[-74.089426,41.749674],[-74.08945900000001,41.749613],[-74.08951999999999,41.749452],[-74.089546,41.749242],[-74.089544,41.749088],[-74.08945199999999,41.748448],[-74.089451,41.748121],[-74.08947000000001,41.747861],[-74.089493,41.747761],[-74.089658,41.747386],[-74.089973,41.746788],[-74.089996,41.746713],[-74.090003,41.746642],[-74.090141,41.746663],[-74.090188,41.746669],[-74.090233,41.746676],[-74.090422,41.746707],[-74.090288,41.74714],[-74.09011599999999,41.748892],[-74.090243,41.750223],[-74.091312,41.751562],[-74.09179899999999,41.751954],[-74.09307200000001,41.752549],[-74.094039,41.752831],[-74.094567,41.753314],[-74.094718,41.753604],[-74.09525600000001,41.753942],[-74.096097,41.754989],[-74.097292,41.75614],[-74.09743400000001,41.756995]]],"type":"Polygon"}
}