{
  "id": "360550151012",
  "type": "Feature",
  "properties": {
    "area_land":14288840,
    "area_water":0,
    "geoid":"360550151012",
    "name":"Block Group 2",
    "state":"ny"
},
  "bbox": [
    -77.9211,
    43.284065,
    -77.827711,
    43.304768
],
  "geometry": {"coordinates":[[[-77.9211,43.304768],[-77.91953599999999,43.30436],[-77.912336,43.30316],[-77.906046,43.302939],[-77.895235,43.30256],[-77.890581,43.302863],[-77.859309,43.301356],[-77.85929299999999,43.301355],[-77.84653400000001,43.300861],[-77.82771099999999,43.298138],[-77.83118399999999,43.290367],[-77.832577,43.28725],[-77.833264,43.285746],[-77.833285,43.285699],[-77.834018,43.284075],[-77.836634,43.28407],[-77.836725,43.28407],[-77.840278,43.284085],[-77.84142,43.284069],[-77.84491300000001,43.284065],[-77.847729,43.284081],[-77.853115,43.284102],[-77.853973,43.284104],[-77.854609,43.284122],[-77.855754,43.284129],[-77.856965,43.284138],[-77.86004699999999,43.284174],[-77.86342,43.284213],[-77.866896,43.284262],[-77.875102,43.284339],[-77.878731,43.284386],[-77.879846,43.284393],[-77.881536,43.284416],[-77.88448699999999,43.284457],[-77.88502699999999,43.284448],[-77.88587,43.284467],[-77.89002600000001,43.284475],[-77.890575,43.284475],[-77.891156,43.284481],[-77.8917,43.284473],[-77.892779,43.284473],[-77.895809,43.284469],[-77.897592,43.284471],[-77.89792300000001,43.284486],[-77.90593200000001,43.284475],[-77.908244,43.284479],[-77.91015299999999,43.284491],[-77.91082900000001,43.284495],[-77.913099,43.284482],[-77.91461700000001,43.28447],[-77.916087,43.284469],[-77.916579,43.284482],[-77.921071,43.284511],[-77.921009,43.286867],[-77.920969,43.288363],[-77.920922,43.289825],[-77.92092,43.289873],[-77.920902,43.29044],[-77.92087600000001,43.291335],[-77.920771,43.295338],[-77.92086999999999,43.29794],[-77.920924,43.299864],[-77.920925,43.299898],[-77.921025,43.302697],[-77.921048,43.303323],[-77.921066,43.303976],[-77.92106699999999,43.304008],[-77.9211,43.304768]]],"type":"Polygon"}
}