{
  "id": "360830525012",
  "type": "Feature",
  "properties": {
    "area_land":19597280,
    "area_water":919295,
    "geoid":"360830525012",
    "name":"Block Group 2",
    "state":"ny"
},
  "bbox": [
    -73.756789,
    42.534637,
    -73.674955,
    42.582255
],
  "geometry": {"coordinates":[[[-73.756666,42.543681],[-73.756765,42.54378],[-73.75646500000001,42.54868],[-73.75566499999999,42.55158],[-73.754065,42.55678],[-73.75216500000001,42.56658],[-73.752168,42.56672],[-73.75218,42.567391],[-73.752185,42.567657],[-73.752365,42.57668],[-73.750266,42.57688],[-73.748266,42.577081],[-73.747426,42.577262],[-73.747361,42.577276],[-73.74483600000001,42.577534],[-73.740314,42.578083],[-73.73838000000001,42.578317],[-73.736636,42.578506],[-73.731464,42.579067],[-73.719979,42.58028],[-73.704122,42.582255],[-73.704244,42.581643],[-73.704291,42.581438],[-73.704354,42.581165],[-73.70455,42.580595],[-73.70514900000001,42.579084],[-73.705365,42.578572],[-73.70548100000001,42.578276],[-73.70559900000001,42.577854],[-73.705657,42.577671],[-73.70602599999999,42.577009],[-73.706068,42.576864],[-73.70607200000001,42.576726],[-73.70605,42.576439],[-73.70602700000001,42.576252],[-73.70600899999999,42.576101],[-73.705983,42.575809],[-73.70596500000001,42.575519],[-73.70598099999999,42.575236],[-73.70599900000001,42.575085],[-73.70610499999999,42.574683],[-73.706126,42.574365],[-73.706247,42.573106],[-73.70624100000001,42.572982],[-73.706233,42.572824],[-73.706141,42.572239],[-73.706017,42.571638],[-73.705668,42.569946],[-73.705619,42.569655],[-73.70547000000001,42.568623],[-73.70528899999999,42.567532],[-73.705207,42.56715],[-73.70499700000001,42.565864],[-73.704984,42.565776],[-73.704953,42.565151],[-73.704944,42.564779],[-73.704864,42.563801],[-73.704798,42.562889],[-73.704807,42.562778],[-73.704825,42.562625],[-73.70487799999999,42.562486],[-73.705429,42.561181],[-73.705763,42.560306],[-73.705248,42.560229],[-73.70489600000001,42.560194],[-73.704061,42.560095],[-73.703874,42.560088],[-73.703515,42.560084],[-73.703242,42.560099],[-73.70305,42.560119],[-73.70283000000001,42.560161],[-73.701307,42.560561],[-73.700209,42.560847],[-73.697982,42.561393],[-73.69689,42.561629],[-73.69470200000001,42.56215],[-73.694553,42.562184],[-73.69441,42.562216],[-73.69432500000001,42.562235],[-73.693907,42.562333],[-73.69322200000001,42.562501],[-73.692165,42.562735],[-73.69206699999999,42.562744],[-73.69190500000001,42.562758],[-73.69178700000001,42.562762],[-73.691202,42.562717],[-73.690856,42.562665],[-73.690208,42.562523],[-73.69009200000001,42.562506],[-73.689339,42.562318],[-73.689103,42.562275],[-73.688924,42.562264],[-73.68879,42.56227],[-73.688652,42.562291],[-73.68847700000001,42.562334],[-73.68810499999999,42.562502],[-73.687488,42.562805],[-73.68700800000001,42.563048],[-73.686412,42.563349],[-73.685402,42.563888],[-73.68445199999999,42.564379],[-73.68405300000001,42.56461],[-73.68373,42.564784],[-73.6835,42.564896],[-73.683392,42.564938],[-73.683227,42.564988],[-73.683103,42.56502],[-73.682963,42.56506],[-73.681594,42.562556],[-73.680474,42.56041],[-73.680029,42.559574],[-73.67971,42.559003],[-73.679501,42.558634],[-73.67891,42.557519],[-73.67857100000001,42.556966],[-73.67833899999999,42.55661],[-73.678101,42.556289],[-73.677565,42.555691],[-73.677288,42.555382],[-73.67692599999999,42.555001],[-73.67645899999999,42.554483],[-73.674955,42.552871],[-73.67559199999999,42.552828],[-73.676106,42.552794],[-73.677801,42.552717],[-73.67823199999999,42.552699],[-73.679129,42.552634],[-73.679726,42.552532],[-73.68008399999999,42.552444],[-73.680313,42.552375],[-73.68145800000001,42.551901],[-73.68252,42.551483],[-73.683204,42.551173],[-73.684293,42.5507],[-73.684791,42.550474],[-73.685326,42.550265],[-73.68601700000001,42.550067],[-73.686235,42.550023],[-73.68649499999999,42.549986],[-73.68729999999999,42.549906],[-73.688742,42.549801],[-73.68895999999999,42.549795],[-73.689094,42.549801],[-73.689181,42.549813],[-73.689307,42.54975],[-73.689457,42.549695],[-73.69003600000001,42.549539],[-73.69093599999999,42.549324],[-73.69148,42.549181],[-73.69164000000001,42.549141],[-73.691999,42.5491],[-73.692223,42.549079],[-73.692533,42.549032],[-73.692677,42.548989],[-73.692792,42.548937],[-73.692851,42.54889],[-73.69292299999999,42.548806],[-73.692964,42.548726],[-73.693018,42.548478],[-73.693029,42.548285],[-73.69299599999999,42.547877],[-73.69299100000001,42.547516],[-73.69300699999999,42.547345],[-73.693066,42.547233],[-73.69322200000001,42.547003],[-73.693365,42.546766],[-73.693479,42.54655],[-73.693561,42.546402],[-73.693623,42.546264],[-73.69367800000001,42.546085],[-73.693729,42.545458],[-73.69370499999999,42.544578],[-73.69368799999999,42.543754],[-73.69445399999999,42.543681],[-73.69662599999999,42.543524],[-73.696973,42.543499],[-73.697371,42.543463],[-73.697557,42.543434],[-73.697772,42.543375],[-73.698122,42.543241],[-73.698534,42.543],[-73.69958,42.542297],[-73.699927,42.542089],[-73.70100600000001,42.54139],[-73.702172,42.540661],[-73.70250299999999,42.540432],[-73.702814,42.540209],[-73.703227,42.539892],[-73.703625,42.53957],[-73.705522,42.537986],[-73.70604299999999,42.537551],[-73.706157,42.537438],[-73.70665700000001,42.53704],[-73.706985,42.536854],[-73.707233,42.536765],[-73.707587,42.536676],[-73.707988,42.536614],[-73.70844,42.536516],[-73.708651,42.536407],[-73.70875100000001,42.536327],[-73.70890300000001,42.536206],[-73.709344,42.535762],[-73.709526,42.535565],[-73.70980299999999,42.535306],[-73.71013499999999,42.53503],[-73.710741,42.534637],[-73.71117,42.535003],[-73.71203300000001,42.53574],[-73.712248,42.535896],[-73.712329,42.535936],[-73.71491399999999,42.53696],[-73.715333,42.537142],[-73.715588,42.537273],[-73.716037,42.537527],[-73.71623,42.53769],[-73.71725000000001,42.538651],[-73.717997,42.539496],[-73.718109,42.539643],[-73.718261,42.540093],[-73.71835900000001,42.540286],[-73.718501,42.540512],[-73.71861800000001,42.540658],[-73.718811,42.540818],[-73.718884,42.54087],[-73.71906,42.540958],[-73.71961400000001,42.541079],[-73.719722,42.541122],[-73.719784,42.54117],[-73.71986099999999,42.541145],[-73.719928,42.541177],[-73.720181,42.540934],[-73.720275,42.541079],[-73.720533,42.541549],[-73.720601,42.541644],[-73.720713,42.541758],[-73.720834,42.541835],[-73.720888,42.541865],[-73.720974,42.541898],[-73.721031,42.541913],[-73.721199,42.541946],[-73.72170699999999,42.542061],[-73.72185899999999,42.542112],[-73.722375,42.542333],[-73.723545,42.542852],[-73.724774,42.543308],[-73.72538400000001,42.54351],[-73.725685,42.543627],[-73.72612700000001,42.543822],[-73.72672,42.544057],[-73.726923,42.544129],[-73.72725,42.544207],[-73.727507,42.54422],[-73.72825,42.544207],[-73.728488,42.544161],[-73.72878900000001,42.544064],[-73.729169,42.543985],[-73.729364,42.54394],[-73.72961100000001,42.54392],[-73.730238,42.543953],[-73.730512,42.543972],[-73.73066300000001,42.544005],[-73.731556,42.544096],[-73.731741,42.54409],[-73.732676,42.544005],[-73.733735,42.543881],[-73.734382,42.543792],[-73.735435,42.543626],[-73.73635,42.543468],[-73.737218,42.543361],[-73.738196,42.543262],[-73.739177,42.543177],[-73.73934300000001,42.543142],[-73.739501,42.543095],[-73.740551,42.542554],[-73.741112,42.542252],[-73.741372,42.542147],[-73.741625,42.542077],[-73.741902,42.542025],[-73.742138,42.54199],[-73.742367,42.541984],[-73.742604,42.541985],[-73.74273700000001,42.542001],[-73.742859,42.542025],[-73.74294500000001,42.542072],[-73.743056,42.542154],[-73.743529,42.542463],[-73.743667,42.542545],[-73.74409799999999,42.542753],[-73.744252,42.542808],[-73.744395,42.542835],[-73.74457099999999,42.542855],[-73.744799,42.542843],[-73.744938,42.542816],[-73.74531,42.542761],[-73.745559,42.542741],[-73.74573700000001,42.54275],[-73.745875,42.542764],[-73.746301,42.542844],[-73.746754,42.542982],[-73.747142,42.543122],[-73.74725599999999,42.54317],[-73.747326,42.543206],[-73.747608,42.543384],[-73.748114,42.543809],[-73.74833,42.544032],[-73.74842200000001,42.544143],[-73.74849500000001,42.544278],[-73.748547,42.544423],[-73.748554,42.544515],[-73.748527,42.544791],[-73.748462,42.545067],[-73.748344,42.545347],[-73.74817299999999,42.545691],[-73.74812,42.545778],[-73.74789699999999,42.546107],[-73.747845,42.546213],[-73.74782500000001,42.546276],[-73.74782500000001,42.546339],[-73.747851,42.546407],[-73.74789699999999,42.546494],[-73.747989,42.5466],[-73.748087,42.546668],[-73.748181,42.546723],[-73.748294,42.546767],[-73.748458,42.546815],[-73.748591,42.546227],[-73.74891100000001,42.544455],[-73.749099,42.543454],[-73.749498,42.543621],[-73.74966499999999,42.54367],[-73.749949,42.543793],[-73.75016599999999,42.543905],[-73.750348,42.543942],[-73.750422,42.543946],[-73.750607,42.543957],[-73.7509,42.543931],[-73.751285,42.54383],[-73.751502,42.543793],[-73.7517,42.543782],[-73.751856,42.543778],[-73.752104,42.543808],[-73.75231599999999,42.543797],[-73.752503,42.543733],[-73.752574,42.543681],[-73.752837,42.543551],[-73.752944,42.543521],[-73.75326699999999,42.543483],[-73.75362199999999,42.543482],[-73.75575499999999,42.543181],[-73.756789,42.542972],[-73.756666,42.543681]]],"type":"Polygon"}
}