{
  "id": "360850033002",
  "type": "Feature",
  "properties": {
    "area_land":686190,
    "area_water":0,
    "geoid":"360850033002",
    "name":"Block Group 2",
    "state":"ny"
},
  "bbox": [
    -74.09409,
    40.61593,
    -74.079725,
    40.631081
],
  "geometry": {"coordinates":[[[-74.09408999999999,40.617873],[-74.09407899999999,40.617996],[-74.094048,40.618117],[-74.093998,40.618235],[-74.093934,40.618338],[-74.093862,40.618427],[-74.09381,40.618503],[-74.093734,40.61858],[-74.093648,40.618643],[-74.093548,40.618697],[-74.09343800000001,40.618736],[-74.093334,40.61876],[-74.09321799999999,40.618773],[-74.093096,40.618771],[-74.09303199999999,40.61877],[-74.092787,40.618754],[-74.092586,40.61873],[-74.092376,40.618694],[-74.092141,40.61864],[-74.091922,40.618575],[-74.091076,40.618611],[-74.09066799999999,40.618709],[-74.09022400000001,40.619409],[-74.08986,40.619875],[-74.08942,40.620307],[-74.08867499999999,40.621031],[-74.088629,40.621458],[-74.088545,40.622619],[-74.08848999999999,40.623449],[-74.088498,40.62388],[-74.088528,40.62418],[-74.088719,40.625899],[-74.090495,40.625903],[-74.09083099999999,40.626094],[-74.09158100000001,40.626546],[-74.088904,40.630292],[-74.088077,40.631081],[-74.086823,40.630318],[-74.086491,40.630111],[-74.085207,40.629313],[-74.08456200000001,40.629733],[-74.083882,40.629286],[-74.08302999999999,40.628725],[-74.081731,40.630012],[-74.080759,40.629494],[-74.079725,40.628951],[-74.08037899999999,40.628262],[-74.08044700000001,40.628223],[-74.080513,40.628146],[-74.080569,40.628073],[-74.080586,40.628016],[-74.080592,40.627922],[-74.080613,40.627819],[-74.080626,40.627737],[-74.080645,40.627676],[-74.08068400000001,40.627564],[-74.080725,40.627494],[-74.080787,40.627434],[-74.080831,40.627408],[-74.080924,40.627365],[-74.08101600000001,40.627343],[-74.08113899999999,40.627326],[-74.081372,40.627332],[-74.081531,40.627339],[-74.081695,40.627366],[-74.08187700000001,40.627403],[-74.08205700000001,40.627437],[-74.082206,40.627475],[-74.082335,40.627473],[-74.08257399999999,40.627441],[-74.083033,40.627372],[-74.083395,40.62712],[-74.08376199999999,40.626776],[-74.084154,40.626267],[-74.084962,40.624625],[-74.08525,40.622801],[-74.085375,40.622187],[-74.085466,40.621744],[-74.085487,40.62165],[-74.085605,40.621143],[-74.08562999999999,40.621044],[-74.085702,40.620762],[-74.085802,40.620365],[-74.085899,40.619909],[-74.086007,40.619094],[-74.08604099999999,40.61882],[-74.08608,40.618515],[-74.08626700000001,40.617832],[-74.08657100000001,40.61717],[-74.086985,40.616533],[-74.087414,40.61593],[-74.0896,40.616608],[-74.08980200000001,40.616808],[-74.089854,40.61686],[-74.090307,40.616952],[-74.090469,40.61699],[-74.090698,40.617055],[-74.090913,40.617133],[-74.091109,40.61722],[-74.091278,40.617308],[-74.09147900000001,40.617431],[-74.09166399999999,40.617567],[-74.09181700000001,40.617701],[-74.092,40.617801],[-74.092269,40.617963],[-74.092534,40.618141],[-74.092643,40.618212],[-74.092748,40.618261],[-74.09285800000001,40.618296],[-74.092978,40.618318],[-74.093081,40.618325],[-74.093208,40.618321],[-74.093311,40.618306],[-74.09341000000001,40.618281],[-74.093512,40.618242],[-74.093604,40.618195],[-74.093684,40.61814],[-74.093768,40.618062],[-74.09383,40.617981],[-74.094071,40.617704],[-74.094082,40.617759],[-74.09408999999999,40.617873]]],"type":"Polygon"}
}