{
  "id": "360470858002",
  "type": "Feature",
  "properties": {
    "area_land":62802,
    "area_water":0,
    "geoid":"360470858002",
    "name":"Block Group 2",
    "state":"ny"
},
  "bbox": [
    -73.942826,
    40.649339,
    -73.938895,
    40.651326
],
  "geometry": {"coordinates":[[[-73.942826,40.65111],[-73.941891,40.651169],[-73.940957,40.651229],[-73.94002500000001,40.651276],[-73.93905100000001,40.651326],[-73.938895,40.64957],[-73.939834,40.649512],[-73.940764,40.649454],[-73.9417,40.649394],[-73.94263100000001,40.649339],[-73.942826,40.65111]]],"type":"Polygon"}
}