{
  "id": "360810459001",
  "type": "Feature",
  "properties": {
    "area_land":91288,
    "area_water":0,
    "geoid":"360810459001",
    "name":"Block Group 1",
    "state":"ny"
},
  "bbox": [
    -73.874361,
    40.738803,
    -73.867318,
    40.741678
],
  "geometry": {"coordinates":[[[-73.87436099999999,40.74016],[-73.873481,40.740357],[-73.872614,40.74055],[-73.871723,40.740748],[-73.870858,40.740941],[-73.869506,40.741243],[-73.86755700000001,40.741678],[-73.867563,40.740942],[-73.867318,40.740261],[-73.868985,40.739884],[-73.8712,40.739389],[-73.873835,40.738803],[-73.87410300000001,40.739488],[-73.87436099999999,40.74016]]],"type":"Polygon"}
}