{
  "id": "360290073022",
  "type": "Feature",
  "properties": {
    "area_land":658516,
    "area_water":0,
    "geoid":"360290073022",
    "name":"Block Group 2",
    "state":"ny"
},
  "bbox": [
    -78.959435,
    42.984298,
    -78.947555,
    42.99273
],
  "geometry": {"coordinates":[[[-78.959329,42.98516],[-78.959237,42.985903],[-78.959192,42.986339],[-78.95912800000001,42.986776],[-78.95910600000001,42.986891],[-78.958921,42.987817],[-78.958648,42.988736],[-78.958393,42.989332],[-78.957992,42.990442],[-78.957577,42.991329],[-78.95684900000001,42.99273],[-78.956684,42.992675],[-78.955713,42.992354],[-78.954617,42.991983],[-78.953957,42.991759],[-78.953417,42.991567],[-78.953311,42.99151],[-78.95240800000001,42.991067],[-78.951615,42.990694],[-78.951176,42.99056],[-78.950811,42.990454],[-78.950095,42.990305],[-78.94874299999999,42.990084],[-78.948273,42.989918],[-78.94755499999999,42.989678],[-78.947695,42.989341],[-78.94804999999999,42.988093],[-78.948064,42.987857],[-78.948127,42.987088],[-78.9483,42.986785],[-78.948437,42.986508],[-78.948489,42.986422],[-78.94855099999999,42.986289],[-78.94859599999999,42.986151],[-78.94862000000001,42.986027],[-78.948624,42.9859],[-78.948604,42.985774],[-78.948561,42.985651],[-78.948385,42.985087],[-78.948201,42.98447],[-78.950822,42.984432],[-78.951686,42.984437],[-78.954325,42.984436],[-78.956784,42.984337],[-78.958603,42.984311],[-78.95880099999999,42.984307],[-78.95929,42.9843],[-78.959435,42.984298],[-78.959329,42.98516]]],"type":"Polygon"}
}