{
  "id": "360050332013",
  "type": "Feature",
  "properties": {
    "area_land":47473,
    "area_water":0,
    "geoid":"360050332013",
    "name":"Block Group 3",
    "state":"ny"
},
  "bbox": [
    -73.869516,
    40.85852,
    -73.867486,
    40.861382
],
  "geometry": {"coordinates":[[[-73.86948700000001,40.85977],[-73.86943599999999,40.861382],[-73.86849599999999,40.861363],[-73.867486,40.861346],[-73.86752,40.859568],[-73.86759499999999,40.858989],[-73.867835,40.85852],[-73.868576,40.858828],[-73.869516,40.858869],[-73.86948700000001,40.85977]]],"type":"Polygon"}
}