{
  "id": "361190086022",
  "type": "Feature",
  "properties": {
    "area_land":5420172,
    "area_water":1341759,
    "geoid":"361190086022",
    "name":"Block Group 2",
    "state":"ny"
},
  "bbox": [
    -73.752584,
    41.051988,
    -73.718548,
    41.079651
],
  "geometry": {"coordinates":[[[-73.752584,41.078849],[-73.750744,41.079183],[-73.750601,41.079208],[-73.748789,41.079381],[-73.746589,41.079651],[-73.746421,41.078942],[-73.74619199999999,41.0784],[-73.74549,41.077744],[-73.744666,41.077477],[-73.74350699999999,41.077569],[-73.74164399999999,41.078011],[-73.73984400000001,41.078362],[-73.738608,41.078492],[-73.73767700000001,41.078316],[-73.73668499999999,41.077744],[-73.73610499999999,41.076989],[-73.735815,41.075944],[-73.735753,41.075801],[-73.735449,41.075097],[-73.734762,41.074647],[-73.734359,41.074647],[-73.73371,41.074647],[-73.732962,41.074914],[-73.73226,41.074959],[-73.731222,41.074647],[-73.73033700000001,41.074471],[-73.72929999999999,41.074448],[-73.728476,41.074608],[-73.72760700000001,41.074959],[-73.726966,41.075448],[-73.72608099999999,41.076157],[-73.725211,41.076775],[-73.72434199999999,41.077256],[-73.72364,41.077744],[-73.72312100000001,41.07801],[-73.722663,41.078231],[-73.72217499999999,41.078315],[-73.721839,41.078315],[-73.72153400000001,41.07814],[-73.721244,41.077964],[-73.721137,41.077743],[-73.72107699999999,41.07183],[-73.719094,41.072006],[-73.71855499999999,41.072022],[-73.718548,41.071668],[-73.718557,41.070749],[-73.718586,41.07049],[-73.71862400000001,41.070278],[-73.718729,41.069791],[-73.71902,41.068878],[-73.7192,41.068451],[-73.719376,41.068089],[-73.71973800000001,41.067511],[-73.72010899999999,41.067001],[-73.720557,41.06648],[-73.720426,41.066499],[-73.72023,41.066523],[-73.719793,41.066581],[-73.719446,41.066636],[-73.719375,41.066417],[-73.719347,41.066168],[-73.71934,41.066102],[-73.71933199999999,41.066034],[-73.71925299999999,41.064916],[-73.71922499999999,41.064414],[-73.719194,41.063918],[-73.719151,41.063003],[-73.719129,41.062761],[-73.719036,41.060835],[-73.719033,41.060677],[-73.719019,41.060502],[-73.719004,41.060233],[-73.71898,41.059767],[-73.718941,41.059214],[-73.71888300000001,41.058418],[-73.71875300000001,41.057164],[-73.71874699999999,41.057004],[-73.71869100000001,41.055618],[-73.71871299999999,41.054843],[-73.718749,41.054383],[-73.718774,41.054153],[-73.718762,41.053817],[-73.718688,41.053284],[-73.718676,41.053133],[-73.71973300000001,41.053009],[-73.720626,41.052939],[-73.72129,41.052901],[-73.722632,41.052745],[-73.723232,41.052653],[-73.72384599999999,41.05261],[-73.72411,41.052621],[-73.72556,41.052869],[-73.726996,41.053133],[-73.72721,41.053167],[-73.727925,41.053281],[-73.72811400000001,41.053314],[-73.72826000000001,41.05334],[-73.72842900000001,41.053369],[-73.728728,41.053419],[-73.72908099999999,41.053492],[-73.729675,41.053631],[-73.730046,41.053718],[-73.73156,41.054037],[-73.73227799999999,41.054213],[-73.73311200000001,41.05497],[-73.73330900000001,41.055155],[-73.733491,41.055267],[-73.733895,41.055433],[-73.73396099999999,41.055474],[-73.734077,41.055571],[-73.734622,41.055325],[-73.734775,41.055245],[-73.73508099999999,41.055119],[-73.735394,41.055029],[-73.73592600000001,41.054848],[-73.736046,41.054788],[-73.73611200000001,41.054743],[-73.736425,41.054447],[-73.73665800000001,41.054313],[-73.73709700000001,41.054097],[-73.73722600000001,41.054022],[-73.737381,41.053936],[-73.738343,41.053294],[-73.73865499999999,41.053024],[-73.738726,41.05292],[-73.738871,41.052656],[-73.739125,41.051988],[-73.739316,41.052118],[-73.73951099999999,41.05229],[-73.74024799999999,41.05303],[-73.740419,41.053433],[-73.740887,41.053369],[-73.74085700000001,41.054052],[-73.74116100000001,41.054582],[-73.74169000000001,41.05454],[-73.742183,41.055243],[-73.742587,41.055213],[-73.74288799999999,41.055609],[-73.74272499999999,41.055764],[-73.743092,41.056406],[-73.743326,41.056446],[-73.743565,41.056866],[-73.744702,41.056901],[-73.744872,41.05661],[-73.74529099999999,41.055657],[-73.747276,41.055344],[-73.748538,41.052889],[-73.74865,41.05267],[-73.749227,41.052895],[-73.74956400000001,41.053041],[-73.75029600000001,41.053285],[-73.75077,41.053536],[-73.750938,41.053673],[-73.750877,41.053948],[-73.75083600000001,41.05409],[-73.750782,41.054279],[-73.750772,41.054323],[-73.75039599999999,41.055189],[-73.75033999999999,41.055264],[-73.749651,41.055846],[-73.749163,41.056373],[-73.749033,41.056773],[-73.749015,41.05748],[-73.748908,41.057778],[-73.748969,41.058083],[-73.749259,41.058571],[-73.749488,41.05893],[-73.749549,41.059228],[-73.749656,41.059716],[-73.74983899999999,41.059891],[-73.75035800000001,41.060074],[-73.750541,41.06025],[-73.75048,41.060555],[-73.75035,41.060984],[-73.749962,41.062226],[-73.749962,41.063386],[-73.750666,41.067247],[-73.75093200000001,41.068705],[-73.751081,41.069564],[-73.751178,41.070148],[-73.751237,41.070425],[-73.75132600000001,41.070785],[-73.751744,41.072503],[-73.751907,41.073096],[-73.752123,41.074196],[-73.752223,41.075253],[-73.752258,41.075479],[-73.752421,41.076134],[-73.75244600000001,41.076332],[-73.752436,41.076396],[-73.752393,41.076453],[-73.75237,41.076482],[-73.752523,41.07746],[-73.752523,41.078032],[-73.752584,41.078849]]],"type":"Polygon"}
}