{
  "id": "361059509002",
  "type": "Feature",
  "properties": {
    "area_land":9185319,
    "area_water":524198,
    "geoid":"361059509002",
    "name":"Block Group 2",
    "state":"ny"
},
  "bbox": [
    -74.678755,
    41.686293,
    -74.631373,
    41.74382
],
  "geometry": {"coordinates":[[[-74.67833299999999,41.72931],[-74.67753999999999,41.730004],[-74.677228,41.730262],[-74.676982,41.7305],[-74.67680300000001,41.730705],[-74.676647,41.730902],[-74.67615499999999,41.731584],[-74.675827,41.732039],[-74.67554199999999,41.73247],[-74.67542299999999,41.732614],[-74.67528299999999,41.732852],[-74.67514300000001,41.733122],[-74.674907,41.733566],[-74.67472600000001,41.733785],[-74.674533,41.733985],[-74.674261,41.73429],[-74.67411800000001,41.734487],[-74.67404399999999,41.734629],[-74.674003,41.734765],[-74.67399399999999,41.734814],[-74.67409499999999,41.735446],[-74.674149,41.735736],[-74.67416,41.735958],[-74.674143,41.736038],[-74.674114,41.736127],[-74.674013,41.736352],[-74.673543,41.737295],[-74.672963,41.738447],[-74.672933,41.738504],[-74.672484,41.739474],[-74.672263,41.739995],[-74.672162,41.740216],[-74.67148,41.74172],[-74.670922,41.743032],[-74.670745,41.743486],[-74.670596,41.74382],[-74.67050500000001,41.743767],[-74.670193,41.743635],[-74.669101,41.743101],[-74.668418,41.742754],[-74.668381,41.742739],[-74.668145,41.742643],[-74.667637,41.742498],[-74.66733600000001,41.74246],[-74.667113,41.742449],[-74.666832,41.742476],[-74.66659,41.742528],[-74.66532100000001,41.742879],[-74.664745,41.743011],[-74.66441,41.743017],[-74.663003,41.742893],[-74.66270799999999,41.742877],[-74.66213500000001,41.742877],[-74.661434,41.742897],[-74.659909,41.742959],[-74.659137,41.742975],[-74.65830200000001,41.742965],[-74.657636,41.742912],[-74.656935,41.742782],[-74.65659599999999,41.7427],[-74.65621299999999,41.742594],[-74.655879,41.742488],[-74.655173,41.742271],[-74.654892,41.7422],[-74.654713,41.742165],[-74.654515,41.74215],[-74.65427699999999,41.742145],[-74.654076,41.742152],[-74.653081,41.742188],[-74.652393,41.742203],[-74.651983,41.742219],[-74.651402,41.742229],[-74.650801,41.742273],[-74.64988700000001,41.742367],[-74.64819300000001,41.742562],[-74.647569,41.742646],[-74.646039,41.74281],[-74.644485,41.743006],[-74.643871,41.743094],[-74.64378499999999,41.743118],[-74.643618,41.743202],[-74.643371,41.74309],[-74.642971,41.742887],[-74.640883,41.741783],[-74.64049,41.741565],[-74.639864,41.741219],[-74.639082,41.74081],[-74.63858500000001,41.740533],[-74.638425,41.740442],[-74.638007,41.7402],[-74.637879,41.740126],[-74.637562,41.739904],[-74.63689599999999,41.73941],[-74.636532,41.73918],[-74.63681699999999,41.738922],[-74.637221,41.73859],[-74.63786,41.738102],[-74.63847800000001,41.737593],[-74.63864,41.737429],[-74.638747,41.737273],[-74.63888799999999,41.736997],[-74.638953,41.736762],[-74.638975,41.736516],[-74.63892300000001,41.735587],[-74.638836,41.734188],[-74.638811,41.733246],[-74.638823,41.732288],[-74.638792,41.73188],[-74.638688,41.731275],[-74.638588,41.730857],[-74.638414,41.730382],[-74.638211,41.729842],[-74.63808899999999,41.729432],[-74.63804500000001,41.729184],[-74.63802200000001,41.728808],[-74.638063,41.728061],[-74.638109,41.727308],[-74.63817,41.726626],[-74.638212,41.726071],[-74.638274,41.725031],[-74.63829200000001,41.72468],[-74.638317,41.724208],[-74.638317,41.723981],[-74.63831500000001,41.723915],[-74.638272,41.723645],[-74.63825300000001,41.723562],[-74.638024,41.722874],[-74.637908,41.72248],[-74.63788700000001,41.722401],[-74.637811,41.722124],[-74.637738,41.721795],[-74.637714,41.721481],[-74.63771,41.721354],[-74.63773,41.721196],[-74.637795,41.72088],[-74.63785300000001,41.720734],[-74.63798800000001,41.72045],[-74.638338,41.719871],[-74.63844400000001,41.719642],[-74.63846700000001,41.719545],[-74.63849999999999,41.719296],[-74.63847699999999,41.718928],[-74.63844400000001,41.71877],[-74.638338,41.718491],[-74.63815099999999,41.718152],[-74.63803,41.717971],[-74.63790899999999,41.717829],[-74.637716,41.717629],[-74.637659,41.717575],[-74.63758799999999,41.717507],[-74.637434,41.717361],[-74.637303,41.717255],[-74.637074,41.717069],[-74.635786,41.71614],[-74.635609,41.715982],[-74.635372,41.715749],[-74.63472899999999,41.715071],[-74.63431300000001,41.714656],[-74.633905,41.714194],[-74.633803,41.714065],[-74.633387,41.713597],[-74.632665,41.712737],[-74.632594,41.712647],[-74.632363,41.712265],[-74.63176799999999,41.711226],[-74.63145400000001,41.710744],[-74.631405,41.710652],[-74.631373,41.710521],[-74.631421,41.710106],[-74.631455,41.709969],[-74.631472,41.709902],[-74.631535,41.709774],[-74.631737,41.709475],[-74.631822,41.709296],[-74.631992,41.708851],[-74.632079,41.70856],[-74.632107,41.708382],[-74.632108,41.70825],[-74.632088,41.708131],[-74.63204500000001,41.708022],[-74.631925,41.707836],[-74.631676,41.707534],[-74.631765,41.707485],[-74.632206,41.707291],[-74.632582,41.707167],[-74.632724,41.707134],[-74.633044,41.707061],[-74.63314,41.707031],[-74.63343999999999,41.706941],[-74.63364300000001,41.706845],[-74.633759,41.706777],[-74.63382,41.70674],[-74.633883,41.706683],[-74.634029,41.706526],[-74.634084,41.706445],[-74.634193,41.706245],[-74.634263,41.706126],[-74.634377,41.705883],[-74.63453699999999,41.705481],[-74.634612,41.705195],[-74.634782,41.704044],[-74.63488700000001,41.703403],[-74.63489199999999,41.703374],[-74.63490899999999,41.703312],[-74.635017,41.70304],[-74.635259,41.702626],[-74.63551200000001,41.702233],[-74.63582100000001,41.701769],[-74.63584299999999,41.701733],[-74.636477,41.70076],[-74.637029,41.69991],[-74.63762,41.698961],[-74.638076,41.698266],[-74.638791,41.69711],[-74.639826,41.695522],[-74.639971,41.695319],[-74.640085,41.695162],[-74.640272,41.694959],[-74.640393,41.694852],[-74.640587,41.694699],[-74.64102800000001,41.694442],[-74.641537,41.694184],[-74.641948,41.693983],[-74.642624,41.693686],[-74.643046,41.693559],[-74.643168,41.693534],[-74.643348,41.693494],[-74.644572,41.693277],[-74.645121,41.693179],[-74.645629,41.693065],[-74.64600299999999,41.692922],[-74.646106,41.692875],[-74.646445,41.692682],[-74.64667,41.692517],[-74.646843,41.692368],[-74.64833,41.691091],[-74.648489,41.690935],[-74.64860299999999,41.690807],[-74.648842,41.690484],[-74.64893600000001,41.690309],[-74.64901999999999,41.690151],[-74.649148,41.689853],[-74.64922799999999,41.689706],[-74.64939,41.689468],[-74.649795,41.688996],[-74.65013399999999,41.688615],[-74.650542,41.688163],[-74.650775,41.687912],[-74.650992,41.687678],[-74.65126100000001,41.687421],[-74.65152999999999,41.687198],[-74.652238,41.686696],[-74.65259,41.686471],[-74.652913,41.686293],[-74.65263,41.687889],[-74.651374,41.695207],[-74.64998300000001,41.703226],[-74.64949300000001,41.706058],[-74.648878,41.709583],[-74.647802,41.715755],[-74.647398,41.718086],[-74.646629,41.722776],[-74.66139200000001,41.725563],[-74.66782000000001,41.726893],[-74.678755,41.728908],[-74.67833299999999,41.72931]]],"type":"Polygon"}
}