{
  "id": "360470291001",
  "type": "Feature",
  "properties": {
    "area_land":82329,
    "area_water":0,
    "geoid":"360470291001",
    "name":"Block Group 1",
    "state":"ny"
},
  "bbox": [
    -73.936758,
    40.69009,
    -73.930616,
    40.692228
],
  "geometry": {"coordinates":[[[-73.936758,40.691556],[-73.93383300000001,40.691893],[-73.930907,40.692228],[-73.93076000000001,40.691495],[-73.930616,40.690762],[-73.933542,40.690428],[-73.93646699999999,40.69009],[-73.936612,40.690822],[-73.936758,40.691556]]],"type":"Polygon"}
}