{
  "id": "360550134023",
  "type": "Feature",
  "properties": {
    "area_land":5848176,
    "area_water":3042969,
    "geoid":"360550134023",
    "name":"Block Group 3",
    "state":"ny"
},
  "bbox": [
    -77.705598,
    43.265229,
    -77.643118,
    43.300297
],
  "geometry": {"coordinates":[[[-77.705429,43.286362],[-77.705375,43.286719],[-77.70389900000001,43.287388],[-77.702349,43.287966],[-77.70055600000001,43.288536],[-77.69842199999999,43.288887],[-77.695858,43.289332],[-77.69335,43.290019],[-77.69053700000001,43.291187],[-77.68755299999999,43.292531],[-77.68530699999999,43.293785],[-77.68420999999999,43.295023],[-77.684028,43.297262],[-77.685029,43.29776],[-77.684872,43.297808],[-77.68443600000001,43.297933],[-77.68403600000001,43.298249],[-77.683728,43.298362],[-77.682115,43.299554],[-77.68105300000001,43.300297],[-77.674598,43.295963],[-77.67269899999999,43.294688],[-77.665829,43.290076],[-77.652827,43.282715],[-77.65124299999999,43.281818],[-77.643118,43.278676],[-77.644125,43.276943],[-77.644645,43.27638],[-77.64546,43.275253],[-77.64743,43.272315],[-77.650226,43.270762],[-77.651107,43.269769],[-77.651741,43.269575],[-77.65195,43.269305],[-77.65185700000001,43.268013],[-77.652182,43.267618],[-77.65318000000001,43.267348],[-77.654077,43.267386],[-77.65450199999999,43.267704],[-77.65475000000001,43.268245],[-77.65489700000001,43.268338],[-77.655407,43.268005],[-77.65563899999999,43.26799],[-77.656049,43.268268],[-77.656297,43.268392],[-77.65700099999999,43.268168],[-77.657124,43.267928],[-77.65675299999999,43.267719],[-77.656699,43.267162],[-77.65681499999999,43.266652],[-77.656683,43.266396],[-77.656931,43.265576],[-77.657296,43.265229],[-77.661135,43.267868],[-77.661215,43.26792],[-77.66361499999999,43.269586],[-77.66368900000001,43.269635],[-77.663708,43.269647],[-77.663781,43.269694],[-77.663805,43.26971],[-77.66472,43.270334],[-77.665798,43.270926],[-77.666583,43.271312],[-77.66765100000001,43.27178],[-77.668257,43.271966],[-77.668813,43.272157],[-77.668998,43.272212],[-77.669557,43.272342],[-77.670267,43.272492],[-77.67077500000001,43.272598],[-77.671271,43.272681],[-77.671689,43.272748],[-77.672224,43.272803],[-77.672748,43.272843],[-77.67346499999999,43.272862],[-77.674001,43.272882],[-77.674375,43.27289],[-77.674738,43.272886],[-77.675104,43.272862],[-77.67556500000001,43.27285],[-77.676014,43.272811],[-77.676408,43.272764],[-77.676743,43.272724],[-77.67709000000001,43.272677],[-77.677566,43.272602],[-77.67820500000001,43.272508],[-77.679536,43.272334],[-77.67985899999999,43.272291],[-77.680454,43.272212],[-77.68089500000001,43.272141],[-77.68136800000001,43.272082],[-77.68186,43.272027],[-77.68211599999999,43.271999],[-77.68279800000001,43.27196],[-77.68325900000001,43.271964],[-77.683532,43.271961],[-77.684004,43.271969],[-77.684629,43.272012],[-77.685435,43.272128],[-77.686277,43.272295],[-77.68705300000001,43.272499],[-77.68745699999999,43.272568],[-77.68832399999999,43.272909],[-77.688942,43.273162],[-77.68963100000001,43.273557],[-77.69044700000001,43.27409],[-77.691079,43.274594],[-77.691633,43.275128],[-77.69164600000001,43.275144],[-77.692167,43.275808],[-77.692605,43.276555],[-77.69299100000001,43.277353],[-77.69335700000001,43.278161],[-77.69371599999999,43.278975],[-77.69396500000001,43.279359],[-77.69404400000001,43.279481],[-77.694444,43.279992],[-77.69489,43.280456],[-77.695382,43.280871],[-77.69607499999999,43.281389],[-77.69618800000001,43.281465],[-77.697022,43.281938],[-77.698252,43.282566],[-77.698769,43.282787],[-77.699116,43.282957],[-77.699394,43.2831],[-77.69971700000001,43.283234],[-77.700363,43.283557],[-77.70110099999999,43.283918],[-77.701936,43.284306],[-77.702707,43.284725],[-77.703681,43.285222],[-77.704317,43.285577],[-77.705141,43.286051],[-77.70559799999999,43.286321],[-77.705429,43.286362]]],"type":"Polygon"}
}