{
  "id": "360390811012",
  "type": "Feature",
  "properties": {
    "area_land":8612692,
    "area_water":24185,
    "geoid":"360390811012",
    "name":"Block Group 2",
    "state":"ny"
},
  "bbox": [
    -74.042393,
    42.162134,
    -74.002519,
    42.196955
],
  "geometry": {"coordinates":[[[-74.039911,42.176046],[-74.039728,42.176465],[-74.037836,42.180951],[-74.037994,42.181958],[-74.03841,42.183069],[-74.03911600000001,42.184912],[-74.039177,42.185669],[-74.038946,42.186481],[-74.038445,42.187357],[-74.037998,42.188161],[-74.037993,42.189288],[-74.037879,42.19043],[-74.037746,42.191186],[-74.03733099999999,42.191974],[-74.036766,42.192609],[-74.036114,42.19342],[-74.035634,42.194248],[-74.035631,42.194956],[-74.03563,42.195101],[-74.035676,42.195283],[-74.03577900000001,42.195689],[-74.03567099999999,42.196038],[-74.035636,42.196155],[-74.035127,42.196396],[-74.034972,42.196538],[-74.034764,42.196719],[-74.034689,42.196955],[-74.03199600000001,42.196545],[-74.03115200000001,42.196499],[-74.030418,42.196367],[-74.029732,42.196122],[-74.029055,42.195862],[-74.027145,42.195211],[-74.02662100000001,42.194953],[-74.02624400000001,42.194835],[-74.025948,42.194621],[-74.025661,42.194431],[-74.025265,42.194247],[-74.02469600000001,42.194053],[-74.02405,42.19389],[-74.023662,42.193779],[-74.02319900000001,42.193699],[-74.022763,42.193659],[-74.022431,42.193536],[-74.02217400000001,42.193379],[-74.02180799999999,42.193072],[-74.020725,42.192493],[-74.018597,42.191844],[-74.018073,42.191763],[-74.01790699999999,42.191718],[-74.01778299999999,42.191685],[-74.017481,42.191604],[-74.017247,42.191456],[-74.01716,42.191308],[-74.017134,42.191179],[-74.017168,42.191059],[-74.017247,42.190933],[-74.017983,42.190089],[-74.018017,42.189753],[-74.017934,42.189507],[-74.017813,42.18932],[-74.01762600000001,42.189188],[-74.01750800000001,42.188979],[-74.017422,42.188891],[-74.017302,42.188874],[-74.017157,42.188903],[-74.016974,42.18901],[-74.016766,42.189047],[-74.01661300000001,42.189101],[-74.016307,42.189177],[-74.01598,42.189204],[-74.01566699999999,42.189199],[-74.01538499999999,42.189146],[-74.015111,42.188916],[-74.015033,42.188632],[-74.015049,42.188431],[-74.015208,42.1882],[-74.01526699999999,42.187999],[-74.015612,42.18736],[-74.015654,42.187239],[-74.01566,42.187107],[-74.015584,42.187008],[-74.01543100000001,42.186948],[-74.01502000000001,42.18675],[-74.01454200000001,42.186484],[-74.01351099999999,42.185693],[-74.013312,42.185467],[-74.012261,42.184142],[-74.011848,42.183738],[-74.011613,42.183598],[-74.01127200000001,42.183496],[-74.010284,42.183092],[-74.00896899999999,42.18272],[-74.008712,42.182564],[-74.008916,42.182102],[-74.009039,42.181864],[-74.009153,42.181666],[-74.00922199999999,42.181525],[-74.00926,42.181423],[-74.00926800000001,42.181304],[-74.00919399999999,42.180942],[-74.00913799999999,42.180636],[-74.009092,42.180483],[-74.009016,42.180341],[-74.00890099999999,42.180188],[-74.008758,42.18003],[-74.008408,42.179789],[-74.00816399999999,42.179676],[-74.008026,42.179619],[-74.007942,42.179557],[-74.007896,42.179478],[-74.007874,42.179398],[-74.007881,42.179319],[-74.00808000000001,42.178572],[-74.008095,42.178436],[-74.007881,42.178515],[-74.00649799999999,42.178951],[-74.006027,42.179108],[-74.00557499999999,42.179259],[-74.005133,42.179396],[-74.004822,42.179482],[-74.004581,42.179538],[-74.004485,42.179439],[-74.00442200000001,42.179357],[-74.004328,42.179145],[-74.00425300000001,42.179043],[-74.004159,42.178959],[-74.003806,42.178704],[-74.003598,42.178567],[-74.003393,42.178449],[-74.003327,42.178394],[-74.003193,42.178214],[-74.003044,42.178076],[-74.002993,42.178049],[-74.00297399999999,42.178018],[-74.00297399999999,42.177971],[-74.003091,42.177729],[-74.003201,42.177561],[-74.00325599999999,42.177498],[-74.003429,42.177431],[-74.003488,42.177384],[-74.003531,42.177272],[-74.00359,42.176955],[-74.003601,42.176747],[-74.003621,42.176618],[-74.00379,42.176312],[-74.003798,42.176265],[-74.00378600000001,42.17621],[-74.00376199999999,42.176174],[-74.00372299999999,42.176143],[-74.003668,42.176057],[-74.003629,42.175923],[-74.003601,42.175869],[-74.00355399999999,42.175845],[-74.00349900000001,42.175845],[-74.003441,42.175865],[-74.00335,42.175943],[-74.003107,42.17608],[-74.002887,42.176261],[-74.002797,42.176281],[-74.00273300000001,42.176257],[-74.00251900000001,42.176162],[-74.00269299999999,42.174062],[-74.002759,42.17326],[-74.002825,42.172457],[-74.00325599999999,42.167186],[-74.00358900000001,42.163365],[-74.004532,42.163266],[-74.004581,42.163261],[-74.004631,42.163255],[-74.00469,42.163249],[-74.00488,42.163229],[-74.00516,42.1632],[-74.00658300000001,42.163051],[-74.006615,42.163048],[-74.007031,42.163029],[-74.00711200000001,42.163025],[-74.00714499999999,42.163024],[-74.007482,42.163009],[-74.008622,42.162957],[-74.009625,42.162911],[-74.01061199999999,42.162834],[-74.011053,42.1628],[-74.01107,42.162799],[-74.011135,42.162794],[-74.01115900000001,42.162792],[-74.011195,42.162789],[-74.01343799999999,42.162613],[-74.017206,42.162318],[-74.017775,42.162273],[-74.017943,42.162271],[-74.019374,42.162246],[-74.020278,42.162247],[-74.020293,42.162247],[-74.020477,42.162247],[-74.024179,42.162152],[-74.024878,42.162134],[-74.025758,42.162548],[-74.02672,42.163],[-74.042393,42.170386],[-74.039911,42.176046]]],"type":"Polygon"}
}