{
  "id": "360550038056",
  "type": "Feature",
  "properties": {
    "area_land":701019,
    "area_water":0,
    "geoid":"360550038056",
    "name":"Block Group 6",
    "state":"ny"
},
  "bbox": [
    -77.616809,
    43.116737,
    -77.603984,
    43.125228
],
  "geometry": {"coordinates":[[[-77.616792,43.117808],[-77.616767,43.118889],[-77.616519,43.119489],[-77.616383,43.119805],[-77.616224,43.120183],[-77.615949,43.120882],[-77.615848,43.121119],[-77.615652,43.121576],[-77.61523800000001,43.122576],[-77.61490000000001,43.123395],[-77.614282,43.124861],[-77.611859,43.124951],[-77.61000900000001,43.125019],[-77.607957,43.125096],[-77.606582,43.125145],[-77.605189,43.125197],[-77.604298,43.12522],[-77.603984,43.125228],[-77.60619699999999,43.121122],[-77.60679500000001,43.119951],[-77.607449,43.118813],[-77.608249,43.117348],[-77.60832499999999,43.117209],[-77.60856800000001,43.116763],[-77.608898,43.116757],[-77.609734,43.116737],[-77.610401,43.116767],[-77.61048700000001,43.116772],[-77.615613,43.117091],[-77.616213,43.117129],[-77.616809,43.117165],[-77.616792,43.117808]]],"type":"Polygon"}
}