{
  "id": "360550139024",
  "type": "Feature",
  "properties": {
    "area_land":472481,
    "area_water":0,
    "geoid":"360550139024",
    "name":"Block Group 4",
    "state":"ny"
},
  "bbox": [
    -77.659481,
    43.204558,
    -77.651572,
    43.214601
],
  "geometry": {"coordinates":[[[-77.65947199999999,43.208879],[-77.65947,43.209353],[-77.659457,43.212219],[-77.659442,43.21262],[-77.65946599999999,43.21314],[-77.659465,43.213226],[-77.659457,43.214475],[-77.659313,43.214473],[-77.657899,43.214469],[-77.65773900000001,43.21446],[-77.65759,43.214462],[-77.657438,43.214477],[-77.657032,43.214544],[-77.656673,43.214592],[-77.656415,43.214601],[-77.655705,43.214599],[-77.651572,43.214583],[-77.651585,43.212786],[-77.651588,43.212433],[-77.651596,43.212021],[-77.651606,43.211054],[-77.65160899999999,43.210511],[-77.65161999999999,43.209907],[-77.651625,43.209269],[-77.65393299999999,43.209284],[-77.655063,43.209289],[-77.656989,43.209303],[-77.656987,43.208666],[-77.656986,43.207876],[-77.65697900000001,43.206658],[-77.65696800000001,43.20556],[-77.656959,43.204558],[-77.657696,43.204578],[-77.658045,43.204588],[-77.658095,43.204589],[-77.658484,43.2046],[-77.659083,43.204793],[-77.659086,43.205424],[-77.659082,43.206654],[-77.659299,43.206601],[-77.65947199999999,43.206559],[-77.65946099999999,43.206661],[-77.659481,43.207101],[-77.65947199999999,43.208879]]],"type":"Polygon"}
}