{
  "id": "360850138001",
  "type": "Feature",
  "properties": {
    "area_land":312525,
    "area_water":0,
    "geoid":"360850138001",
    "name":"Block Group 1",
    "state":"ny"
},
  "bbox": [
    -74.144388,
    40.566687,
    -74.136059,
    40.572909
],
  "geometry": {"coordinates":[[[-74.14402,40.57033],[-74.143874,40.570606],[-74.14404,40.5713],[-74.144186,40.572038],[-74.14184899999999,40.572333],[-74.14110700000001,40.572423],[-74.14024000000001,40.572528],[-74.13846599999999,40.57274],[-74.138139,40.57278],[-74.13704199999999,40.572909],[-74.136906,40.572155],[-74.136768,40.571408],[-74.13661500000001,40.570735],[-74.136572,40.570009],[-74.136675,40.570012],[-74.13678299999999,40.570016],[-74.13689599999999,40.570021],[-74.13633,40.569344],[-74.13619799999999,40.568697],[-74.136059,40.568006],[-74.136713,40.567918],[-74.13718799999999,40.567302],[-74.13762199999999,40.566687],[-74.13890000000001,40.567293],[-74.139764,40.567712],[-74.140275,40.567954],[-74.141311,40.568433],[-74.142635,40.568979],[-74.14289100000001,40.569085],[-74.14438800000001,40.569707],[-74.14402,40.57033]]],"type":"Polygon"}
}