{
  "id": "360593006003",
  "type": "Feature",
  "properties": {
    "area_land":379778,
    "area_water":0,
    "geoid":"360593006003",
    "name":"Block Group 3",
    "state":"ny"
},
  "bbox": [
    -73.734079,
    40.793157,
    -73.715514,
    40.797447
],
  "geometry": {"coordinates":[[[-73.73407899999999,40.795258],[-73.733228,40.795261],[-73.733104,40.795262],[-73.73268899999999,40.7953],[-73.732614,40.795103],[-73.732214,40.795173],[-73.73215999999999,40.795177],[-73.73222,40.795559],[-73.73210899999999,40.795603],[-73.731432,40.795613],[-73.731273,40.795558],[-73.730344,40.795664],[-73.72940199999999,40.795698],[-73.728475,40.795832],[-73.72754999999999,40.795936],[-73.727431,40.795348],[-73.72649699999999,40.795457],[-73.725808,40.795536],[-73.725639,40.795566],[-73.72557399999999,40.795567],[-73.724648,40.795676],[-73.723814,40.795773],[-73.723727,40.795822],[-73.72373399999999,40.795904],[-73.723755,40.795959],[-73.723798,40.796157],[-73.723992,40.797133],[-73.723844,40.797123],[-73.72369999999999,40.797101],[-73.723353,40.797034],[-73.72306500000001,40.79699],[-73.722891,40.796976],[-73.72266,40.796975],[-73.722515,40.796989],[-73.722371,40.797002],[-73.722082,40.797042],[-73.720868,40.797179],[-73.719964,40.797291],[-73.71994100000001,40.796845],[-73.719917,40.796716],[-73.720119,40.796639],[-73.72004699999999,40.796498],[-73.71988,40.796517],[-73.719784,40.796031],[-73.718889,40.796144],[-73.71852199999999,40.796165],[-73.718394,40.796087],[-73.71808299999999,40.796128],[-73.717995,40.796232],[-73.71710299999999,40.796329],[-73.716559,40.796454],[-73.717191,40.797209],[-73.71728899999999,40.797256],[-73.716397,40.797384],[-73.71587700000001,40.797447],[-73.71583800000001,40.79713],[-73.71573100000001,40.796182],[-73.715529,40.796169],[-73.715514,40.795925],[-73.715515,40.795855],[-73.715665,40.795873],[-73.715614,40.795601],[-73.715862,40.795589],[-73.715745,40.794873],[-73.715908,40.794787],[-73.716775,40.794624],[-73.717664,40.794528],[-73.718553,40.794398],[-73.71945700000001,40.794368],[-73.719464,40.794327],[-73.719508,40.794286],[-73.719595,40.794261],[-73.719717,40.794253],[-73.72033399999999,40.794169],[-73.721228,40.794058],[-73.721799,40.793978],[-73.722133,40.793944],[-73.722228,40.794037],[-73.72229,40.794067],[-73.722448,40.794114],[-73.7226,40.794126],[-73.723033,40.794083],[-73.725306,40.793817],[-73.726034,40.793733],[-73.726794,40.793645],[-73.727762,40.793534],[-73.727976,40.793507],[-73.728617,40.793436],[-73.728663,40.793431],[-73.73075900000001,40.79319],[-73.730932,40.793157],[-73.731675,40.793201],[-73.73190200000001,40.793494],[-73.73246899999999,40.793435],[-73.732753,40.79339],[-73.733075,40.793339],[-73.73317400000001,40.793473],[-73.733554,40.794078],[-73.733825,40.794599],[-73.73397,40.794891],[-73.734059,40.795177],[-73.73407899999999,40.795258]]],"type":"Polygon"}
}