{
  "id": "360272101011",
  "type": "Feature",
  "properties": {
    "area_land":1458479,
    "area_water":0,
    "geoid":"360272101011",
    "name":"Block Group 1",
    "state":"ny"
},
  "bbox": [
    -73.968034,
    41.50328,
    -73.942485,
    41.518295
],
  "geometry": {"coordinates":[[[-73.967918,41.508084],[-73.96787500000001,41.508116],[-73.967476,41.508607],[-73.96701400000001,41.509219],[-73.966047,41.510458],[-73.965734,41.510864],[-73.96560700000001,41.511118],[-73.965371,41.511679],[-73.965242,41.511926],[-73.965118,41.512032],[-73.965056,41.51207],[-73.965005,41.512102],[-73.964358,41.512402],[-73.96413200000001,41.512508],[-73.963905,41.512616],[-73.96163,41.513701],[-73.960476,41.514247],[-73.960352,41.514306],[-73.959988,41.514479],[-73.95948300000001,41.514719],[-73.95925200000001,41.514825],[-73.958297,41.515267],[-73.956219,41.513069],[-73.946415,41.518295],[-73.945718,41.517707],[-73.945463,41.517472],[-73.944884,41.516944],[-73.94429700000001,41.516494],[-73.942485,41.514895],[-73.943714,41.514093],[-73.943923,41.51398],[-73.94456599999999,41.513684],[-73.94467299999999,41.513635],[-73.945238,41.513307],[-73.945543,41.513038],[-73.94589999999999,41.512696],[-73.946027,41.512615],[-73.946397,41.512439],[-73.94706600000001,41.512188],[-73.94729599999999,41.512093],[-73.947508,41.512026],[-73.94794899999999,41.511945],[-73.94868099999999,41.511903],[-73.94911,41.511846],[-73.949423,41.511804],[-73.94957100000001,41.511751],[-73.94978999999999,41.511624],[-73.949889,41.511543],[-73.94999300000001,41.511388],[-73.95028600000001,41.510841],[-73.950475,41.510559],[-73.95075300000001,41.510213],[-73.951278,41.509613],[-73.95132700000001,41.509543],[-73.95146099999999,41.509282],[-73.951525,41.509194],[-73.95168700000001,41.509059],[-73.951842,41.508985],[-73.95209699999999,41.508894],[-73.952322,41.508841],[-73.95254799999999,41.508834],[-73.952984,41.508841],[-73.953217,41.508805],[-73.953355,41.508745],[-73.95357,41.50858],[-73.954111,41.508128],[-73.954457,41.507854],[-73.954875,41.507571],[-73.95535700000001,41.50731],[-73.95589,41.507006],[-73.95611599999999,41.506904],[-73.95631,41.506802],[-73.956441,41.506721],[-73.956845,41.506385],[-73.956986,41.506322],[-73.95715199999999,41.506294],[-73.957328,41.50628],[-73.95757500000001,41.506241],[-73.95801299999999,41.506121],[-73.958167,41.506068],[-73.95829000000001,41.506001],[-73.958414,41.505916],[-73.95893599999999,41.505479],[-73.959447,41.505019],[-73.95967899999999,41.504823],[-73.959884,41.504692],[-73.960645,41.50416],[-73.96090100000001,41.503999],[-73.961196,41.503835],[-73.96154900000001,41.503666],[-73.961918,41.503461],[-73.962242,41.503294],[-73.962261,41.50328],[-73.962417,41.50338],[-73.962531,41.503458],[-73.96292,41.503773],[-73.963441,41.504091],[-73.963707,41.504256],[-73.96422200000001,41.504595],[-73.964349,41.504664],[-73.96444200000001,41.504714],[-73.965605,41.505432],[-73.965637,41.505462],[-73.96572,41.505585],[-73.965789,41.505736],[-73.96591100000001,41.505952],[-73.966055,41.506158],[-73.96643400000001,41.506543],[-73.966663,41.506732],[-73.96730599999999,41.507328],[-73.967354,41.507382],[-73.967572,41.507649],[-73.967618,41.507727],[-73.967675,41.507794],[-73.967828,41.507919],[-73.968034,41.508044],[-73.967918,41.508084]]],"type":"Polygon"}
}