{
  "id": "360470013002",
  "type": "Feature",
  "properties": {
    "area_land":23459,
    "area_water":0,
    "geoid":"360470013002",
    "name":"Block Group 2",
    "state":"ny"
},
  "bbox": [
    -73.988713,
    40.698713,
    -73.986797,
    40.700699
],
  "geometry": {"coordinates":[[[-73.988713,40.700261],[-73.98868400000001,40.700699],[-73.98774299999999,40.700663],[-73.98724,40.700643],[-73.987047,40.700634],[-73.986879,40.700622],[-73.98679799999999,40.700617],[-73.986797,40.700477],[-73.98680400000001,40.70021],[-73.986808,40.700084],[-73.986813,40.699956],[-73.986901,40.699221],[-73.98694,40.698781],[-73.986943,40.698753],[-73.986947,40.698713],[-73.987257,40.698729],[-73.98729400000001,40.698731],[-73.98763099999999,40.698748],[-73.987921,40.698764],[-73.987889,40.699264],[-73.987802,40.699674],[-73.987787,40.69998],[-73.988338,40.699975],[-73.988634,40.699963],[-73.988635,40.700101],[-73.988694,40.700222],[-73.988713,40.700261]]],"type":"Polygon"}
}