{
  "id": "360810497002",
  "type": "Feature",
  "properties": {
    "area_land":85813,
    "area_water":0,
    "geoid":"360810497002",
    "name":"Block Group 2",
    "state":"ny"
},
  "bbox": [
    -73.892403,
    40.728162,
    -73.88806,
    40.734513
],
  "geometry": {"coordinates":[[[-73.892364,40.730399],[-73.892342,40.730873],[-73.89233400000001,40.731159],[-73.892134,40.733636],[-73.89213100000001,40.733681],[-73.89206299999999,40.733965],[-73.892009,40.734054],[-73.89175,40.734485],[-73.891385,40.734505],[-73.891139,40.734513],[-73.891194,40.733855],[-73.891212,40.733641],[-73.891447,40.730849],[-73.891454,40.730573],[-73.89055500000001,40.730559],[-73.88811,40.730572],[-73.88806,40.730087],[-73.889263,40.729815],[-73.88939999999999,40.72979],[-73.88955,40.729747],[-73.889685,40.729691],[-73.889808,40.729621],[-73.889916,40.72954],[-73.89000799999999,40.72945],[-73.89082399999999,40.728628],[-73.89093800000001,40.728503],[-73.89103900000001,40.72842],[-73.891169,40.728337],[-73.891293,40.728277],[-73.891518,40.728162],[-73.892403,40.729559],[-73.892364,40.730399]]],"type":"Polygon"}
}