{
  "id": "360290151011",
  "type": "Feature",
  "properties": {
    "area_land":32188825,
    "area_water":136033,
    "geoid":"360290151011",
    "name":"Block Group 1",
    "state":"ny"
},
  "bbox": [
    -78.696934,
    42.6383,
    -78.622385,
    42.695802
],
  "geometry": {"coordinates":[[[-78.696934,42.695772],[-78.69076,42.695802],[-78.68909499999999,42.695778],[-78.68661299999999,42.695728],[-78.685912,42.695698],[-78.68376499999999,42.695596],[-78.68258899999999,42.695559],[-78.679306,42.695347],[-78.676078,42.695256],[-78.667207,42.695004],[-78.660203,42.694793],[-78.65782400000001,42.694721],[-78.657342,42.694706],[-78.656859,42.694692],[-78.65287600000001,42.694572],[-78.64631799999999,42.694381],[-78.644778,42.694335],[-78.642972,42.694282],[-78.64265899999999,42.694272],[-78.64234500000001,42.694263],[-78.641818,42.694248],[-78.639893,42.694191],[-78.63941199999999,42.694177],[-78.639015,42.694165],[-78.634826,42.694042],[-78.6224,42.693865],[-78.62238600000001,42.693833],[-78.62238499999999,42.693683],[-78.622426,42.689854],[-78.622463,42.686688],[-78.622466,42.686491],[-78.622502,42.684215],[-78.622557,42.681737],[-78.62266,42.676435],[-78.622719,42.673354],[-78.622849,42.669318],[-78.62300999999999,42.662037],[-78.623065,42.659057],[-78.623082,42.658144],[-78.62311099999999,42.656246],[-78.623136,42.654631],[-78.623206,42.65071],[-78.623211,42.650643],[-78.628789,42.650787],[-78.633979,42.650921],[-78.63741899999999,42.65101],[-78.638953,42.65105],[-78.64049900000001,42.651086],[-78.64627400000001,42.651224],[-78.654222,42.651419],[-78.65592700000001,42.651473],[-78.655908,42.651211],[-78.65588200000001,42.650948],[-78.655781,42.650177],[-78.655559,42.64865],[-78.65544800000001,42.647934],[-78.654815,42.6441],[-78.654977,42.644121],[-78.66042299999999,42.644597],[-78.66074999999999,42.64462],[-78.661406,42.644652],[-78.66173499999999,42.644661],[-78.662063,42.644665],[-78.662494,42.644663],[-78.665324,42.644702],[-78.668279,42.644743],[-78.670305,42.644782],[-78.67272,42.64479],[-78.67536699999999,42.64483],[-78.676002,42.64484],[-78.679171,42.644857],[-78.682849,42.644905],[-78.683375,42.644912],[-78.683482,42.644913],[-78.683689,42.644897],[-78.683847,42.644849],[-78.684133,42.644701],[-78.68433899999999,42.644539],[-78.684608,42.644309],[-78.68478399999999,42.644225],[-78.685554,42.644047],[-78.68617,42.643793],[-78.686926,42.643426],[-78.687685,42.643058],[-78.687963,42.642897],[-78.688169,42.642772],[-78.688231,42.642734],[-78.68849400000001,42.642567],[-78.68875199999999,42.642396],[-78.68900499999999,42.64222],[-78.689252,42.64204],[-78.689318,42.641998],[-78.689503,42.641864],[-78.689577,42.641801],[-78.689616,42.641767],[-78.68976499999999,42.641615],[-78.689893,42.641454],[-78.689965,42.641342],[-78.690056,42.641168],[-78.69010299999999,42.641049],[-78.690406,42.63996],[-78.690361,42.639874],[-78.690434,42.639767],[-78.690522,42.639666],[-78.690623,42.639572],[-78.690736,42.639487],[-78.690861,42.63941],[-78.690995,42.639343],[-78.691138,42.639286],[-78.691287,42.63924],[-78.69144300000001,42.639206],[-78.69186000000001,42.639152],[-78.692592,42.63907],[-78.693325,42.638999],[-78.693906,42.638897],[-78.69448300000001,42.638784],[-78.69480900000001,42.638717],[-78.696848,42.6383],[-78.696831,42.63921],[-78.696814,42.645655],[-78.696827,42.645877],[-78.696811,42.648022],[-78.696817,42.661131],[-78.69676699999999,42.687563],[-78.696838,42.689148],[-78.696832,42.690327],[-78.696763,42.691312],[-78.696893,42.69469],[-78.696934,42.695772]]],"type":"Polygon"}
}