{
  "id": "360470331003",
  "type": "Feature",
  "properties": {
    "area_land":49816,
    "area_water":0,
    "geoid":"360470331003",
    "name":"Block Group 3",
    "state":"ny"
},
  "bbox": [
    -73.948222,
    40.664055,
    -73.942613,
    40.665248
],
  "geometry": {"coordinates":[[[-73.948222,40.664403],[-73.948151,40.665248],[-73.945381,40.665099],[-73.94261299999999,40.664947],[-73.942696,40.664055],[-73.94408199999999,40.664129],[-73.944892,40.664174],[-73.945463,40.664226],[-73.948166,40.664082],[-73.948222,40.664403]]],"type":"Polygon"}
}