{
  "id": "360850176000",
  "type": "Feature",
  "properties": {
    "area_land":0,
    "area_water":2109347,
    "geoid":"360850176000",
    "name":"Block Group 0",
    "state":"ny"
},
  "bbox": [
    -74.17789,
    40.510879,
    -74.15257,
    40.527556
],
  "geometry": {"coordinates":[[[-74.17775899999999,40.519431],[-74.17773099999999,40.519394],[-74.177684,40.519356],[-74.1776,40.519281],[-74.177525,40.519291],[-74.177497,40.519338],[-74.17747799999999,40.519384],[-74.1773,40.519581],[-74.176784,40.520003],[-74.176428,40.520341],[-74.176006,40.520688],[-74.173466,40.522431],[-74.172753,40.522879],[-74.172006,40.523263],[-74.17173099999999,40.523341],[-74.17119700000001,40.523472],[-74.171075,40.523491],[-74.170841,40.523303],[-74.1707,40.523153],[-74.170475,40.523059],[-74.17018400000001,40.52305],[-74.170034,40.523088],[-74.16994099999999,40.523125],[-74.169631,40.523256],[-74.1695,40.523341],[-74.16923800000001,40.523463],[-74.169078,40.523556],[-74.168994,40.523631],[-74.168863,40.5238],[-74.168769,40.523884],[-74.168656,40.523978],[-74.168544,40.524006],[-74.168413,40.524015],[-74.168188,40.524081],[-74.168019,40.524156],[-74.167794,40.52425],[-74.167531,40.5244],[-74.16715600000001,40.524625],[-74.166884,40.524807],[-74.16615299999999,40.525272],[-74.165947,40.525375],[-74.16561900000001,40.525534],[-74.16530899999999,40.525638],[-74.16519700000001,40.525741],[-74.164991,40.525947],[-74.164841,40.526059],[-74.164616,40.526191],[-74.16436299999999,40.526284],[-74.16419399999999,40.526284],[-74.164044,40.526294],[-74.16378899999999,40.526334],[-74.16372,40.52635],[-74.16356399999999,40.526452],[-74.163516,40.526495],[-74.163409,40.526567],[-74.16322700000001,40.526675],[-74.163172,40.526715],[-74.16312600000001,40.526761],[-74.16301799999999,40.526817],[-74.16289500000001,40.52689],[-74.162763,40.526944],[-74.162565,40.527037],[-74.16250700000001,40.527068],[-74.162441,40.527095],[-74.162385,40.527126],[-74.16233,40.527166],[-74.162272,40.527194],[-74.162226,40.527202],[-74.162144,40.52718],[-74.162098,40.527157],[-74.161967,40.527104],[-74.161827,40.527071],[-74.161692,40.527024],[-74.161647,40.527014],[-74.161582,40.527013],[-74.16152700000001,40.527029],[-74.16139800000001,40.527092],[-74.161338,40.527128],[-74.161271,40.52716],[-74.161199,40.527186],[-74.16093499999999,40.527311],[-74.160875,40.527348],[-74.160815,40.527379],[-74.160692,40.527434],[-74.160618,40.527467],[-74.16047500000001,40.527504],[-74.160409,40.52753],[-74.160341,40.52755],[-74.160304,40.527556],[-74.160265,40.527553],[-74.160207,40.527508],[-74.160168,40.527448],[-74.16013100000001,40.527402],[-74.160107,40.527381],[-74.160084,40.527361],[-74.160056,40.527345],[-74.160011,40.527343],[-74.159944,40.527364],[-74.15988299999999,40.527369],[-74.15257,40.518762],[-74.173689,40.510879],[-74.17789,40.519462],[-74.17775899999999,40.519431]]],"type":"Polygon"}
}