{
  "id": "360299400001",
  "type": "Feature",
  "properties": {
    "area_land":39823162,
    "area_water":922994,
    "geoid":"360299400001",
    "name":"Block Group 1",
    "state":"ny"
},
  "bbox": [
    -79.137873,
    42.521647,
    -78.978243,
    42.585637
],
  "geometry": {"coordinates":[[[-79.13723899999999,42.57199],[-79.137095,42.57361],[-79.13628199999999,42.574842],[-79.13590000000001,42.578187],[-79.134418,42.581497],[-79.133414,42.584666],[-79.132649,42.585581],[-79.13144699999999,42.585611],[-79.12997799999999,42.585612],[-79.12466999999999,42.585572],[-79.12046100000001,42.585637],[-79.103122,42.585542],[-79.10110899999999,42.585536],[-79.101125,42.582951],[-79.09827300000001,42.582923],[-79.096824,42.58287],[-79.095806,42.582861],[-79.089792,42.582808],[-79.080461,42.582702],[-79.068889,42.582571],[-79.063952,42.582477],[-79.06384,42.582475],[-79.062386,42.582379],[-79.06200800000001,42.582379],[-79.062004,42.581172],[-79.062016,42.578697],[-79.06202999999999,42.575663],[-79.06204700000001,42.568384],[-79.048244,42.56798],[-79.017717,42.567088],[-78.999797,42.56685],[-78.996921,42.566829],[-78.992142,42.566794],[-78.980232,42.566705],[-78.980205,42.565261],[-78.979726,42.55948],[-78.97963900000001,42.558429],[-78.97951999999999,42.556994],[-78.979393,42.553925],[-78.97936199999999,42.55275],[-78.979359,42.55265],[-78.979348,42.552242],[-78.979208,42.54792],[-78.97852,42.545715],[-78.978292,42.545043],[-78.978261,42.544892],[-78.978245,42.54474],[-78.97824300000001,42.544589],[-78.978255,42.544436],[-78.978281,42.544285],[-78.97896799999999,42.543026],[-78.978998,42.542963],[-78.97905299999999,42.542889],[-78.979123,42.542823],[-78.979207,42.542767],[-78.979302,42.542723],[-78.97940699999999,42.542691],[-78.979495,42.542676],[-78.98037600000001,42.542644],[-78.980495,42.542625],[-78.980649,42.542585],[-78.98075900000001,42.542545],[-78.980897,42.54248],[-78.981021,42.542403],[-78.981104,42.542336],[-78.981201,42.542238],[-78.981279,42.542132],[-78.981926,42.540814],[-78.982035,42.540604],[-78.986143,42.532642],[-78.9896,42.526873],[-78.98908400000001,42.524471],[-78.988962,42.5239],[-78.988958,42.523883],[-78.98895400000001,42.523865],[-78.988894,42.523584],[-78.988843,42.523429],[-78.988775,42.523289],[-78.988676,42.523134],[-78.988563,42.522997],[-78.988522,42.522954],[-78.98768099999999,42.522195],[-78.987585,42.522089],[-78.98747299999999,42.521931],[-78.987281,42.521647],[-78.987606,42.521653],[-78.988305,42.521684],[-78.988349,42.521734],[-78.98987200000001,42.523426],[-78.989892,42.523459],[-78.99097,42.525199],[-78.991434,42.526624],[-78.991558,42.528462],[-78.991578,42.528746],[-78.991614,42.528894],[-78.991702,42.529249],[-78.991981,42.529569],[-78.992723,42.530094],[-78.99384499999999,42.530739],[-78.994775,42.53139],[-78.99532600000001,42.531796],[-78.995716,42.531957],[-78.996072,42.532033],[-78.996223,42.532051],[-78.996302,42.532061],[-78.996692,42.532101],[-78.99726699999999,42.532067],[-78.997818,42.531991],[-78.998194,42.531912],[-78.998621,42.531796],[-78.99873599999999,42.53178],[-78.998864,42.53177],[-78.999127,42.531754],[-78.999225,42.531761],[-78.999413,42.531774],[-78.999658,42.531791],[-78.999759,42.531798],[-79.00025100000001,42.531825],[-79.001374,42.532153],[-79.003393,42.532796],[-79.004122,42.533281],[-79.004638,42.534014],[-79.004852,42.534751],[-79.006733,42.535817],[-79.00811899999999,42.535793],[-79.009078,42.53497],[-79.00991399999999,42.534407],[-79.011302,42.534339],[-79.01343300000001,42.534679],[-79.018541,42.536614],[-79.020781,42.537624],[-79.02243900000001,42.538253],[-79.023566,42.538767],[-79.02367700000001,42.538817],[-79.024074,42.539252],[-79.024727,42.539895],[-79.025395,42.540177],[-79.027188,42.540636],[-79.028578,42.540465],[-79.029737,42.540235],[-79.03105600000001,42.540689],[-79.03157400000001,42.541402],[-79.03192799999999,42.542233],[-79.032186,42.542905],[-79.032639,42.543121],[-79.033098,42.54328],[-79.03357200000001,42.543306],[-79.034216,42.543094],[-79.034756,42.542767],[-79.03586,42.541737],[-79.036171,42.541078],[-79.036242,42.540396],[-79.03645400000001,42.539905],[-79.03716,42.539296],[-79.037683,42.539121],[-79.03848000000001,42.538969],[-79.03882,42.538358],[-79.03982600000001,42.537679],[-79.040019,42.537604],[-79.04021299999999,42.537527],[-79.04057299999999,42.537429],[-79.04073099999999,42.537375],[-79.040943,42.537415],[-79.041211,42.537509],[-79.04173400000001,42.537579],[-79.041939,42.5376],[-79.043751,42.537691],[-79.04406899999999,42.537837],[-79.045322,42.538213],[-79.04642800000001,42.538783],[-79.047237,42.538993],[-79.047856,42.538989],[-79.049205,42.538976],[-79.049566,42.539003],[-79.05096399999999,42.539106],[-79.051221,42.539125],[-79.05232700000001,42.538307],[-79.05254100000001,42.536955],[-79.05288899999999,42.536478],[-79.053421,42.536234],[-79.053826,42.536246],[-79.056375,42.536987],[-79.058373,42.53725],[-79.06004900000001,42.537679],[-79.060777,42.537853],[-79.06134400000001,42.537995],[-79.063236,42.53861],[-79.064171,42.539037],[-79.065203,42.539971],[-79.065899,42.540397],[-79.067577,42.541074],[-79.06771000000001,42.541114],[-79.067943,42.54122],[-79.06846899999999,42.541371],[-79.068575,42.541398],[-79.06881300000001,42.541457],[-79.070272,42.541937],[-79.07100800000001,42.542332],[-79.07204400000001,42.542656],[-79.07366500000001,42.544122],[-79.074662,42.544603],[-79.07552200000001,42.545089],[-79.07749099999999,42.545732],[-79.079075,42.545736],[-79.079341,42.545737],[-79.080316,42.545668],[-79.08127399999999,42.545727],[-79.08307000000001,42.546369],[-79.08576600000001,42.548848],[-79.086482,42.549537],[-79.087259,42.549854],[-79.088786,42.549981],[-79.089291,42.549953],[-79.089624,42.54997],[-79.09007699999999,42.55024],[-79.090288,42.550502],[-79.09081399999999,42.551027],[-79.090954,42.551311],[-79.091042,42.55159],[-79.09088800000001,42.551923],[-79.090462,42.552245],[-79.090028,42.552387],[-79.089668,42.552474],[-79.089198,42.552463],[-79.088882,42.552354],[-79.08845599999999,42.552081],[-79.08720700000001,42.551961],[-79.086215,42.552431],[-79.085649,42.552693],[-79.084885,42.552949],[-79.08390900000001,42.553113],[-79.082864,42.553162],[-79.08251,42.553267],[-79.08160100000001,42.553676],[-79.081198,42.553901],[-79.08113899999999,42.554077],[-79.081062,42.554171],[-79.081019,42.554456],[-79.08081799999999,42.55472],[-79.080877,42.555437],[-79.08215199999999,42.556153],[-79.083324,42.556649],[-79.086038,42.556473],[-79.087616,42.556526],[-79.088375,42.556385],[-79.089715,42.555966],[-79.090931,42.556142],[-79.091747,42.556407],[-79.092266,42.55677],[-79.09241400000001,42.557123],[-79.09238499999999,42.557939],[-79.09223900000001,42.558864],[-79.09245799999999,42.559372],[-79.09299300000001,42.559911],[-79.093356,42.560088],[-79.093817,42.560256],[-79.094266,42.560457],[-79.094531,42.560862],[-79.094577,42.560993],[-79.094455,42.561245],[-79.09445100000001,42.561257],[-79.094278,42.561818],[-79.094207,42.561928],[-79.094003,42.562277],[-79.093886,42.562582],[-79.093818,42.562925],[-79.093726,42.563125],[-79.093718,42.563148],[-79.093739,42.563196],[-79.093799,42.563328],[-79.094044,42.563767],[-79.095072,42.564239],[-79.09584099999999,42.564487],[-79.09628600000001,42.564566],[-79.096716,42.564604],[-79.097109,42.56447],[-79.097329,42.564358],[-79.09752400000001,42.564309],[-79.097886,42.564182],[-79.09847600000001,42.5636],[-79.099119,42.563202],[-79.09974800000001,42.562884],[-79.10073300000001,42.562559],[-79.10107000000001,42.562437],[-79.101337,42.562395],[-79.10289899999999,42.562439],[-79.103475,42.562648],[-79.104063,42.562882],[-79.104489,42.563057],[-79.10481900000001,42.563286],[-79.105192,42.563341],[-79.105723,42.563695],[-79.10615199999999,42.564104],[-79.106347,42.564557],[-79.106245,42.565053],[-79.106055,42.565442],[-79.105754,42.565991],[-79.104952,42.56651],[-79.10448599999999,42.566705],[-79.10379,42.56705],[-79.103694,42.567312],[-79.10366,42.567592],[-79.10386,42.568027],[-79.104213,42.568189],[-79.104287,42.56826],[-79.10547,42.568895],[-79.107778,42.569965],[-79.108557,42.570201],[-79.10937699999999,42.570267],[-79.109871,42.570203],[-79.11084200000001,42.569829],[-79.111375,42.56972],[-79.111715,42.569724],[-79.111953,42.569759],[-79.111994,42.569765],[-79.11230500000001,42.569866],[-79.112341,42.569874],[-79.112404,42.569888],[-79.11282,42.569976],[-79.11302000000001,42.570003],[-79.11315,42.570021],[-79.113343,42.570048],[-79.113451,42.570062],[-79.11385199999999,42.570117],[-79.114379,42.570122],[-79.114929,42.570046],[-79.115886,42.569712],[-79.116347,42.569412],[-79.117118,42.568857],[-79.117814,42.568287],[-79.11855300000001,42.567728],[-79.11989199999999,42.566742],[-79.12057299999999,42.566297],[-79.121292,42.565865],[-79.121938,42.565614],[-79.12230099999999,42.565463],[-79.123606,42.565255],[-79.123969,42.565257],[-79.124759,42.56526],[-79.125798,42.565092],[-79.127145,42.565201],[-79.12966,42.56623],[-79.13204399999999,42.567194],[-79.13225,42.567277],[-79.134034,42.568089],[-79.134199,42.568164],[-79.135267,42.56873],[-79.136594,42.569609],[-79.136696,42.569675],[-79.136799,42.56974],[-79.136876,42.569788],[-79.136978,42.569853],[-79.13708,42.569918],[-79.137873,42.570462],[-79.13723899999999,42.57199]]],"type":"Polygon"}
}