{
  "id": "360150102004",
  "type": "Feature",
  "properties": {
    "area_land":60211160,
    "area_water":307849,
    "geoid":"360150102004",
    "name":"Block Group 4",
    "state":"ny"
},
  "bbox": [
    -76.848191,
    42.199074,
    -76.76218,
    42.294423
],
  "geometry": {"coordinates":[[[-76.848191,42.293268],[-76.847229,42.293312],[-76.846249,42.293356],[-76.846037,42.293382],[-76.84470899999999,42.293543],[-76.84465,42.293551],[-76.842907,42.293756],[-76.840057,42.293751],[-76.834559,42.293821],[-76.83257399999999,42.293849],[-76.830016,42.293878],[-76.828892,42.29384],[-76.82804,42.293814],[-76.827787,42.293826],[-76.826922,42.293865],[-76.824327,42.293985],[-76.823679,42.294015],[-76.823463,42.29402],[-76.821428,42.294063],[-76.820774,42.294077],[-76.815324,42.294108],[-76.813501,42.294119],[-76.81328999999999,42.29412],[-76.81126999999999,42.294131],[-76.807748,42.294151],[-76.80521400000001,42.294288],[-76.803428,42.294386],[-76.803197,42.294383],[-76.800859,42.294351],[-76.79576900000001,42.294284],[-76.793845,42.294297],[-76.79150799999999,42.294314],[-76.78797,42.294339],[-76.784938,42.294388],[-76.782561,42.294423],[-76.77927,42.294302],[-76.77836499999999,42.294267],[-76.777886,42.294176],[-76.77766099999999,42.29418],[-76.775083,42.294221],[-76.77213500000001,42.294184],[-76.771592,42.294216],[-76.771069,42.29418],[-76.769823,42.294093],[-76.769577,42.294076],[-76.767742,42.294184],[-76.766082,42.294259],[-76.764984,42.294309],[-76.76483500000001,42.294297],[-76.764872,42.294162],[-76.764912,42.293876],[-76.764944,42.293518],[-76.76493000000001,42.293298],[-76.764848,42.292878],[-76.764808,42.292635],[-76.764797,42.292574],[-76.764713,42.292349],[-76.764309,42.291441],[-76.763942,42.290594],[-76.762699,42.287878],[-76.762287,42.286806],[-76.76221,42.286505],[-76.76218,42.286112],[-76.762325,42.285766],[-76.76246399999999,42.285391],[-76.76339299999999,42.283358],[-76.763805,42.282347],[-76.763879,42.282129],[-76.764019,42.281718],[-76.76420299999999,42.281261],[-76.76431599999999,42.280806],[-76.764492,42.280348],[-76.764545,42.280039],[-76.764545,42.279719],[-76.764567,42.27943],[-76.764633,42.278561],[-76.76463699999999,42.278502],[-76.764652,42.278143],[-76.764698,42.277815],[-76.76481200000001,42.277384],[-76.764965,42.277056],[-76.765773,42.275591],[-76.765854,42.275451],[-76.76624700000001,42.274767],[-76.76674300000001,42.273936],[-76.76674199999999,42.272681],[-76.768429,42.27112],[-76.770954,42.26882],[-76.771297,42.268538],[-76.772114,42.267268],[-76.775952,42.259875],[-76.77688999999999,42.258132],[-76.777317,42.257315],[-76.777501,42.25688],[-76.77760000000001,42.256537],[-76.777638,42.256316],[-76.777798,42.255553],[-76.778035,42.254679],[-76.778263,42.253893],[-76.778515,42.252993],[-76.778729,42.252661],[-76.778935,42.252265],[-76.779072,42.251876],[-76.77931599999999,42.250319],[-76.779782,42.247569],[-76.779843,42.247275],[-76.779858,42.246875],[-76.77981200000001,42.246592],[-76.77933899999999,42.243525],[-76.778921,42.240906],[-76.77882099999999,42.240275],[-76.77865300000001,42.239302],[-76.77865300000001,42.239009],[-76.77869800000001,42.238658],[-76.778836,42.238246],[-76.77929399999999,42.236819],[-76.77944599999999,42.236476],[-76.779614,42.236197],[-76.77987400000001,42.235899],[-76.780247,42.235533],[-76.781459,42.23454],[-76.78414600000001,42.23234],[-76.784367,42.232131],[-76.78448899999999,42.231959],[-76.784627,42.231703],[-76.784657,42.231471],[-76.784657,42.230505],[-76.784665,42.230483],[-76.78459599999999,42.219683],[-76.784581,42.21913],[-76.784543,42.218741],[-76.784543,42.218218],[-76.78452,42.218009],[-76.784398,42.2176],[-76.78436000000001,42.217372],[-76.78433699999999,42.217047],[-76.784352,42.216727],[-76.78439,42.21646],[-76.78433699999999,42.213069],[-76.784342,42.20749],[-76.784345,42.204737],[-76.784398,42.204447],[-76.784505,42.204211],[-76.78472600000001,42.203944],[-76.78491699999999,42.20373],[-76.785207,42.203486],[-76.78545099999999,42.203356],[-76.78564900000001,42.203242],[-76.785939,42.203112],[-76.786306,42.203013],[-76.78688099999999,42.202849],[-76.78858700000001,42.202364],[-76.78914399999999,42.202189],[-76.789457,42.202048],[-76.789762,42.201918],[-76.790105,42.201701],[-76.790306,42.20151],[-76.790662,42.201174],[-76.790869,42.200829],[-76.79092900000001,42.200728],[-76.791028,42.20053],[-76.791082,42.200228],[-76.79114300000001,42.199927],[-76.79114800000001,42.199876],[-76.794426,42.199858],[-76.808521,42.199778],[-76.808779,42.199776],[-76.810377,42.199694],[-76.810591,42.199678],[-76.811487,42.199675],[-76.812093,42.199673],[-76.814937,42.199676],[-76.821938,42.19967],[-76.828782,42.19962],[-76.834141,42.199581],[-76.83451100000001,42.199566],[-76.834673,42.199559],[-76.83548,42.199448],[-76.83591800000001,42.199388],[-76.837487,42.199172],[-76.83791100000001,42.19908],[-76.83797800000001,42.199074],[-76.839268,42.199181],[-76.845876,42.199176],[-76.845979,42.200674],[-76.846294,42.21137],[-76.84622299999999,42.211849],[-76.846215,42.212022],[-76.846175,42.212559],[-76.84616699999999,42.212721],[-76.846086,42.214363],[-76.84607,42.214672],[-76.84606599999999,42.214773],[-76.846177,42.21862],[-76.846171,42.219893],[-76.846166,42.22053],[-76.84614999999999,42.223469],[-76.846177,42.226181],[-76.846174,42.226996],[-76.846174,42.227284],[-76.84617799999999,42.235972],[-76.84617900000001,42.239458],[-76.84616,42.241305],[-76.846152,42.242115],[-76.84616,42.242488],[-76.846172,42.243045],[-76.846323,42.249911],[-76.84666900000001,42.253505],[-76.84672,42.254138],[-76.846751,42.255006],[-76.84694,42.261033],[-76.84695000000001,42.261179],[-76.84696099999999,42.261286],[-76.847037,42.262278],[-76.84703399999999,42.262456],[-76.847161,42.264982],[-76.847334,42.268878],[-76.84754599999999,42.273012],[-76.84759699999999,42.274],[-76.84777800000001,42.278705],[-76.847826,42.279951],[-76.84796900000001,42.283532],[-76.84797500000001,42.283998],[-76.848078,42.287053],[-76.848191,42.293268]]],"type":"Polygon"}
}