{
  "id": "360470527006",
  "type": "Feature",
  "properties": {
    "area_land":21489,
    "area_water":0,
    "geoid":"360470527006",
    "name":"Block Group 6",
    "state":"ny"
},
  "bbox": [
    -73.955119,
    40.707745,
    -73.95283,
    40.709522
],
  "geometry": {"coordinates":[[[-73.954719,40.708901],[-73.95432599999999,40.709522],[-73.95283000000001,40.708974],[-73.953221,40.708353],[-73.95360599999999,40.707745],[-73.955119,40.708266],[-73.954719,40.708901]]],"type":"Polygon"}
}