{
  "id": "360110409001",
  "type": "Feature",
  "properties": {
    "area_land":75987394,
    "area_water":982184,
    "geoid":"360110409001",
    "name":"Block Group 1",
    "state":"ny"
},
  "bbox": [
    -76.372463,
    42.695539,
    -76.270012,
    42.785866
],
  "geometry": {"coordinates":[[[-76.372463,42.781812],[-76.367619,42.782023],[-76.364046,42.782186],[-76.342454,42.783144],[-76.334124,42.783496],[-76.319261,42.78394],[-76.319232,42.784056],[-76.319214,42.784085],[-76.31917199999999,42.784132],[-76.31914999999999,42.784148],[-76.31911599999999,42.784165],[-76.31902100000001,42.784185],[-76.31890199999999,42.784192],[-76.31841300000001,42.784208],[-76.318023,42.784229],[-76.316779,42.784277],[-76.316047,42.784321],[-76.315135,42.784364],[-76.31408399999999,42.784398],[-76.31355499999999,42.784424],[-76.31238500000001,42.784468],[-76.311841,42.784511],[-76.311385,42.784529],[-76.309539,42.784615],[-76.309206,42.784623],[-76.308849,42.784638],[-76.307706,42.784666],[-76.307176,42.784695],[-76.306988,42.784711],[-76.30678399999999,42.784723],[-76.30662,42.784726],[-76.30638399999999,42.784739],[-76.305896,42.784752],[-76.305324,42.784757],[-76.305142,42.784759],[-76.304967,42.784774],[-76.304649,42.78479],[-76.303242,42.784836],[-76.301293,42.784935],[-76.300895,42.784945],[-76.300725,42.784957],[-76.300516,42.784965],[-76.30009200000001,42.784972],[-76.299908,42.784979],[-76.299786,42.784979],[-76.299724,42.784974],[-76.29964200000001,42.78495],[-76.299516,42.78489],[-76.29933,42.784794],[-76.288427,42.785427],[-76.286525,42.785541],[-76.286039,42.785563],[-76.28285700000001,42.785701],[-76.279663,42.785841],[-76.279067,42.785866],[-76.278882,42.785597],[-76.27869699999999,42.785328],[-76.277914,42.784192],[-76.277131,42.783057],[-76.276584,42.782263],[-76.276036,42.781469],[-76.27534799999999,42.78047],[-76.275305,42.779883],[-76.27522399999999,42.778774],[-76.275143,42.777666],[-76.27510100000001,42.777093],[-76.275059,42.77652],[-76.274941,42.774912],[-76.274823,42.773303],[-76.274748,42.77228],[-76.27467300000001,42.771257],[-76.274607,42.77032],[-76.274541,42.769382],[-76.274198,42.764518],[-76.274193,42.764444],[-76.273965,42.761219],[-76.273337,42.7523],[-76.27318,42.750068],[-76.272532,42.739702],[-76.27246700000001,42.738665],[-76.272246,42.735135],[-76.271964,42.730633],[-76.271952,42.730441],[-76.271951,42.730431],[-76.271939,42.730228],[-76.270228,42.701901],[-76.27022700000001,42.701888],[-76.27022599999999,42.701862],[-76.27020899999999,42.701582],[-76.270065,42.699206],[-76.270062,42.699162],[-76.27006,42.699131],[-76.27001199999999,42.698334],[-76.28179,42.697984],[-76.28529899999999,42.697879],[-76.288724,42.697778],[-76.297613,42.697513],[-76.306158,42.697268],[-76.31964000000001,42.696857],[-76.32308,42.696754],[-76.340627,42.696233],[-76.340818,42.696245],[-76.340976,42.696245],[-76.34119,42.696246],[-76.341876,42.69623],[-76.34200199999999,42.696224],[-76.34262,42.696211],[-76.34411900000001,42.696179],[-76.344424,42.696177],[-76.344922,42.696168],[-76.345555,42.696155],[-76.346746,42.696124],[-76.347487,42.6961],[-76.349485,42.696047],[-76.350387,42.696016],[-76.35156499999999,42.695984],[-76.35202099999999,42.695976],[-76.353418,42.695929],[-76.354,42.695913],[-76.354429,42.695904],[-76.354862,42.695887],[-76.355109,42.695881],[-76.355311,42.69587],[-76.35778000000001,42.69581],[-76.36059299999999,42.695733],[-76.360989,42.695715],[-76.36284499999999,42.695665],[-76.36315500000001,42.695667],[-76.367572,42.695539],[-76.36763000000001,42.696631],[-76.36807399999999,42.705047],[-76.368539,42.713827],[-76.36907600000001,42.723969],[-76.369101,42.72577],[-76.368988,42.726247],[-76.369049,42.726259],[-76.369117,42.726286],[-76.369208,42.726307],[-76.36939099999999,42.729755],[-76.369828,42.737956],[-76.370431,42.749335],[-76.37046100000001,42.749602],[-76.37048299999999,42.749844],[-76.37048900000001,42.749904],[-76.37046100000001,42.75007],[-76.370481,42.750453],[-76.371988,42.774312],[-76.37202499999999,42.774866],[-76.372463,42.781812]]],"type":"Polygon"}
}