{
  "id": "360594091002",
  "type": "Feature",
  "properties": {
    "area_land":208869,
    "area_water":0,
    "geoid":"360594091002",
    "name":"Block Group 2",
    "state":"ny"
},
  "bbox": [
    -73.523482,
    40.707402,
    -73.514778,
    40.711946
],
  "geometry": {"coordinates":[[[-73.52265,40.711202],[-73.52183100000001,40.711483],[-73.52100799999999,40.711759],[-73.520785,40.711839],[-73.520597,40.71189],[-73.520495,40.711906],[-73.520273,40.711901],[-73.51969200000001,40.711899],[-73.518862,40.711889],[-73.518721,40.711871],[-73.518483,40.711827],[-73.517465,40.711653],[-73.517194,40.711607],[-73.517049,40.711601],[-73.51693400000001,40.711609],[-73.515236,40.711946],[-73.515006,40.711278],[-73.51477800000001,40.710621],[-73.51618999999999,40.710336],[-73.516915,40.71019],[-73.51700200000001,40.710182],[-73.517218,40.710196],[-73.5177,40.710283],[-73.517922,40.709584],[-73.517937,40.709508],[-73.518022,40.709239],[-73.518125,40.708909],[-73.51814400000001,40.708883],[-73.518152,40.708817],[-73.518332,40.70824],[-73.518592,40.707402],[-73.51882500000001,40.707455],[-73.518919,40.707492],[-73.519012,40.707547],[-73.51921299999999,40.707693],[-73.519285,40.707729],[-73.5194,40.707765],[-73.520523,40.708017],[-73.520725,40.708026],[-73.520914,40.708002],[-73.520978,40.708005],[-73.52104300000001,40.707984],[-73.52134599999999,40.707946],[-73.521491,40.707952],[-73.522364,40.708148],[-73.522296,40.708329],[-73.522266,40.708516],[-73.522271,40.708713],[-73.52230299999999,40.708856],[-73.522333,40.708906],[-73.52234199999999,40.708961],[-73.52241600000001,40.709109],[-73.523482,40.710928],[-73.52265,40.711202]]],"type":"Polygon"}
}