{
  "id": "360610213032",
  "type": "Feature",
  "properties": {
    "area_land":58110,
    "area_water":0,
    "geoid":"360610213032",
    "name":"Block Group 2",
    "state":"ny"
},
  "bbox": [
    -73.955707,
    40.812051,
    -73.952974,
    40.815737
],
  "geometry": {"coordinates":[[[-73.955457,40.814488],[-73.955001,40.815112],[-73.95454700000001,40.815737],[-73.952974,40.81507],[-73.953075,40.814299],[-73.95311,40.813495],[-73.953129,40.812692],[-73.95354399999999,40.812051],[-73.954081,40.81228],[-73.955203,40.813554],[-73.955707,40.814144],[-73.955457,40.814488]]],"type":"Polygon"}
}