{
  "id": "361031462022",
  "type": "Feature",
  "properties": {
    "area_land":913633,
    "area_water":0,
    "geoid":"361031462022",
    "name":"Block Group 2",
    "state":"ny"
},
  "bbox": [
    -73.214895,
    40.762713,
    -73.203324,
    40.778478
],
  "geometry": {"coordinates":[[[-73.214895,40.776207],[-73.213669,40.776401],[-73.212784,40.776539],[-73.211899,40.776681],[-73.212221,40.777885],[-73.211322,40.778024],[-73.21029799999999,40.778183],[-73.20941999999999,40.778328],[-73.20841299999999,40.778478],[-73.208083,40.777281],[-73.20775399999999,40.77608],[-73.20742799999999,40.774866],[-73.207249,40.774229],[-73.207182,40.773986],[-73.206361,40.77405],[-73.20426399999999,40.766563],[-73.20332399999999,40.763616],[-73.203391,40.763274],[-73.20372500000001,40.763227],[-73.20425299999999,40.763187],[-73.20523900000001,40.763105],[-73.207228,40.762947],[-73.21022000000001,40.762713],[-73.210393,40.763943],[-73.21044000000001,40.764306],[-73.210561,40.765165],[-73.21060199999999,40.765535],[-73.21072599999999,40.766402],[-73.210773,40.76677],[-73.21088399999999,40.767631],[-73.21092899999999,40.767994],[-73.211033,40.768715],[-73.21110400000001,40.768864],[-73.21128,40.769212],[-73.211725,40.77006],[-73.21188600000001,40.770373],[-73.21248799999999,40.771545],[-73.212666,40.771875],[-73.21308399999999,40.772712],[-73.213498,40.773493],[-73.213694,40.773878],[-73.214294,40.775046],[-73.214321,40.775106],[-73.21466100000001,40.775766],[-73.214895,40.776207]]],"type":"Polygon"}
}