{
  "id": "361090017002",
  "type": "Feature",
  "properties": {
    "area_land":35348845,
    "area_water":93557,
    "geoid":"361090017002",
    "name":"Block Group 2",
    "state":"ny"
},
  "bbox": [
    -76.690307,
    42.406772,
    -76.569966,
    42.452324
],
  "geometry": {"coordinates":[[[-76.690307,42.452324],[-76.689504,42.452278],[-76.68901200000001,42.452258],[-76.688686,42.452236],[-76.688182,42.452168],[-76.688013,42.452135],[-76.68772199999999,42.452067],[-76.687437,42.451986],[-76.687105,42.451874],[-76.686618,42.451688],[-76.68594299999999,42.451437],[-76.68523,42.451179],[-76.684433,42.450903],[-76.68300600000001,42.450381],[-76.682408,42.45017],[-76.682007,42.450032],[-76.681195,42.449774],[-76.680581,42.449594],[-76.680183,42.449466],[-76.679913,42.449389],[-76.67977500000001,42.449359],[-76.679568,42.449326],[-76.679357,42.449303],[-76.67925,42.449296],[-76.678956,42.449291],[-76.678909,42.449293],[-76.67867099999999,42.449305],[-76.67826599999999,42.449315],[-76.67701700000001,42.44937],[-76.67548600000001,42.449437],[-76.674108,42.449483],[-76.673869,42.449487],[-76.672946,42.449519],[-76.672768,42.449521],[-76.672206,42.449543],[-76.670704,42.449601],[-76.66987899999999,42.449636],[-76.66869199999999,42.44968],[-76.668299,42.449699],[-76.66750399999999,42.449729],[-76.66699,42.449754],[-76.666729,42.449762],[-76.665954,42.449801],[-76.66569,42.449809],[-76.664897,42.449848],[-76.664632,42.449856],[-76.66352000000001,42.449904],[-76.663236,42.449912],[-76.66295100000001,42.449925],[-76.66212899999999,42.449951],[-76.661587,42.449963],[-76.659342,42.450041],[-76.65912400000001,42.450044],[-76.657955,42.450077],[-76.657473,42.45009],[-76.65516700000001,42.450155],[-76.654331,42.45019],[-76.654053,42.450198],[-76.65362399999999,42.450218],[-76.652771,42.450248],[-76.652344,42.450268],[-76.650291,42.450338],[-76.649782,42.450346],[-76.64962199999999,42.450348],[-76.649503,42.450359],[-76.649148,42.450369],[-76.648123,42.450413],[-76.647053,42.450453],[-76.64574500000001,42.45051],[-76.644096,42.450565],[-76.64340300000001,42.45059],[-76.64203999999999,42.450627],[-76.641216,42.450657],[-76.639944,42.450692],[-76.638755,42.45073],[-76.63758900000001,42.450773],[-76.632874,42.450913],[-76.631444,42.450964],[-76.631118,42.450973],[-76.630415,42.450996],[-76.629085,42.451028],[-76.62691599999999,42.451092],[-76.626673,42.451099],[-76.62617,42.451127],[-76.625102,42.451149],[-76.62343300000001,42.451195],[-76.617921,42.451367],[-76.615369,42.451439],[-76.611361,42.451572],[-76.61117900000001,42.451575],[-76.60830199999999,42.451687],[-76.60490299999999,42.451784],[-76.60338299999999,42.451819],[-76.601179,42.451886],[-76.601105,42.451892],[-76.599208,42.451945],[-76.59849699999999,42.451973],[-76.596802,42.452031],[-76.595997,42.452059],[-76.595844,42.452064],[-76.59544699999999,42.452074],[-76.593873,42.452128],[-76.593069,42.452143],[-76.592956,42.452149],[-76.592383,42.452148],[-76.59169300000001,42.452122],[-76.591193,42.452084],[-76.590338,42.451965],[-76.589713,42.451848],[-76.588425,42.451528],[-76.588393,42.451519],[-76.588167,42.451459],[-76.58754,42.451306],[-76.586806,42.451118],[-76.585212,42.450721],[-76.58496700000001,42.450666],[-76.58358699999999,42.450325],[-76.582942,42.450158],[-76.582297,42.449996],[-76.580956,42.449668],[-76.57595000000001,42.448472],[-76.575594,42.448382],[-76.573296,42.447815],[-76.57271299999999,42.447679],[-76.57184700000001,42.447483],[-76.571502,42.447412],[-76.571212,42.44737],[-76.571198,42.447226],[-76.570986,42.443388],[-76.570939,42.442448],[-76.57092799999999,42.442232],[-76.570708,42.438331],[-76.570671,42.437647],[-76.570652,42.437283],[-76.570533,42.435029],[-76.570436,42.433188],[-76.570356,42.431794],[-76.570263,42.429895],[-76.57023599999999,42.428962],[-76.570156,42.427212],[-76.570109,42.425966],[-76.57000499999999,42.423536],[-76.570003,42.42351],[-76.56996599999999,42.422978],[-76.570308,42.422973],[-76.570567,42.422963],[-76.57065799999999,42.422959],[-76.571163,42.422948],[-76.571668,42.422932],[-76.57324,42.422892],[-76.574507,42.422857],[-76.574804,42.422853],[-76.57511100000001,42.422844],[-76.575412,42.42284],[-76.575976,42.422824],[-76.576258,42.422819],[-76.57811100000001,42.422771],[-76.578363,42.422768],[-76.57879699999999,42.42276],[-76.579746,42.422744],[-76.580196,42.422729],[-76.58049699999999,42.422725],[-76.580726,42.422731],[-76.58080699999999,42.422739],[-76.580966,42.422746],[-76.581124,42.422761],[-76.581541,42.422832],[-76.581632,42.422844],[-76.58172500000001,42.422861],[-76.58189900000001,42.422881],[-76.582144,42.422896],[-76.582397,42.422892],[-76.582489,42.422887],[-76.582537,42.422881],[-76.583208,42.4228],[-76.58356499999999,42.42275],[-76.58390900000001,42.422714],[-76.584176,42.422688],[-76.584689,42.422658],[-76.585201,42.422633],[-76.585458,42.422625],[-76.58585600000001,42.422606],[-76.586376,42.42259],[-76.58650799999999,42.422588],[-76.58665499999999,42.422581],[-76.58901,42.422522],[-76.58931200000001,42.422517],[-76.58946899999999,42.422515],[-76.589657,42.422508],[-76.58968400000001,42.422346],[-76.589682,42.422224],[-76.58966599999999,42.422044],[-76.58965600000001,42.421815],[-76.589634,42.420933],[-76.58957100000001,42.419691],[-76.589541,42.419205],[-76.58949699999999,42.418751],[-76.589482,42.418508],[-76.58946,42.417558],[-76.589398,42.416136],[-76.589378,42.415884],[-76.589367,42.415564],[-76.58934600000001,42.415439],[-76.58930599999999,42.415304],[-76.58923,42.415134],[-76.589134,42.41496],[-76.589088,42.414816],[-76.589068,42.414605],[-76.589163,42.414428],[-76.589269,42.414282],[-76.58932,42.414178],[-76.589327,42.414039],[-76.58931,42.413886],[-76.589251,42.413589],[-76.58920999999999,42.413302],[-76.589167,42.412267],[-76.589083,42.41121],[-76.589038,42.409931],[-76.589037,42.409274],[-76.589018,42.40904],[-76.588962,42.408568],[-76.588857,42.40789],[-76.588847,42.407773],[-76.588866,42.407709],[-76.588892,42.407678],[-76.58890599999999,42.407326],[-76.588908,42.406997],[-76.588925,42.406772],[-76.589005,42.406793],[-76.58915399999999,42.406845],[-76.589448,42.406963],[-76.58970100000001,42.407072],[-76.59012300000001,42.407296],[-76.590396,42.407423],[-76.590479,42.407466],[-76.590649,42.407532],[-76.59080899999999,42.407575],[-76.590987,42.407594],[-76.59102300000001,42.407598],[-76.591099,42.407606],[-76.59117999999999,42.407614],[-76.591334,42.407612],[-76.591644,42.40759],[-76.591887,42.407582],[-76.59201,42.407585],[-76.592254,42.407581],[-76.5926,42.40759],[-76.593048,42.407611],[-76.59327,42.407626],[-76.594026,42.40766],[-76.594351,42.407669],[-76.59448999999999,42.407676],[-76.594645,42.407679],[-76.59531699999999,42.407669],[-76.59588100000001,42.407648],[-76.59598699999999,42.407647],[-76.59623999999999,42.407661],[-76.596386,42.407682],[-76.596598,42.407704],[-76.596645,42.407709],[-76.59676,42.407726],[-76.596874,42.407733],[-76.596962,42.407732],[-76.597133,42.407721],[-76.597219,42.407706],[-76.597621,42.407664],[-76.5977,42.407659],[-76.597776,42.407649],[-76.59804699999999,42.407645],[-76.598314,42.407659],[-76.598654,42.407719],[-76.598765,42.407732],[-76.598922,42.40775],[-76.598996,42.407762],[-76.599244,42.407781],[-76.599338,42.407784],[-76.59943,42.407792],[-76.59960100000001,42.407799],[-76.59996,42.40783],[-76.600106,42.407841],[-76.60030999999999,42.407874],[-76.600711,42.407963],[-76.601011,42.408049],[-76.601208,42.408119],[-76.60145900000001,42.408196],[-76.60168299999999,42.408274],[-76.601731,42.408287],[-76.601882,42.40833],[-76.60239,42.408449],[-76.60245,42.408466],[-76.602512,42.408483],[-76.602619,42.408518],[-76.60293,42.408635],[-76.603132,42.408718],[-76.603255,42.408774],[-76.60361,42.408959],[-76.604231,42.409306],[-76.60437400000001,42.409398],[-76.604573,42.409539],[-76.60485,42.409756],[-76.60514000000001,42.410009],[-76.605442,42.410261],[-76.60566900000001,42.410434],[-76.605884,42.410579],[-76.606036,42.410676],[-76.60629299999999,42.410812],[-76.606556,42.410944],[-76.60667599999999,42.411009],[-76.607266,42.411361],[-76.607366,42.411423],[-76.608158,42.411912],[-76.60870799999999,42.412237],[-76.608901,42.412361],[-76.609324,42.412656],[-76.609672,42.412935],[-76.60985100000001,42.413072],[-76.610006,42.413173],[-76.61043600000001,42.413429],[-76.610771,42.413604],[-76.611001,42.413718],[-76.611154,42.413783],[-76.61163500000001,42.413966],[-76.61229400000001,42.414195],[-76.612799,42.414364],[-76.61309900000001,42.414458],[-76.614073,42.414733],[-76.614389,42.414814],[-76.614571,42.414852],[-76.614756,42.414881],[-76.614943,42.414901],[-76.615168,42.414915],[-76.615622,42.414905],[-76.61609799999999,42.414857],[-76.616332,42.414823],[-76.616607,42.414769],[-76.617014,42.414669],[-76.61715100000001,42.41464],[-76.617397,42.4146],[-76.61764599999999,42.414565],[-76.617897,42.414539],[-76.618043,42.414533],[-76.618191,42.414522],[-76.61833799999999,42.41452],[-76.618487,42.414513],[-76.61899200000001,42.414515],[-76.61941400000001,42.414527],[-76.620048,42.414558],[-76.620369,42.414569],[-76.620726,42.41458],[-76.621178,42.414601],[-76.621404,42.414607],[-76.62260499999999,42.414655],[-76.6237,42.414687],[-76.62467599999999,42.414711],[-76.625142,42.414743],[-76.62539200000001,42.414771],[-76.625674,42.414812],[-76.62584,42.414855],[-76.626108,42.414918],[-76.626243,42.414961],[-76.626563,42.415083],[-76.62677499999999,42.415179],[-76.626833,42.415209],[-76.62706900000001,42.415332],[-76.627252,42.415446],[-76.62741699999999,42.415561],[-76.627717,42.415812],[-76.62782199999999,42.415913],[-76.628012,42.41613],[-76.628277,42.416466],[-76.628531,42.416767],[-76.628691,42.416975],[-76.628833,42.417188],[-76.62889800000001,42.417305],[-76.628956,42.41741],[-76.62901599999999,42.417523],[-76.629121,42.417757],[-76.629189,42.417972],[-76.629232,42.41817],[-76.629266,42.418372],[-76.629296,42.418646],[-76.629408,42.420563],[-76.629428,42.420984],[-76.62945000000001,42.421454],[-76.629659,42.421446],[-76.630375,42.421436],[-76.63073,42.421427],[-76.631004,42.421423],[-76.631092,42.421422],[-76.63144699999999,42.421412],[-76.633493,42.421378],[-76.63618099999999,42.421286],[-76.636482,42.421282],[-76.63792599999999,42.421243],[-76.638766,42.421227],[-76.639488,42.421203],[-76.642555,42.421114],[-76.642826,42.42111],[-76.644362,42.421065],[-76.64460099999999,42.421062],[-76.644842,42.421054],[-76.644901,42.421049],[-76.64493400000001,42.421048],[-76.647679,42.420973],[-76.647817,42.420975],[-76.647864,42.420973],[-76.647983,42.420968],[-76.64846799999999,42.420943],[-76.65039400000001,42.420884],[-76.65075400000001,42.420879],[-76.65097900000001,42.420871],[-76.652142,42.42085],[-76.653024,42.420824],[-76.653851,42.420794],[-76.655485,42.420747],[-76.655736,42.420744],[-76.65676999999999,42.420711],[-76.65706900000001,42.420702],[-76.657397,42.420688],[-76.658053,42.42067],[-76.658558,42.420651],[-76.659632,42.42062],[-76.66055299999999,42.420598],[-76.662927,42.420523],[-76.664238,42.420481],[-76.664664,42.420472],[-76.664811,42.420467],[-76.665982,42.420429],[-76.66622599999999,42.420416],[-76.667141,42.420385],[-76.66735300000001,42.420382],[-76.667778,42.420367],[-76.668633,42.420345],[-76.668843,42.420347],[-76.669054,42.420343],[-76.67243999999999,42.420218],[-76.67312,42.42019],[-76.67418000000001,42.420156],[-76.677392,42.420037],[-76.67771500000001,42.420027],[-76.678237,42.420007],[-76.67948,42.419957],[-76.67981399999999,42.419948],[-76.680481,42.41992],[-76.682565,42.419849],[-76.68294299999999,42.419838],[-76.68464899999999,42.419787],[-76.685393,42.419758],[-76.686881,42.419709],[-76.68699700000001,42.419707],[-76.687162,42.4197],[-76.687303,42.419698],[-76.687752,42.419682],[-76.68780599999999,42.419686],[-76.687955,42.419675],[-76.68821199999999,42.419644],[-76.68828000000001,42.42062],[-76.688283,42.420673],[-76.688294,42.420814],[-76.6885,42.424224],[-76.688631,42.426757],[-76.68871799999999,42.428219],[-76.688773,42.429067],[-76.688774,42.429089],[-76.68884300000001,42.430153],[-76.689013,42.433269],[-76.689016,42.433318],[-76.689038,42.43373],[-76.68905599999999,42.434059],[-76.689117,42.434972],[-76.689171,42.435675],[-76.689173,42.4357],[-76.689261,42.436838],[-76.689384,42.438643],[-76.689487,42.43991],[-76.68949600000001,42.440017],[-76.689522,42.440319],[-76.68953,42.44052],[-76.689847,42.4457],[-76.689947,42.447148],[-76.690077,42.449011],[-76.690223,42.451219],[-76.690303,42.452193],[-76.690307,42.452324]]],"type":"Polygon"}
}