{
  "id": "360830525013",
  "type": "Feature",
  "properties": {
    "area_land":18062173,
    "area_water":65424,
    "geoid":"360830525013",
    "name":"Block Group 3",
    "state":"ny"
},
  "bbox": [
    -73.716086,
    42.473691,
    -73.671268,
    42.552871
],
  "geometry": {"coordinates":[[[-73.716086,42.525486],[-73.71588300000001,42.526552],[-73.715701,42.527607],[-73.71566,42.527756],[-73.715502,42.528092],[-73.714904,42.529048],[-73.71482,42.529197],[-73.71465499999999,42.529554],[-73.71452499999999,42.529878],[-73.714384,42.530306],[-73.71422200000001,42.531033],[-73.714179,42.531135],[-73.714117,42.531241],[-73.713802,42.531648],[-73.713725,42.53173],[-73.713668,42.531823],[-73.713537,42.532046],[-73.713289,42.532702],[-73.713139,42.533026],[-73.71299399999999,42.533303],[-73.712913,42.533423],[-73.712829,42.533521],[-73.712673,42.533656],[-73.712542,42.533729],[-73.71202,42.533955],[-73.71177900000001,42.534075],[-73.710965,42.534512],[-73.71099700000001,42.534774],[-73.71117,42.535003],[-73.710741,42.534637],[-73.71013499999999,42.53503],[-73.70980299999999,42.535306],[-73.709526,42.535565],[-73.709344,42.535762],[-73.70890300000001,42.536206],[-73.70875100000001,42.536327],[-73.708651,42.536407],[-73.70844,42.536516],[-73.707988,42.536614],[-73.707587,42.536676],[-73.707233,42.536765],[-73.706985,42.536854],[-73.70665700000001,42.53704],[-73.706157,42.537438],[-73.70604299999999,42.537551],[-73.705522,42.537986],[-73.703625,42.53957],[-73.703227,42.539892],[-73.702814,42.540209],[-73.70250299999999,42.540432],[-73.702172,42.540661],[-73.70100600000001,42.54139],[-73.699927,42.542089],[-73.69958,42.542297],[-73.698534,42.543],[-73.698122,42.543241],[-73.697772,42.543375],[-73.697557,42.543434],[-73.697371,42.543463],[-73.696973,42.543499],[-73.69662599999999,42.543524],[-73.69445399999999,42.543681],[-73.69368799999999,42.543754],[-73.69370499999999,42.544578],[-73.693729,42.545458],[-73.69367800000001,42.546085],[-73.693623,42.546264],[-73.693561,42.546402],[-73.693479,42.54655],[-73.693365,42.546766],[-73.69322200000001,42.547003],[-73.693066,42.547233],[-73.69300699999999,42.547345],[-73.69299100000001,42.547516],[-73.69299599999999,42.547877],[-73.693029,42.548285],[-73.693018,42.548478],[-73.692964,42.548726],[-73.69292299999999,42.548806],[-73.692851,42.54889],[-73.692792,42.548937],[-73.692677,42.548989],[-73.692533,42.549032],[-73.692223,42.549079],[-73.691999,42.5491],[-73.69164000000001,42.549141],[-73.69148,42.549181],[-73.69093599999999,42.549324],[-73.69003600000001,42.549539],[-73.689457,42.549695],[-73.689307,42.54975],[-73.689181,42.549813],[-73.689094,42.549801],[-73.68895999999999,42.549795],[-73.688742,42.549801],[-73.68729999999999,42.549906],[-73.68649499999999,42.549986],[-73.686235,42.550023],[-73.68601700000001,42.550067],[-73.685326,42.550265],[-73.684791,42.550474],[-73.684293,42.5507],[-73.683204,42.551173],[-73.68252,42.551483],[-73.68145800000001,42.551901],[-73.680313,42.552375],[-73.68008399999999,42.552444],[-73.679726,42.552532],[-73.679129,42.552634],[-73.67823199999999,42.552699],[-73.677801,42.552717],[-73.676106,42.552794],[-73.67559199999999,42.552828],[-73.674955,42.552871],[-73.674269,42.552081],[-73.67344900000001,42.55121],[-73.672721,42.550267],[-73.672568,42.5502],[-73.6718,42.54922],[-73.671474,42.548794],[-73.67139899999999,42.548683],[-73.671316,42.548452],[-73.671283,42.548248],[-73.671268,42.548009],[-73.671302,42.547695],[-73.671335,42.547561],[-73.67153999999999,42.547102],[-73.671778,42.546588],[-73.672085,42.546131],[-73.672161,42.546072],[-73.672314,42.545896],[-73.67263699999999,42.545595],[-73.673389,42.545032],[-73.673579,42.54489],[-73.67411199999999,42.544432],[-73.674274,42.544278],[-73.674598,42.543906],[-73.674706,42.543771],[-73.674902,42.543493],[-73.676579,42.540957],[-73.677646,42.539369],[-73.677955,42.538858],[-73.67814,42.53853],[-73.678376,42.538051],[-73.678603,42.537389],[-73.67875100000001,42.536946],[-73.678872,42.536504],[-73.678973,42.536068],[-73.679001,42.535884],[-73.679006,42.535829],[-73.679042,42.535431],[-73.679057,42.535113],[-73.67904799999999,42.534405],[-73.67888600000001,42.533173],[-73.678839,42.532904],[-73.67871100000001,42.531931],[-73.678697,42.531662],[-73.67871,42.531364],[-73.678718,42.531225],[-73.67873,42.531011],[-73.678777,42.530743],[-73.67888499999999,42.530251],[-73.678932,42.530092],[-73.679074,42.529744],[-73.679202,42.529456],[-73.679519,42.528929],[-73.679788,42.528537],[-73.68005100000001,42.528224],[-73.68063100000001,42.527529],[-73.680674,42.527473],[-73.681116,42.526908],[-73.681366,42.526515],[-73.681541,42.526217],[-73.68168,42.525923],[-73.681828,42.525522],[-73.681934,42.525147],[-73.68196500000001,42.525047],[-73.68218,42.524011],[-73.68219499999999,42.523912],[-73.682244,42.523522],[-73.682254,42.523401],[-73.68227899999999,42.523299],[-73.682378,42.522843],[-73.682427,42.522485],[-73.682447,42.522035],[-73.68245,42.521874],[-73.682418,42.521503],[-73.682374,42.521256],[-73.68225700000001,42.520784],[-73.68212,42.520343],[-73.681956,42.519988],[-73.681268,42.518647],[-73.681237,42.518575],[-73.680891,42.517947],[-73.68055200000001,42.517266],[-73.680406,42.516978],[-73.68021400000001,42.5166],[-73.6799,42.516016],[-73.679501,42.515389],[-73.678764,42.514189],[-73.678078,42.513121],[-73.677643,42.512419],[-73.677429,42.512037],[-73.677167,42.511484],[-73.67616599999999,42.508817],[-73.675985,42.508394],[-73.67563800000001,42.507692],[-73.67536200000001,42.507188],[-73.675144,42.506829],[-73.674857,42.506386],[-73.674421,42.505782],[-73.67337000000001,42.504411],[-73.67314399999999,42.504068],[-73.673045,42.503886],[-73.672989,42.503788],[-73.6729,42.50361],[-73.672774,42.503273],[-73.672667,42.502939],[-73.67260899999999,42.502663],[-73.672518,42.50222],[-73.672506,42.502161],[-73.672489,42.501781],[-73.672501,42.50125],[-73.672529,42.50101],[-73.67256399999999,42.500782],[-73.67267200000001,42.500411],[-73.672775,42.500109],[-73.672786,42.500078],[-73.672968,42.499667],[-73.673146,42.499264],[-73.673455,42.498544],[-73.673661,42.498],[-73.673981,42.497053],[-73.674153,42.496547],[-73.67444999999999,42.4958],[-73.674578,42.49555],[-73.675676,42.493522],[-73.67609400000001,42.492795],[-73.67653799999999,42.492024],[-73.677089,42.491072],[-73.67797,42.489542],[-73.67803600000001,42.48943],[-73.67836200000001,42.48891],[-73.67855299999999,42.488615],[-73.67866100000001,42.488447],[-73.679289,42.487417],[-73.67958,42.486827],[-73.679699,42.486539],[-73.679834,42.486151],[-73.679939,42.485792],[-73.680036,42.485294],[-73.68010099999999,42.484538],[-73.68007799999999,42.483844],[-73.679929,42.482923],[-73.67982000000001,42.481972],[-73.679801,42.481527],[-73.679799,42.481393],[-73.67980300000001,42.481113],[-73.679832,42.480663],[-73.679946,42.479984],[-73.68008500000001,42.479498],[-73.68019200000001,42.479178],[-73.680294,42.478904],[-73.680519,42.478469],[-73.68079400000001,42.478007],[-73.680891,42.477844],[-73.681276,42.477319],[-73.681529,42.477018],[-73.681938,42.476589],[-73.682176,42.476381],[-73.68216200000001,42.476206],[-73.682187,42.476142],[-73.682256,42.476073],[-73.683064,42.475368],[-73.683173,42.475363],[-73.68334,42.475371],[-73.684729,42.474194],[-73.68503699999999,42.474162],[-73.686722,42.47399],[-73.686785,42.473984],[-73.687049,42.473956],[-73.687347,42.473926],[-73.688303,42.473829],[-73.68855499999999,42.473803],[-73.689049,42.473753],[-73.689657,42.473691],[-73.691177,42.474087],[-73.691272,42.474169],[-73.691413,42.474256],[-73.691647,42.474346],[-73.69381300000001,42.475135],[-73.694928,42.475579],[-73.695155,42.475648],[-73.695207,42.475897],[-73.695308,42.476223],[-73.69539,42.476563],[-73.695509,42.476963],[-73.69556799999999,42.477124],[-73.69577099999999,42.477522],[-73.695976,42.47786],[-73.696005,42.477908],[-73.69617100000001,42.478226],[-73.69636800000001,42.478672],[-73.697104,42.480538],[-73.697143,42.48069],[-73.697175,42.480874],[-73.697198,42.481102],[-73.697266,42.481626],[-73.69730800000001,42.481768],[-73.697366,42.48188],[-73.697434,42.481961],[-73.697526,42.482029],[-73.69761800000001,42.482078],[-73.699105,42.482754],[-73.698931,42.48299],[-73.698891,42.483059],[-73.698818,42.483161],[-73.698655,42.483422],[-73.698587,42.483501],[-73.698474,42.483589],[-73.698323,42.483675],[-73.698161,42.483733],[-73.697647,42.483841],[-73.697343,42.483917],[-73.697191,42.483969],[-73.69691400000001,42.484117],[-73.6968,42.484209],[-73.696665,42.484365],[-73.696594,42.484489],[-73.696545,42.484669],[-73.69654,42.484793],[-73.696551,42.484893],[-73.69659900000001,42.485035],[-73.69666599999999,42.485244],[-73.696856,42.485862],[-73.696896,42.486005],[-73.69708300000001,42.486669],[-73.697153,42.486996],[-73.697278,42.487589],[-73.697407,42.488199],[-73.697228,42.488469],[-73.697166,42.488563],[-73.697095,42.488648],[-73.697006,42.488731],[-73.69732399999999,42.490202],[-73.697349,42.490447],[-73.697345,42.490498],[-73.697338,42.490586],[-73.69731299999999,42.490671],[-73.69726300000001,42.490738],[-73.697964,42.494628],[-73.69861899999999,42.494897],[-73.698874,42.494841],[-73.69899599999999,42.49498],[-73.69914,42.495086],[-73.699439,42.495216],[-73.699612,42.495267],[-73.700571,42.49537],[-73.701256,42.495472],[-73.70177700000001,42.495529],[-73.701876,42.495557],[-73.70217,42.495734],[-73.702382,42.495879],[-73.702808,42.496237],[-73.70334800000001,42.496736],[-73.703599,42.496902],[-73.70375199999999,42.49697],[-73.703968,42.497051],[-73.704499,42.4972],[-73.70481100000001,42.497299],[-73.704877,42.497327],[-73.704975,42.49737],[-73.705326,42.497575],[-73.705578,42.497742],[-73.706022,42.498085],[-73.706653,42.498656],[-73.706913,42.498948],[-73.707065,42.499143],[-73.70718100000001,42.499327],[-73.707244,42.499501],[-73.707244,42.499564],[-73.707227,42.499621],[-73.70717,42.499709],[-73.707103,42.49978],[-73.70697,42.49988],[-73.70677999999999,42.500001],[-73.70620599999999,42.500304],[-73.705634,42.500632],[-73.705387,42.500806],[-73.705305,42.500891],[-73.705258,42.500986],[-73.705251,42.501076],[-73.705271,42.501166],[-73.705319,42.501267],[-73.705397,42.501367],[-73.705736,42.501778],[-73.70651700000001,42.502663],[-73.706659,42.50297],[-73.706835,42.503595],[-73.707519,42.506244],[-73.70765,42.506908],[-73.70780000000001,42.507665],[-73.707807,42.507756],[-73.707774,42.507949],[-73.70768700000001,42.508157],[-73.707184,42.509126],[-73.70679699999999,42.50996],[-73.70667,42.510182],[-73.706586,42.510284],[-73.706451,42.510408],[-73.706177,42.510605],[-73.705732,42.51088],[-73.705662,42.510943],[-73.705585,42.511057],[-73.705569,42.511154],[-73.705572,42.511317],[-73.70590900000001,42.51248],[-73.705974,42.512651],[-73.706086,42.512976],[-73.70649400000001,42.514248],[-73.706575,42.514612],[-73.706604,42.514812],[-73.706746,42.516842],[-73.70681399999999,42.517193],[-73.706979,42.51772],[-73.70734400000001,42.518696],[-73.707447,42.519043],[-73.707464,42.5191],[-73.707472,42.519217],[-73.707461,42.519312],[-73.707442,42.519487],[-73.70743299999999,42.519567],[-73.70740600000001,42.519822],[-73.70739500000001,42.520179],[-73.70741,42.520452],[-73.707453,42.520641],[-73.70757,42.520878],[-73.707672,42.521009],[-73.707751,42.521093],[-73.70802,42.52138],[-73.708167,42.521538],[-73.708583,42.521924],[-73.708637,42.521973],[-73.71024,42.523444],[-73.71034400000001,42.523539],[-73.710483,42.523682],[-73.71071600000001,42.523953],[-73.710752,42.524007],[-73.710795,42.524044],[-73.710927,42.52419],[-73.71102500000001,42.524262],[-73.71135200000001,42.524295],[-73.71144,42.524304],[-73.711878,42.524335],[-73.712254,42.524369],[-73.712542,42.524414],[-73.71278,42.524462],[-73.713022,42.524516],[-73.713514,42.524644],[-73.71393500000001,42.524758],[-73.71402,42.524781],[-73.71460399999999,42.524921],[-73.71488100000001,42.524992],[-73.715081,42.525054],[-73.715273,42.525125],[-73.715457,42.525202],[-73.715885,42.525398],[-73.716086,42.525486]]],"type":"Polygon"}
}