{
  "id": "361031583081",
  "type": "Feature",
  "properties": {
    "area_land":1563142,
    "area_water":0,
    "geoid":"361031583081",
    "name":"Block Group 1",
    "state":"ny"
},
  "bbox": [
    -73.047234,
    40.913432,
    -73.027999,
    40.931635
],
  "geometry": {"coordinates":[[[-73.047234,40.925076],[-73.04698399999999,40.925225],[-73.046547,40.925489],[-73.046267,40.92565],[-73.045254,40.92629],[-73.04521,40.926318],[-73.044473,40.926759],[-73.043735,40.9272],[-73.043278,40.927486],[-73.042152,40.928171],[-73.04160400000001,40.928507],[-73.040673,40.929071],[-73.04019099999999,40.929356],[-73.03958900000001,40.929734],[-73.03877900000001,40.930201],[-73.038415,40.930396],[-73.038128,40.930538],[-73.037963,40.930608],[-73.03721400000001,40.930934],[-73.036778,40.9311],[-73.03634099999999,40.931265],[-73.035062,40.931635],[-73.03501,40.931487],[-73.03473700000001,40.930664],[-73.034599,40.930229],[-73.034409,40.929446],[-73.034325,40.929061],[-73.03424099999999,40.928856],[-73.034187,40.928757],[-73.03398199999999,40.928329],[-73.033913,40.928284],[-73.033761,40.92818],[-73.033416,40.927872],[-73.03304300000001,40.927669],[-73.032883,40.927608],[-73.032539,40.927494],[-73.03160800000001,40.927215],[-73.03086,40.927009],[-73.030449,40.926639],[-73.029893,40.92617],[-73.029579,40.925872],[-73.029267,40.925747],[-73.029076,40.925657],[-73.02866400000001,40.925461],[-73.028588,40.924976],[-73.028426,40.923561],[-73.028328,40.922939],[-73.02826399999999,40.92237],[-73.028199,40.921802],[-73.02812900000001,40.921177],[-73.028046,40.920554],[-73.02799899999999,40.920158],[-73.028847,40.920349],[-73.028885,40.920357],[-73.029853,40.920565],[-73.03089199999999,40.920829],[-73.031029,40.92086],[-73.03186100000001,40.921093],[-73.031471,40.917987],[-73.03109000000001,40.915012],[-73.031021,40.914275],[-73.031015,40.914227],[-73.03094400000001,40.913632],[-73.030956,40.91357],[-73.031071,40.913432],[-73.03123100000001,40.913618],[-73.03136000000001,40.913757],[-73.031757,40.914098],[-73.032172,40.914381],[-73.032414,40.914532],[-73.032501,40.914598],[-73.03278400000001,40.914833],[-73.033547,40.915343],[-73.03404999999999,40.915649],[-73.034797,40.91614],[-73.035325,40.916487],[-73.036293,40.917128],[-73.037254,40.917726],[-73.037347,40.917792],[-73.037362,40.917829],[-73.03831,40.918509],[-73.039006,40.918973],[-73.040576,40.920028],[-73.04128,40.920479],[-73.041506,40.920612],[-73.041585,40.920623],[-73.042117,40.920945],[-73.04411399999999,40.92202],[-73.044853,40.922451],[-73.044944,40.922532],[-73.045007,40.922588],[-73.046269,40.92401],[-73.046761,40.924565],[-73.04712000000001,40.924953],[-73.047234,40.925076]]],"type":"Polygon"}
}