{
  "id": "360070134002",
  "type": "Feature",
  "properties": {
    "area_land":306709,
    "area_water":0,
    "geoid":"360070134002",
    "name":"Block Group 2",
    "state":"ny"
},
  "bbox": [
    -76.047342,
    42.111095,
    -76.037145,
    42.115228
],
  "geometry": {"coordinates":[[[-76.047342,42.11501],[-76.046637,42.115045],[-76.046426,42.115055],[-76.046251,42.115063],[-76.046164,42.115067],[-76.04540799999999,42.1151],[-76.045027,42.115117],[-76.044605,42.115101],[-76.044133,42.115072],[-76.04394600000001,42.115072],[-76.043075,42.115108],[-76.04199199999999,42.115154],[-76.040915,42.115193],[-76.039945,42.115228],[-76.039861,42.1139],[-76.039788,42.113142],[-76.038871,42.113167],[-76.037933,42.11321],[-76.037221,42.113242],[-76.037145,42.111452],[-76.037431,42.111441],[-76.037807,42.111425],[-76.038729,42.111394],[-76.039655,42.111364],[-76.040672,42.111337],[-76.04125999999999,42.111313],[-76.04174399999999,42.111294],[-76.04281899999999,42.11125],[-76.043905,42.111212],[-76.04517,42.111162],[-76.046001,42.111131],[-76.04709200000001,42.111095],[-76.047201,42.112884],[-76.047342,42.11501]]],"type":"Polygon"}
}