{
  "id": "360870102003",
  "type": "Feature",
  "properties": {
    "area_land":1984876,
    "area_water":3340813,
    "geoid":"360870102003",
    "name":"Block Group 3",
    "state":"ny"
},
  "bbox": [
    -73.987556,
    41.215961,
    -73.947965,
    41.243851
],
  "geometry": {"coordinates":[[[-73.98754700000001,41.228091],[-73.987469,41.228304],[-73.98736100000001,41.228495],[-73.987245,41.228681],[-73.98716,41.228821],[-73.987044,41.229049],[-73.98694500000001,41.229294],[-73.986868,41.229479],[-73.98672500000001,41.229748],[-73.986152,41.230712],[-73.98603,41.230965],[-73.98598699999999,41.231091],[-73.98595,41.23126],[-73.98591999999999,41.231477],[-73.985871,41.231879],[-73.985794,41.232131],[-73.98571800000001,41.232277],[-73.98568400000001,41.232326],[-73.98553800000001,41.232501],[-73.98545900000001,41.232568],[-73.985023,41.232872],[-73.984848,41.233044],[-73.98478299999999,41.233129],[-73.98468200000001,41.233119],[-73.984351,41.233181],[-73.984202,41.2332],[-73.983842,41.233236],[-73.983732,41.233228],[-73.98353,41.233179],[-73.9834,41.233124],[-73.98325,41.233043],[-73.98309399999999,41.232939],[-73.982811,41.232778],[-73.982698,41.232733],[-73.982589,41.232704],[-73.98227799999999,41.23265],[-73.982069,41.232629],[-73.98143399999999,41.232544],[-73.980738,41.232465],[-73.97970100000001,41.232363],[-73.97957,41.23235],[-73.977935,41.232131],[-73.977701,41.232095],[-73.977633,41.232092],[-73.97757,41.232626],[-73.97717799999999,41.235272],[-73.976804,41.237809],[-73.976782,41.237958],[-73.976713,41.23845],[-73.97671,41.238476],[-73.976647,41.239168],[-73.97663300000001,41.239552],[-73.976615,41.240088],[-73.97662,41.240973],[-73.976632,41.241041],[-73.97663,41.241536],[-73.97662699999999,41.242457],[-73.976598,41.243253],[-73.97659899999999,41.243692],[-73.976422,41.243841],[-73.964142,41.243851],[-73.96388399999999,41.243694],[-73.96128299999999,41.241994],[-73.96078300000001,41.239394],[-73.961383,41.234194],[-73.957983,41.231694],[-73.953283,41.228994],[-73.951083,41.226494],[-73.950947,41.226346],[-73.947965,41.223101],[-73.964116,41.220899],[-73.964142,41.220887],[-73.96529700000001,41.220699],[-73.96536,41.2207],[-73.965418,41.220683],[-73.96558,41.22066],[-73.966464,41.220567],[-73.966768,41.220537],[-73.967157,41.220463],[-73.96823000000001,41.220334],[-73.96824700000001,41.220378],[-73.969121,41.220204],[-73.969369,41.22013],[-73.969325,41.220007],[-73.96924199999999,41.219855],[-73.96915199999999,41.219734],[-73.96882600000001,41.219343],[-73.968226,41.218815],[-73.968119,41.218651],[-73.96811,41.218477],[-73.968177,41.21837],[-73.968332,41.218283],[-73.968565,41.218245],[-73.96871,41.218283],[-73.968884,41.218361],[-73.969455,41.218786],[-73.96983299999999,41.218951],[-73.97051999999999,41.219144],[-73.970811,41.219183],[-73.97111099999999,41.219183],[-73.971372,41.219173],[-73.972036,41.219071],[-73.972909,41.218713],[-73.973083,41.218621],[-73.97321700000001,41.218517],[-73.973287,41.218428],[-73.97344099999999,41.21818],[-73.973472,41.218065],[-73.97347499999999,41.21773],[-73.97345199999999,41.217603],[-73.97341,41.217492],[-73.97303700000001,41.216701],[-73.97322800000001,41.216676],[-73.97879,41.215961],[-73.978713,41.216593],[-73.97855800000001,41.218717],[-73.978545,41.218889],[-73.978539,41.219045],[-73.978493,41.219927],[-73.978426,41.220445],[-73.978335,41.220817],[-73.97814700000001,41.221349],[-73.978043,41.221604],[-73.97850699999999,41.221741],[-73.97867100000001,41.221763],[-73.97877099999999,41.221763],[-73.979314,41.221707],[-73.979995,41.221663],[-73.980707,41.221592],[-73.98092699999999,41.2216],[-73.98106900000001,41.221623],[-73.981489,41.221759],[-73.981689,41.221836],[-73.981781,41.221894],[-73.98187799999999,41.221979],[-73.98204699999999,41.222159],[-73.982355,41.222523],[-73.982405,41.222607],[-73.982405,41.222673],[-73.982378,41.222715],[-73.98235099999999,41.222727],[-73.98222,41.222723],[-73.98217,41.222734],[-73.982085,41.222815],[-73.98192400000001,41.223015],[-73.98190099999999,41.223177],[-73.98187799999999,41.223211],[-73.98177800000001,41.223275],[-73.981751,41.223313],[-73.981751,41.223459],[-73.98176599999999,41.223513],[-73.981808,41.223571],[-73.98187,41.223617],[-73.981916,41.223679],[-73.982089,41.224063],[-73.98213199999999,41.224109],[-73.982162,41.224125],[-73.98225100000001,41.224144],[-73.982578,41.224142],[-73.982732,41.224184],[-73.98284,41.224227],[-73.98295899999999,41.224311],[-73.983417,41.224702],[-73.983498,41.224802],[-73.983537,41.224882],[-73.98356800000001,41.224982],[-73.983598,41.225279],[-73.983598,41.225532],[-73.983502,41.225777],[-73.98348300000001,41.225869],[-73.98348300000001,41.226054],[-73.983498,41.226142],[-73.983552,41.226296],[-73.98364100000001,41.22643],[-73.983698,41.226484],[-73.983783,41.226534],[-73.98391700000001,41.226593],[-73.98403,41.226632],[-73.98477200000001,41.226808],[-73.98527900000001,41.226955],[-73.985679,41.227102],[-73.985918,41.227234],[-73.98635299999999,41.227505],[-73.986772,41.227737],[-73.987556,41.228053],[-73.98754700000001,41.228091]]],"type":"Polygon"}
}