{
  "id": "360379513001",
  "type": "Feature",
  "properties": {
    "area_land":40845906,
    "area_water":276128,
    "geoid":"360379513001",
    "name":"Block Group 1",
    "state":"ny"
},
  "bbox": [
    -78.006984,
    42.862754,
    -77.934234,
    42.946523
],
  "geometry": {"coordinates":[[[-78.006984,42.944866],[-77.999771,42.944896],[-77.99564700000001,42.944966],[-77.995655,42.946047],[-77.995628,42.946288],[-77.995572,42.946523],[-77.979842,42.946446],[-77.976822,42.946416],[-77.97434699999999,42.946397],[-77.97127500000001,42.946369],[-77.96628699999999,42.946323],[-77.963126,42.946258],[-77.950284,42.945961],[-77.94913699999999,42.945961],[-77.94775799999999,42.945898],[-77.934234,42.94558],[-77.934262,42.943976],[-77.93434600000001,42.939164],[-77.934375,42.937561],[-77.93440099999999,42.936893],[-77.934483,42.934892],[-77.93451,42.934225],[-77.934545,42.93282],[-77.93454800000001,42.932707],[-77.934681,42.927346],[-77.934724,42.9256],[-77.93473899999999,42.925015],[-77.934765,42.92392],[-77.934847,42.920638],[-77.934877,42.919434],[-77.93488600000001,42.919092],[-77.934918,42.917774],[-77.935018,42.913821],[-77.935051,42.912504],[-77.93507099999999,42.911649],[-77.935135,42.909084],[-77.93515600000001,42.90823],[-77.935197,42.90656],[-77.93523,42.905261],[-77.93894,42.90537],[-77.94061000000001,42.90542],[-77.94064400000001,42.905421],[-77.941186,42.905437],[-77.942812,42.905485],[-77.943355,42.905501],[-77.94470800000001,42.905541],[-77.94877,42.905661],[-77.94884399999999,42.905663],[-77.950124,42.905692],[-77.95018399999999,42.905703],[-77.951205,42.905733],[-77.952088,42.905759],[-77.954448,42.905829],[-77.95553,42.905861],[-77.95551500000001,42.904978],[-77.955472,42.902329],[-77.95545799999999,42.901446],[-77.955457,42.901395],[-77.955455,42.901243],[-77.955455,42.901193],[-77.95545300000001,42.901133],[-77.95545,42.900953],[-77.955449,42.900893],[-77.955429,42.899662],[-77.955369,42.895969],[-77.955359,42.895348],[-77.95535,42.894738],[-77.95533399999999,42.893822],[-77.95528899999999,42.891076],[-77.955275,42.890161],[-77.955236,42.887772],[-77.955119,42.880607],[-77.95508100000001,42.878219],[-77.955063,42.877141],[-77.955028,42.875009],[-77.955046,42.873909],[-77.95506399999999,42.872919],[-77.955062,42.872832],[-77.95500699999999,42.870788],[-77.95495200000001,42.868696],[-77.954921,42.864655],[-77.954921,42.864625],[-77.954964,42.862754],[-77.95508700000001,42.862775],[-77.95522800000001,42.862788],[-77.955287,42.862793],[-77.956681,42.862809],[-77.958843,42.862835],[-77.960014,42.862851],[-77.961271,42.862876],[-77.96375,42.86293],[-77.964105,42.86294],[-77.964878,42.862952],[-77.96619,42.862951],[-77.966233,42.862946],[-77.975495,42.862962],[-77.978497,42.862997],[-77.979902,42.863011],[-77.979899,42.863169],[-77.979882,42.86415],[-77.979851,42.865832],[-77.979806,42.868117],[-77.97976300000001,42.869765],[-77.979755,42.871804],[-77.979777,42.873097],[-77.979778,42.874017],[-77.979765,42.875139],[-77.979705,42.880512],[-77.979704,42.880637],[-77.97970599999999,42.882691],[-77.97970100000001,42.884042],[-77.979843,42.884021],[-77.979917,42.884015],[-77.98389899999999,42.884069],[-77.98783899999999,42.884047],[-77.98961300000001,42.884051],[-77.991024,42.88407],[-77.99297799999999,42.884063],[-77.993562,42.884066],[-77.99439099999999,42.884072],[-77.99503199999999,42.88411],[-77.99551700000001,42.884176],[-77.99653600000001,42.884339],[-77.99695,42.884413],[-77.997213,42.884444],[-77.997615,42.884466],[-77.998169,42.884478],[-77.99857900000001,42.884478],[-78.003215,42.884468],[-78.00533,42.884483],[-78.00649300000001,42.884481],[-78.00647499999999,42.885136],[-78.006473,42.887239],[-78.006451,42.889388],[-78.00649900000001,42.892454],[-78.006541,42.896569],[-78.00658900000001,42.899428],[-78.006604,42.901395],[-78.006638,42.903498],[-78.00667199999999,42.905944],[-78.00669600000001,42.909344],[-78.00671,42.909825],[-78.006728,42.912813],[-78.00675200000001,42.91425],[-78.006726,42.91635],[-78.00670100000001,42.917783],[-78.006726,42.919882],[-78.006721,42.922715],[-78.00673,42.924714],[-78.006771,42.928137],[-78.00677,42.928245],[-78.00677,42.928316],[-78.00677,42.928451],[-78.00678600000001,42.930487],[-78.006855,42.934393],[-78.006861,42.935319],[-78.006871,42.935725],[-78.006922,42.939835],[-78.006953,42.940921],[-78.006984,42.943743],[-78.006984,42.944866]]],"type":"Polygon"}
}