{
  "id": "361190026002",
  "type": "Feature",
  "properties": {
    "area_land":1198360,
    "area_water":32765,
    "geoid":"361190026002",
    "name":"Block Group 2",
    "state":"ny"
},
  "bbox": [
    -73.834408,
    40.88975,
    -73.815167,
    40.902608
],
  "geometry": {"coordinates":[[[-73.834408,40.896589],[-73.83347500000001,40.896793],[-73.832519,40.897008],[-73.832978,40.89821],[-73.833399,40.899274],[-73.83246,40.899477],[-73.831518,40.899685],[-73.83058800000001,40.899902],[-73.829649,40.900109],[-73.828703,40.900314],[-73.828597,40.900336],[-73.82746899999999,40.900577],[-73.826785,40.90072],[-73.82651199999999,40.900766],[-73.825968,40.900883],[-73.825836,40.900905],[-73.82527,40.900983],[-73.82437299999999,40.901089],[-73.82381599999999,40.901146],[-73.822861,40.901232],[-73.82264000000001,40.901252],[-73.821915,40.901327],[-73.82102999999999,40.90142],[-73.820222,40.901508],[-73.81998900000001,40.901548],[-73.81932,40.901671],[-73.819093,40.901721],[-73.818226,40.901914],[-73.816727,40.90224],[-73.816574,40.902274],[-73.816245,40.902348],[-73.81545300000001,40.902533],[-73.815167,40.902608],[-73.815308,40.902399],[-73.815409,40.902313],[-73.815776,40.902112],[-73.81591,40.902016],[-73.816018,40.901939],[-73.816068,40.901892],[-73.81611599999999,40.901847],[-73.816351,40.901626],[-73.81657,40.901365],[-73.817421,40.900351],[-73.817545,40.900133],[-73.81756300000001,40.899974],[-73.817531,40.899801],[-73.817369,40.899436],[-73.81732,40.899269],[-73.817334,40.899173],[-73.81741,40.899038],[-73.81767000000001,40.898676],[-73.817909,40.89825],[-73.81802999999999,40.89796],[-73.818254,40.897078],[-73.818269,40.89702],[-73.81823300000001,40.897011],[-73.818174,40.896966],[-73.818139,40.896907],[-73.81814300000001,40.896834],[-73.818333,40.896594],[-73.819468,40.895805],[-73.820627,40.895378],[-73.82086099999999,40.895299],[-73.821077,40.895187],[-73.821217,40.895043],[-73.821895,40.894125],[-73.822097,40.893791],[-73.822762,40.892694],[-73.82326399999999,40.891357],[-73.823244,40.891199],[-73.82328200000001,40.891082],[-73.823302,40.890989],[-73.823256,40.890961],[-73.823205,40.890918],[-73.823132,40.890871],[-73.82311300000001,40.890777],[-73.82312,40.890648],[-73.823172,40.890545],[-73.823303,40.890421],[-73.823373,40.890416],[-73.823527,40.89043],[-73.823576,40.890426],[-73.823617,40.890413],[-73.823634,40.890391],[-73.82365,40.890338],[-73.823661,40.89017],[-73.823671,40.890137],[-73.823689,40.890076],[-73.82368,40.89003],[-73.823598,40.889956],[-73.823573,40.889882],[-73.823555,40.88987],[-73.82356,40.889857],[-73.823607,40.889853],[-73.823781,40.889809],[-73.82396300000001,40.889763],[-73.824017,40.88975],[-73.82403600000001,40.889823],[-73.82404699999999,40.889866],[-73.824009,40.889978],[-73.82402500000001,40.889978],[-73.824403,40.889978],[-73.825002,40.890178],[-73.82524100000001,40.890244],[-73.825256,40.890248],[-73.827224,40.890785],[-73.827269,40.890797],[-73.827943,40.890928],[-73.828125,40.891051],[-73.828716,40.891274],[-73.830022,40.891686],[-73.83008700000001,40.8917],[-73.83081799999999,40.891879],[-73.830972,40.891935],[-73.831703,40.892178],[-73.831856,40.892217],[-73.832503,40.892377],[-73.8327,40.892438],[-73.832716,40.892443],[-73.833595,40.892706],[-73.833395,40.893516],[-73.833192,40.893454],[-73.833316,40.893777],[-73.83372900000001,40.894828],[-73.83415100000001,40.89587],[-73.834408,40.896589]]],"type":"Polygon"}
}