{
  "id": "360290113003",
  "type": "Feature",
  "properties": {
    "area_land":870173,
    "area_water":0,
    "geoid":"360290113003",
    "name":"Block Group 3",
    "state":"ny"
},
  "bbox": [
    -78.787837,
    42.854187,
    -78.771157,
    42.864496
],
  "geometry": {"coordinates":[[[-78.78774,42.855529],[-78.787729,42.85564],[-78.787676,42.857035],[-78.787582,42.859388],[-78.787582,42.859473],[-78.787498,42.861787],[-78.787498,42.861804],[-78.787454,42.862114],[-78.787447,42.8622],[-78.787244,42.864496],[-78.786185,42.864267],[-78.785757,42.864175],[-78.78522100000001,42.864028],[-78.784494,42.863829],[-78.784149,42.863734],[-78.78310500000001,42.863441],[-78.783056,42.863422],[-78.783012,42.863396],[-78.78252500000001,42.86318],[-78.78177700000001,42.862566],[-78.77923199999999,42.86047],[-78.77902899999999,42.860304],[-78.77866,42.860003],[-78.77722300000001,42.858829],[-78.77651400000001,42.858252],[-78.776066,42.857888],[-78.775764,42.857644],[-78.77483700000001,42.856886],[-78.77475200000001,42.856816],[-78.773734,42.855987],[-78.77282200000001,42.855254],[-78.771355,42.854315],[-78.771157,42.854187],[-78.772893,42.854223],[-78.773821,42.854243],[-78.77489799999999,42.854267],[-78.77596800000001,42.854291],[-78.777016,42.854315],[-78.77777500000001,42.854332],[-78.77987299999999,42.854377],[-78.782873,42.854445],[-78.78343599999999,42.854457],[-78.78451800000001,42.854476],[-78.785584,42.854496],[-78.786663,42.854519],[-78.787284,42.854533],[-78.787837,42.854545],[-78.78774,42.855529]]],"type":"Polygon"}
}