{
  "id": "360550047022",
  "type": "Feature",
  "properties": {
    "area_land":238252,
    "area_water":0,
    "geoid":"360550047022",
    "name":"Block Group 2",
    "state":"ny"
},
  "bbox": [
    -77.607405,
    43.186563,
    -77.599577,
    43.191026
],
  "geometry": {"coordinates":[[[-77.607405,43.188962],[-77.606291,43.188997],[-77.605238,43.189038],[-77.604162,43.189076],[-77.60426099999999,43.190743],[-77.603662,43.190768],[-77.603517,43.190787],[-77.603386,43.19082],[-77.60315900000001,43.190894],[-77.603082,43.190907],[-77.60300100000001,43.190915],[-77.602081,43.190948],[-77.600988,43.190984],[-77.599836,43.191026],[-77.59979,43.190351],[-77.599722,43.189225],[-77.599676,43.188424],[-77.59963,43.187627],[-77.599577,43.186814],[-77.601705,43.186746],[-77.602812,43.186696],[-77.60299500000001,43.186692],[-77.60400199999999,43.186666],[-77.605059,43.186633],[-77.60512300000001,43.186631],[-77.606138,43.186593],[-77.607229,43.186563],[-77.607405,43.188962]]],"type":"Polygon"}
}