{
  "id": "360470564001",
  "type": "Feature",
  "properties": {
    "area_land":58192,
    "area_water":0,
    "geoid":"360470564001",
    "name":"Block Group 1",
    "state":"ny"
},
  "bbox": [
    -73.943208,
    40.605073,
    -73.93921,
    40.607582
],
  "geometry": {"coordinates":[[[-73.943208,40.607392],[-73.942207,40.607503],[-73.941547,40.607582],[-73.941168,40.607244],[-73.94050799999999,40.606642],[-73.940031,40.606203],[-73.93921,40.605479],[-73.939916,40.605386],[-73.940842,40.605285],[-73.941771,40.605183],[-73.942769,40.605073],[-73.943208,40.607392]]],"type":"Polygon"}
}