{
  "id": "360830412003",
  "type": "Feature",
  "properties": {
    "area_land":1013288,
    "area_water":19291,
    "geoid":"360830412003",
    "name":"Block Group 3",
    "state":"ny"
},
  "bbox": [
    -73.675397,
    42.712569,
    -73.654969,
    42.72359
],
  "geometry": {"coordinates":[[[-73.675397,42.721716],[-73.674713,42.721781],[-73.67373000000001,42.721861],[-73.673483,42.721871],[-73.67232799999999,42.721856],[-73.67213700000001,42.721853],[-73.671914,42.721831],[-73.67155,42.721747],[-73.671294,42.721653],[-73.670744,42.721437],[-73.670303,42.721241],[-73.670113,42.72112],[-73.67008800000001,42.721087],[-73.670073,42.72104],[-73.67008,42.720996],[-73.670106,42.72096],[-73.670321,42.720767],[-73.67039699999999,42.720665],[-73.670427,42.720581],[-73.670427,42.720516],[-73.67039699999999,42.720399],[-73.670343,42.720293],[-73.67026300000001,42.72022],[-73.67019000000001,42.720169],[-73.67006600000001,42.720111],[-73.66993100000001,42.720078],[-73.669603,42.72006],[-73.669016,42.720086],[-73.66865799999999,42.720129],[-73.66807300000001,42.72022],[-73.667357,42.72033],[-73.66708,42.720395],[-73.66683500000001,42.720483],[-73.66664900000001,42.72057],[-73.66647399999999,42.720676],[-73.666077,42.720971],[-73.66561799999999,42.721357],[-73.66548299999999,42.721492],[-73.665384,42.721616],[-73.66526,42.721805],[-73.665228,42.721874],[-73.665209,42.721991],[-73.66521299999999,42.722133],[-73.665198,42.722301],[-73.665166,42.722461],[-73.6651,42.722676],[-73.665038,42.722953],[-73.664936,42.723113],[-73.664867,42.723171],[-73.664783,42.723208],[-73.66436,42.723259],[-73.66416700000001,42.723255],[-73.663999,42.72323],[-73.663707,42.723146],[-73.663572,42.723084],[-73.663426,42.722993],[-73.66336099999999,42.722938],[-73.663281,42.722851],[-73.663197,42.722709],[-73.66315299999999,42.722588],[-73.663076,42.722191],[-73.662938,42.721674],[-73.66289399999999,42.721568],[-73.66283199999999,42.721488],[-73.662369,42.721066],[-73.662081,42.720862],[-73.66196100000001,42.720792],[-73.66186999999999,42.72076],[-73.661768,42.720752],[-73.66162199999999,42.720756],[-73.661556,42.720781],[-73.661501,42.720825],[-73.661472,42.720887],[-73.66143599999999,42.721073],[-73.66141399999999,42.721845],[-73.661396,42.722016],[-73.661359,42.722199],[-73.661199,42.722734],[-73.66107100000001,42.722985],[-73.661002,42.72308],[-73.660871,42.723193],[-73.660532,42.723394],[-73.660331,42.723474],[-73.660116,42.723547],[-73.659992,42.723572],[-73.659854,42.723587],[-73.659671,42.72359],[-73.65944500000001,42.723561],[-73.659307,42.723525],[-73.658895,42.723361],[-73.658428,42.723189],[-73.658191,42.72312],[-73.657892,42.723069],[-73.657484,42.723033],[-73.657207,42.722978],[-73.656488,42.722792],[-73.656346,42.722727],[-73.656288,42.72269],[-73.656233,42.722628],[-73.656193,42.722552],[-73.656175,42.722457],[-73.656167,42.722312],[-73.6562,42.721987],[-73.656561,42.720811],[-73.656569,42.720479],[-73.656616,42.720282],[-73.656685,42.720166],[-73.656744,42.720093],[-73.657039,42.719885],[-73.657068,42.719853],[-73.657068,42.719816],[-73.65704599999999,42.719776],[-73.65701300000001,42.719743],[-73.656999,42.719681],[-73.656999,42.719605],[-73.657123,42.719146],[-73.657134,42.719062],[-73.65713,42.718985],[-73.65710799999999,42.718927],[-73.657017,42.718822],[-73.656948,42.718774],[-73.65682,42.718738],[-73.65660099999999,42.718698],[-73.656375,42.718683],[-73.656255,42.71869],[-73.65615699999999,42.718709],[-73.656047,42.718745],[-73.65594900000001,42.718796],[-73.65552599999999,42.718948],[-73.65496899999999,42.71544],[-73.65536400000001,42.715413],[-73.655981,42.715362],[-73.656239,42.715365],[-73.65707399999999,42.715394],[-73.657763,42.715518],[-73.658131,42.715598],[-73.65950599999999,42.715955],[-73.66019799999999,42.716147],[-73.66154,42.716498],[-73.66261299999999,42.716798],[-73.663027,42.715462],[-73.663156,42.715074],[-73.663251,42.714848],[-73.66341799999999,42.714524],[-73.66350199999999,42.714404],[-73.664191,42.713649],[-73.66425700000001,42.713558],[-73.664314,42.713452],[-73.664337,42.713374],[-73.664404,42.713301],[-73.665497,42.712819],[-73.66610900000001,42.712569],[-73.666616,42.713267],[-73.667114,42.713897],[-73.667388,42.714241],[-73.667666,42.714576],[-73.66782600000001,42.71475],[-73.668285,42.715167],[-73.66917599999999,42.715945],[-73.669794,42.71649],[-73.670423,42.717067],[-73.671058,42.717585],[-73.671138,42.717636],[-73.671598,42.717916],[-73.67211,42.718192],[-73.672837,42.718565],[-73.673424,42.718816],[-73.673745,42.718944],[-73.674336,42.719159],[-73.674526,42.719279],[-73.674646,42.719384],[-73.674722,42.719483],[-73.674773,42.71957],[-73.674845,42.719752],[-73.675,42.720328],[-73.675191,42.720961],[-73.675397,42.721716]]],"type":"Polygon"}
}