{
  "id": "360470114001",
  "type": "Feature",
  "properties": {
    "area_land":59832,
    "area_water":0,
    "geoid":"360470114001",
    "name":"Block Group 1",
    "state":"ny"
},
  "bbox": [
    -73.999757,
    40.637893,
    -73.99551,
    40.642026
],
  "geometry": {"coordinates":[[[-73.99917600000001,40.642026],[-73.99697399999999,40.640694],[-73.99551,40.63981],[-73.996227,40.639331],[-73.996942,40.638853],[-73.997658,40.638374],[-73.998374,40.637893],[-73.99930500000001,40.638455],[-73.998722,40.639016],[-73.99813899999999,40.639575],[-73.997557,40.640136],[-73.999757,40.641467],[-73.99917600000001,40.642026]]],"type":"Polygon"}
}