{
  "id": "360594138041",
  "type": "Feature",
  "properties": {
    "area_land":342324,
    "area_water":0,
    "geoid":"360594138041",
    "name":"Block Group 1",
    "state":"ny"
},
  "bbox": [
    -73.604032,
    40.621919,
    -73.596083,
    40.632808
],
  "geometry": {"coordinates":[[[-73.604032,40.63128],[-73.603048,40.631555],[-73.600978,40.632125],[-73.598523,40.632808],[-73.598494,40.632729],[-73.598465,40.632693],[-73.59839700000001,40.632545],[-73.598309,40.632411],[-73.59839100000001,40.632375],[-73.598427,40.632333],[-73.5985,40.632304],[-73.59885199999999,40.632203],[-73.599131,40.632126],[-73.60007,40.631867],[-73.60019800000001,40.631829],[-73.599152,40.630223],[-73.59976899999999,40.63],[-73.599671,40.629843],[-73.599553,40.629711],[-73.59952800000001,40.629667],[-73.599502,40.629653],[-73.59926299999999,40.629413],[-73.598951,40.628937],[-73.598859,40.628811],[-73.598551,40.628327],[-73.59821700000001,40.627812],[-73.598163,40.627702],[-73.59811500000001,40.627646],[-73.59788500000001,40.627306],[-73.597728,40.62704],[-73.59766,40.626881],[-73.597593,40.626661],[-73.597559,40.626452],[-73.597556,40.626163],[-73.59715300000001,40.626143],[-73.59709599999999,40.626132],[-73.596952,40.626077],[-73.596909,40.626052],[-73.59683699999999,40.625983],[-73.59677000000001,40.625868],[-73.596379,40.624851],[-73.596333,40.624708],[-73.596327,40.624609],[-73.596345,40.62451],[-73.59645500000001,40.62434],[-73.596513,40.624277],[-73.59661800000001,40.62419],[-73.59669,40.624141],[-73.596915,40.624019],[-73.596683,40.623649],[-73.596389,40.623204],[-73.59627500000001,40.62301],[-73.596175,40.622865],[-73.59611099999999,40.622742],[-73.59608299999999,40.622654],[-73.596084,40.622533],[-73.596098,40.622489],[-73.59613,40.622433],[-73.596153,40.622393],[-73.5962,40.622344],[-73.59626900000001,40.622287],[-73.59639900000001,40.622224],[-73.597424,40.621969],[-73.59769799999999,40.621924],[-73.59795699999999,40.621919],[-73.598231,40.621945],[-73.598382,40.621978],[-73.598461,40.622009],[-73.598586,40.622094],[-73.59864399999999,40.622152],[-73.598679,40.622207],[-73.598708,40.622284],[-73.598707,40.622469],[-73.598709,40.62263],[-73.598786,40.623025],[-73.59880099999999,40.623231],[-73.59881300000001,40.623415],[-73.59883000000001,40.623503],[-73.598934,40.623765],[-73.598983,40.623825],[-73.599234,40.624045],[-73.599424,40.624172],[-73.599599,40.624254],[-73.599729,40.624333],[-73.599859,40.624388],[-73.600081,40.624468],[-73.60030399999999,40.624532],[-73.600337,40.624546],[-73.600424,40.624573],[-73.600684,40.624654],[-73.600891,40.624747],[-73.600953,40.624801],[-73.60106,40.624906],[-73.601161,40.625025],[-73.60123,40.62518],[-73.601471,40.625807],[-73.601524,40.626038],[-73.601527,40.626181],[-73.60150400000001,40.626356],[-73.601451,40.626573],[-73.601434,40.626658],[-73.601421,40.626888],[-73.601466,40.627111],[-73.601563,40.627335],[-73.602014,40.628037],[-73.60235900000001,40.628573],[-73.60242599999999,40.628681],[-73.602842,40.629349],[-73.60290500000001,40.629442],[-73.60294399999999,40.629497],[-73.603236,40.629957],[-73.60355800000001,40.630455],[-73.603638,40.630593],[-73.603722,40.630713],[-73.603911,40.631032],[-73.604032,40.63128]]],"type":"Polygon"}
}