{
  "id": "361190146072",
  "type": "Feature",
  "properties": {
    "area_land":3709923,
    "area_water":33651,
    "geoid":"361190146072",
    "name":"Block Group 2",
    "state":"ny"
},
  "bbox": [
    -73.894754,
    41.267893,
    -73.865138,
    41.293378
],
  "geometry": {"coordinates":[[[-73.89475400000001,41.274951],[-73.88852199999999,41.279926],[-73.88850100000001,41.279944],[-73.888233,41.280173],[-73.88692899999999,41.281508],[-73.88499899999999,41.283323],[-73.88316,41.284624],[-73.88283,41.285013],[-73.881998,41.28697],[-73.881955,41.287039],[-73.881647,41.287196],[-73.881623,41.287224],[-73.881603,41.28728],[-73.881621,41.287523],[-73.881761,41.288236],[-73.88098599999999,41.288293],[-73.879965,41.288403],[-73.87971899999999,41.288422],[-73.879525,41.288427],[-73.879293,41.288969],[-73.878654,41.29018],[-73.878457,41.29061],[-73.878074,41.291519],[-73.877995,41.291764],[-73.87791900000001,41.291955],[-73.877878,41.292122],[-73.877861,41.292338],[-73.87866200000001,41.292354],[-73.87855500000001,41.292731],[-73.878539,41.292789],[-73.87852599999999,41.292835],[-73.87796899999999,41.292656],[-73.87791300000001,41.292639],[-73.877683,41.292618],[-73.877365,41.292618],[-73.875922,41.292693],[-73.875001,41.292923],[-73.874043,41.293129],[-73.872585,41.293378],[-73.872281,41.293371],[-73.87205899999999,41.293336],[-73.87201,41.293319],[-73.87188999999999,41.293278],[-73.871574,41.29317],[-73.871341,41.293187],[-73.87110300000001,41.293188],[-73.871077,41.293188],[-73.871043,41.293186],[-73.87043799999999,41.293153],[-73.869772,41.293098],[-73.868144,41.292936],[-73.868171,41.292397],[-73.868212,41.291938],[-73.868236,41.291757],[-73.86824900000001,41.291658],[-73.868258,41.291588],[-73.868275,41.291463],[-73.868309,41.29131],[-73.86837300000001,41.291033],[-73.86847,41.290741],[-73.868595,41.290434],[-73.8687,41.29029],[-73.86895199999999,41.290028],[-73.869077,41.289882],[-73.869182,41.289736],[-73.869204,41.289689],[-73.869276,41.289534],[-73.86933500000001,41.289381],[-73.86939700000001,41.289172],[-73.86950899999999,41.288581],[-73.869544,41.288234],[-73.86955500000001,41.288039],[-73.869574,41.287713],[-73.869578,41.287605],[-73.86959299999999,41.287153],[-73.86959299999999,41.286942],[-73.86957200000001,41.286594],[-73.86953,41.286208],[-73.869315,41.284938],[-73.869238,41.284482],[-73.868953,41.283187],[-73.86884000000001,41.282709],[-73.86880600000001,41.282532],[-73.868799,41.282493],[-73.868757,41.28186],[-73.868701,41.281532],[-73.868604,41.28131],[-73.868422,41.280997],[-73.86824799999999,41.280732],[-73.868133,41.280544],[-73.867216,41.279042],[-73.867118,41.278896],[-73.86690900000001,41.278652],[-73.866749,41.278485],[-73.866533,41.278311],[-73.86617099999999,41.278068],[-73.86558599999999,41.277741],[-73.86551,41.277685],[-73.865461,41.277615],[-73.86534899999999,41.277413],[-73.865202,41.27716],[-73.865139,41.276972],[-73.865138,41.276826],[-73.865313,41.276499],[-73.865459,41.276255],[-73.865599,41.275977],[-73.865781,41.275653],[-73.866039,41.275326],[-73.86617099999999,41.275201],[-73.866359,41.275083],[-73.86726400000001,41.274658],[-73.868875,41.273869],[-73.869551,41.273619],[-73.86968299999999,41.273546],[-73.869823,41.273451],[-73.869962,41.27302],[-73.87000399999999,41.272881],[-73.870087,41.272749],[-73.870363,41.272571],[-73.870386,41.272563],[-73.87042700000001,41.272549],[-73.87047699999999,41.272533],[-73.871048,41.272435],[-73.871222,41.27238],[-73.871376,41.272303],[-73.87171499999999,41.272084],[-73.87245799999999,41.271632],[-73.873239,41.27101],[-73.87342,41.270808],[-73.873789,41.270203],[-73.873859,41.270064],[-73.873897,41.269938],[-73.87395600000001,41.269716],[-73.87397,41.269556],[-73.873964,41.2694],[-73.873896,41.269088],[-73.873859,41.268949],[-73.873789,41.26869],[-73.87375400000001,41.268453],[-73.87375400000001,41.268154],[-73.87378200000001,41.26798],[-73.873807,41.267893],[-73.87387200000001,41.267943],[-73.874241,41.268138],[-73.874735,41.268362],[-73.87486800000001,41.268423],[-73.87611200000001,41.268931],[-73.877324,41.269465],[-73.878202,41.26986],[-73.87916199999999,41.270302],[-73.87987099999999,41.270591],[-73.880073,41.27065],[-73.880911,41.270835],[-73.881451,41.270969],[-73.881922,41.271032],[-73.882294,41.271064],[-73.882653,41.271069],[-73.88298899999999,41.270995],[-73.88314,41.270947],[-73.88348000000001,41.270794],[-73.883979,41.270598],[-73.88422300000001,41.270514],[-73.88458300000001,41.270459],[-73.88479599999999,41.270441],[-73.884987,41.270441],[-73.885339,41.270481],[-73.885406,41.270501],[-73.885655,41.27058],[-73.88583199999999,41.270665],[-73.886078,41.270804],[-73.886448,41.270978],[-73.88678299999999,41.271105],[-73.887095,41.271186],[-73.8874,41.271237],[-73.88797099999999,41.271313],[-73.888096,41.271331],[-73.888696,41.27138],[-73.88984600000001,41.271532],[-73.891092,41.271738],[-73.891356,41.271809],[-73.89174,41.271932],[-73.892139,41.272037],[-73.89242900000001,41.272125],[-73.892612,41.272206],[-73.892858,41.272327],[-73.89295799999999,41.272393],[-73.89305299999999,41.272477],[-73.893604,41.273182],[-73.89421400000001,41.274114],[-73.894364,41.27436],[-73.89475400000001,41.274951]]],"type":"Polygon"}
}