{
  "id": "360593009004",
  "type": "Feature",
  "properties": {
    "area_land":2318277,
    "area_water":0,
    "geoid":"360593009004",
    "name":"Block Group 4",
    "state":"ny"
},
  "bbox": [
    -73.695713,
    40.762193,
    -73.656545,
    40.780697
],
  "geometry": {"coordinates":[[[-73.695713,40.767167],[-73.695243,40.767244],[-73.695071,40.767275],[-73.69453799999999,40.767384],[-73.693877,40.767558],[-73.69363800000001,40.767632],[-73.69335700000001,40.767731],[-73.692851,40.767929],[-73.692458,40.768109],[-73.692094,40.768301],[-73.691638,40.768568],[-73.690544,40.769215],[-73.690381,40.769314],[-73.68977,40.769657],[-73.689475,40.769843],[-73.689307,40.769929],[-73.68919,40.77],[-73.688002,40.770676],[-73.687084,40.771214],[-73.68647199999999,40.77155],[-73.6859,40.771809],[-73.68553,40.771947],[-73.684862,40.772155],[-73.68449,40.772242],[-73.68402399999999,40.772333],[-73.683618,40.772381],[-73.683021,40.77246],[-73.675791,40.773381],[-73.675248,40.773456],[-73.673911,40.773639],[-73.672731,40.773812],[-73.67220399999999,40.773908],[-73.671193,40.774164],[-73.670907,40.77426],[-73.670434,40.774431],[-73.669845,40.774679],[-73.66944700000001,40.774883],[-73.669141,40.77504],[-73.66873099999999,40.775284],[-73.668555,40.775406],[-73.668256,40.775624],[-73.66769499999999,40.776093],[-73.66607500000001,40.777679],[-73.665232,40.778318],[-73.664655,40.778645],[-73.663994,40.778944],[-73.663539,40.779109],[-73.662987,40.779275],[-73.66232100000001,40.779419],[-73.662019,40.779477],[-73.66162300000001,40.779554],[-73.661083,40.779656],[-73.65936499999999,40.779982],[-73.658903,40.780087],[-73.658626,40.780166],[-73.65840799999999,40.780235],[-73.658271,40.780284],[-73.65786199999999,40.780431],[-73.65746300000001,40.780609],[-73.65730499999999,40.780697],[-73.657309,40.780534],[-73.657315,40.780258],[-73.657312,40.779816],[-73.65731100000001,40.779655],[-73.656784,40.778922],[-73.656609,40.778819],[-73.65657899999999,40.778338],[-73.65654499999999,40.777789],[-73.657337,40.777682],[-73.657572,40.777658],[-73.65819500000001,40.77754],[-73.658984,40.777384],[-73.65920699999999,40.777338],[-73.659237,40.777427],[-73.65946,40.77773],[-73.65963600000001,40.777911],[-73.65979799999999,40.778052],[-73.659902,40.778151],[-73.660205,40.778401],[-73.661012,40.778303],[-73.66113900000001,40.778399],[-73.661283,40.77846],[-73.661413,40.77849],[-73.661503,40.778496],[-73.661619,40.778485],[-73.66213500000001,40.778377],[-73.662519,40.778271],[-73.66282200000001,40.778173],[-73.663264,40.77801],[-73.66374500000001,40.777794],[-73.664056,40.77763],[-73.66443,40.777407],[-73.664783,40.777172],[-73.664659,40.777061],[-73.665308,40.776645],[-73.665702,40.776393],[-73.66616,40.77569],[-73.66678400000001,40.775653],[-73.66661499999999,40.774783],[-73.667072,40.773209],[-73.66728000000001,40.77293],[-73.667008,40.772709],[-73.667232,40.772409],[-73.66721800000001,40.772076],[-73.667642,40.77203],[-73.667631,40.771745],[-73.667964,40.771538],[-73.667732,40.771103],[-73.667616,40.770038],[-73.66690199999999,40.769286],[-73.666664,40.768995],[-73.66655,40.768984],[-73.666456,40.76898],[-73.666386,40.768949],[-73.666308,40.768909],[-73.66605,40.768778],[-73.665519,40.76844],[-73.66686799999999,40.767736],[-73.667081,40.7677],[-73.667315,40.767638],[-73.667473,40.767615],[-73.667827,40.767563],[-73.66803899999999,40.767519],[-73.668909,40.767414],[-73.670033,40.767278],[-73.67037999999999,40.767227],[-73.670579,40.767215],[-73.670807,40.76632],[-73.67083700000001,40.766034],[-73.670824,40.765727],[-73.670743,40.765342],[-73.670376,40.764298],[-73.67020100000001,40.763902],[-73.670148,40.763804],[-73.670073,40.763696],[-73.66997600000001,40.763559],[-73.66968799999999,40.763264],[-73.66852900000001,40.762272],[-73.66871500000001,40.762193],[-73.668724,40.762244],[-73.669742,40.76314],[-73.66997000000001,40.763034],[-73.67036899999999,40.762879],[-73.670834,40.762708],[-73.671111,40.762635],[-73.671363,40.762594],[-73.671656,40.76257],[-73.67264900000001,40.762609],[-73.675451,40.762807],[-73.682265,40.763306],[-73.68396199999999,40.762807],[-73.684943,40.762959],[-73.68537000000001,40.763143],[-73.68699599999999,40.763438],[-73.689618,40.764005],[-73.689851,40.763997],[-73.69188200000001,40.764054],[-73.69218100000001,40.764064],[-73.693781,40.764116],[-73.69237699999999,40.766158],[-73.692645,40.76616],[-73.69299100000001,40.766145],[-73.693338,40.766143],[-73.69345300000001,40.766154],[-73.69359799999999,40.766185],[-73.693792,40.766259],[-73.693879,40.766315],[-73.69408,40.76648],[-73.694328,40.766666],[-73.69454,40.766912],[-73.69492099999999,40.766843],[-73.69520300000001,40.76681],[-73.695317,40.766794],[-73.695713,40.767167]]],"type":"Polygon"}
}