{
  "id": "360870134021",
  "type": "Feature",
  "properties": {
    "area_land":6908956,
    "area_water":5216809,
    "geoid":"360870134021",
    "name":"Block Group 1",
    "state":"ny"
},
  "bbox": [
    -73.928875,
    40.997205,
    -73.88938,
    41.045196
],
  "geometry": {"coordinates":[[[-73.928839,41.018151],[-73.92881800000001,41.018358],[-73.92877300000001,41.018866],[-73.928712,41.019512],[-73.928679,41.019847],[-73.928628,41.020813],[-73.928579,41.021267],[-73.92856,41.021641],[-73.92854,41.021813],[-73.928493,41.022071],[-73.928399,41.02237],[-73.92834999999999,41.0225],[-73.92822200000001,41.022771],[-73.92791699999999,41.023322],[-73.92773,41.023662],[-73.927661,41.023807],[-73.927196,41.024666],[-73.927144,41.0248],[-73.926663,41.025694],[-73.926361,41.02634],[-73.925625,41.027592],[-73.92523300000001,41.028108],[-73.925157,41.028242],[-73.925128,41.028339],[-73.925121,41.028431],[-73.925128,41.028495],[-73.92515,41.028555],[-73.925454,41.028992],[-73.92497,41.029687],[-73.92478199999999,41.029938],[-73.92349299999999,41.031691],[-73.92294800000001,41.032312],[-73.92284100000001,41.03241],[-73.922442,41.032677],[-73.91811300000001,41.034178],[-73.918042,41.034202],[-73.917691,41.034324],[-73.917186,41.0345],[-73.916589,41.035033],[-73.91656999999999,41.035051],[-73.91653100000001,41.035085],[-73.915424,41.036077],[-73.915476,41.036153],[-73.91504,41.036448],[-73.915162,41.036516],[-73.91575400000001,41.036847],[-73.915541,41.037068],[-73.915373,41.037105],[-73.914147,41.037378],[-73.91383,41.037451],[-73.91168,41.037948],[-73.91157,41.037966],[-73.911168,41.038032],[-73.911012,41.038059],[-73.91100299999999,41.038081],[-73.908311,41.038358],[-73.907893,41.038402],[-73.90786900000001,41.038502],[-73.907813,41.038581],[-73.907742,41.038644],[-73.90761500000001,41.038676],[-73.907464,41.038748],[-73.90635899999999,41.039025],[-73.90098,41.040797],[-73.896359,41.042697],[-73.89028,41.045196],[-73.88938,41.037597],[-73.88947899999999,41.034097],[-73.889915,41.025749],[-73.890079,41.022597],[-73.893579,41.005297],[-73.893979,40.997205],[-73.902455,40.997304],[-73.902449,40.997322],[-73.902512,40.997323],[-73.902682,40.997326],[-73.902715,40.997327],[-73.904989,40.998344],[-73.906716,40.999116],[-73.911345,41.001188],[-73.911661,41.001335],[-73.911731,41.001364],[-73.911861,41.001422],[-73.918492,41.004404],[-73.919881,41.00503],[-73.920238,41.005191],[-73.92027,41.005231],[-73.920377,41.005363],[-73.92061200000001,41.005688],[-73.92078100000001,41.005938],[-73.92157,41.007198],[-73.921696,41.007407],[-73.922167,41.008225],[-73.92262599999999,41.009168],[-73.923924,41.012001],[-73.924026,41.01219],[-73.924491,41.013051],[-73.925032,41.013871],[-73.925263,41.014189],[-73.925817,41.014912],[-73.92653199999999,41.015697],[-73.92687599999999,41.016033],[-73.92729300000001,41.016438],[-73.927469,41.016597],[-73.927666,41.016772],[-73.928387,41.017353],[-73.92887500000001,41.017739],[-73.928839,41.018151]]],"type":"Polygon"}
}