{
  "id": "360610193001",
  "type": "Feature",
  "properties": {
    "area_land":21273,
    "area_water":0,
    "geoid":"360610193001",
    "name":"Block Group 1",
    "state":"ny"
},
  "bbox": [
    -73.960527,
    40.799352,
    -73.958195,
    40.801156
],
  "geometry": {"coordinates":[[[-73.960065,40.800586],[-73.959647,40.801156],[-73.95903199999999,40.800899],[-73.958558,40.800701],[-73.958502,40.800678],[-73.958195,40.800553],[-73.958354,40.800337],[-73.958619,40.799977],[-73.95907699999999,40.799352],[-73.960527,40.799958],[-73.960065,40.800586]]],"type":"Polygon"}
}