{
  "id": "360070003001",
  "type": "Feature",
  "properties": {
    "area_land":2655391,
    "area_water":14182,
    "geoid":"360070003001",
    "name":"Block Group 1",
    "state":"ny"
},
  "bbox": [
    -75.941365,
    42.111129,
    -75.906029,
    42.131775
],
  "geometry": {"coordinates":[[[-75.941365,42.116075],[-75.940923,42.116056],[-75.938744,42.116202],[-75.93848300000001,42.116224],[-75.937984,42.116251],[-75.93715,42.116296],[-75.935964,42.116361],[-75.93544199999999,42.116389],[-75.933398,42.1165],[-75.921145,42.116882],[-75.921086,42.117095],[-75.921064,42.11724],[-75.921048,42.117759],[-75.92104,42.118035],[-75.921008,42.118086],[-75.92098900000001,42.118099],[-75.92313300000001,42.117977],[-75.923174,42.118456],[-75.924785,42.118373],[-75.924758,42.118751],[-75.93195,42.118425],[-75.93208,42.119346],[-75.932276,42.120722],[-75.932287,42.120794],[-75.928776,42.121121],[-75.929219,42.124381],[-75.929659,42.128766],[-75.9297,42.131084],[-75.929706,42.131219],[-75.929716,42.131406],[-75.925641,42.131775],[-75.92544100000001,42.128875],[-75.92243499999999,42.128771],[-75.922055,42.128797],[-75.921638,42.127413],[-75.92163499999999,42.127303],[-75.920592,42.127678],[-75.92052099999999,42.127405],[-75.919732,42.127816],[-75.915948,42.124857],[-75.916839,42.124374],[-75.916043,42.123778],[-75.91734,42.123676],[-75.91504,42.121676],[-75.914141,42.121673],[-75.91344100000001,42.120176],[-75.913341,42.118775],[-75.915937,42.118573],[-75.915537,42.117875],[-75.91043999999999,42.118148],[-75.909654,42.118212],[-75.90924200000001,42.118241],[-75.906879,42.118374],[-75.906199,42.118381],[-75.906279,42.118245],[-75.90645499999999,42.118059],[-75.906643,42.117753],[-75.90668700000001,42.117677],[-75.906751,42.117567],[-75.906857,42.117346],[-75.90744100000001,42.116187],[-75.907481,42.116096],[-75.907501,42.116053],[-75.907145,42.115915],[-75.90684400000001,42.115825],[-75.906418,42.115725],[-75.906029,42.115631],[-75.906417,42.11491],[-75.906998,42.114882],[-75.907282,42.11486],[-75.907735,42.114788],[-75.908019,42.11472],[-75.908385,42.1146],[-75.908477,42.114566],[-75.908699,42.114467],[-75.90886500000001,42.114112],[-75.909391,42.113231],[-75.90971399999999,42.112708],[-75.910184,42.111939],[-75.91052999999999,42.111332],[-75.910766,42.111413],[-75.910967,42.111442],[-75.911287,42.111431],[-75.912128,42.111278],[-75.912638,42.111194],[-75.912986,42.111158],[-75.9135,42.111132],[-75.913701,42.111129],[-75.91399,42.111138],[-75.91452700000001,42.111198],[-75.914705,42.11122],[-75.91562399999999,42.111396],[-75.91621600000001,42.111513],[-75.917286,42.111722],[-75.91942400000001,42.112123],[-75.920965,42.112408],[-75.921783,42.112564],[-75.922006,42.112606],[-75.922517,42.112668],[-75.923259,42.112749],[-75.925358,42.112978],[-75.927464,42.113227],[-75.932996,42.113937],[-75.933864,42.114048],[-75.934878,42.114176],[-75.935233,42.114228],[-75.935507,42.114304],[-75.93616299999999,42.114508],[-75.93863899999999,42.115314],[-75.938828,42.115376],[-75.93932700000001,42.115508],[-75.940258,42.115739],[-75.94095900000001,42.11593],[-75.941365,42.116075]]],"type":"Polygon"}
}