{
  "id": "360610146011",
  "type": "Feature",
  "properties": {
    "area_land":18743,
    "area_water":0,
    "geoid":"360610146011",
    "name":"Block Group 1",
    "state":"ny"
},
  "bbox": [
    -73.954482,
    40.777194,
    -73.951743,
    40.778822
],
  "geometry": {"coordinates":[[[-73.95398400000001,40.778822],[-73.95174299999999,40.777875],[-73.95224,40.777194],[-73.954482,40.778139],[-73.95398400000001,40.778822]]],"type":"Polygon"}
}