{
  "id": "360870125012",
  "type": "Feature",
  "properties": {
    "area_land":1889346,
    "area_water":0,
    "geoid":"360870125012",
    "name":"Block Group 2",
    "state":"ny"
},
  "bbox": [
    -74.077922,
    41.079504,
    -74.060546,
    41.101763
],
  "geometry": {"coordinates":[[[-74.077888,41.087082],[-74.07776800000001,41.087276],[-74.077708,41.087425],[-74.077072,41.089197],[-74.076989,41.08942],[-74.076848,41.089736],[-74.076582,41.090185],[-74.076168,41.090824],[-74.07603899999999,41.091006],[-74.075833,41.09126],[-74.075656,41.091447],[-74.07543099999999,41.091647],[-74.07513400000001,41.091898],[-74.074423,41.092675],[-74.07427,41.092866],[-74.07417599999999,41.093024],[-74.074145,41.093127],[-74.074018,41.093703],[-74.073992,41.093848],[-74.073972,41.093962],[-74.07388400000001,41.09426],[-74.07364,41.094923],[-74.073534,41.095175],[-74.07339399999999,41.095387],[-74.07327100000001,41.095528],[-74.07295000000001,41.095838],[-74.072518,41.096228],[-74.07229100000001,41.096415],[-74.07193700000001,41.096671],[-74.071044,41.097282],[-74.07079,41.097483],[-74.070739,41.097533],[-74.070077,41.098197],[-74.069238,41.099092],[-74.069084,41.099259],[-74.069022,41.099348],[-74.068966,41.099446],[-74.068949,41.099526],[-74.068927,41.099679],[-74.06896399999999,41.100066],[-74.069091,41.100696],[-74.069181,41.101194],[-74.069191,41.101251],[-74.069239,41.101503],[-74.06928499999999,41.101763],[-74.06917300000001,41.101749],[-74.068639,41.101663],[-74.068545,41.101648],[-74.06788400000001,41.101434],[-74.067547,41.101336],[-74.066874,41.101141],[-74.06675300000001,41.101103],[-74.066498,41.101019],[-74.06567,41.100747],[-74.065264,41.100613],[-74.065037,41.100539],[-74.064871,41.100524],[-74.06448,41.100489],[-74.06320599999999,41.100213],[-74.06310999999999,41.100192],[-74.062755,41.100115],[-74.061029,41.099675],[-74.060816,41.099626],[-74.060964,41.099344],[-74.061035,41.099142],[-74.061314,41.098178],[-74.06170299999999,41.096976],[-74.06181100000001,41.096658],[-74.061879,41.09644],[-74.06192,41.096355],[-74.061971,41.096284],[-74.062048,41.096203],[-74.06233,41.095991],[-74.062535,41.095886],[-74.062834,41.095751],[-74.063979,41.095315],[-74.064151,41.095257],[-74.064436,41.095139],[-74.064565,41.095053],[-74.06467600000001,41.094924],[-74.064785,41.094727],[-74.065084,41.094122],[-74.065118,41.094018],[-74.065145,41.0938],[-74.065106,41.092827],[-74.06506299999999,41.092707],[-74.06501900000001,41.092634],[-74.06490100000001,41.09247],[-74.06479400000001,41.092238],[-74.06474300000001,41.092055],[-74.064711,41.091833],[-74.064724,41.091389],[-74.064813,41.090456],[-74.064851,41.090148],[-74.064914,41.089755],[-74.06491699999999,41.089444],[-74.064903,41.089161],[-74.064874,41.088474],[-74.064836,41.088166],[-74.064806,41.088026],[-74.064774,41.087937],[-74.064635,41.087677],[-74.064578,41.087541],[-74.06453399999999,41.087339],[-74.06451,41.087053],[-74.064499,41.086522],[-74.06450100000001,41.086075],[-74.064457,41.085852],[-74.064325,41.085489],[-74.064064,41.084893],[-74.063937,41.084699],[-74.063759,41.084497],[-74.063698,41.084428],[-74.06368999999999,41.084418],[-74.063464,41.084222],[-74.06305399999999,41.083919],[-74.06282899999999,41.083722],[-74.062653,41.08354],[-74.062456,41.083338],[-74.062088,41.082934],[-74.061808,41.082679],[-74.061639,41.08256],[-74.060773,41.082015],[-74.060546,41.081843],[-74.06088200000001,41.081542],[-74.06112899999999,41.081284],[-74.06132700000001,41.08104],[-74.06147300000001,41.080836],[-74.061666,41.080524],[-74.062136,41.079504],[-74.062911,41.079801],[-74.062989,41.079844],[-74.063085,41.079933],[-74.06329700000001,41.080277],[-74.0641,41.081648],[-74.064183,41.081735],[-74.06429900000001,41.081804],[-74.064368,41.081814],[-74.06447900000001,41.081803],[-74.06453500000001,41.081781],[-74.065842,41.081095],[-74.065923,41.08118],[-74.06600299999999,41.08125],[-74.06611599999999,41.081319],[-74.066293,41.081365],[-74.06649,41.081381],[-74.066801,41.081394],[-74.068611,41.081417],[-74.069103,41.081411],[-74.069265,41.081426],[-74.069397,41.081471],[-74.06932,41.081936],[-74.06925099999999,41.082577],[-74.070098,41.0827],[-74.070279,41.082711],[-74.07191899999999,41.082731],[-74.074488,41.082621],[-74.075006,41.082798],[-74.075104,41.084889],[-74.07511599999999,41.085708],[-74.075163,41.086488],[-74.075159,41.086611],[-74.075309,41.086647],[-74.07552,41.086688],[-74.075784,41.086697],[-74.076217,41.086686],[-74.076588,41.086704],[-74.077015,41.08677],[-74.07722200000001,41.086812],[-74.077507,41.086842],[-74.07773299999999,41.086897],[-74.07778500000001,41.086927],[-74.077922,41.087041],[-74.077888,41.087082]]],"type":"Polygon"}
}