{
  "id": "360650225001",
  "type": "Feature",
  "properties": {
    "area_land":1601706,
    "area_water":117599,
    "geoid":"360650225001",
    "name":"Block Group 1",
    "state":"ny"
},
  "bbox": [
    -75.455219,
    43.200295,
    -75.428148,
    43.210564
],
  "geometry": {"coordinates":[[[-75.455215,43.206446],[-75.455179,43.20657],[-75.45507600000001,43.206709],[-75.454971,43.206803],[-75.45478799999999,43.206913],[-75.454581,43.207007],[-75.454144,43.207186],[-75.45395600000001,43.207276],[-75.453557,43.207467],[-75.45325,43.20765],[-75.45314,43.207712],[-75.452437,43.208115],[-75.452264,43.208229],[-75.452174,43.208286],[-75.451949,43.208524],[-75.45186,43.208625],[-75.451729,43.208683],[-75.451215,43.208796],[-75.451002,43.208833],[-75.450898,43.208862],[-75.450778,43.208916],[-75.450588,43.209087],[-75.450337,43.209386],[-75.450045,43.20939],[-75.44991899999999,43.209388],[-75.44984599999999,43.209387],[-75.449546,43.209383],[-75.449072,43.209361],[-75.448696,43.209364],[-75.44843,43.209379],[-75.44808399999999,43.209423],[-75.44746000000001,43.209539],[-75.447125,43.209623],[-75.446749,43.209747],[-75.446046,43.209958],[-75.445294,43.210082],[-75.445054,43.210097],[-75.444817,43.210097],[-75.444576,43.210086],[-75.444372,43.210067],[-75.444175,43.210024],[-75.44371599999999,43.209893],[-75.44346299999999,43.209796],[-75.44314,43.209674],[-75.442633,43.209568],[-75.442352,43.209528],[-75.44211900000001,43.209521],[-75.441532,43.20955],[-75.44104299999999,43.209627],[-75.44081,43.209678],[-75.44054,43.209769],[-75.44020500000001,43.209933],[-75.44014199999999,43.209975],[-75.439797,43.209902],[-75.43916400000001,43.209511],[-75.43903299999999,43.209456],[-75.43884300000001,43.209445],[-75.43859500000001,43.209529],[-75.438377,43.209642],[-75.43823399999999,43.209733],[-75.437952,43.209938],[-75.437894,43.20991],[-75.43781,43.209891],[-75.43767,43.209901],[-75.4376,43.209937],[-75.43688400000001,43.210564],[-75.436745,43.210508],[-75.436522,43.210372],[-75.435044,43.209393],[-75.434507,43.20905],[-75.433606,43.208475],[-75.433093,43.208129],[-75.432022,43.207437],[-75.433179,43.206506],[-75.433487,43.206274],[-75.433657,43.206173],[-75.433787,43.206094],[-75.43504799999999,43.205086],[-75.43530199999999,43.204869],[-75.43536899999999,43.204767],[-75.43548199999999,43.204402],[-75.43477,43.204413],[-75.43421600000001,43.204422],[-75.43356,43.204434],[-75.431635,43.204478],[-75.43134000000001,43.204487],[-75.431378,43.202902],[-75.43136800000001,43.202675],[-75.431309,43.202507],[-75.431245,43.2024],[-75.431059,43.202224],[-75.430868,43.202105],[-75.43072100000001,43.202047],[-75.43035,43.201945],[-75.42922799999999,43.201664],[-75.428815,43.201581],[-75.42868300000001,43.201557],[-75.42814799999999,43.201486],[-75.428201,43.201394],[-75.428343,43.201123],[-75.42844700000001,43.200894],[-75.42858699999999,43.200562],[-75.428685,43.200295],[-75.42923399999999,43.200321],[-75.432733,43.200485],[-75.44097499999999,43.2006],[-75.44551,43.200788],[-75.448305,43.20096],[-75.452901,43.201095],[-75.45335,43.202355],[-75.453379,43.202391],[-75.45383099999999,43.202953],[-75.453999,43.203189],[-75.45406800000001,43.203342],[-75.454123,43.203579],[-75.454134,43.203914],[-75.454116,43.204424],[-75.45407899999999,43.204934],[-75.454087,43.205098],[-75.45411199999999,43.205233],[-75.45417,43.205342],[-75.454273,43.205463],[-75.454382,43.205568],[-75.454748,43.205721],[-75.45486099999999,43.205776],[-75.454956,43.205834],[-75.45504699999999,43.205944],[-75.45511999999999,43.20606],[-75.455179,43.206188],[-75.455219,43.206312],[-75.455215,43.206446]]],"type":"Polygon"}
}