{
  "id": "360811571022",
  "type": "Feature",
  "properties": {
    "area_land":195022,
    "area_water":0,
    "geoid":"360811571022",
    "name":"Block Group 2",
    "state":"ny"
},
  "bbox": [
    -73.72751,
    40.733455,
    -73.722675,
    40.740823
],
  "geometry": {"coordinates":[[[-73.72712900000001,40.740708],[-73.72672900000001,40.740785],[-73.726569,40.740823],[-73.726091,40.740529],[-73.725874,40.740396],[-73.725758,40.74031],[-73.72545599999999,40.740051],[-73.72515,40.739788],[-73.725116,40.739759],[-73.72489,40.739566],[-73.72482599999999,40.739487],[-73.72459499999999,40.739234],[-73.72438200000001,40.738971],[-73.72423999999999,40.738764],[-73.724188,40.7387],[-73.72389800000001,40.738296],[-73.723865,40.738135],[-73.72325600000001,40.736701],[-73.723128,40.736416],[-73.72305900000001,40.736253],[-73.72297399999999,40.736001],[-73.722954,40.735941],[-73.722852,40.7356],[-73.722764,40.735182],[-73.72269799999999,40.734775],[-73.722691,40.734556],[-73.722675,40.734247],[-73.722825,40.734215],[-73.723264,40.734122],[-73.72365000000001,40.734032],[-73.72404400000001,40.73394],[-73.724555,40.733845],[-73.725246,40.733696],[-73.725464,40.73365],[-73.726105,40.73351],[-73.726366,40.733455],[-73.72686,40.735069],[-73.726923,40.73527],[-73.727014,40.735582],[-73.726112,40.736382],[-73.726529,40.73757],[-73.72751,40.740688],[-73.72712900000001,40.740708]]],"type":"Polygon"}
}