{
  "id": "360050195003",
  "type": "Feature",
  "properties": {
    "area_land":21237,
    "area_water":0,
    "geoid":"360050195003",
    "name":"Block Group 3",
    "state":"ny"
},
  "bbox": [
    -73.922516,
    40.831337,
    -73.920365,
    40.833833
],
  "geometry": {"coordinates":[[[-73.922516,40.831633],[-73.921223,40.833833],[-73.920365,40.833543],[-73.92106200000001,40.832355],[-73.921661,40.831337],[-73.922516,40.831633]]],"type":"Polygon"}
}