{
  "id": "360594051003",
  "type": "Feature",
  "properties": {
    "area_land":338849,
    "area_water":0,
    "geoid":"360594051003",
    "name":"Block Group 3",
    "state":"ny"
},
  "bbox": [
    -73.700833,
    40.686195,
    -73.69091,
    40.693325
],
  "geometry": {"coordinates":[[[-73.700833,40.693138],[-73.70078100000001,40.693207],[-73.70068000000001,40.693305],[-73.700664,40.693325],[-73.700074,40.693101],[-73.6987,40.692456],[-73.69797199999999,40.692117],[-73.697785,40.692034],[-73.697672,40.692274],[-73.697598,40.692431],[-73.697523,40.692591],[-73.697418,40.692734],[-73.697311,40.692902],[-73.697275,40.693043],[-73.69717,40.693093],[-73.69666599999999,40.69325],[-73.696181,40.693283],[-73.695905,40.693261],[-73.695275,40.693202],[-73.69544999999999,40.692448],[-73.69502,40.692274],[-73.69417199999999,40.69192],[-73.693967,40.691833],[-73.693608,40.691682],[-73.693327,40.691568],[-73.69247,40.691211],[-73.691931,40.690985],[-73.691706,40.690881],[-73.69165599999999,40.690857],[-73.69149899999999,40.690816],[-73.690952,40.690689],[-73.69091,40.690318],[-73.690932,40.69023],[-73.69098,40.69012],[-73.69119499999999,40.68959],[-73.69141,40.689068],[-73.69162300000001,40.688541],[-73.691738,40.688242],[-73.691835,40.687936],[-73.69194400000001,40.687594],[-73.692024,40.687347],[-73.692211,40.686763],[-73.69239899999999,40.686195],[-73.69305199999999,40.686385],[-73.69336199999999,40.686473],[-73.693851,40.686611],[-73.694215,40.686714],[-73.694417,40.686767],[-73.694633,40.686812],[-73.694878,40.686848],[-73.695109,40.68687],[-73.69546699999999,40.686873],[-73.695606,40.686877],[-73.69588,40.686856],[-73.69624,40.686799],[-73.696641,40.686709],[-73.698061,40.686326],[-73.698239,40.686289],[-73.69828699999999,40.686412],[-73.698294,40.686445],[-73.69828699999999,40.686503],[-73.697886,40.687358],[-73.697559,40.688052],[-73.697472,40.688218],[-73.697306,40.688598],[-73.69729599999999,40.68866],[-73.69724600000001,40.688721],[-73.696958,40.68939],[-73.69668900000001,40.68998],[-73.69684599999999,40.690032],[-73.69711100000001,40.69012],[-73.698108,40.69044],[-73.69911399999999,40.690741],[-73.698915,40.691105],[-73.69883900000001,40.691222],[-73.69864699999999,40.691444],[-73.69852,40.691628],[-73.698465,40.691727],[-73.698454,40.691792],[-73.698483,40.691858],[-73.698533,40.691911],[-73.699191,40.69222],[-73.699966,40.692575],[-73.700289,40.692728],[-73.70040400000001,40.692766],[-73.700541,40.692835],[-73.70063399999999,40.69291],[-73.700738,40.693031],[-73.700782,40.693067],[-73.700833,40.693138]]],"type":"Polygon"}
}