{
  "id": "361119501004",
  "type": "Feature",
  "properties": {
    "area_land":8141107,
    "area_water":66825,
    "geoid":"361119501004",
    "name":"Block Group 4",
    "state":"ny"
},
  "bbox": [
    -74.031459,
    42.103755,
    -73.98643,
    42.144692
],
  "geometry": {"coordinates":[[[-74.03126,42.107586],[-74.03109000000001,42.107963],[-74.030896,42.108354],[-74.030734,42.108604],[-74.03065700000001,42.108715],[-74.030361,42.109023],[-74.03007599999999,42.109269],[-74.029926,42.109373],[-74.02871500000001,42.110052],[-74.028368,42.11024],[-74.028153,42.110383],[-74.028026,42.110502],[-74.02793699999999,42.110613],[-74.027647,42.111111],[-74.02742499999999,42.11161],[-74.02736,42.111798],[-74.0271,42.112431],[-74.026976,42.112699],[-74.02695,42.112754],[-74.026782,42.11324],[-74.02676099999999,42.113318],[-74.02660899999999,42.113917],[-74.026546,42.114242],[-74.026411,42.114642],[-74.02628300000001,42.114973],[-74.026276,42.11499],[-74.025851,42.116048],[-74.025391,42.116954],[-74.025233,42.117285],[-74.024838,42.118221],[-74.024698,42.118611],[-74.02464000000001,42.1189],[-74.024573,42.119302],[-74.024492,42.11951],[-74.023993,42.120161],[-74.023859,42.120319],[-74.023635,42.120535],[-74.023551,42.1206],[-74.023439,42.120654],[-74.02331599999999,42.1207],[-74.0231,42.120761],[-74.022723,42.120842],[-74.02251699999999,42.120871],[-74.022402,42.120879],[-74.022313,42.120867],[-74.022201,42.12084],[-74.02208299999999,42.121078],[-74.021641,42.121867],[-74.021389,42.122365],[-74.021304,42.122619],[-74.021298,42.122666],[-74.02125599999999,42.122987],[-74.021248,42.123301],[-74.021315,42.1243],[-74.021356,42.125264],[-74.021387,42.125831],[-74.02136299999999,42.126034],[-74.021321,42.12617],[-74.021244,42.126325],[-74.021123,42.126498],[-74.02091299999999,42.126721],[-74.02076099999999,42.126869],[-74.02032199999999,42.12727],[-74.020139,42.127504],[-74.019991,42.127799],[-74.019811,42.128301],[-74.019704,42.128611],[-74.019593,42.128905],[-74.01937700000001,42.12931],[-74.019115,42.129766],[-74.018879,42.130112],[-74.018665,42.13036],[-74.018314,42.130729],[-74.01832,42.130841],[-74.018349,42.130905],[-74.01840799999999,42.130984],[-74.01827299999999,42.130934],[-74.01818,42.130925],[-74.018128,42.130941],[-74.01799800000001,42.131097],[-74.017833,42.131336],[-74.017556,42.131822],[-74.017535,42.131866],[-74.017386,42.132172],[-74.01731599999999,42.132314],[-74.017174,42.132585],[-74.017004,42.132912],[-74.01663600000001,42.133536],[-74.01634,42.133954],[-74.016088,42.134273],[-74.015654,42.134796],[-74.01544,42.135056],[-74.014634,42.136033],[-74.014388,42.136276],[-74.014256,42.13636],[-74.014134,42.136424],[-74.01393299999999,42.136488],[-74.013732,42.136516],[-74.013481,42.136512],[-74.013311,42.136497],[-74.012171,42.136375],[-74.01173900000001,42.136337],[-74.01136099999999,42.136333],[-74.011077,42.136362],[-74.010864,42.136409],[-74.010673,42.136479],[-74.01048299999999,42.136571],[-74.010244,42.136717],[-74.010046,42.136874],[-74.00998,42.136937],[-74.009913,42.13702],[-74.00968399999999,42.137398],[-74.008906,42.138833],[-74.008662,42.139299],[-74.00809700000001,42.140288],[-74.007919,42.140561],[-74.007881,42.140603],[-74.007678,42.140809],[-74.007457,42.140987],[-74.00699899999999,42.141283],[-74.006743,42.141433],[-74.00632299999999,42.141665],[-74.006077,42.141808],[-74.00603099999999,42.141835],[-74.00526600000001,42.142264],[-74.005003,42.142441],[-74.004752,42.142641],[-74.00456,42.142821],[-74.004336,42.143082],[-74.00424700000001,42.143195],[-74.00422,42.14323],[-74.003486,42.144177],[-74.00314899999999,42.144564],[-74.003041,42.144659],[-74.002954,42.144692],[-74.002971,42.14456],[-74.002987,42.14443],[-74.002987,42.144204],[-74.002962,42.144048],[-74.002938,42.143969],[-74.002893,42.14382],[-74.002639,42.143093],[-74.00258700000001,42.14297],[-74.00256899999999,42.142928],[-74.002394,42.142605],[-74.001857,42.141789],[-74.00146100000001,42.141187],[-74.00130299999999,42.140913],[-74.001198,42.140629],[-74.001166,42.140453],[-74.001114,42.139756],[-74.00110100000001,42.139531],[-74.001105,42.139343],[-74.001107,42.13926],[-74.00112300000001,42.139057],[-74.001122,42.139006],[-74.001214,42.13799],[-74.00121799999999,42.137928],[-74.001255,42.137539],[-74.001245,42.137299],[-74.001109,42.136354],[-74.00102099999999,42.135879],[-74.000923,42.135584],[-74.00089199999999,42.135524],[-74.000805,42.135355],[-74.00062699999999,42.135094],[-74.000454,42.134908],[-74.000182,42.134665],[-74.00005899999999,42.134554],[-73.999869,42.134362],[-73.99968800000001,42.134128],[-73.999492,42.133786],[-73.99945200000001,42.133705],[-73.999308,42.133411],[-73.999222,42.133162],[-73.998971,42.132437],[-73.998965,42.132421],[-73.99879199999999,42.132015],[-73.998632,42.131594],[-73.998474,42.131271],[-73.997946,42.130211],[-73.997902,42.130123],[-73.99767799999999,42.12968],[-73.997597,42.129541],[-73.99726699999999,42.129076],[-73.996612,42.128208],[-73.996407,42.127895],[-73.996281,42.127578],[-73.995772,42.125926],[-73.99550499999999,42.125114],[-73.995464,42.124986],[-73.995273,42.124572],[-73.994995,42.124098],[-73.99454799999999,42.123463],[-73.99431300000001,42.123147],[-73.993899,42.122661],[-73.993453,42.122192],[-73.99315199999999,42.121905],[-73.992677,42.121499],[-73.99226299999999,42.121168],[-73.991759,42.120791],[-73.99143100000001,42.120572],[-73.99130100000001,42.120491],[-73.991027,42.120319],[-73.99088500000001,42.120234],[-73.990729,42.12014],[-73.99019199999999,42.119837],[-73.98961300000001,42.119547],[-73.98969200000001,42.119307],[-73.989696,42.119153],[-73.989665,42.119029],[-73.98958,42.118881],[-73.98948,42.118781],[-73.989363,42.118699],[-73.98915100000001,42.11861],[-73.988344,42.118398],[-73.98766500000001,42.118226],[-73.987644,42.118217],[-73.987611,42.118195],[-73.9876,42.118129],[-73.987629,42.118018],[-73.98788399999999,42.117461],[-73.988021,42.117149],[-73.988514,42.116293],[-73.98862200000001,42.116068],[-73.988916,42.115215],[-73.989059,42.114855],[-73.989126,42.114494],[-73.989261,42.112859],[-73.989209,42.112613],[-73.989053,42.112349],[-73.988776,42.111996],[-73.988651,42.111886],[-73.98843100000001,42.111782],[-73.988223,42.111753],[-73.987719,42.111762],[-73.987521,42.111745],[-73.987359,42.111707],[-73.987314,42.111684],[-73.98724199999999,42.111634],[-73.987193,42.111586],[-73.987134,42.111482],[-73.987109,42.111328],[-73.98709700000001,42.111002],[-73.987049,42.110611],[-73.987055,42.110474],[-73.98714099999999,42.110158],[-73.987145,42.109988],[-73.987105,42.109907],[-73.987003,42.109803],[-73.98668499999999,42.109533],[-73.98659499999999,42.109445],[-73.986491,42.109301],[-73.98643,42.109197],[-73.986699,42.10925],[-73.987167,42.109327],[-73.987359,42.109345],[-73.98752500000001,42.109328],[-73.98766000000001,42.109289],[-73.987711,42.109268],[-73.98779999999999,42.109206],[-73.987916,42.109059],[-73.988079,42.108804],[-73.988191,42.108664],[-73.98830599999999,42.108547],[-73.98837,42.108506],[-73.988426,42.108483],[-73.988589,42.108439],[-73.98863,42.108431],[-73.988957,42.108396],[-73.989357,42.108381],[-73.989507,42.108354],[-73.989654,42.108303],[-73.98994,42.108139],[-73.990146,42.108045],[-73.99035600000001,42.107965],[-73.990568,42.107921],[-73.990701,42.107911],[-73.990816,42.107913],[-73.99113,42.10793],[-73.991563,42.107988],[-73.991854,42.108021],[-73.99211200000001,42.108022],[-73.992329,42.108003],[-73.99270300000001,42.107932],[-73.992907,42.107904],[-73.994429,42.107952],[-73.995166,42.107918],[-73.995372,42.107931],[-73.995561,42.107965],[-73.995722,42.10801],[-73.995739,42.108016],[-73.996098,42.108142],[-73.996297,42.108233],[-73.996889,42.108499],[-73.997235,42.108679],[-73.99733000000001,42.108719],[-73.997557,42.108862],[-73.997749,42.109072],[-73.99789,42.109195],[-73.997973,42.109228],[-73.99808400000001,42.10923],[-73.998194,42.109208],[-73.998606,42.109036],[-73.99928,42.108793],[-73.999601,42.108663],[-74.000001,42.108489],[-74.000158,42.108467],[-74.00031199999999,42.108473],[-74.00048200000001,42.108504],[-74.000686,42.108562],[-74.00102,42.108693],[-74.001469,42.108919],[-74.001749,42.109077],[-74.00212399999999,42.109329],[-74.002354,42.10952],[-74.002472,42.109646],[-74.00261500000001,42.109821],[-74.002726,42.109923],[-74.00290699999999,42.110032],[-74.003186,42.110131],[-74.003533,42.110227],[-74.003731,42.110162],[-74.003924,42.110125],[-74.00432000000001,42.110106],[-74.004705,42.110129],[-74.005482,42.110196],[-74.006028,42.110253],[-74.007766,42.110405],[-74.00824799999999,42.110409],[-74.008737,42.110368],[-74.008957,42.110333],[-74.009157,42.110287],[-74.009371,42.110223],[-74.009502,42.11017],[-74.009733,42.110031],[-74.00984800000001,42.109947],[-74.010121,42.109685],[-74.01078200000001,42.108964],[-74.010955,42.108802],[-74.011093,42.108702],[-74.011336,42.108552],[-74.011459,42.108495],[-74.01165899999999,42.108429],[-74.01192500000001,42.108379],[-74.013097,42.10825],[-74.01386100000001,42.108152],[-74.014031,42.108114],[-74.014201,42.108052],[-74.014342,42.107972],[-74.01450800000001,42.107856],[-74.01480599999999,42.10762],[-74.015091,42.107358],[-74.015199,42.107243],[-74.01529499999999,42.10712],[-74.015415,42.10692],[-74.015478,42.106691],[-74.01554400000001,42.106164],[-74.01561700000001,42.105906],[-74.01570100000001,42.105702],[-74.01589,42.105356],[-74.016015,42.105162],[-74.01609999999999,42.104993],[-74.016181,42.10475],[-74.016244,42.104448],[-74.01628599999999,42.104298],[-74.016424,42.103965],[-74.016531,42.103755],[-74.017315,42.103985],[-74.017599,42.104074],[-74.01853199999999,42.104303],[-74.019373,42.104521],[-74.01974,42.10463],[-74.020038,42.10476],[-74.020323,42.104926],[-74.020371,42.104955],[-74.020636,42.10506],[-74.020748,42.105091],[-74.02091900000001,42.105106],[-74.02106000000001,42.105105],[-74.021136,42.105102],[-74.02121200000001,42.105098],[-74.021353,42.105092],[-74.021895,42.105077],[-74.02216300000001,42.1051],[-74.022279,42.105126],[-74.022475,42.105203],[-74.022856,42.105407],[-74.02311,42.1055],[-74.023445,42.105565],[-74.02452700000001,42.105682],[-74.025871,42.105819],[-74.026546,42.105905],[-74.026675,42.105928],[-74.026808,42.105951],[-74.027008,42.105998],[-74.027158,42.106044],[-74.027289,42.106098],[-74.027439,42.106175],[-74.02764000000001,42.106294],[-74.028038,42.106561],[-74.028234,42.106676],[-74.02840399999999,42.106753],[-74.028603,42.106812],[-74.028812,42.106853],[-74.030253,42.106986],[-74.03111800000001,42.107046],[-74.031459,42.107055],[-74.03126,42.107586]]],"type":"Polygon"}
}