{
  "id": "361190121011",
  "type": "Feature",
  "properties": {
    "area_land":2789949,
    "area_water":2855,
    "geoid":"361190121011",
    "name":"Block Group 1",
    "state":"ny"
},
  "bbox": [
    -73.760656,
    41.115554,
    -73.740892,
    41.145383
],
  "geometry": {"coordinates":[[[-73.760656,41.129452],[-73.760516,41.130593],[-73.760476,41.130837],[-73.760029,41.130849],[-73.759394,41.130916],[-73.757988,41.131034],[-73.757266,41.13108],[-73.755887,41.131167],[-73.754335,41.131209],[-73.75399299999999,41.131241],[-73.753731,41.131285],[-73.754032,41.132323],[-73.75451200000001,41.133574],[-73.754735,41.134409],[-73.754977,41.135316],[-73.755109,41.135764],[-73.75566499999999,41.137698],[-73.755883,41.13827],[-73.756016,41.138521],[-73.756243,41.138851],[-73.75642000000001,41.139087],[-73.756726,41.139452],[-73.757054,41.139868],[-73.75748299999999,41.140386],[-73.757767,41.140748],[-73.758364,41.141324],[-73.758499,41.14144],[-73.75876599999999,41.141637],[-73.75911600000001,41.141864],[-73.75955,41.142125],[-73.759655,41.142203],[-73.759595,41.142334],[-73.759316,41.142817],[-73.759246,41.14296],[-73.75920499999999,41.143159],[-73.75920000000001,41.143371],[-73.75922300000001,41.143734],[-73.759244,41.143928],[-73.75928,41.144119],[-73.75936,41.144325],[-73.759429,41.144502],[-73.759535,41.144726],[-73.758308,41.145383],[-73.756371,41.144461],[-73.755967,41.144269],[-73.754717,41.143699],[-73.753736,41.14323],[-73.753423,41.14308],[-73.752825,41.142801],[-73.74985700000001,41.141348],[-73.74553,41.140171],[-73.745487,41.140096],[-73.745113,41.13968],[-73.74488599999999,41.139464],[-73.744739,41.139272],[-73.744682,41.139135],[-73.744665,41.13896],[-73.744682,41.138835],[-73.744711,41.13873],[-73.744737,41.138634],[-73.7448,41.138514],[-73.744826,41.138373],[-73.744776,41.138247],[-73.74476799999999,41.138098],[-73.744803,41.137936],[-73.7449,41.137767],[-73.745046,41.137589],[-73.74590499999999,41.136438],[-73.746149,41.136161],[-73.746486,41.135842],[-73.746787,41.135628],[-73.747018,41.13538],[-73.74711499999999,41.135133],[-73.74727,41.135076],[-73.746606,41.134586],[-73.74606799999999,41.133731],[-73.74603999999999,41.133597],[-73.746275,41.133421],[-73.746308,41.132714],[-73.74649100000001,41.132238],[-73.74637,41.131952],[-73.74598400000001,41.131551],[-73.74566299999999,41.131148],[-73.745794,41.130407],[-73.745475,41.130073],[-73.74529800000001,41.129295],[-73.745216,41.128265],[-73.745445,41.128074],[-73.745445,41.127878],[-73.744906,41.126405],[-73.744742,41.126025],[-73.744393,41.125788],[-73.744105,41.125692],[-73.743816,41.125458],[-73.74363700000001,41.124931],[-73.743234,41.124402],[-73.743257,41.124374],[-73.74327099999999,41.124333],[-73.74325,41.124201],[-73.743174,41.124021],[-73.74312500000001,41.123807],[-73.74245000000001,41.122398],[-73.741972,41.121623],[-73.741484,41.120775],[-73.741089,41.119993],[-73.74104699999999,41.119834],[-73.741034,41.119592],[-73.741041,41.11946],[-73.741068,41.11928],[-73.74104699999999,41.11917],[-73.740905,41.118793],[-73.740892,41.118613],[-73.74097500000001,41.118274],[-73.740989,41.118163],[-73.740989,41.118017],[-73.740954,41.117927],[-73.74094700000001,41.117844],[-73.74097500000001,41.117734],[-73.741023,41.11763],[-73.741106,41.117505],[-73.741269,41.117322],[-73.741629,41.117017],[-73.74171200000001,41.116927],[-73.741823,41.116761],[-73.742045,41.116471],[-73.742204,41.116311],[-73.742419,41.116194],[-73.74281999999999,41.116069],[-73.74294500000001,41.116],[-73.743042,41.11591],[-73.74319800000001,41.115727],[-73.74333,41.115595],[-73.743392,41.115568],[-73.743454,41.115554],[-73.743572,41.115568],[-73.743759,41.115616],[-73.743883,41.115678],[-73.744029,41.115768],[-73.744147,41.115865],[-73.744445,41.116004],[-73.744756,41.116073],[-73.745352,41.116177],[-73.745456,41.116218],[-73.74558,41.116315],[-73.74569099999999,41.11646],[-73.745858,41.116709],[-73.745954,41.116813],[-73.74647,41.11719],[-73.74660900000001,41.117329],[-73.746754,41.117585],[-73.746962,41.118111],[-73.747101,41.118422],[-73.74723899999999,41.118651],[-73.74744,41.118934],[-73.74766200000001,41.119336],[-73.747773,41.119571],[-73.74790400000001,41.119973],[-73.74798699999999,41.120111],[-73.748057,41.120132],[-73.748133,41.120118],[-73.748153,41.12009],[-73.748167,41.12],[-73.74816,41.119855],[-73.748223,41.119737],[-73.748313,41.119668],[-73.748396,41.119661],[-73.748465,41.119627],[-73.748507,41.119537],[-73.748507,41.119384],[-73.748479,41.119267],[-73.748423,41.119149],[-73.748389,41.118734],[-73.74818399999999,41.118156],[-73.748122,41.118045],[-73.748018,41.1179],[-73.74792100000001,41.117817],[-73.747693,41.117678],[-73.74760999999999,41.117609],[-73.747968,41.117774],[-73.74815,41.117969],[-73.74841499999999,41.118355],[-73.748638,41.118503],[-73.74943399999999,41.119431],[-73.749949,41.120003],[-73.750793,41.1208],[-73.75106,41.121051],[-73.75192699999999,41.121615],[-73.75210300000001,41.121708],[-73.75400500000001,41.122684],[-73.753888,41.122554],[-73.753874,41.122515],[-73.753874,41.122467],[-73.75393800000001,41.122368],[-73.754048,41.122297],[-73.754186,41.122226],[-73.75421,41.122203],[-73.754245,41.122229],[-73.754367,41.12225],[-73.754527,41.122246],[-73.754834,41.122178],[-73.75504100000001,41.122183],[-73.75514200000001,41.122212],[-73.75540700000001,41.122372],[-73.75556,41.122437],[-73.75566999999999,41.122462],[-73.75583,41.122469],[-73.75635200000001,41.122417],[-73.756536,41.122425],[-73.756621,41.122453],[-73.75685900000001,41.122554],[-73.757051,41.122611],[-73.757171,41.122657],[-73.757285,41.122735],[-73.757384,41.122777],[-73.757459,41.122792],[-73.757633,41.122799],[-73.757807,41.122781],[-73.757955,41.122778],[-73.75802,41.122793],[-73.758115,41.122827],[-73.75838899999999,41.122953],[-73.75869400000001,41.123139],[-73.759046,41.123397],[-73.75926200000001,41.123572],[-73.759353,41.123663],[-73.759624,41.123933],[-73.759805,41.12421],[-73.759868,41.124366],[-73.76000000000001,41.124774],[-73.76024700000001,41.125743],[-73.76031399999999,41.125956],[-73.760402,41.126238],[-73.76044400000001,41.126567],[-73.760457,41.126669],[-73.760479,41.126942],[-73.76053400000001,41.127421],[-73.76054600000001,41.127524],[-73.760577,41.127756],[-73.760644,41.128553],[-73.760656,41.129452]]],"type":"Polygon"}
}