{
  "id": "360150103001",
  "type": "Feature",
  "properties": {
    "area_land":5732188,
    "area_water":46851,
    "geoid":"360150103001",
    "name":"Block Group 1",
    "state":"ny"
},
  "bbox": [
    -76.966109,
    42.134135,
    -76.906795,
    42.160488
],
  "geometry": {"coordinates":[[[-76.966109,42.143461],[-76.96609100000001,42.143547],[-76.96607899999999,42.143532],[-76.966064,42.143496],[-76.966041,42.143471],[-76.96574099999999,42.143456],[-76.964545,42.143438],[-76.963988,42.143461],[-76.963446,42.143557],[-76.96137899999999,42.144167],[-76.96058499999999,42.144381],[-76.96005100000001,42.14448],[-76.95928000000001,42.144526],[-76.95786099999999,42.144747],[-76.95719699999999,42.145002],[-76.95616,42.145727],[-76.955832,42.145926],[-76.955519,42.146021],[-76.955168,42.146063],[-76.954847,42.146059],[-76.95363399999999,42.145994],[-76.95204,42.145914],[-76.952,42.145913],[-76.95142199999999,42.145891],[-76.949888,42.145804],[-76.94959799999999,42.145784],[-76.947958,42.145681],[-76.94803400000001,42.146265],[-76.948194,42.147806],[-76.94824,42.148085],[-76.948448,42.149953],[-76.948645,42.15172],[-76.948652,42.151926],[-76.946913,42.150774],[-76.946753,42.150667],[-76.94499,42.151436],[-76.943973,42.151873],[-76.94319400000001,42.15221],[-76.936004,42.15533],[-76.926338,42.159526],[-76.924122,42.160488],[-76.924099,42.160216],[-76.923733,42.160216],[-76.923466,42.160188],[-76.923345,42.160175],[-76.922406,42.160078],[-76.921406,42.159979],[-76.921162,42.159952],[-76.921032,42.159941],[-76.920714,42.159909],[-76.91972800000001,42.159811],[-76.91930600000001,42.159768],[-76.91824699999999,42.159659],[-76.91766,42.159579],[-76.916752,42.159411],[-76.916149,42.159331],[-76.913021,42.159197],[-76.912746,42.159187],[-76.909305,42.159067],[-76.907428,42.158976],[-76.907169,42.158953],[-76.906795,42.158957],[-76.90694000000001,42.158037],[-76.907222,42.156408],[-76.90729899999999,42.15589],[-76.907551,42.155218],[-76.908069,42.153975],[-76.908069,42.153956],[-76.908641,42.152552],[-76.908912,42.151875],[-76.90925,42.151033],[-76.909347,42.150663],[-76.909475,42.150288],[-76.90952900000001,42.149904],[-76.910437,42.149701],[-76.91336099999999,42.149089],[-76.914512,42.148837],[-76.915189,42.148654],[-76.91716700000001,42.148129],[-76.922916,42.146453],[-76.923783,42.146217],[-76.923914,42.146179],[-76.924387,42.146042],[-76.925471,42.145774],[-76.92628000000001,42.145564],[-76.92884599999999,42.144794],[-76.93051800000001,42.144303],[-76.931922,42.143942],[-76.932474,42.143779],[-76.93347799999999,42.143466],[-76.93598299999999,42.14275],[-76.936323,42.142665],[-76.940973,42.141373],[-76.941714,42.141164],[-76.94299700000001,42.140767],[-76.946557,42.139764],[-76.94673899999999,42.13971],[-76.947202,42.13963],[-76.947457,42.139541],[-76.947686,42.13949],[-76.950293,42.138717],[-76.95124300000001,42.138439],[-76.95272900000001,42.138018],[-76.95321300000001,42.137877],[-76.95443400000001,42.13753],[-76.959459,42.136127],[-76.963087,42.135089],[-76.96364,42.134783],[-76.964454,42.134538],[-76.96514500000001,42.134326],[-76.96573100000001,42.13417],[-76.965853,42.134135],[-76.965852,42.134289],[-76.96584199999999,42.135275],[-76.965863,42.136239],[-76.965903,42.138071],[-76.965896,42.138641],[-76.96588800000001,42.139296],[-76.965874,42.140146],[-76.965873,42.140188],[-76.965895,42.141623],[-76.965895,42.141653],[-76.96595499999999,42.142052],[-76.965987,42.142271],[-76.96602,42.142446],[-76.966094,42.142843],[-76.966109,42.143461]]],"type":"Polygon"}
}