{
  "id": "360050181011",
  "type": "Feature",
  "properties": {
    "area_land":46691,
    "area_water":0,
    "geoid":"360050181011",
    "name":"Block Group 1",
    "state":"ny"
},
  "bbox": [
    -73.91811,
    40.82929,
    -73.915008,
    40.832322
],
  "geometry": {"coordinates":[[[-73.917446,40.83113],[-73.916752,40.832322],[-73.915892,40.832026],[-73.915008,40.831723],[-73.915699,40.830536],[-73.91641,40.82929],[-73.91728500000001,40.829655],[-73.91811,40.830005],[-73.917446,40.83113]]],"type":"Polygon"}
}