{
  "id": "360593035002",
  "type": "Feature",
  "properties": {
    "area_land":170792,
    "area_water":0,
    "geoid":"360593035002",
    "name":"Block Group 2",
    "state":"ny"
},
  "bbox": [
    -73.647906,
    40.743096,
    -73.641689,
    40.748224
],
  "geometry": {"coordinates":[[[-73.647695,40.746955],[-73.64703,40.747175],[-73.646855,40.747233],[-73.64608699999999,40.747487],[-73.645268,40.747763],[-73.64389799999999,40.748224],[-73.643495,40.74758],[-73.64313300000001,40.746954],[-73.64277199999999,40.746324],[-73.64241199999999,40.745696],[-73.642049,40.745067],[-73.641689,40.744437],[-73.643923,40.743696],[-73.644847,40.743387],[-73.645725,40.743096],[-73.646807,40.744985],[-73.646905,40.745169],[-73.647277,40.74579],[-73.64790600000001,40.746885],[-73.647695,40.746955]]],"type":"Polygon"}
}