{
  "id": "360470374021",
  "type": "Feature",
  "properties": {
    "area_land":125079,
    "area_water":0,
    "geoid":"360470374021",
    "name":"Block Group 1",
    "state":"ny"
},
  "bbox": [
    -73.97441,
    40.585758,
    -73.970752,
    40.590443
],
  "geometry": {"coordinates":[[[-73.974368,40.5865],[-73.974326,40.5872],[-73.974277,40.58794],[-73.974227,40.588706],[-73.974217,40.590111],[-73.972976,40.590241],[-73.972077,40.590341],[-73.97115100000001,40.590443],[-73.970752,40.588322],[-73.971677,40.588222],[-73.971278,40.586101],[-73.972204,40.586001],[-73.97441000000001,40.585758],[-73.974368,40.5865]]],"type":"Polygon"}
}