{
  "id": "360850133022",
  "type": "Feature",
  "properties": {
    "area_land":409003,
    "area_water":0,
    "geoid":"360850133022",
    "name":"Block Group 2",
    "state":"ny"
},
  "bbox": [
    -74.127032,
    40.634078,
    -74.117549,
    40.641298
],
  "geometry": {"coordinates":[[[-74.127015,40.639319],[-74.12696200000001,40.640181],[-74.123744,40.640202],[-74.120659,40.641196],[-74.120563,40.640942],[-74.11968299999999,40.641092],[-74.118067,40.641298],[-74.11806900000001,40.641214],[-74.11800700000001,40.640562],[-74.117757,40.639849],[-74.11764599999999,40.639377],[-74.117648,40.638968],[-74.11765699999999,40.638062],[-74.117549,40.636954],[-74.11975200000001,40.636667],[-74.120636,40.636573],[-74.120239,40.6343],[-74.12064100000001,40.63426],[-74.121228,40.63422],[-74.121938,40.634161],[-74.12306700000001,40.634078],[-74.123144,40.634666],[-74.12325300000001,40.635493],[-74.12433299999999,40.635408],[-74.124605,40.637466],[-74.125652,40.637198],[-74.12688799999999,40.63721],[-74.126915,40.637429],[-74.126959,40.637827],[-74.127032,40.638377],[-74.127015,40.639319]]],"type":"Polygon"}
}