{
  "id": "360470462011",
  "type": "Feature",
  "properties": {
    "area_land":58090,
    "area_water":0,
    "geoid":"360470462011",
    "name":"Block Group 1",
    "state":"ny"
},
  "bbox": [
    -73.974832,
    40.627231,
    -73.971114,
    40.629988
],
  "geometry": {"coordinates":[[[-73.97483200000001,40.628412],[-73.97402700000001,40.628806],[-73.972852,40.629372],[-73.971806,40.629874],[-73.971718,40.629916],[-73.971568,40.629988],[-73.971374,40.628966],[-73.971208,40.62809],[-73.971114,40.627586],[-73.971377,40.627557],[-73.97248999999999,40.627437],[-73.973415,40.627333],[-73.974343,40.627231],[-73.974418,40.627636],[-73.974514,40.628025],[-73.97483200000001,40.628412]]],"type":"Polygon"}
}