{
  "id": "360550106011",
  "type": "Feature",
  "properties": {
    "area_land":593896,
    "area_water":0,
    "geoid":"360550106011",
    "name":"Block Group 1",
    "state":"ny"
},
  "bbox": [
    -77.580188,
    43.199045,
    -77.572431,
    43.211455
],
  "geometry": {"coordinates":[[[-77.58018800000001,43.211194],[-77.578862,43.211248],[-77.578312,43.21126],[-77.57780200000001,43.211273],[-77.577292,43.211287],[-77.576294,43.211332],[-77.575087,43.211374],[-77.574254,43.211409],[-77.573143,43.211455],[-77.57288800000001,43.207568],[-77.572838,43.206528],[-77.572746,43.205312],[-77.57252,43.201835],[-77.57243099999999,43.200344],[-77.57358600000001,43.200017],[-77.57592200000001,43.199356],[-77.577021,43.199045],[-77.57709199999999,43.20034],[-77.577198,43.202082],[-77.577285,43.203375],[-77.57735700000001,43.203651],[-77.577477,43.203932],[-77.578098,43.205216],[-77.578377,43.205794],[-77.578773,43.206617],[-77.579061,43.207259],[-77.579521,43.208252],[-77.579956,43.209301],[-77.580056,43.209781],[-77.58010899999999,43.2102],[-77.58018800000001,43.211194]]],"type":"Polygon"}
}