{
  "id": "360870125023",
  "type": "Feature",
  "properties": {
    "area_land":2189035,
    "area_water":0,
    "geoid":"360870125023",
    "name":"Block Group 3",
    "state":"ny"
},
  "bbox": [
    -74.067892,
    41.066284,
    -74.039885,
    41.093806
],
  "geometry": {"coordinates":[[[-74.067864,41.071139],[-74.067821,41.071437],[-74.067741,41.071963],[-74.067683,41.072172],[-74.067606,41.072329],[-74.067413,41.072611],[-74.06729900000001,41.072731],[-74.06702900000001,41.07299],[-74.066202,41.073642],[-74.06483,41.074721],[-74.064526,41.074954],[-74.064375,41.075084],[-74.064136,41.075371],[-74.06397800000001,41.075604],[-74.063897,41.075751],[-74.06336899999999,41.076856],[-74.06316700000001,41.077287],[-74.062834,41.077957],[-74.062517,41.078664],[-74.062136,41.079504],[-74.061666,41.080524],[-74.06147300000001,41.080836],[-74.06132700000001,41.08104],[-74.06112899999999,41.081284],[-74.06088200000001,41.081542],[-74.060546,41.081843],[-74.059933,41.082267],[-74.058903,41.082846],[-74.058026,41.083342],[-74.05766800000001,41.08353],[-74.056256,41.084226],[-74.055885,41.084423],[-74.05564699999999,41.084568],[-74.054788,41.085176],[-74.05463399999999,41.085307],[-74.054354,41.085629],[-74.053133,41.085237],[-74.05280500000001,41.085136],[-74.050313,41.084545],[-74.049852,41.085429],[-74.049251,41.085339],[-74.04880199999999,41.08522],[-74.047697,41.084833],[-74.047493,41.084793],[-74.047211,41.084782],[-74.046913,41.084795],[-74.04680999999999,41.084815],[-74.046544,41.084901],[-74.046459,41.08494],[-74.046325,41.085019],[-74.04613000000001,41.085167],[-74.045818,41.085516],[-74.04490699999999,41.086582],[-74.044488,41.087098],[-74.04375,41.08797],[-74.043261,41.088561],[-74.043211,41.088648],[-74.04319700000001,41.088737],[-74.043237,41.089116],[-74.043612,41.091341],[-74.043654,41.091572],[-74.043783,41.09181],[-74.04398399999999,41.092079],[-74.04419799999999,41.092336],[-74.04387,41.092445],[-74.04346200000001,41.092606],[-74.042795,41.092897],[-74.04232,41.093141],[-74.04189100000001,41.093382],[-74.041077,41.093806],[-74.04093899999999,41.093496],[-74.040633,41.09293],[-74.040457,41.092666],[-74.040373,41.09259],[-74.04012400000001,41.092394],[-74.039885,41.092222],[-74.040066,41.091655],[-74.040229,41.091203],[-74.04043299999999,41.090712],[-74.04066400000001,41.090224],[-74.040936,41.089747],[-74.04124,41.089259],[-74.041569,41.088764],[-74.041929,41.088276],[-74.042306,41.087789],[-74.04270699999999,41.087317],[-74.043138,41.086846],[-74.045373,41.084469],[-74.047577,41.082093],[-74.04836,41.081133],[-74.048697,41.080659],[-74.049018,41.080183],[-74.049311,41.079711],[-74.04983799999999,41.078758],[-74.05091,41.076399],[-74.051033,41.076127],[-74.05117300000001,41.075819],[-74.051604,41.07487],[-74.051892,41.074161],[-74.052002,41.07389],[-74.052195,41.073413],[-74.05247300000001,41.072786],[-74.052807,41.072119],[-74.052891,41.071954],[-74.05327699999999,41.071271],[-74.053455,41.070968],[-74.053708,41.070568],[-74.053906,41.070257],[-74.05413,41.069904],[-74.05475199999999,41.069057],[-74.055137,41.068562],[-74.055545,41.068071],[-74.055964,41.067587],[-74.05642400000001,41.067092],[-74.05681199999999,41.066706],[-74.05721800000001,41.066284],[-74.058198,41.066722],[-74.05865,41.066923],[-74.05952000000001,41.067311],[-74.06096599999999,41.067953],[-74.061582,41.068227],[-74.06780500000001,41.070994],[-74.067892,41.071031],[-74.067864,41.071139]]],"type":"Polygon"}
}