{
  "id": "361190017003",
  "type": "Feature",
  "properties": {
    "area_land":208755,
    "area_water":0,
    "geoid":"361190017003",
    "name":"Block Group 3",
    "state":"ny"
},
  "bbox": [
    -73.874659,
    40.942427,
    -73.866191,
    40.947083
],
  "geometry": {"coordinates":[[[-73.87465899999999,40.944187],[-73.874422,40.944464],[-73.873842,40.945058],[-73.873491,40.945417],[-73.87336999999999,40.945558],[-73.872839,40.946123],[-73.87268400000001,40.946334],[-73.872488,40.946647],[-73.872325,40.946938],[-73.872123,40.946835],[-73.87205,40.946797],[-73.871745,40.946638],[-73.870976,40.946233],[-73.87022899999999,40.94585],[-73.869781,40.946369],[-73.869388,40.946793],[-73.869347,40.946857],[-73.869303,40.947083],[-73.868351,40.947009],[-73.867429,40.946903],[-73.866191,40.946728],[-73.866235,40.946596],[-73.866615,40.946135],[-73.867508,40.945173],[-73.867921,40.944681],[-73.868394,40.944193],[-73.86899099999999,40.943658],[-73.869119,40.94354],[-73.869169,40.943461],[-73.86920499999999,40.943318],[-73.869322,40.94249],[-73.86947000000001,40.942437],[-73.86953699999999,40.942427],[-73.869636,40.94243],[-73.87024599999999,40.942545],[-73.871105,40.942666],[-73.872604,40.942911],[-73.872845,40.942962],[-73.87297700000001,40.943003],[-73.873181,40.943088],[-73.873272,40.943152],[-73.873503,40.943406],[-73.873676,40.943596],[-73.873853,40.943741],[-73.873998,40.943859],[-73.874106,40.943927],[-73.87421000000001,40.943995],[-73.87432800000001,40.94405],[-73.874444,40.944097],[-73.87465899999999,40.944187]]],"type":"Polygon"}
}