{
  "id": "360610209012",
  "type": "Feature",
  "properties": {
    "area_land":55561,
    "area_water":0,
    "geoid":"360610209012",
    "name":"Block Group 2",
    "state":"ny"
},
  "bbox": [
    -73.957808,
    40.810064,
    -73.954011,
    40.813375
],
  "geometry": {"coordinates":[[[-73.957432,40.811779],[-73.95734899999999,40.811894],[-73.95733199999999,40.811917],[-73.956827,40.812612],[-73.95626900000001,40.813375],[-73.95573899999999,40.812766],[-73.95550799999999,40.8125],[-73.954835,40.811725],[-73.95401099999999,40.81137],[-73.95428800000001,40.810992],[-73.95451300000001,40.810687],[-73.954966,40.810064],[-73.956801,40.810839],[-73.957808,40.811264],[-73.957432,40.811779]]],"type":"Polygon"}
}