{
  "id": "360290008001",
  "type": "Feature",
  "properties": {
    "area_land":197522,
    "area_water":0,
    "geoid":"360290008001",
    "name":"Block Group 1",
    "state":"ny"
},
  "bbox": [
    -78.823732,
    42.843583,
    -78.814885,
    42.846941
],
  "geometry": {"coordinates":[[[-78.823729,42.844967],[-78.823728,42.845342],[-78.82372700000001,42.845919],[-78.82372100000001,42.846175],[-78.823716,42.846924],[-78.82330399999999,42.846917],[-78.82280799999999,42.846918],[-78.822129,42.846937],[-78.821364,42.846941],[-78.82041700000001,42.846932],[-78.820194,42.84693],[-78.818397,42.846901],[-78.818223,42.846901],[-78.818162,42.84679],[-78.818107,42.846689],[-78.817643,42.846348],[-78.817499,42.846242],[-78.816774,42.845713],[-78.816472,42.845493],[-78.81593700000001,42.845101],[-78.81502999999999,42.844436],[-78.814994,42.844449],[-78.814944,42.844426],[-78.81489500000001,42.84441],[-78.814885,42.84436],[-78.814893,42.844347],[-78.814905,42.844335],[-78.814937,42.844321],[-78.814966,42.844317],[-78.814977,42.843583],[-78.81796799999999,42.843612],[-78.82044999999999,42.843645],[-78.82043899999999,42.844435],[-78.82043899999999,42.84448],[-78.82373200000001,42.844515],[-78.823729,42.844967]]],"type":"Polygon"}
}