{
  "id": "360593040021",
  "type": "Feature",
  "properties": {
    "area_land":431402,
    "area_water":0,
    "geoid":"360593040021",
    "name":"Block Group 1",
    "state":"ny"
},
  "bbox": [
    -73.600994,
    40.753724,
    -73.586758,
    40.763421
],
  "geometry": {"coordinates":[[[-73.600994,40.759758],[-73.59986600000001,40.760087],[-73.599244,40.760288],[-73.59828899999999,40.760619],[-73.596873,40.761039],[-73.596007,40.761316],[-73.595359,40.761529],[-73.594846,40.761694],[-73.594331,40.761851],[-73.593746,40.762001],[-73.59319000000001,40.762113],[-73.593054,40.762141],[-73.592794,40.762181],[-73.591694,40.762346],[-73.59122000000001,40.76242],[-73.59071900000001,40.762511],[-73.590273,40.762588],[-73.590081,40.76262],[-73.588559,40.762925],[-73.58816,40.763057],[-73.587641,40.763193],[-73.586758,40.763421],[-73.58677400000001,40.763287],[-73.586806,40.763089],[-73.58682899999999,40.763042],[-73.586851,40.762909],[-73.58702700000001,40.762411],[-73.587046,40.762345],[-73.587208,40.761953],[-73.587321,40.761694],[-73.587371,40.76155],[-73.587627,40.760939],[-73.587903,40.760198],[-73.58955400000001,40.75994],[-73.591007,40.759713],[-73.592522,40.759475],[-73.593349,40.759339],[-73.593648,40.75928],[-73.59416899999999,40.759156],[-73.59529000000001,40.758834],[-73.596165,40.758577],[-73.596434,40.759031],[-73.59697199999999,40.758835],[-73.59714700000001,40.758782],[-73.597279,40.75876],[-73.596867,40.758068],[-73.596485,40.757422],[-73.59611700000001,40.756792],[-73.59576300000001,40.756178],[-73.595405,40.755557],[-73.59504,40.754933],[-73.594674,40.754311],[-73.59607,40.753958],[-73.59645999999999,40.753844],[-73.596923,40.753724],[-73.59716400000001,40.754088],[-73.597337,40.754349],[-73.597576,40.754708],[-73.597742,40.754962],[-73.59798600000001,40.755331],[-73.598145,40.755575],[-73.598392,40.755954],[-73.59854300000001,40.756187],[-73.598803,40.756576],[-73.598963,40.756793],[-73.599062,40.756947],[-73.59924599999999,40.757187],[-73.59939799999999,40.757398],[-73.599673,40.757792],[-73.600103,40.758403],[-73.60040499999999,40.758852],[-73.600758,40.759398],[-73.600994,40.759758]]],"type":"Polygon"}
}