{
  "id": "360650207052",
  "type": "Feature",
  "properties": {
    "area_land":356505,
    "area_water":0,
    "geoid":"360650207052",
    "name":"Block Group 2",
    "state":"ny"
},
  "bbox": [
    -75.260986,
    43.082756,
    -75.250328,
    43.089227
],
  "geometry": {"coordinates":[[[-75.260986,43.086754],[-75.259237,43.087622],[-75.25862499999999,43.087928],[-75.256877,43.088804],[-75.256275,43.089099],[-75.25601399999999,43.089227],[-75.255757,43.089111],[-75.25447699999999,43.088545],[-75.253745,43.088212],[-75.253382,43.088059],[-75.25226499999999,43.087568],[-75.250524,43.086836],[-75.250328,43.086759],[-75.250629,43.086369],[-75.251524,43.085285],[-75.25246,43.084153],[-75.253283,43.083154],[-75.253398,43.083045],[-75.25358799999999,43.082912],[-75.25393699999999,43.082756],[-75.254622,43.083066],[-75.25559800000001,43.083492],[-75.25668899999999,43.083943],[-75.257237,43.083281],[-75.25763999999999,43.083462],[-75.257925,43.083577],[-75.258156,43.083701],[-75.25825500000001,43.083781],[-75.259063,43.084635],[-75.259237,43.084827],[-75.259748,43.085393],[-75.260614,43.086319],[-75.260986,43.086754]]],"type":"Polygon"}
}