{
  "id": "360239712001",
  "type": "Feature",
  "properties": {
    "area_land":65601482,
    "area_water":38199,
    "geoid":"360239712001",
    "name":"Block Group 1",
    "state":"ny"
},
  "bbox": [
    -76.141081,
    42.410628,
    -76.057633,
    42.555668
],
  "geometry": {"coordinates":[[[-76.141081,42.507861],[-76.1404,42.510189],[-76.140191,42.510965],[-76.139869,42.512154],[-76.139548,42.513344],[-76.139312,42.514222],[-76.139374,42.518364],[-76.139375,42.52026],[-76.138201,42.521182],[-76.13757099999999,42.521659],[-76.1357,42.523134],[-76.135125,42.523613],[-76.13328799999999,42.525073],[-76.13278800000001,42.525495],[-76.13271400000001,42.525578],[-76.132668,42.525709],[-76.13266299999999,42.525738],[-76.13265199999999,42.526044],[-76.132758,42.527974],[-76.132887,42.529927],[-76.13291,42.530417],[-76.13290499999999,42.530598],[-76.132977,42.532281],[-76.132953,42.532677],[-76.132895,42.532912],[-76.132701,42.533281],[-76.132527,42.533523],[-76.131073,42.535321],[-76.13024900000001,42.536304],[-76.129454,42.537297],[-76.129086,42.537778],[-76.127712,42.539713],[-76.127205,42.540441],[-76.127028,42.540695],[-76.126676,42.541249],[-76.12658999999999,42.541457],[-76.126561,42.541627],[-76.126589,42.541863],[-76.126639,42.541999],[-76.126952,42.542728],[-76.127116,42.543127],[-76.12737199999999,42.543649],[-76.12818799999999,42.545015],[-76.129064,42.546511],[-76.12925799999999,42.546867],[-76.129362,42.547086],[-76.12939799999999,42.54721],[-76.129407,42.547368],[-76.129391,42.547463],[-76.129324,42.547622],[-76.12916199999999,42.547865],[-76.12886399999999,42.548217],[-76.128321,42.548812],[-76.12819,42.548946],[-76.127995,42.549095],[-76.127691,42.549302],[-76.127081,42.549679],[-76.126796,42.549851],[-76.126537,42.550048],[-76.125962,42.55056],[-76.124999,42.551351],[-76.124815,42.551483],[-76.124585,42.551691],[-76.124443,42.551876],[-76.124375,42.551996],[-76.124312,42.552189],[-76.12429299999999,42.552457],[-76.12431100000001,42.553074],[-76.124385,42.554078],[-76.12456899999999,42.555125],[-76.12456,42.55548],[-76.11599699999999,42.555535],[-76.114474,42.555592],[-76.113319,42.555636],[-76.112619,42.555668],[-76.112601,42.555592],[-76.11255800000001,42.555498],[-76.112267,42.555027],[-76.11214099999999,42.554876],[-76.11191599999999,42.554666],[-76.110799,42.553827],[-76.109718,42.553095],[-76.108942,42.55267],[-76.108402,42.55236],[-76.108206,42.552226],[-76.107963,42.552037],[-76.107782,42.55186],[-76.107347,42.551374],[-76.10718,42.551155],[-76.106905,42.550659],[-76.106825,42.550449],[-76.106611,42.550015],[-76.10656400000001,42.549954],[-76.106368,42.549766],[-76.105991,42.549501],[-76.105197,42.549079],[-76.10434100000001,42.548552],[-76.103151,42.547823],[-76.102491,42.547452],[-76.101755,42.546963],[-76.101204,42.546649],[-76.10102999999999,42.546559],[-76.100098,42.54618],[-76.099891,42.546061],[-76.09954999999999,42.54581],[-76.099369,42.545644],[-76.098949,42.54507],[-76.098778,42.544856],[-76.09847000000001,42.544435],[-76.09826200000001,42.544189],[-76.097882,42.543789],[-76.097418,42.543251],[-76.097179,42.542946],[-76.096462,42.541943],[-76.093659,42.542038],[-76.091278,42.54212],[-76.091183,42.542123],[-76.090784,42.542137],[-76.084401,42.54235],[-76.082418,42.533113],[-76.081288,42.527847],[-76.076122,42.527899],[-76.063643,42.528083],[-76.062468,42.502259],[-76.06237400000001,42.500012],[-76.062252,42.492249],[-76.062156,42.489726],[-76.061972,42.484944],[-76.061948,42.484582],[-76.06194600000001,42.484558],[-76.061949,42.484389],[-76.06193,42.483873],[-76.06189999999999,42.483066],[-76.06189500000001,42.482954],[-76.061763,42.479458],[-76.061672,42.477043],[-76.061571,42.474877],[-76.06152899999999,42.47334],[-76.06152299999999,42.473277],[-76.060941,42.469665],[-76.060906,42.469147],[-76.060894,42.468903],[-76.06089900000001,42.468021],[-76.0607,42.465135],[-76.06066199999999,42.464068],[-76.060632,42.462327],[-76.060598,42.461006],[-76.060581,42.460424],[-76.06045899999999,42.458157],[-76.06030199999999,42.456147],[-76.06026199999999,42.455891],[-76.060237,42.455793],[-76.06034,42.455501],[-76.060312,42.454482],[-76.060305,42.454222],[-76.059834,42.449718],[-76.05953599999999,42.444629],[-76.059522,42.444283],[-76.059341,42.441269],[-76.058885,42.433469],[-76.05786999999999,42.416022],[-76.057633,42.411941],[-76.057785,42.411938],[-76.05807799999999,42.411932],[-76.067638,42.411723],[-76.06842,42.411707],[-76.070289,42.411657],[-76.09704600000001,42.411083],[-76.10865699999999,42.410831],[-76.11201,42.410758],[-76.11796,42.410628],[-76.11788799999999,42.410679],[-76.117636,42.41086],[-76.117608,42.41088],[-76.11690299999999,42.411398],[-76.116634,42.411614],[-76.116123,42.412023],[-76.115476,42.412624],[-76.1152,42.412908],[-76.11496699999999,42.413209],[-76.11467399999999,42.413637],[-76.11397100000001,42.414695],[-76.113787,42.414934],[-76.11362800000001,42.415106],[-76.113584,42.415143],[-76.113489,42.415219],[-76.112628,42.415909],[-76.11189,42.416564],[-76.111434,42.41699],[-76.11125699999999,42.417221],[-76.110614,42.418202],[-76.11023,42.418814],[-76.109961,42.419327],[-76.109893,42.419516],[-76.10980499999999,42.419886],[-76.109754,42.420329],[-76.10968099999999,42.421102],[-76.109612,42.422147],[-76.10963,42.42375],[-76.109644,42.423969],[-76.109694,42.424931],[-76.109696,42.425036],[-76.109708,42.425557],[-76.109759,42.427351],[-76.109899,42.430767],[-76.10999,42.434034],[-76.11004,42.435096],[-76.110106,42.436132],[-76.110219,42.437499],[-76.11024,42.438257],[-76.110203,42.438493],[-76.110142,42.438597],[-76.110071,42.438671],[-76.10996400000001,42.438732],[-76.109814,42.438792],[-76.109736,42.438814],[-76.109476,42.438842],[-76.108057,42.438875],[-76.107056,42.438901],[-76.10645599999999,42.438928],[-76.104699,42.439075],[-76.103523,42.439165],[-76.10098600000001,42.43938],[-76.099729,42.439511],[-76.099328,42.439556],[-76.09920700000001,42.439577],[-76.099075,42.439616],[-76.098979,42.439659],[-76.09884700000001,42.439762],[-76.098755,42.439883],[-76.098705,42.440029],[-76.09868,42.440186],[-76.09868,42.440396],[-76.09875599999999,42.442114],[-76.098817,42.443291],[-76.098922,42.446139],[-76.09895299999999,42.446739],[-76.099042,42.448924],[-76.09909500000001,42.450771],[-76.099113,42.451072],[-76.09913899999999,42.451516],[-76.099158,42.452001],[-76.09917299999999,42.452632],[-76.09922,42.453372],[-76.099273,42.453646],[-76.099344,42.453913],[-76.099458,42.454138],[-76.09963999999999,42.454401],[-76.09985500000001,42.454634],[-76.100261,42.454986],[-76.100959,42.455485],[-76.101506,42.455835],[-76.101688,42.455999],[-76.101951,42.45628],[-76.10226299999999,42.456659],[-76.102754,42.457335],[-76.10346800000001,42.458273],[-76.10415,42.459193],[-76.104326,42.459484],[-76.104642,42.460132],[-76.10473399999999,42.460364],[-76.10480099999999,42.460585],[-76.10487000000001,42.460936],[-76.10511700000001,42.464059],[-76.10527999999999,42.465688],[-76.105366,42.465942],[-76.105486,42.46615],[-76.1056,42.466314],[-76.10641,42.467315],[-76.106595,42.467568],[-76.106809,42.46791],[-76.107145,42.46852],[-76.10738600000001,42.469027],[-76.107497,42.469347],[-76.107646,42.469846],[-76.10823000000001,42.471753],[-76.108548,42.47268],[-76.108839,42.473622],[-76.109043,42.474228],[-76.109168,42.474499],[-76.10928699999999,42.474696],[-76.10940100000001,42.474849],[-76.10950800000001,42.47497],[-76.109888,42.475467],[-76.110562,42.47639],[-76.11065000000001,42.476638],[-76.110704,42.476939],[-76.110732,42.477175],[-76.11073399999999,42.477203],[-76.11082399999999,42.478598],[-76.11085300000001,42.478904],[-76.110888,42.479122],[-76.110935,42.479314],[-76.11108400000001,42.479748],[-76.11118399999999,42.479969],[-76.111284,42.480257],[-76.11131399999999,42.480369],[-76.111328,42.480522],[-76.11131399999999,42.480739],[-76.111296,42.480835],[-76.111225,42.481017],[-76.11094300000001,42.48159],[-76.110794,42.48192],[-76.110676,42.482266],[-76.110614,42.482532],[-76.11060500000001,42.482581],[-76.110574,42.482751],[-76.110562,42.482896],[-76.11053699999999,42.482994],[-76.110505,42.48313],[-76.11047499999999,42.483203],[-76.110456,42.483248],[-76.110393,42.483346],[-76.110236,42.483502],[-76.110051,42.483645],[-76.109414,42.484012],[-76.109255,42.484091],[-76.108953,42.484205],[-76.108796,42.484248],[-76.10824,42.484362],[-76.107738,42.484476],[-76.107496,42.484543],[-76.107156,42.484652],[-76.106988,42.484721],[-76.10593299999999,42.485241],[-76.105749,42.485307],[-76.10559600000001,42.485342],[-76.104884,42.485456],[-76.104229,42.485545],[-76.103206,42.485698],[-76.103009,42.485735],[-76.102895,42.485769],[-76.10266300000001,42.485867],[-76.10253899999999,42.485935],[-76.102414,42.486027],[-76.102268,42.486155],[-76.102069,42.486362],[-76.10173500000001,42.486782],[-76.101347,42.487228],[-76.101009,42.487638],[-76.100655,42.488006],[-76.100632,42.488027],[-76.100359,42.488269],[-76.100121,42.48844],[-76.099738,42.488659],[-76.099243,42.488897],[-76.09903300000001,42.489015],[-76.09883499999999,42.489148],[-76.09855399999999,42.489387],[-76.098454,42.489483],[-76.098322,42.489632],[-76.09826200000001,42.489728],[-76.098219,42.489885],[-76.098208,42.489974],[-76.098235,42.490154],[-76.09844099999999,42.490655],[-76.098451,42.490771],[-76.09840699999999,42.49095],[-76.099029,42.491338],[-76.099425,42.491614],[-76.099895,42.491971],[-76.100354,42.492273],[-76.100812,42.492527],[-76.10106500000001,42.492657],[-76.101575,42.49289],[-76.102811,42.493391],[-76.10324,42.493558],[-76.103639,42.493709],[-76.104834,42.494093],[-76.106432,42.49454],[-76.10675999999999,42.49462],[-76.10700799999999,42.494669],[-76.10734100000001,42.494722],[-76.10757599999999,42.494748],[-76.10783499999999,42.494755],[-76.10815599999999,42.494742],[-76.108439,42.49472],[-76.10878099999999,42.49468],[-76.11037899999999,42.494401],[-76.11203500000001,42.494091],[-76.112893,42.4939],[-76.11341400000001,42.49377],[-76.114008,42.493647],[-76.114422,42.493585],[-76.114727,42.493553],[-76.115104,42.493536],[-76.11596,42.493555],[-76.11639,42.493581],[-76.11682500000001,42.493624],[-76.117152,42.493677],[-76.117695,42.493812],[-76.117918,42.493887],[-76.11832099999999,42.494041],[-76.118605,42.494185],[-76.11897399999999,42.494418],[-76.119124,42.49453],[-76.11942000000001,42.494793],[-76.119568,42.494941],[-76.120659,42.49624],[-76.121528,42.4973],[-76.12178400000001,42.497645],[-76.12195699999999,42.497936],[-76.122512,42.499051],[-76.122973,42.499999],[-76.123105,42.500252],[-76.123243,42.500479],[-76.123445,42.500748],[-76.123649,42.500945],[-76.12390499999999,42.501145],[-76.124202,42.501317],[-76.124494,42.501451],[-76.124892,42.501584],[-76.12499800000001,42.501615],[-76.12787899999999,42.502272],[-76.12818300000001,42.502341],[-76.128213,42.502348],[-76.129149,42.502571],[-76.129322,42.502618],[-76.129801,42.502782],[-76.130234,42.502969],[-76.130786,42.503228],[-76.13178600000001,42.503709],[-76.132161,42.503892],[-76.13234799999999,42.503983],[-76.133531,42.504554],[-76.134276,42.504936],[-76.134725,42.505192],[-76.135048,42.505422],[-76.135756,42.505957],[-76.137019,42.506933],[-76.13729499999999,42.507119],[-76.137478,42.507223],[-76.13778499999999,42.50737],[-76.13817,42.507524],[-76.138594,42.507647],[-76.138974,42.507724],[-76.13927099999999,42.507767],[-76.13966000000001,42.507796],[-76.14095,42.507852],[-76.141081,42.507861]]],"type":"Polygon"}
}