{
  "id": "360470349002",
  "type": "Feature",
  "properties": {
    "area_land":50061,
    "area_water":0,
    "geoid":"360470349002",
    "name":"Block Group 2",
    "state":"ny"
},
  "bbox": [
    -73.931214,
    40.667672,
    -73.928261,
    40.669738
],
  "geometry": {"coordinates":[[[-73.93114,40.668581],[-73.931119,40.668798],[-73.931099,40.669019],[-73.931033,40.669738],[-73.92826100000001,40.669588],[-73.92832900000001,40.668862],[-73.92834999999999,40.668647],[-73.92837,40.668436],[-73.928443,40.667672],[-73.931214,40.667825],[-73.93114,40.668581]]],"type":"Polygon"}
}