{
  "id": "360910605031",
  "type": "Feature",
  "properties": {
    "area_land":113949497,
    "area_water":2842622,
    "geoid":"360910605031",
    "name":"Block Group 1",
    "state":"ny"
},
  "bbox": [
    -74.124335,
    43.066753,
    -73.964797,
    43.166942
],
  "geometry": {"coordinates":[[[-74.124335,43.1539],[-74.12293699999999,43.154035],[-74.12091700000001,43.154231],[-74.115943,43.154731],[-74.11535000000001,43.154771],[-74.11452300000001,43.154803],[-74.113767,43.154889],[-74.112053,43.155073],[-74.098073,43.156249],[-74.087902,43.157076],[-74.07181199999999,43.158428],[-74.06532199999999,43.158974],[-74.05459,43.159888],[-74.051937,43.160106],[-74.051098,43.160162],[-74.050911,43.160198],[-74.050076,43.160316],[-74.04448600000001,43.160719],[-74.043244,43.160852],[-74.03413,43.16162],[-74.01343,43.163318],[-74.01053,43.163568],[-73.999571,43.164517],[-73.992054,43.165383],[-73.990464,43.165566],[-73.98409700000001,43.166281],[-73.981109,43.166588],[-73.97748199999999,43.166942],[-73.97718,43.164225],[-73.977057,43.162893],[-73.976586,43.15973],[-73.97506300000001,43.14782],[-73.974683,43.144751],[-73.97426900000001,43.141289],[-73.974148,43.140628],[-73.973404,43.134369],[-73.973392,43.134292],[-73.97224199999999,43.125364],[-73.971394,43.120279],[-73.967212,43.094944],[-73.966757,43.091449],[-73.96605700000001,43.086987],[-73.964901,43.079913],[-73.964797,43.079126],[-73.96865200000001,43.078816],[-73.969577,43.078736],[-73.97905900000001,43.077913],[-73.986863,43.07717],[-73.991108,43.076906],[-73.999585,43.076113],[-74.003675,43.075797],[-74.006618,43.075508],[-74.00931199999999,43.07528],[-74.018154,43.074593],[-74.027137,43.073742],[-74.044648,43.072281],[-74.05389,43.071489],[-74.06903,43.070234],[-74.07147399999999,43.070006],[-74.077591,43.069505],[-74.08011500000001,43.069323],[-74.093847,43.068144],[-74.10072,43.067641],[-74.11062,43.066753],[-74.111981,43.07524],[-74.111997,43.075338],[-74.11207899999999,43.075851],[-74.112082,43.075868],[-74.112898,43.080956],[-74.113635,43.085549],[-74.11378499999999,43.086525],[-74.11388700000001,43.087184],[-74.11402200000001,43.088061],[-74.114277,43.089709],[-74.11429200000001,43.089806],[-74.11436,43.090243],[-74.11458500000001,43.091703],[-74.11521999999999,43.095813],[-74.115498,43.097606],[-74.115511,43.097693],[-74.116298,43.102793],[-74.116338,43.103047],[-74.116421,43.103585],[-74.116902,43.106698],[-74.116995,43.107416],[-74.117135,43.108503],[-74.117785,43.112482],[-74.11782100000001,43.112701],[-74.11919399999999,43.121666],[-74.11928399999999,43.122254],[-74.119411,43.123081],[-74.119654,43.124661],[-74.119663,43.124693],[-74.119773,43.125073],[-74.12216600000001,43.140124],[-74.12272900000001,43.143729],[-74.12318500000001,43.146646],[-74.123188,43.146665],[-74.12343,43.148218],[-74.123451,43.148349],[-74.123525,43.148608],[-74.124049,43.152034],[-74.124335,43.1539]]],"type":"Polygon"}
}