{
  "id": "360930320002",
  "type": "Feature",
  "properties": {
    "area_land":477343,
    "area_water":0,
    "geoid":"360930320002",
    "name":"Block Group 2",
    "state":"ny"
},
  "bbox": [
    -73.904157,
    42.819076,
    -73.891929,
    42.828435
],
  "geometry": {"coordinates":[[[-73.904157,42.822673],[-73.90374,42.822485],[-73.90338199999999,42.822887],[-73.902765,42.822475],[-73.901369,42.821674],[-73.898627,42.823108],[-73.89749399999999,42.823771],[-73.897048,42.824274],[-73.896315,42.825294],[-73.895769,42.825977],[-73.894773,42.826618],[-73.893978,42.827105],[-73.89319399999999,42.827628],[-73.89248600000001,42.828435],[-73.891929,42.828394],[-73.89205699999999,42.826199],[-73.892124,42.824071],[-73.892242,42.822095],[-73.892342,42.820173],[-73.893669,42.820139],[-73.893714,42.820138],[-73.89526499999999,42.819877],[-73.896922,42.819737],[-73.89864900000001,42.819743],[-73.899585,42.819885],[-73.900378,42.81955],[-73.901567,42.819076],[-73.90169,42.819555],[-73.903717,42.820582],[-73.903874,42.821191],[-73.903993,42.821892],[-73.904157,42.822673]]],"type":"Polygon"}
}