{
  "id": "361031591084",
  "type": "Feature",
  "properties": {
    "area_land":1330021,
    "area_water":0,
    "geoid":"361031591084",
    "name":"Block Group 4",
    "state":"ny"
},
  "bbox": [
    -72.989266,
    40.795461,
    -72.968002,
    40.803638
],
  "geometry": {"coordinates":[[[-72.989266,40.802337],[-72.984888,40.802607],[-72.984193,40.802646],[-72.982866,40.802742],[-72.981607,40.802802],[-72.979578,40.80294],[-72.978593,40.803012],[-72.97762299999999,40.803074],[-72.977441,40.803093],[-72.97663900000001,40.803138],[-72.97566999999999,40.803196],[-72.974756,40.803248],[-72.97467899999999,40.803253],[-72.97274,40.803387],[-72.971788,40.803455],[-72.971498,40.803481],[-72.97081799999999,40.803515],[-72.970223,40.80355],[-72.969773,40.803573],[-72.968827,40.803638],[-72.968538,40.801303],[-72.96830799999999,40.798922],[-72.96813299999999,40.797645],[-72.968086,40.797561],[-72.968002,40.796736],[-72.96910099999999,40.796661],[-72.970054,40.796585],[-72.97103199999999,40.796528],[-72.97200100000001,40.796454],[-72.972977,40.796394],[-72.973466,40.796366],[-72.97395400000001,40.796337],[-72.974929,40.796284],[-72.975877,40.796233],[-72.97685300000001,40.796157],[-72.97978999999999,40.795981],[-72.981829,40.795874],[-72.983621,40.795768],[-72.985116,40.795668],[-72.988483,40.795461],[-72.988631,40.79691],[-72.988771,40.798271],[-72.988907,40.799559],[-72.989266,40.802337]]],"type":"Polygon"}
}