{
  "id": "360050210013",
  "type": "Feature",
  "properties": {
    "area_land":16418,
    "area_water":0,
    "geoid":"360050210013",
    "name":"Block Group 3",
    "state":"ny"
},
  "bbox": [
    -73.856916,
    40.840793,
    -73.855429,
    40.842227
],
  "geometry": {"coordinates":[[[-73.856916,40.842062],[-73.856184,40.842146],[-73.855465,40.842227],[-73.855452,40.842065],[-73.855435,40.841805],[-73.855429,40.841557],[-73.855457,40.841449],[-73.855503,40.841161],[-73.855672,40.840935],[-73.85583099999999,40.84085],[-73.855941,40.84083],[-73.85602799999999,40.840816],[-73.85619800000001,40.840793],[-73.856402,40.840793],[-73.856616,40.840906],[-73.856763,40.841031],[-73.856831,40.841169],[-73.856814,40.841246],[-73.85682199999999,40.841295],[-73.856916,40.842062]]],"type":"Polygon"}
}