{
  "id": "360471014002",
  "type": "Feature",
  "properties": {
    "area_land":77384,
    "area_water":0,
    "geoid":"360471014002",
    "name":"Block Group 2",
    "state":"ny"
},
  "bbox": [
    -73.892141,
    40.63908,
    -73.887386,
    40.642611
],
  "geometry": {"coordinates":[[[-73.891426,40.641173],[-73.890683,40.641651],[-73.88994599999999,40.64213],[-73.8892,40.642611],[-73.888582,40.642055],[-73.888001,40.641533],[-73.88738600000001,40.640981],[-73.88812799999999,40.640501],[-73.88887099999999,40.640025],[-73.88961399999999,40.639542],[-73.890328,40.63908],[-73.892141,40.640712],[-73.891426,40.641173]]],"type":"Polygon"}
}