{
  "id": "360050151001",
  "type": "Feature",
  "properties": {
    "area_land":33847,
    "area_water":0,
    "geoid":"360050151001",
    "name":"Block Group 1",
    "state":"ny"
},
  "bbox": [
    -73.899449,
    40.832734,
    -73.896369,
    40.834721
],
  "geometry": {"coordinates":[[[-73.898999,40.833892],[-73.898453,40.834721],[-73.898093,40.834629],[-73.897015,40.834391],[-73.89696600000001,40.834343],[-73.89636900000001,40.83351],[-73.896754,40.833322],[-73.89689799999999,40.833254],[-73.897457,40.833042],[-73.89785500000001,40.832858],[-73.89801199999999,40.832734],[-73.898993,40.833068],[-73.899449,40.833218],[-73.898999,40.833892]]],"type":"Polygon"}
}