{
  "id": "360470216002",
  "type": "Feature",
  "properties": {
    "area_land":56639,
    "area_water":0,
    "geoid":"360470216002",
    "name":"Block Group 2",
    "state":"ny"
},
  "bbox": [
    -74.001764,
    40.631315,
    -73.997813,
    40.634326
],
  "geometry": {"coordinates":[[[-74.001178,40.63321],[-74.00059899999999,40.633765],[-74.000016,40.634326],[-73.99781299999999,40.632996],[-73.998397,40.632435],[-73.99898,40.631873],[-73.999561,40.631315],[-74.00176399999999,40.632645],[-74.001178,40.63321]]],"type":"Polygon"}
}