{
  "id": "360470180001",
  "type": "Feature",
  "properties": {
    "area_land":91643,
    "area_water":0,
    "geoid":"360470180001",
    "name":"Block Group 1",
    "state":"ny"
},
  "bbox": [
    -74.009078,
    40.607393,
    -74.003425,
    40.611325
],
  "geometry": {"coordinates":[[[-74.009078,40.608378],[-74.007535,40.609861],[-74.007311,40.610077],[-74.006683,40.610681],[-74.00601399999999,40.611325],[-74.00342499999999,40.609969],[-74.004228,40.609195],[-74.00485500000001,40.608594],[-74.005681,40.609094],[-74.007447,40.607393],[-74.008252,40.607881],[-74.009078,40.608378]]],"type":"Polygon"}
}