{
  "id": "360259714003",
  "type": "Feature",
  "properties": {
    "area_land":2434438,
    "area_water":337651,
    "geoid":"360259714003",
    "name":"Block Group 3",
    "state":"ny"
},
  "bbox": [
    -75.296694,
    41.930306,
    -75.272259,
    41.959084
],
  "geometry": {"coordinates":[[[-75.296677,41.954785],[-75.296634,41.955048],[-75.29658999999999,41.95531],[-75.296617,41.955408],[-75.296627,41.955447],[-75.29664200000001,41.955776],[-75.296627,41.95598],[-75.296575,41.956216],[-75.296532,41.956323],[-75.29627000000001,41.956397],[-75.29596600000001,41.956465],[-75.29593300000001,41.956471],[-75.295815,41.956493],[-75.295665,41.956516],[-75.295367,41.956553],[-75.295216,41.956566],[-75.29490800000001,41.956572],[-75.29445699999999,41.956537],[-75.294163,41.956497],[-75.293841,41.956448],[-75.29314599999999,41.956342],[-75.29297800000001,41.95631],[-75.29291499999999,41.956297],[-75.29219500000001,41.956173],[-75.291451,41.956031],[-75.291241,41.955987],[-75.290858,41.955903],[-75.290487,41.955822],[-75.290109,41.955733],[-75.28998799999999,41.955693],[-75.289843,41.95567],[-75.28971799999999,41.95563],[-75.288743,41.955367],[-75.288498,41.955314],[-75.28824899999999,41.955251],[-75.288115,41.955224],[-75.28756300000001,41.955137],[-75.287542,41.955194],[-75.287459,41.955586],[-75.287437,41.955645],[-75.287417,41.955767],[-75.28735,41.956073],[-75.287327,41.956177],[-75.287257,41.956433],[-75.287201,41.956618],[-75.28718499999999,41.956744],[-75.287133,41.956929],[-75.28712,41.956992],[-75.287029,41.95729],[-75.286987,41.957353],[-75.28688,41.957349],[-75.286663,41.957331],[-75.28644300000001,41.957332],[-75.28635800000001,41.957327],[-75.286272,41.957328],[-75.286185,41.957323],[-75.286098,41.957324],[-75.28603200000001,41.957318],[-75.28574500000001,41.957306],[-75.28565999999999,41.957298],[-75.285569,41.957302],[-75.285383,41.957294],[-75.285291,41.957285],[-75.285202,41.957285],[-75.285025,41.957268],[-75.284852,41.957264],[-75.284763,41.957255],[-75.284582,41.957246],[-75.28435,41.957242],[-75.28413999999999,41.957229],[-75.284024,41.957226],[-75.283856,41.957217],[-75.28371,41.957217],[-75.283556,41.957231],[-75.283468,41.957231],[-75.282937,41.957273],[-75.282754,41.957287],[-75.28237900000001,41.957324],[-75.28234999999999,41.957324],[-75.282375,41.95749],[-75.282391,41.957549],[-75.282415,41.957693],[-75.282415,41.957778],[-75.282449,41.958013],[-75.28246300000001,41.958152],[-75.282523,41.95853],[-75.282544,41.958594],[-75.282589,41.958737],[-75.282656,41.958881],[-75.282659,41.958931],[-75.28264299999999,41.95898],[-75.28260899999999,41.959025],[-75.282561,41.959057],[-75.282499,41.95908],[-75.282432,41.959084],[-75.282365,41.959076],[-75.282304,41.959049],[-75.282191,41.958986],[-75.28208100000001,41.958914],[-75.281897,41.958816],[-75.281657,41.958668],[-75.281554,41.958578],[-75.28151,41.958528],[-75.28147199999999,41.958474],[-75.281412,41.958366],[-75.281391,41.958308],[-75.281367,41.958204],[-75.281336,41.957889],[-75.281333,41.957835],[-75.281333,41.957722],[-75.281333,41.957705],[-75.281368,41.957628],[-75.281385,41.957583],[-75.281429,41.957502],[-75.281457,41.957466],[-75.281482,41.957407],[-75.28152300000001,41.957384],[-75.281569,41.957346],[-75.281645,41.957285],[-75.28174,41.957226],[-75.281779,41.957186],[-75.28189399999999,41.957118],[-75.281998,41.957032],[-75.282043,41.956987],[-75.28207999999999,41.956937],[-75.28210300000001,41.956883],[-75.282118,41.956702],[-75.28202899999999,41.956717],[-75.281758,41.956722],[-75.281668,41.956714],[-75.281615,41.956709],[-75.281566,41.9567],[-75.281471,41.956673],[-75.28142800000001,41.956655],[-75.281308,41.956588],[-75.281216,41.956561],[-75.281082,41.95655],[-75.28105100000001,41.956287],[-75.281038,41.956012],[-75.281012,41.955741],[-75.280993,41.955539],[-75.28098900000001,41.955499],[-75.280981,41.955463],[-75.28097699999999,41.95531],[-75.28096499999999,41.955278],[-75.280963,41.955206],[-75.280978,41.955104],[-75.280979,41.955075],[-75.280986,41.955062],[-75.280929,41.955071],[-75.280855,41.955089],[-75.280688,41.955121],[-75.280513,41.95514],[-75.280316,41.955145],[-75.280214,41.955143],[-75.280102,41.955141],[-75.27999199999999,41.955132],[-75.27988000000001,41.955128],[-75.279769,41.955119],[-75.279657,41.955115],[-75.27944100000001,41.955097],[-75.279071,41.955076],[-75.279016,41.955071],[-75.278496,41.95505],[-75.278057,41.955024],[-75.27797700000001,41.955015],[-75.27762300000001,41.954998],[-75.27752599999999,41.954989],[-75.277432,41.95499],[-75.27678,41.95496],[-75.276678,41.954951],[-75.276574,41.954947],[-75.276472,41.954938],[-75.276374,41.954934],[-75.27619,41.95492],[-75.275961,41.95491],[-75.27598399999999,41.954646],[-75.27598399999999,41.954583],[-75.27604100000001,41.954061],[-75.276053,41.953989],[-75.27606900000001,41.953962],[-75.276234,41.953966],[-75.276363,41.953965],[-75.27651,41.95397],[-75.276614,41.953974],[-75.276786,41.953987],[-75.276974,41.953995],[-75.277089,41.954004],[-75.277208,41.954008],[-75.277315,41.954017],[-75.27742499999999,41.954021],[-75.277528,41.95403],[-75.277653,41.954036],[-75.277321,41.953246],[-75.277078,41.95279],[-75.27695,41.952592],[-75.276775,41.952398],[-75.276647,41.952191],[-75.276511,41.952013],[-75.27620400000001,41.951624],[-75.27591099999999,41.95126],[-75.27561,41.95086],[-75.27538800000001,41.950509],[-75.275255,41.950262],[-75.27519599999999,41.950113],[-75.275132,41.950023],[-75.27507799999999,41.94987],[-75.27497,41.949596],[-75.274874,41.949317],[-75.274789,41.949029],[-75.274407,41.947593],[-75.2743,41.947166],[-75.27417,41.946581],[-75.274036,41.945842],[-75.273933,41.945392],[-75.273714,41.944627],[-75.273461,41.943858],[-75.273363,41.943515],[-75.27333,41.943399],[-75.273228,41.942931],[-75.273155,41.942524],[-75.273141,41.942444],[-75.273065,41.941927],[-75.273026,41.941585],[-75.272998,41.941233],[-75.272982,41.940878],[-75.27297900000001,41.940166],[-75.27298500000001,41.93963],[-75.273202,41.939634],[-75.27328799999999,41.939634],[-75.273312,41.939552],[-75.27330499999999,41.939294],[-75.273335,41.939141],[-75.273386,41.93902],[-75.27347399999999,41.93891],[-75.27357000000001,41.938817],[-75.273791,41.938663],[-75.27396,41.938471],[-75.27406999999999,41.938279],[-75.274232,41.937933],[-75.274247,41.937598],[-75.27418900000001,41.937269],[-75.274152,41.937164],[-75.274086,41.937054],[-75.274057,41.936901],[-75.274057,41.93672],[-75.27405899999999,41.9367],[-75.273859,41.935973],[-75.273844,41.935918],[-75.273815,41.93583],[-75.273741,41.935687],[-75.273719,41.935588],[-75.27366000000001,41.935467],[-75.273565,41.935094],[-75.273484,41.93488],[-75.273521,41.934677],[-75.27363200000001,41.934441],[-75.273669,41.934188],[-75.273617,41.934078],[-75.27353599999999,41.933947],[-75.27338899999999,41.933606],[-75.27325,41.93337],[-75.273177,41.933183],[-75.273066,41.932991],[-75.27290499999999,41.932804],[-75.272809,41.93259],[-75.272706,41.932403],[-75.272611,41.932167],[-75.27252300000001,41.932025],[-75.272464,41.931816],[-75.272317,41.931399],[-75.27225900000001,41.931053],[-75.272296,41.930915],[-75.272318,41.93063],[-75.27230299999999,41.930498],[-75.272333,41.930388],[-75.272406,41.930306],[-75.27301199999999,41.930454],[-75.273392,41.930794],[-75.27409900000001,41.931066],[-75.275943,41.932008],[-75.276354,41.932217],[-75.276563,41.932324],[-75.277036,41.932494],[-75.277175,41.932544],[-75.277243,41.933598],[-75.277672,41.934414],[-75.278385,41.935767],[-75.278938,41.937589],[-75.278993,41.938059],[-75.27903999999999,41.93846],[-75.279087,41.93886],[-75.279094,41.938917],[-75.27952500000001,41.939092],[-75.28069000000001,41.939567],[-75.28109000000001,41.939749],[-75.28255900000001,41.940416],[-75.28413,41.941556],[-75.284679,41.941954],[-75.286935,41.942202],[-75.287295,41.942303],[-75.28832199999999,41.942592],[-75.289349,41.942882],[-75.289383,41.942891],[-75.290966,41.945039],[-75.291155,41.945536],[-75.29115899999999,41.945573],[-75.2914,41.946166],[-75.29164400000001,41.946796],[-75.291754,41.947082],[-75.291766,41.947279],[-75.291766,41.947293],[-75.291798,41.947866],[-75.291831,41.948445],[-75.29190199999999,41.948686],[-75.291814,41.949388],[-75.291726,41.950091],[-75.29161499999999,41.950976],[-75.291552,41.951488],[-75.29151899999999,41.951753],[-75.29148600000001,41.952018],[-75.29147399999999,41.952117],[-75.291472,41.952135],[-75.29147,41.952152],[-75.291456,41.95226],[-75.291453,41.952287],[-75.29145,41.952312],[-75.29143000000001,41.952477],[-75.291488,41.952548],[-75.29201,41.953188],[-75.29253300000001,41.953828],[-75.29258900000001,41.953897],[-75.293713,41.954593],[-75.29408100000001,41.954643],[-75.295236,41.954798],[-75.296694,41.954679],[-75.296677,41.954785]]],"type":"Polygon"}
}