{
  "id": "361031122122",
  "type": "Feature",
  "properties": {
    "area_land":3695615,
    "area_water":0,
    "geoid":"361031122122",
    "name":"Block Group 2",
    "state":"ny"
},
  "bbox": [
    -73.380746,
    40.788976,
    -73.342136,
    40.81263
],
  "geometry": {"coordinates":[[[-73.380746,40.807331],[-73.380458,40.807821],[-73.38036700000001,40.807977],[-73.37924,40.809564],[-73.379,40.809901],[-73.377938,40.8098],[-73.377437,40.809757],[-73.376803,40.80971],[-73.376259,40.809647],[-73.37266200000001,40.809374],[-73.37086499999999,40.809229],[-73.369669,40.809122],[-73.368644,40.808997],[-73.367583,40.808898],[-73.36624,40.808777],[-73.364981,40.808658],[-73.364165,40.808589],[-73.36368299999999,40.808535],[-73.362539,40.808519],[-73.362433,40.808525],[-73.360732,40.808685],[-73.35876399999999,40.80899],[-73.358373,40.809105],[-73.358054,40.809219],[-73.35777899999999,40.80931],[-73.35707600000001,40.809664],[-73.35539799999999,40.810524],[-73.353903,40.811576],[-73.353308,40.811839],[-73.353144,40.8119],[-73.3524,40.812176],[-73.35213899999999,40.812251],[-73.35178999999999,40.81237],[-73.35120999999999,40.812495],[-73.350814,40.812572],[-73.35048500000001,40.81263],[-73.349661,40.812602],[-73.34870600000001,40.812552],[-73.348364,40.812522],[-73.347173,40.812392],[-73.34690000000001,40.812369],[-73.345799,40.81235],[-73.345011,40.812313],[-73.344335,40.812302],[-73.343318,40.812296],[-73.34235,40.812306],[-73.34218199999999,40.812308],[-73.342136,40.811568],[-73.34214799999999,40.81121],[-73.342325,40.811214],[-73.346684,40.811312],[-73.34707899999999,40.811266],[-73.347461,40.811142],[-73.347753,40.811009],[-73.34799099999999,40.810802],[-73.34817700000001,40.81055],[-73.34848100000001,40.810038],[-73.34918999999999,40.808874],[-73.349509,40.808368],[-73.34971299999999,40.8082],[-73.34992099999999,40.808062],[-73.350195,40.807944],[-73.35028200000001,40.807912],[-73.35052899999999,40.807821],[-73.35058100000001,40.807802],[-73.35144,40.807486],[-73.353452,40.806755],[-73.353774,40.806637],[-73.355154,40.806148],[-73.35788599999999,40.805163],[-73.358313,40.804957],[-73.358687,40.804721],[-73.358954,40.804503],[-73.36063900000001,40.802891],[-73.361182,40.802344],[-73.361936,40.801609],[-73.36350899999999,40.800106],[-73.363944,40.799724],[-73.364226,40.799361],[-73.364402,40.799075],[-73.364493,40.798836],[-73.364676,40.797966],[-73.36495600000001,40.796619],[-73.365064,40.796097],[-73.364823,40.796027],[-73.364417,40.796],[-73.363502,40.796013],[-73.362464,40.795711],[-73.362143,40.795653],[-73.361884,40.795639],[-73.361625,40.795645],[-73.361312,40.795662],[-73.360617,40.795707],[-73.36005299999999,40.795726],[-73.35961,40.795726],[-73.35858899999999,40.795722],[-73.357979,40.795685],[-73.35715500000001,40.795493],[-73.35679500000001,40.795367],[-73.356245,40.795191],[-73.355673,40.79511],[-73.354845,40.795039],[-73.354086,40.794747],[-73.353658,40.794502],[-73.353486,40.794689],[-73.353227,40.79489],[-73.352985,40.795047],[-73.35272999999999,40.795147],[-73.352447,40.795233],[-73.351963,40.795366],[-73.350216,40.7958],[-73.349919,40.795842],[-73.349694,40.795842],[-73.349208,40.795792],[-73.348867,40.795745],[-73.348438,40.795563],[-73.348319,40.795566],[-73.34805799999999,40.795639],[-73.347335,40.795886],[-73.346412,40.796223],[-73.345313,40.796661],[-73.343968,40.797213],[-73.342457,40.797884],[-73.34223799999999,40.797982],[-73.342181,40.797606],[-73.342409,40.797506],[-73.342731,40.797367],[-73.346098,40.795958],[-73.34702799999999,40.795609],[-73.347185,40.795553],[-73.347373,40.795496],[-73.348708,40.795048],[-73.35007899999999,40.794635],[-73.351429,40.794274],[-73.352328,40.794052],[-73.353058,40.793888],[-73.35890999999999,40.792607],[-73.361447,40.792052],[-73.362178,40.791884],[-73.363708,40.791512],[-73.364462,40.791321],[-73.366051,40.790895],[-73.367949,40.790363],[-73.36825899999999,40.790276],[-73.36905400000001,40.790055],[-73.369615,40.789897],[-73.372452,40.789115],[-73.37309500000001,40.788976],[-73.37354499999999,40.789885],[-73.373976,40.790728],[-73.374138,40.791144],[-73.37437300000001,40.791691],[-73.375052,40.792984],[-73.375664,40.794857],[-73.375946,40.795395],[-73.376099,40.795638],[-73.37658500000001,40.795578],[-73.376868,40.795531],[-73.37728,40.795444],[-73.377458,40.795723],[-73.37791300000001,40.796398],[-73.37815000000001,40.796661],[-73.379705,40.798377],[-73.379576,40.798969],[-73.37941600000001,40.79927],[-73.379043,40.799873],[-73.378998,40.800113],[-73.378969,40.800366],[-73.379198,40.800963],[-73.379414,40.801428],[-73.379496,40.801603],[-73.379741,40.802109],[-73.379749,40.802603],[-73.379645,40.802848],[-73.379546,40.803093],[-73.37952300000001,40.803314],[-73.37967500000001,40.803879],[-73.379693,40.803987],[-73.379721,40.804149],[-73.379797,40.804744],[-73.379943,40.805298],[-73.380189,40.806335],[-73.380641,40.807144],[-73.380746,40.807331]]],"type":"Polygon"}
}