{
  "id": "360550142034",
  "type": "Feature",
  "properties": {
    "area_land":889060,
    "area_water":0,
    "geoid":"360550142034",
    "name":"Block Group 4",
    "state":"ny"
},
  "bbox": [
    -77.713413,
    43.164572,
    -77.701538,
    43.173152
],
  "geometry": {"coordinates":[[[-77.713413,43.172159],[-77.712913,43.172049],[-77.711741,43.171785],[-77.711747,43.172375],[-77.71175700000001,43.173098],[-77.70829999999999,43.173108],[-77.70663,43.173122],[-77.704961,43.173137],[-77.701593,43.173152],[-77.701595,43.173033],[-77.7016,43.17244],[-77.701601,43.172345],[-77.701604,43.171603],[-77.701571,43.169557],[-77.701538,43.167259],[-77.70154100000001,43.164647],[-77.70276,43.164642],[-77.704928,43.164629],[-77.705777,43.164623],[-77.706541,43.164617],[-77.70833500000001,43.164605],[-77.708682,43.164603],[-77.709979,43.164592],[-77.71156000000001,43.164581],[-77.712259,43.164577],[-77.713249,43.164572],[-77.71328699999999,43.165572],[-77.713309,43.166584],[-77.713379,43.169925],[-77.71339500000001,43.170881],[-77.713413,43.172159]]],"type":"Polygon"}
}