{
  "id": "361019623003",
  "type": "Feature",
  "properties": {
    "area_land":1093612,
    "area_water":0,
    "geoid":"361019623003",
    "name":"Block Group 3",
    "state":"ny"
},
  "bbox": [
    -77.105343,
    42.154375,
    -77.090249,
    42.169031
],
  "geometry": {"coordinates":[[[-77.105341,42.16403],[-77.104726,42.164569],[-77.104507,42.164737],[-77.103937,42.165131],[-77.103615,42.165382],[-77.10328199999999,42.165595],[-77.103161,42.165674],[-77.10314,42.165689],[-77.102604,42.166066],[-77.102312,42.166289],[-77.10196500000001,42.166502],[-77.101574,42.1667],[-77.101468,42.166766],[-77.101286,42.166879],[-77.101074,42.16709],[-77.101034,42.167152],[-77.101018,42.167241],[-77.100987,42.167414],[-77.100959,42.167477],[-77.100888,42.167631],[-77.10081599999999,42.167763],[-77.100489,42.168245],[-77.100238,42.168777],[-77.100076,42.169031],[-77.099283,42.168771],[-77.09903199999999,42.168674],[-77.09889099999999,42.16862],[-77.09868899999999,42.168531],[-77.098508,42.168455],[-77.097763,42.168073],[-77.097416,42.16787],[-77.09715799999999,42.167706],[-77.096963,42.167578],[-77.09644900000001,42.167174],[-77.096155,42.166915],[-77.09607800000001,42.166847],[-77.09543499999999,42.166247],[-77.094956,42.165747],[-77.09319499999999,42.163653],[-77.092741,42.163114],[-77.09217599999999,42.162441],[-77.091444,42.161547],[-77.09098,42.160941],[-77.090783,42.160685],[-77.090249,42.160016],[-77.09128200000001,42.15928],[-77.092071,42.158731],[-77.09211500000001,42.158701],[-77.092191,42.158648],[-77.092343,42.158544],[-77.093751,42.157549],[-77.09383699999999,42.157482],[-77.09395600000001,42.157402],[-77.09398,42.157343],[-77.09420799999999,42.15718],[-77.094222,42.157168],[-77.09432200000001,42.157081],[-77.094359,42.157056],[-77.094555,42.156925],[-77.094403,42.156806],[-77.094281,42.156711],[-77.09421399999999,42.156552],[-77.09417000000001,42.156447],[-77.094088,42.156123],[-77.09393,42.155747],[-77.09388300000001,42.155683],[-77.09392099999999,42.155507],[-77.09394500000001,42.155395],[-77.09429900000001,42.15519],[-77.094447,42.154906],[-77.09472700000001,42.154861],[-77.09497,42.15484],[-77.09531200000001,42.154749],[-77.095697,42.154605],[-77.096171,42.154375],[-77.097027,42.154526],[-77.097089,42.154537],[-77.097319,42.154591],[-77.097556,42.154668],[-77.09767100000001,42.154721],[-77.097802,42.154781],[-77.098024,42.154912],[-77.098128,42.154984],[-77.098202,42.155034],[-77.09848700000001,42.155247],[-77.09851399999999,42.155269],[-77.09867,42.1554],[-77.09878999999999,42.155528],[-77.09917900000001,42.156047],[-77.099639,42.156661],[-77.10119299999999,42.158533],[-77.102058,42.159473],[-77.104541,42.162016],[-77.104738,42.162238],[-77.105053,42.162675],[-77.105177,42.162941],[-77.105267,42.163222],[-77.105329,42.163539],[-77.105343,42.163834],[-77.105341,42.16403]]],"type":"Polygon"}
}