{
  "id": "361119542003",
  "type": "Feature",
  "properties": {
    "area_land":44801074,
    "area_water":229592,
    "geoid":"361119542003",
    "name":"Block Group 3",
    "state":"ny"
},
  "bbox": [
    -74.303632,
    41.656265,
    -74.173764,
    41.737992
],
  "geometry": {"coordinates":[[[-74.301123,41.695225],[-74.29901599999999,41.695762],[-74.28854200000001,41.700385],[-74.283751,41.699007],[-74.280179,41.701567],[-74.271553,41.700233],[-74.271131,41.700131],[-74.270518,41.700355],[-74.26765899999999,41.700993],[-74.266032,41.701427],[-74.26539200000001,41.701598],[-74.26433400000001,41.701881],[-74.263924,41.70199],[-74.260246,41.702561],[-74.259714,41.702659],[-74.259315,41.702727],[-74.25480899999999,41.70553],[-74.251369,41.707924],[-74.25134,41.708207],[-74.249576,41.709801],[-74.249233,41.71034],[-74.24165000000001,41.714538],[-74.241551,41.714631],[-74.241079,41.714909],[-74.24088,41.715091],[-74.23960599999999,41.715618],[-74.23893200000001,41.716015],[-74.240047,41.714647],[-74.242435,41.711998],[-74.243801,41.710296],[-74.24471800000001,41.70948],[-74.245346,41.708659],[-74.24544400000001,41.708531],[-74.24598899999999,41.707636],[-74.246578,41.706267],[-74.246803,41.705159],[-74.247163,41.703849],[-74.247523,41.70274],[-74.248243,41.701262],[-74.249188,41.699582],[-74.249728,41.698138],[-74.25004300000001,41.69629],[-74.25004300000001,41.69535],[-74.25013300000001,41.694812],[-74.25001899999999,41.694374],[-74.24977699999999,41.693676],[-74.249511,41.693172],[-74.248334,41.693739],[-74.248188,41.693864],[-74.245816,41.695433],[-74.242875,41.696887],[-74.240725,41.698436],[-74.237129,41.701734],[-74.233952,41.703169],[-74.23033700000001,41.704028],[-74.230239,41.704104],[-74.229251,41.704302],[-74.228086,41.70504],[-74.227575,41.705635],[-74.225548,41.707544],[-74.222492,41.711033],[-74.224011,41.715165],[-74.222555,41.715869],[-74.225453,41.719378],[-74.226592,41.720769],[-74.227486,41.721873],[-74.225396,41.729352],[-74.220411,41.734069],[-74.220371,41.734127],[-74.219784,41.734625],[-74.21887,41.735207],[-74.218171,41.735673],[-74.21810600000001,41.735835],[-74.21748100000001,41.736588],[-74.216379,41.737651],[-74.216301,41.737594],[-74.216194,41.737501],[-74.216047,41.73734],[-74.21591600000001,41.737151],[-74.215824,41.736957],[-74.215777,41.736798],[-74.21575799999999,41.736586],[-74.215777,41.736366],[-74.215839,41.736125],[-74.216099,41.735401],[-74.216205,41.735125],[-74.21633300000001,41.734736],[-74.21639999999999,41.734388],[-74.21641200000001,41.733972],[-74.21638799999999,41.733696],[-74.21634400000001,41.733482],[-74.216184,41.732954],[-74.215538,41.731033],[-74.21540400000001,41.730759],[-74.215284,41.730591],[-74.215164,41.73046],[-74.214961,41.730288],[-74.214725,41.730136],[-74.214493,41.73002],[-74.214241,41.729927],[-74.213899,41.729846],[-74.213561,41.729808],[-74.213494,41.729804],[-74.213189,41.729813],[-74.21289299999999,41.729847],[-74.21266799999999,41.729897],[-74.212373,41.729992],[-74.21171099999999,41.730289],[-74.211293,41.730519],[-74.21092899999999,41.730741],[-74.21053000000001,41.731014],[-74.21023599999999,41.731242],[-74.209975,41.731466],[-74.209639,41.731794],[-74.209515,41.731936],[-74.20932500000001,41.73221],[-74.20869999999999,41.73302],[-74.20839700000001,41.733334],[-74.207982,41.733676],[-74.207629,41.733915],[-74.20729300000001,41.734107],[-74.206754,41.734357],[-74.206496,41.734451],[-74.205949,41.73461],[-74.205539,41.734697],[-74.205268,41.734738],[-74.204808,41.734795],[-74.2037,41.734911],[-74.202732,41.735018],[-74.20231,41.735096],[-74.202067,41.735159],[-74.20165799999999,41.735294],[-74.196561,41.737231],[-74.196172,41.737366],[-74.195898,41.737431],[-74.195689,41.737444],[-74.195502,41.737427],[-74.195318,41.737386],[-74.195165,41.737333],[-74.19494,41.737212],[-74.194717,41.737048],[-74.19421800000001,41.736667],[-74.194113,41.7366],[-74.19391,41.736502],[-74.193062,41.736188],[-74.192547,41.736018],[-74.192278,41.735978],[-74.19213499999999,41.73598],[-74.19195499999999,41.736005],[-74.191588,41.736107],[-74.191346,41.736163],[-74.191057,41.736169],[-74.19059,41.736137],[-74.19039600000001,41.736148],[-74.19023900000001,41.736178],[-74.190033,41.736256],[-74.189939,41.736307],[-74.189448,41.736621],[-74.18923599999999,41.736721],[-74.189042,41.73678],[-74.18870200000001,41.736849],[-74.188225,41.736902],[-74.187867,41.736906],[-74.18764,41.736895],[-74.187321,41.736898],[-74.186701,41.736948],[-74.18592200000001,41.737039],[-74.185782,41.737062],[-74.185498,41.73714],[-74.18524600000001,41.737245],[-74.18500899999999,41.737386],[-74.184791,41.737557],[-74.184466,41.737898],[-74.18438,41.737966],[-74.18431,41.737992],[-74.18423300000001,41.73799],[-74.184167,41.737955],[-74.184145,41.737909],[-74.184162,41.737848],[-74.18425999999999,41.737744],[-74.18432199999999,41.737691],[-74.184731,41.73734],[-74.185057,41.737008],[-74.185089,41.736968],[-74.185429,41.736548],[-74.18558299999999,41.736392],[-74.185823,41.736207],[-74.18610200000001,41.736051],[-74.186269,41.735982],[-74.18653999999999,41.735905],[-74.187167,41.735828],[-74.18745,41.735753],[-74.187709,41.735624],[-74.18783500000001,41.735526],[-74.18840299999999,41.734971],[-74.18857800000001,41.73483],[-74.18874099999999,41.734732],[-74.188999,41.734624],[-74.18947300000001,41.734474],[-74.189891,41.734312],[-74.19023799999999,41.734127],[-74.190468,41.733981],[-74.190668,41.733835],[-74.190712,41.733796],[-74.19095,41.73359],[-74.191261,41.733276],[-74.191362,41.73314],[-74.19145899999999,41.732969],[-74.191524,41.732777],[-74.191565,41.732533],[-74.191554,41.732313],[-74.191503,41.731912],[-74.191489,41.731597],[-74.191501,41.731331],[-74.19156,41.731],[-74.19165700000001,41.73073],[-74.191801,41.730438],[-74.19222499999999,41.729717],[-74.192328,41.729542],[-74.192427,41.729329],[-74.192536,41.728995],[-74.192592,41.7287],[-74.19260800000001,41.728238],[-74.192622,41.727952],[-74.192667,41.727625],[-74.192697,41.727483],[-74.192792,41.727214],[-74.192965,41.726859],[-74.19315,41.726589],[-74.19324899999999,41.726467],[-74.19384700000001,41.725814],[-74.19407699999999,41.7255],[-74.194256,41.725142],[-74.194366,41.724785],[-74.194514,41.723852],[-74.194587,41.723582],[-74.194734,41.723228],[-74.19510699999999,41.722466],[-74.195363,41.722051],[-74.195376,41.72203],[-74.195702,41.72155],[-74.195829,41.721316],[-74.195887,41.721184],[-74.19596799999999,41.720949],[-74.196727,41.717958],[-74.19678,41.717788],[-74.19681799999999,41.71767],[-74.196952,41.717313],[-74.197131,41.716957],[-74.19735900000001,41.716594],[-74.197841,41.715917],[-74.197914,41.715815],[-74.198065,41.715614],[-74.19818600000001,41.715614],[-74.198305,41.715598],[-74.19840000000001,41.715564],[-74.198504,41.715503],[-74.19876499999999,41.715285],[-74.19897400000001,41.715085],[-74.199116,41.714973],[-74.19945800000001,41.71478],[-74.199594,41.714687],[-74.200146,41.714233],[-74.199854,41.71389],[-74.199303,41.713155],[-74.19924899999999,41.713101],[-74.19917,41.713057],[-74.19896799999999,41.713044],[-74.19895099999999,41.712967],[-74.19887300000001,41.71273],[-74.19875999999999,41.712483],[-74.19861899999999,41.712249],[-74.196995,41.709878],[-74.195322,41.707551],[-74.195189,41.707343],[-74.195103,41.707178],[-74.19463,41.70627],[-74.194317,41.705621],[-74.19418400000001,41.705266],[-74.19362700000001,41.703175],[-74.192938,41.700365],[-74.19274,41.699583],[-74.192622,41.699271],[-74.192519,41.699067],[-74.192364,41.698822],[-74.192291,41.698724],[-74.192182,41.698596],[-74.191985,41.698403],[-74.19180799999999,41.698251],[-74.191484,41.698015],[-74.190038,41.697078],[-74.189302,41.696593],[-74.18815499999999,41.69586],[-74.187299,41.695312],[-74.187072,41.695167],[-74.18436699999999,41.693482],[-74.18401799999999,41.693262],[-74.18314599999999,41.692713],[-74.182742,41.69246],[-74.180266,41.690978],[-74.17977999999999,41.690726],[-74.179338,41.690549],[-74.17887500000001,41.690397],[-74.178804,41.69038],[-74.17846299999999,41.690298],[-74.178083,41.690229],[-74.17512000000001,41.689833],[-74.174786,41.689788],[-74.17478,41.689492],[-74.174773,41.689409],[-74.174763,41.689348],[-74.17469800000001,41.689141],[-74.17423700000001,41.688087],[-74.174182,41.68796],[-74.174137,41.687857],[-74.17407,41.687701],[-74.17399500000001,41.687519],[-74.17395999999999,41.687448],[-74.173861,41.687245],[-74.17378600000001,41.68701],[-74.17376899999999,41.686884],[-74.17376400000001,41.686718],[-74.17379099999999,41.686486],[-74.173832,41.686336],[-74.174025,41.685808],[-74.174144,41.685399],[-74.17425799999999,41.68484],[-74.174361,41.684155],[-74.174376,41.683882],[-74.174361,41.682697],[-74.174374,41.682319],[-74.174409,41.682052],[-74.17447799999999,41.681763],[-74.174685,41.681085],[-74.174845,41.680503],[-74.174896,41.680223],[-74.175307,41.678298],[-74.175623,41.676908],[-74.176016,41.677],[-74.17697200000001,41.677272],[-74.177809,41.677511],[-74.17868900000001,41.67775],[-74.179134,41.677896],[-74.179455,41.678019],[-74.17991499999999,41.67822],[-74.18012,41.678319],[-74.18053,41.678561],[-74.180858,41.678782],[-74.18111399999999,41.678976],[-74.181719,41.679474],[-74.182166,41.679866],[-74.18297200000001,41.680537],[-74.183807,41.681174],[-74.184372,41.681641],[-74.184662,41.681848],[-74.185166,41.682138],[-74.185483,41.682291],[-74.18562300000001,41.682346],[-74.185908,41.682424],[-74.187101,41.682649],[-74.18744599999999,41.682731],[-74.18865700000001,41.683101],[-74.188971,41.683221],[-74.18930899999999,41.683396],[-74.18989000000001,41.68316],[-74.191446,41.681289],[-74.19210200000001,41.680485],[-74.192499,41.680015],[-74.19284399999999,41.679592],[-74.193234,41.679116],[-74.193855,41.678387],[-74.195127,41.676864],[-74.197435,41.674126],[-74.197464,41.674091],[-74.198297,41.673102],[-74.198342,41.673047],[-74.198537,41.672809],[-74.199736,41.671392],[-74.200153,41.670911],[-74.20052,41.670424],[-74.200813,41.669916],[-74.201491,41.668451],[-74.201797,41.667788],[-74.202361,41.666509],[-74.20289,41.665371],[-74.203091,41.664929],[-74.20348,41.66404],[-74.203508,41.663974],[-74.203868,41.662962],[-74.204553,41.661035],[-74.204829,41.660342],[-74.204843,41.660307],[-74.205776,41.657715],[-74.20626799999999,41.656288],[-74.206276,41.656265],[-74.21074,41.657288],[-74.217555,41.658871],[-74.225353,41.660674],[-74.231218,41.662073],[-74.233372,41.662607],[-74.239976,41.664146],[-74.245662,41.665439],[-74.249568,41.666374],[-74.249944,41.666535],[-74.252381,41.667065],[-74.25436500000001,41.66749],[-74.258881,41.668439],[-74.265114,41.669678],[-74.26741,41.670136],[-74.26890400000001,41.670435],[-74.27019799999999,41.669873],[-74.270335,41.669827],[-74.27099,41.669605],[-74.27417,41.668852],[-74.282687,41.666061],[-74.283654,41.668458],[-74.285843,41.673736],[-74.286766,41.674812],[-74.287323,41.67548],[-74.28755200000001,41.675749],[-74.290305,41.67905],[-74.29338,41.682629],[-74.29652400000001,41.686319],[-74.298154,41.688232],[-74.30363199999999,41.694589],[-74.301123,41.695225]]],"type":"Polygon"}
}