{
  "id": "360670040001",
  "type": "Feature",
  "properties": {
    "area_land":501636,
    "area_water":0,
    "geoid":"360670040001",
    "name":"Block Group 1",
    "state":"ny"
},
  "bbox": [
    -76.172396,
    43.038333,
    -76.153869,
    43.04365
],
  "geometry": {"coordinates":[[[-76.17202899999999,43.040929],[-76.17200099999999,43.040999],[-76.17181600000001,43.041465],[-76.17164099999999,43.041908],[-76.171283,43.042829],[-76.17093800000001,43.042841],[-76.169505,43.042924],[-76.168605,43.042953],[-76.16761099999999,43.043003],[-76.164053,43.043165],[-76.161171,43.04331],[-76.160461,43.043336],[-76.15963600000001,43.043386],[-76.158873,43.043418],[-76.158191,43.043451],[-76.15797600000001,43.043459],[-76.157844,43.043464],[-76.157044,43.043493],[-76.156122,43.043543],[-76.154725,43.043603],[-76.15392,43.04365],[-76.153891,43.043516],[-76.153871,43.043255],[-76.153869,43.043171],[-76.153875,43.042969],[-76.153902,43.042839],[-76.153935,43.042767],[-76.154174,43.042474],[-76.15465500000001,43.041902],[-76.155153,43.041166],[-76.155418,43.040527],[-76.15547100000001,43.040371],[-76.155486,43.040194],[-76.155423,43.03986],[-76.15537399999999,43.039654],[-76.15523399999999,43.039069],[-76.155205,43.038679],[-76.155154,43.038472],[-76.156053,43.038333],[-76.15610100000001,43.03841],[-76.156285,43.038576],[-76.156414,43.038671],[-76.156756,43.038922],[-76.157363,43.039363],[-76.157893,43.039749],[-76.158163,43.039962],[-76.158185,43.03998],[-76.15850399999999,43.039759],[-76.15918499999999,43.03926],[-76.160425,43.04017],[-76.161312,43.040803],[-76.161755,43.040466],[-76.161895,43.040483],[-76.162308,43.040481],[-76.16381800000001,43.040399],[-76.16408199999999,43.040389],[-76.16545000000001,43.04032],[-76.16739,43.040238],[-76.16988600000001,43.04012],[-76.170838,43.040071],[-76.17239600000001,43.040012],[-76.17202899999999,43.040929]]],"type":"Polygon"}
}