{
  "id": "360050462025",
  "type": "Feature",
  "properties": {
    "area_land":132158,
    "area_water":0,
    "geoid":"360050462025",
    "name":"Block Group 5",
    "state":"ny"
},
  "bbox": [
    -73.839248,
    40.871109,
    -73.834904,
    40.876954
],
  "geometry": {"coordinates":[[[-73.83841099999999,40.876868],[-73.838148,40.876954],[-73.83725099999999,40.876568],[-73.835823,40.875989],[-73.835719,40.875757],[-73.835588,40.875533],[-73.83548999999999,40.875334],[-73.83540499999999,40.875123],[-73.835339,40.874916],[-73.83525299999999,40.874493],[-73.835249,40.874385],[-73.835267,40.87428],[-73.835308,40.874177],[-73.835356,40.874101],[-73.835421,40.874023],[-73.83550099999999,40.873953],[-73.835599,40.873888],[-73.835706,40.873836],[-73.835818,40.873798],[-73.83490399999999,40.871912],[-73.835773,40.871632],[-73.83657599999999,40.871373],[-73.837402,40.871109],[-73.838292,40.872951],[-73.837461,40.873223],[-73.83835500000001,40.874922],[-73.839248,40.876619],[-73.83841099999999,40.876868]]],"type":"Polygon"}
}