{
  "id": "360670017011",
  "type": "Feature",
  "properties": {
    "area_land":332221,
    "area_water":0,
    "geoid":"360670017011",
    "name":"Block Group 1",
    "state":"ny"
},
  "bbox": [
    -76.13053,
    43.057995,
    -76.122193,
    43.065024
],
  "geometry": {"coordinates":[[[-76.13052999999999,43.061162],[-76.128664,43.062079],[-76.12853,43.062144],[-76.128016,43.062397],[-76.126867,43.062956],[-76.126068,43.063348],[-76.124955,43.063899],[-76.12364700000001,43.064541],[-76.122686,43.065024],[-76.12266200000001,43.064687],[-76.122632,43.064261],[-76.122576,43.063492],[-76.12254299999999,43.063021],[-76.122525,43.062736],[-76.122467,43.061955],[-76.12241400000001,43.061185],[-76.122398,43.060965],[-76.12232899999999,43.060038],[-76.122305,43.059672],[-76.122266,43.05915],[-76.122207,43.058401],[-76.122193,43.058231],[-76.12258300000001,43.058214],[-76.123574,43.058174],[-76.124426,43.058142],[-76.124999,43.058114],[-76.125167,43.058097],[-76.12566200000001,43.058075],[-76.126587,43.058034],[-76.127717,43.057995],[-76.127799,43.058011],[-76.127849,43.058065],[-76.12794100000001,43.058167],[-76.12929800000001,43.059755],[-76.129784,43.060303],[-76.13052999999999,43.061162]]],"type":"Polygon"}
}