{
  "id": "361031476024",
  "type": "Feature",
  "properties": {
    "area_land":1035668,
    "area_water":0,
    "geoid":"361031476024",
    "name":"Block Group 4",
    "state":"ny"
},
  "bbox": [
    -73.126746,
    40.742954,
    -73.111962,
    40.755095
],
  "geometry": {"coordinates":[[[-73.126746,40.749182],[-73.125598,40.75074],[-73.125349,40.751078],[-73.125028,40.751514],[-73.12458100000001,40.752124],[-73.124943,40.752228],[-73.124396,40.752372],[-73.12391100000001,40.752475],[-73.12328100000001,40.752644],[-73.12106,40.753126],[-73.12035400000001,40.753276],[-73.119428,40.753477],[-73.118882,40.753589],[-73.117999,40.753774],[-73.116466,40.754134],[-73.11472999999999,40.754622],[-73.11317099999999,40.755095],[-73.113135,40.754915],[-73.113043,40.754444],[-73.11301400000001,40.754255],[-73.112961,40.753897],[-73.1129,40.753486],[-73.112893,40.752962],[-73.11252500000001,40.750405],[-73.11247,40.75002],[-73.11218,40.748118],[-73.111994,40.746797],[-73.11198,40.746636],[-73.111983,40.746298],[-73.11197799999999,40.743904],[-73.11196200000001,40.743226],[-73.111963,40.742954],[-73.113609,40.743001],[-73.115014,40.743034],[-73.11524799999999,40.743079],[-73.116084,40.74343],[-73.116366,40.743557],[-73.11721900000001,40.743919],[-73.11749500000001,40.744047],[-73.118031,40.744275],[-73.118298,40.744383],[-73.118905,40.744659],[-73.119285,40.744824],[-73.119455,40.744883],[-73.119631,40.744904],[-73.120262,40.7449],[-73.120288,40.746706],[-73.120918,40.746704],[-73.121025,40.74673],[-73.121559,40.746962],[-73.121886,40.747107],[-73.12234599999999,40.7473],[-73.122651,40.747441],[-73.12594,40.748841],[-73.126746,40.749182]]],"type":"Polygon"}
}