{
  "id": "361019607001",
  "type": "Feature",
  "properties": {
    "area_land":750921,
    "area_water":0,
    "geoid":"361019607001",
    "name":"Block Group 1",
    "state":"ny"
},
  "bbox": [
    -77.658417,
    42.322619,
    -77.644878,
    42.336911
],
  "geometry": {"coordinates":[[[-77.658417,42.329468],[-77.65767700000001,42.330585],[-77.657582,42.330732],[-77.655541,42.330718],[-77.653994,42.330687],[-77.65329199999999,42.330672],[-77.653122,42.330669],[-77.652531,42.330662],[-77.652053,42.330657],[-77.652259,42.331021],[-77.652416,42.331276],[-77.652687,42.331761],[-77.65295399999999,42.3323],[-77.65324,42.332864],[-77.653497,42.333338],[-77.653881,42.333947],[-77.654045,42.334242],[-77.654594,42.335109],[-77.654689,42.335294],[-77.654946,42.335957],[-77.655008,42.336074],[-77.65517699999999,42.33634],[-77.65541399999999,42.336635],[-77.65552700000001,42.336741],[-77.65565100000001,42.336824],[-77.655722,42.33686],[-77.653043,42.336907],[-77.652895,42.336911],[-77.651546,42.336871],[-77.64832699999999,42.328276],[-77.647853,42.326982],[-77.645495,42.326977],[-77.64487800000001,42.32697],[-77.645053,42.324147],[-77.64509,42.324134],[-77.645168,42.324102],[-77.646124,42.323712],[-77.647643,42.323122],[-77.648349,42.322862],[-77.648477,42.322823],[-77.649047,42.322647],[-77.64910999999999,42.322633],[-77.649181,42.322626],[-77.64983700000001,42.322619],[-77.64988200000001,42.322633],[-77.649929,42.322671],[-77.65037100000001,42.323101],[-77.650434,42.323116],[-77.65120400000001,42.323276],[-77.651251,42.323356],[-77.65137300000001,42.323553],[-77.651488,42.323691],[-77.65166000000001,42.323855],[-77.65187299999999,42.323991],[-77.652018,42.324067],[-77.65246399999999,42.324246],[-77.653114,42.324483],[-77.653553,42.324642],[-77.654689,42.325063],[-77.65514,42.325233],[-77.65497499999999,42.325458],[-77.65419300000001,42.326645],[-77.653944,42.327023],[-77.653514,42.327676],[-77.6549,42.328181],[-77.655109,42.328256],[-77.655557,42.328417],[-77.65615,42.328636],[-77.657888,42.329274],[-77.658417,42.329468]]],"type":"Polygon"}
}