{
  "id": "360610122003",
  "type": "Feature",
  "properties": {
    "area_land":49317,
    "area_water":0,
    "geoid":"360610122003",
    "name":"Block Group 3",
    "state":"ny"
},
  "bbox": [
    -73.971189,
    40.766091,
    -73.967759,
    40.769271
],
  "geometry": {"coordinates":[[[-73.97072799999999,40.767394],[-73.970281,40.768025],[-73.969825,40.768646],[-73.969365,40.769271],[-73.967759,40.768596],[-73.968215,40.767968],[-73.968672,40.767342],[-73.969129,40.766716],[-73.969585,40.766091],[-73.971189,40.766767],[-73.97072799999999,40.767394]]],"type":"Polygon"}
}