{
  "id": "360290006003",
  "type": "Feature",
  "properties": {
    "area_land":255840,
    "area_water":0,
    "geoid":"360290006003",
    "name":"Block Group 3",
    "state":"ny"
},
  "bbox": [
    -78.823855,
    42.834647,
    -78.812413,
    42.837268
],
  "geometry": {"coordinates":[[[-78.823847,42.835337],[-78.82384500000001,42.83555],[-78.82383400000001,42.836379],[-78.82383299999999,42.836418],[-78.82382200000001,42.837235],[-78.82202700000001,42.837209],[-78.819836,42.837183],[-78.816098,42.837153],[-78.81510900000001,42.837139],[-78.815107,42.837268],[-78.81366199999999,42.837254],[-78.81241300000001,42.837235],[-78.812416,42.837096],[-78.812428,42.8364],[-78.812439,42.835448],[-78.812453,42.834647],[-78.812504,42.834648],[-78.813655,42.83467],[-78.81515899999999,42.834689],[-78.816784,42.834713],[-78.81828,42.834734],[-78.819541,42.83475],[-78.820829,42.834766],[-78.822406,42.834785],[-78.82385499999999,42.834816],[-78.823847,42.835337]]],"type":"Polygon"}
}