{
  "id": "360670055002",
  "type": "Feature",
  "properties": {
    "area_land":589800,
    "area_water":0,
    "geoid":"360670055002",
    "name":"Block Group 2",
    "state":"ny"
},
  "bbox": [
    -76.14055,
    43.015637,
    -76.127902,
    43.026462
],
  "geometry": {"coordinates":[[[-76.14055,43.020895],[-76.140522,43.021534],[-76.140488,43.021876],[-76.14031799999999,43.023276],[-76.140231,43.024081],[-76.140215,43.024244],[-76.140202,43.024373],[-76.140152,43.02489],[-76.140156,43.025365],[-76.14017800000001,43.02564],[-76.14030700000001,43.026365],[-76.140124,43.026389],[-76.13987400000001,43.026418],[-76.139646,43.026436],[-76.13918099999999,43.026462],[-76.138689,43.026441],[-76.13821299999999,43.026404],[-76.137344,43.026334],[-76.137158,43.026319],[-76.135786,43.026209],[-76.135587,43.026187],[-76.135582,43.025939],[-76.135541,43.025446],[-76.13548900000001,43.024826],[-76.13545000000001,43.024218],[-76.13541600000001,43.024139],[-76.135322,43.024022],[-76.13444800000001,43.023105],[-76.133768,43.022327],[-76.133078,43.021521],[-76.13286100000001,43.021274],[-76.132662,43.021303],[-76.13193800000001,43.021337],[-76.131075,43.02138],[-76.130162,43.021414],[-76.129786,43.021443],[-76.128443,43.021494],[-76.128288,43.019866],[-76.12828,43.019774],[-76.128229,43.019181],[-76.128156,43.018367],[-76.12790200000001,43.015637],[-76.13019799999999,43.018246],[-76.13050800000001,43.018581],[-76.130904,43.01903],[-76.13144200000001,43.018931],[-76.132482,43.018697],[-76.132913,43.018607],[-76.133256,43.018533],[-76.134754,43.018221],[-76.1358,43.01803],[-76.13731199999999,43.017783],[-76.137658,43.017701],[-76.137817,43.017682],[-76.138435,43.018632],[-76.13870799999999,43.019041],[-76.13890600000001,43.019262],[-76.139112,43.019426],[-76.13925500000001,43.01952],[-76.13939999999999,43.019591],[-76.139877,43.01979],[-76.14008200000001,43.019877],[-76.14034700000001,43.020027],[-76.140542,43.020141],[-76.14055,43.020693],[-76.14055,43.020895]]],"type":"Polygon"}
}