{
  "id": "360470362003",
  "type": "Feature",
  "properties": {
    "area_land":56510,
    "area_water":0,
    "geoid":"360470362003",
    "name":"Block Group 3",
    "state":"ny"
},
  "bbox": [
    -73.968535,
    40.576291,
    -73.965095,
    40.578808
],
  "geometry": {"coordinates":[[[-73.968507,40.576422],[-73.968352,40.577115],[-73.968074,40.578313],[-73.967772,40.57838],[-73.96666399999999,40.578624],[-73.96581500000001,40.578808],[-73.965689,40.578468],[-73.965586,40.578187],[-73.965294,40.57739],[-73.96509500000001,40.576827],[-73.96583099999999,40.576664],[-73.965912,40.576646],[-73.96638,40.576551],[-73.96717200000001,40.576386],[-73.967355,40.576348],[-73.968262,40.576304],[-73.968535,40.576291],[-73.968507,40.576422]]],"type":"Polygon"}
}