{
  "id": "360810050001",
  "type": "Feature",
  "properties": {
    "area_land":157058,
    "area_water":0,
    "geoid":"360810050001",
    "name":"Block Group 1",
    "state":"ny"
},
  "bbox": [
    -73.857793,
    40.675287,
    -73.852466,
    40.679728
],
  "geometry": {"coordinates":[[[-73.857793,40.679456],[-73.85721100000001,40.679486],[-73.856972,40.6795],[-73.856801,40.67951],[-73.85507,40.679618],[-73.854393,40.67966],[-73.85392400000001,40.679686],[-73.853257,40.679728],[-73.852985,40.678266],[-73.852851,40.677564],[-73.852726,40.676917],[-73.852602,40.676262],[-73.85246600000001,40.675584],[-73.85248199999999,40.675287],[-73.853213,40.675445],[-73.85361399999999,40.675539],[-73.854108,40.675637],[-73.854375,40.675766],[-73.854596,40.675753],[-73.85507800000001,40.675885],[-73.85555100000001,40.676033],[-73.856871,40.676455],[-73.857482,40.678172],[-73.857669,40.678739],[-73.857702,40.678836],[-73.857793,40.679456]]],"type":"Polygon"}
}