{
  "id": "360775905003",
  "type": "Feature",
  "properties": {
    "area_land":62200540,
    "area_water":62382,
    "geoid":"360775905003",
    "name":"Block Group 3",
    "state":"ny"
},
  "bbox": [
    -75.055163,
    42.476241,
    -74.95114,
    42.59855
],
  "geometry": {"coordinates":[[[-75.054901,42.528512],[-75.053033,42.5334],[-75.052306,42.535299],[-75.05043499999999,42.540184],[-75.048615,42.544983],[-75.045027,42.554506],[-75.043488,42.55859],[-75.042225,42.561975],[-75.041645,42.563546],[-75.039329,42.569186],[-75.033509,42.584381],[-75.033188,42.585215],[-75.03307700000001,42.585503],[-75.03254099999999,42.586927],[-75.034507,42.595718],[-75.016356,42.597371],[-75.015827,42.597428],[-75.00412900000001,42.598528],[-75.00391500000001,42.59855],[-75.00385799999999,42.598462],[-75.00382,42.598336],[-75.003871,42.597677],[-75.004042,42.596069],[-75.004092,42.595657],[-75.004143,42.595334],[-75.004171,42.595054],[-75.004204,42.594847],[-75.004284,42.594471],[-75.004289,42.594337],[-75.00427000000001,42.594205],[-75.004242,42.594088],[-75.00420200000001,42.593972],[-75.003945,42.593452],[-75.00372,42.593062],[-75.003563,42.592842],[-75.00338499999999,42.592632],[-75.00321599999999,42.592463],[-75.00301899999999,42.592297],[-75.002771,42.592114],[-75.002584,42.591993],[-75.00231700000001,42.591809],[-75.002028,42.591632],[-75.001312,42.591208],[-75.00114600000001,42.591089],[-75.000969,42.590941],[-75.00070100000001,42.590743],[-75.000432,42.590551],[-75.000131,42.590358],[-74.999882,42.590213],[-74.999807,42.590172],[-74.99970500000001,42.590116],[-74.999281,42.589915],[-74.998706,42.589645],[-74.997602,42.589114],[-74.997122,42.588878],[-74.996595,42.588556],[-74.99642,42.588424],[-74.99626499999999,42.588298],[-74.996118,42.588164],[-74.995856,42.58785],[-74.995744,42.587687],[-74.995485,42.58719],[-74.995339,42.586879],[-74.995189,42.586523],[-74.99514499999999,42.586405],[-74.995091,42.586301],[-74.995028,42.586203],[-74.99496600000001,42.586129],[-74.99487999999999,42.586041],[-74.994747,42.585925],[-74.994378,42.585659],[-74.994197,42.58555],[-74.993776,42.585317],[-74.993526,42.585201],[-74.99335499999999,42.585136],[-74.993188,42.585081],[-74.99292199999999,42.58501],[-74.992627,42.584948],[-74.992414,42.584918],[-74.992197,42.584896],[-74.991721,42.584874],[-74.990841,42.584877],[-74.990127,42.584876],[-74.98972999999999,42.584866],[-74.98862099999999,42.584814],[-74.988148,42.584809],[-74.986582,42.584816],[-74.986282,42.58481],[-74.985809,42.584773],[-74.98550899999999,42.584743],[-74.985274,42.584709],[-74.985135,42.584683],[-74.984917,42.584633],[-74.98474400000001,42.584581],[-74.984516,42.584506],[-74.98414099999999,42.584351],[-74.983921,42.58425],[-74.98361,42.584134],[-74.983591,42.584129],[-74.98344299999999,42.584088],[-74.983318,42.584073],[-74.98306700000001,42.584073],[-74.981962,42.584155],[-74.98149600000001,42.584168],[-74.98060599999999,42.584233],[-74.979405,42.584314],[-74.978904,42.584355],[-74.97851799999999,42.584356],[-74.978409,42.584333],[-74.97830500000001,42.584299],[-74.978123,42.584253],[-74.977338,42.5841],[-74.976839,42.583993],[-74.97640199999999,42.583862],[-74.976106,42.583755],[-74.974653,42.583136],[-74.974549,42.583087],[-74.97440400000001,42.583006],[-74.97429200000001,42.582921],[-74.974131,42.58281],[-74.97338000000001,42.58216],[-74.973029,42.581843],[-74.972534,42.581454],[-74.972111,42.58115],[-74.971823,42.58095],[-74.971583,42.580796],[-74.971294,42.580634],[-74.971047,42.58051],[-74.970776,42.580392],[-74.97048599999999,42.580281],[-74.970111,42.580149],[-74.96905700000001,42.579811],[-74.968406,42.579624],[-74.96802,42.579524],[-74.96777400000001,42.579472],[-74.96751399999999,42.579425],[-74.966752,42.579322],[-74.966491,42.579281],[-74.966185,42.579211],[-74.96596,42.579145],[-74.965755,42.57907],[-74.965417,42.57893],[-74.96504299999999,42.578749],[-74.965017,42.578735],[-74.96491399999999,42.578679],[-74.964563,42.578457],[-74.964114,42.578135],[-74.96405300000001,42.578086],[-74.963874,42.577945],[-74.963494,42.57762],[-74.963272,42.577421],[-74.963041,42.57719],[-74.96249,42.576613],[-74.962225,42.576368],[-74.962169,42.576319],[-74.962062,42.576225],[-74.96195,42.57614],[-74.96086099999999,42.575348],[-74.96067499999999,42.575224],[-74.960295,42.575003],[-74.95984900000001,42.574782],[-74.95938099999999,42.57459],[-74.95913,42.574508],[-74.95890300000001,42.574453],[-74.958524,42.574378],[-74.957866,42.574291],[-74.957481,42.574214],[-74.956799,42.574003],[-74.956625,42.573912],[-74.95648199999999,42.573819],[-74.956391,42.573733],[-74.956323,42.573662],[-74.95627899999999,42.573584],[-74.956217,42.573428],[-74.956164,42.573252],[-74.95611100000001,42.572966],[-74.956092,42.572759],[-74.95607200000001,42.572379],[-74.95605999999999,42.571811],[-74.956008,42.570872],[-74.95599799999999,42.570466],[-74.954825,42.570166],[-74.95362299999999,42.569821],[-74.95295900000001,42.569621],[-74.951972,42.569337],[-74.95114,42.569112],[-74.951165,42.569054],[-74.951194,42.568962],[-74.95130899999999,42.568608],[-74.951363,42.56844],[-74.951776,42.567194],[-74.95350500000001,42.562444],[-74.953748,42.561788],[-74.953913,42.561343],[-74.954126,42.560765],[-74.95419099999999,42.560546],[-74.95426500000001,42.56024],[-74.95434299999999,42.559797],[-74.954419,42.55925],[-74.954477,42.558735],[-74.954497,42.558428],[-74.95448399999999,42.557953],[-74.954459,42.557787],[-74.954427,42.557619],[-74.9543,42.55712],[-74.95424300000001,42.556966],[-74.953998,42.556401],[-74.953457,42.555121],[-74.95339300000001,42.554927],[-74.95334099999999,42.55475],[-74.953307,42.554597],[-74.95326900000001,42.554344],[-74.95325800000001,42.55418],[-74.953259,42.553891],[-74.95327399999999,42.553698],[-74.953301,42.553507],[-74.95334699999999,42.553295],[-74.953435,42.553036],[-74.953492,42.552888],[-74.95361699999999,42.552614],[-74.95371900000001,42.552416],[-74.953907,42.552072],[-74.954157,42.551546],[-74.954695,42.550291],[-74.955082,42.549347],[-74.955354,42.548636],[-74.955398,42.548442],[-74.95567800000001,42.547086],[-74.95581900000001,42.546704],[-74.955924,42.546465],[-74.956073,42.546213],[-74.95619600000001,42.546025],[-74.956363,42.545793],[-74.956486,42.545637],[-74.957004,42.545107],[-74.959479,42.542715],[-74.96024800000001,42.541995],[-74.960491,42.54176],[-74.960696,42.54153],[-74.96087,42.541334],[-74.961095,42.541042],[-74.961202,42.540903],[-74.96210600000001,42.539464],[-74.96235900000001,42.539009],[-74.962458,42.538794],[-74.962903,42.537589],[-74.963129,42.53709],[-74.963302,42.536733],[-74.96342799999999,42.536512],[-74.96370899999999,42.536081],[-74.963921,42.535775],[-74.964494,42.534885],[-74.966168,42.532335],[-74.96682699999999,42.531358],[-74.96741,42.530439],[-74.96778500000001,42.529877],[-74.96795299999999,42.529641],[-74.968001,42.529573],[-74.968147,42.529408],[-74.968309,42.529264],[-74.96845500000001,42.529155],[-74.968729,42.528975],[-74.968982,42.528846],[-74.969165,42.528767],[-74.969402,42.528682],[-74.96964,42.52862],[-74.96993000000001,42.528575],[-74.970321,42.52853],[-74.97049699999999,42.528524],[-74.970688,42.528519],[-74.970947,42.528531],[-74.971119,42.528549],[-74.97131899999999,42.528579],[-74.971507,42.528614],[-74.972178,42.528762],[-74.97279,42.528916],[-74.973071,42.528996],[-74.973325,42.529081],[-74.97449,42.529504],[-74.97465099999999,42.529551],[-74.97481999999999,42.529591],[-74.975247,42.529682],[-74.97557399999999,42.529739],[-74.97678000000001,42.529929],[-74.977267,42.529987],[-74.978611,42.530073],[-74.978995,42.530089],[-74.979339,42.530099],[-74.979851,42.530075],[-74.980171,42.530042],[-74.980345,42.530015],[-74.98052,42.529972],[-74.982157,42.5295],[-74.982584,42.529358],[-74.98283000000001,42.529276],[-74.98311099999999,42.529167],[-74.983289,42.529083],[-74.98367399999999,42.528863],[-74.984037,42.528621],[-74.98444600000001,42.528315],[-74.98499099999999,42.52786],[-74.985699,42.527284],[-74.986557,42.526594],[-74.987151,42.526098],[-74.98750200000001,42.525768],[-74.98772599999999,42.525531],[-74.98794100000001,42.525279],[-74.98870700000001,42.524351],[-74.98894900000001,42.524022],[-74.989099,42.523845],[-74.989487,42.523379],[-74.989918,42.522791],[-74.990207,42.522318],[-74.99069799999999,42.521489],[-74.990785,42.521279],[-74.990934,42.520939],[-74.991015,42.520722],[-74.991062,42.520551],[-74.991101,42.520361],[-74.991136,42.520137],[-74.991148,42.519967],[-74.99115399999999,42.519746],[-74.99118300000001,42.51878],[-74.991192,42.518582],[-74.991238,42.518136],[-74.991271,42.517726],[-74.99130100000001,42.517161],[-74.99137399999999,42.516658],[-74.99138499999999,42.516595],[-74.99150400000001,42.515948],[-74.991585,42.515514],[-74.99169500000001,42.514919],[-74.992074,42.512753],[-74.992069,42.512622],[-74.99203300000001,42.512392],[-74.991984,42.512256],[-74.991923,42.511997],[-74.99187000000001,42.511844],[-74.99179700000001,42.511669],[-74.991367,42.510739],[-74.991184,42.510348],[-74.99058599999999,42.508969],[-74.990359,42.508506],[-74.990133,42.50813],[-74.989986,42.507921],[-74.989763,42.507655],[-74.988423,42.506223],[-74.9883,42.506091],[-74.988238,42.506031],[-74.987784,42.505595],[-74.98736599999999,42.505221],[-74.98621199999999,42.50428],[-74.985668,42.503768],[-74.985204,42.50332],[-74.98488500000001,42.502987],[-74.984195,42.502288],[-74.984014,42.502089],[-74.983429,42.501428],[-74.983068,42.500959],[-74.982772,42.50055],[-74.982551,42.500217],[-74.982467,42.50009],[-74.982382,42.49994],[-74.982372,42.499917],[-74.982266,42.499681],[-74.98189600000001,42.498868],[-74.98182799999999,42.498727],[-74.98172099999999,42.498512],[-74.981543,42.498146],[-74.98164300000001,42.498089],[-74.98180499999999,42.49796],[-74.981954,42.497837],[-74.981993,42.497794],[-74.98208099999999,42.497672],[-74.982148,42.4975],[-74.98217200000001,42.497398],[-74.982226,42.497055],[-74.982373,42.496116],[-74.98246899999999,42.495309],[-74.982499,42.494911],[-74.982479,42.494619],[-74.982466,42.494506],[-74.982382,42.493912],[-74.98191,42.491524],[-74.981883,42.491388],[-74.98181099999999,42.491008],[-74.982444,42.490789],[-74.982528,42.490761],[-74.984261,42.490194],[-74.984871,42.489984],[-74.985815,42.489676],[-74.986289,42.489514],[-74.986581,42.489391],[-74.986767,42.489299],[-74.986959,42.489176],[-74.987138,42.489042],[-74.987476,42.488742],[-74.987807,42.488428],[-74.988829,42.487394],[-74.989385,42.486851],[-74.98982700000001,42.486493],[-74.991221,42.485485],[-74.991669,42.485154],[-74.99201499999999,42.484889],[-74.992375,42.48456],[-74.992621,42.484258],[-74.99273700000001,42.484081],[-74.99284299999999,42.483897],[-74.992902,42.483773],[-74.993071,42.483376],[-74.993425,42.482657],[-74.993786,42.482012],[-74.99444,42.481026],[-74.995035,42.480213],[-74.995862,42.479004],[-74.996583,42.478095],[-74.99806700000001,42.476453],[-74.99825199999999,42.476241],[-74.999574,42.47644],[-75.000326,42.476695],[-75.019042,42.491323],[-75.015372,42.500157],[-75.013468,42.504941],[-75.01093,42.511311],[-75.028083,42.510212],[-75.030253,42.510081],[-75.039283,42.509512],[-75.03376799999999,42.523804],[-75.031626,42.529422],[-75.032123,42.529437],[-75.033484,42.529357],[-75.034933,42.529234],[-75.035099,42.529203],[-75.035195,42.529162],[-75.035421,42.529037],[-75.03747300000001,42.528914],[-75.04395100000001,42.528516],[-75.047087,42.52833],[-75.05516299999999,42.527834],[-75.054901,42.528512]]],"type":"Polygon"}
}