{
  "id": "360070132021",
  "type": "Feature",
  "properties": {
    "area_land":1034954,
    "area_water":3681,
    "geoid":"360070132021",
    "name":"Block Group 1",
    "state":"ny"
},
  "bbox": [
    -76.039964,
    42.120868,
    -76.023083,
    42.132845
],
  "geometry": {"coordinates":[[[-76.039964,42.132845],[-76.038622,42.132275],[-76.03795,42.131978],[-76.036593,42.131397],[-76.03285099999999,42.129872],[-76.032709,42.130242],[-76.032641,42.130192],[-76.03215400000001,42.130062],[-76.0314,42.129909],[-76.03133800000001,42.129928],[-76.031256,42.129936],[-76.029698,42.130013],[-76.027916,42.130065],[-76.02696299999999,42.130106],[-76.025109,42.130143],[-76.02496600000001,42.130146],[-76.02488,42.130148],[-76.02472400000001,42.130152],[-76.023083,42.130179],[-76.023287,42.129088],[-76.023439,42.128291],[-76.02348600000001,42.128072],[-76.02352999999999,42.127885],[-76.023779,42.127029],[-76.023906,42.126551],[-76.023993,42.126222],[-76.02405299999999,42.126042],[-76.02409,42.125985],[-76.024168,42.125898],[-76.024306,42.125787],[-76.02459,42.12601],[-76.024985,42.126261],[-76.026661,42.127235],[-76.026691,42.127252],[-76.02705,42.127452],[-76.027377,42.127609],[-76.02838800000001,42.128036],[-76.02875400000001,42.127536],[-76.028873,42.127492],[-76.028977,42.127399],[-76.02911400000001,42.127333],[-76.029284,42.127295],[-76.029613,42.127268],[-76.029732,42.127247],[-76.02982900000001,42.127208],[-76.029954,42.127121],[-76.030218,42.126792],[-76.030383,42.126567],[-76.030676,42.126138],[-76.030873,42.125779],[-76.030945,42.125589],[-76.030978,42.125387],[-76.030973,42.125257],[-76.030942,42.125172],[-76.030716,42.124772],[-76.03065100000001,42.124687],[-76.030567,42.124611],[-76.030404,42.124503],[-76.030247,42.124425],[-76.030045,42.124348],[-76.029708,42.124251],[-76.02934399999999,42.124191],[-76.02918699999999,42.124149],[-76.028964,42.124069],[-76.028868,42.124018],[-76.028749,42.123929],[-76.028702,42.123872],[-76.02866400000001,42.123805],[-76.02863499999999,42.123724],[-76.02860800000001,42.123558],[-76.028629,42.123418],[-76.028694,42.123303],[-76.02873700000001,42.123259],[-76.02885999999999,42.123166],[-76.02946900000001,42.122909],[-76.029754,42.122776],[-76.030293,42.122465],[-76.03040799999999,42.122373],[-76.030554,42.122208],[-76.030621,42.122102],[-76.03064500000001,42.121877],[-76.030638,42.121709],[-76.030598,42.121272],[-76.03385900000001,42.121116],[-76.034308,42.121099],[-76.03625599999999,42.121004],[-76.03918,42.120868],[-76.039315,42.123028],[-76.039378,42.123957],[-76.03956100000001,42.126854],[-76.039616,42.127733],[-76.03968999999999,42.128911],[-76.03971199999999,42.129235],[-76.039869,42.131616],[-76.039964,42.132845]]],"type":"Polygon"}
}