{
  "id": "361190098001",
  "type": "Feature",
  "properties": {
    "area_land":731395,
    "area_water":0,
    "geoid":"361190098001",
    "name":"Block Group 1",
    "state":"ny"
},
  "bbox": [
    -73.77656,
    40.975986,
    -73.764939,
    40.987948
],
  "geometry": {"coordinates":[[[-73.77656,40.983967],[-73.775865,40.984203],[-73.77534199999999,40.984396],[-73.775183,40.984465],[-73.77459,40.984713],[-73.77422199999999,40.984877],[-73.773871,40.985042],[-73.77290000000001,40.98549],[-73.77252799999999,40.985672],[-73.771396,40.98622],[-73.770906,40.98647],[-73.77073,40.986549],[-73.76938,40.987147],[-73.768839,40.987401],[-73.767689,40.987948],[-73.767349,40.987375],[-73.76709,40.98699],[-73.76661900000001,40.986235],[-73.766335,40.985793],[-73.766032,40.985267],[-73.76582999999999,40.984957],[-73.76570599999999,40.98477],[-73.76562800000001,40.984676],[-73.76528,40.984375],[-73.765175,40.984259],[-73.765049,40.984066],[-73.764996,40.983939],[-73.764943,40.983731],[-73.764939,40.983412],[-73.76496400000001,40.98326],[-73.764999,40.98316],[-73.765176,40.98286],[-73.765393,40.982538],[-73.76553199999999,40.982268],[-73.765624,40.981992],[-73.765642,40.981841],[-73.765917,40.981318],[-73.766418,40.98091],[-73.766943,40.980508],[-73.76704599999999,40.980391],[-73.76713100000001,40.980245],[-73.767347,40.97993],[-73.767475,40.979774],[-73.767535,40.979717],[-73.767723,40.979614],[-73.76782799999999,40.979574],[-73.768213,40.979474],[-73.769492,40.979168],[-73.77045699999999,40.978926],[-73.77105299999999,40.97871],[-73.771334,40.978589],[-73.772209,40.978254],[-73.77269,40.978046],[-73.772809,40.977979],[-73.773022,40.977834],[-73.77358700000001,40.977384],[-73.774434,40.976687],[-73.774996,40.976222],[-73.775201,40.976029],[-73.775318,40.975986],[-73.77533200000001,40.976376],[-73.775403,40.976886],[-73.77549500000001,40.977378],[-73.775845,40.978698],[-73.775942,40.979167],[-73.776021,40.979626],[-73.776101,40.980086],[-73.776151,40.980531],[-73.77619900000001,40.981021],[-73.77619900000001,40.981159],[-73.776262,40.981345],[-73.776315,40.983848],[-73.77656,40.983967]]],"type":"Polygon"}
}