{
  "id": "360610087004",
  "type": "Feature",
  "properties": {
    "area_land":21607,
    "area_water":0,
    "geoid":"360610087004",
    "name":"Block Group 4",
    "state":"ny"
},
  "bbox": [
    -73.999422,
    40.742811,
    -73.996129,
    40.74463
],
  "geometry": {"coordinates":[[[-73.99897199999999,40.74463],[-73.996129,40.743431],[-73.99657999999999,40.742811],[-73.999422,40.744009],[-73.99897199999999,40.74463]]],"type":"Polygon"}
}