{
  "id": "361190115002",
  "type": "Feature",
  "properties": {
    "area_land":836261,
    "area_water":2815728,
    "geoid":"361190115002",
    "name":"Block Group 2",
    "state":"ny"
},
  "bbox": [
    -73.89478,
    41.062373,
    -73.861114,
    41.080824
],
  "geometry": {"coordinates":[[[-73.894779,41.070572],[-73.894777,41.070791],[-73.892768,41.071565],[-73.890084,41.072497],[-73.88661399999999,41.073798],[-73.882582,41.075237],[-73.87456,41.078144],[-73.869203,41.079907],[-73.86841099999999,41.079994],[-73.86741000000001,41.080444],[-73.867262,41.080488],[-73.866541,41.080811],[-73.866523,41.080741],[-73.86585100000001,41.080824],[-73.864487,41.080596],[-73.86409,41.080478],[-73.863508,41.080173],[-73.863181,41.080072],[-73.863179,41.080022],[-73.86297399999999,41.079999],[-73.862754,41.079997],[-73.862245,41.080022],[-73.86145999999999,41.080038],[-73.861507,41.079353],[-73.861576,41.078616],[-73.861784,41.078766],[-73.86228800000001,41.079091],[-73.86266999999999,41.079352],[-73.86268,41.07918],[-73.86271499999999,41.078871],[-73.86278299999999,41.078265],[-73.86277800000001,41.077395],[-73.862746,41.07735],[-73.86269900000001,41.077194],[-73.862708,41.076945],[-73.862853,41.076389],[-73.862925,41.076268],[-73.86299699999999,41.076201],[-73.863095,41.07615],[-73.862989,41.075896],[-73.862859,41.075671],[-73.86278900000001,41.075565],[-73.86264199999999,41.075343],[-73.86242799999999,41.075063],[-73.86252899999999,41.074921],[-73.862596,41.074798],[-73.862627,41.074706],[-73.862632,41.074611],[-73.86258599999999,41.074432],[-73.862596,41.074288],[-73.862627,41.074206],[-73.862714,41.074052],[-73.862842,41.073791],[-73.862894,41.073632],[-73.86287299999999,41.073498],[-73.862683,41.07326],[-73.862702,41.073248],[-73.862758,41.073166],[-73.86348,41.07165],[-73.864333,41.071901],[-73.864667,41.071232],[-73.86423499999999,41.071121],[-73.86405600000001,41.071054],[-73.863804,41.0709],[-73.863596,41.070836],[-73.86318199999999,41.070747],[-73.861114,41.070103],[-73.861358,41.069524],[-73.86163000000001,41.068941],[-73.861819,41.068576],[-73.86215199999999,41.067916],[-73.86226000000001,41.067666],[-73.862362,41.067328],[-73.862442,41.067045],[-73.862449,41.067],[-73.86245700000001,41.066917],[-73.86245700000001,41.066426],[-73.86240599999999,41.065458],[-73.862379,41.064874],[-73.862341,41.064136],[-73.862314,41.063621],[-73.86230399999999,41.063279],[-73.862298,41.063024],[-73.86230399999999,41.062899],[-73.862318,41.062752],[-73.86230399999999,41.062561],[-73.862291,41.062373],[-73.862505,41.062403],[-73.86265299999999,41.062444],[-73.862847,41.06257],[-73.863204,41.062954],[-73.86338499999999,41.062914],[-73.86352100000001,41.06292],[-73.863849,41.062972],[-73.864194,41.063041],[-73.86521399999999,41.063226],[-73.86559699999999,41.063288],[-73.866293,41.063419],[-73.866794,41.06352],[-73.86662,41.064211],[-73.866708,41.064225],[-73.867504,41.06435],[-73.86778200000001,41.064384],[-73.86774699999999,41.064512],[-73.868363,41.064395],[-73.89448,41.064596],[-73.89467999999999,41.069796],[-73.8947,41.069937],[-73.89471,41.070004],[-73.894713,41.070023],[-73.894732,41.070165],[-73.894738,41.070206],[-73.894758,41.070342],[-73.89478,41.070496],[-73.894779,41.070572]]],"type":"Polygon"}
}