{
  "id": "360010138022",
  "type": "Feature",
  "properties": {
    "area_land":1401730,
    "area_water":0,
    "geoid":"360010138022",
    "name":"Block Group 2",
    "state":"ny"
},
  "bbox": [
    -73.841184,
    42.757966,
    -73.824516,
    42.773237
],
  "geometry": {"coordinates":[[[-73.841184,42.768194],[-73.84111300000001,42.768927],[-73.84110200000001,42.76934],[-73.84108000000001,42.769534],[-73.841043,42.769682],[-73.84100100000001,42.769781],[-73.84094899999999,42.769901],[-73.840628,42.770514],[-73.840189,42.771355],[-73.838058,42.771613],[-73.834413,42.772047],[-73.832618,42.772263],[-73.82814999999999,42.772798],[-73.827085,42.772926],[-73.82512699999999,42.773163],[-73.824797,42.773203],[-73.824516,42.773237],[-73.82484599999999,42.773087],[-73.824895,42.772995],[-73.825041,42.772676],[-73.82513,42.77242],[-73.825194,42.772226],[-73.825411,42.771582],[-73.825658,42.770942],[-73.825821,42.770657],[-73.82585,42.770591],[-73.825917,42.770475],[-73.826041,42.770318],[-73.826272,42.77007],[-73.826604,42.769666],[-73.826975,42.769257],[-73.82718,42.768979],[-73.828029,42.767444],[-73.828174,42.76725],[-73.82852,42.766616],[-73.82863,42.76639],[-73.82878700000001,42.766073],[-73.829455,42.764654],[-73.829719,42.764103],[-73.829748,42.764041],[-73.82984500000001,42.763938],[-73.82992900000001,42.763867],[-73.830123,42.763756],[-73.830218,42.763682],[-73.830395,42.763526],[-73.830485,42.763411],[-73.83070600000001,42.76304],[-73.830771,42.762881],[-73.830794,42.762813],[-73.83085800000001,42.762621],[-73.83096500000001,42.76225],[-73.831007,42.762068],[-73.831113,42.761511],[-73.83124100000001,42.760851],[-73.83139799999999,42.760117],[-73.83149400000001,42.759676],[-73.831518,42.75949],[-73.83153799999999,42.759409],[-73.83157,42.759329],[-73.831626,42.759247],[-73.831694,42.759184],[-73.83178599999999,42.759131],[-73.831878,42.759093],[-73.832042,42.759046],[-73.832328,42.758978],[-73.833575,42.758703],[-73.833809,42.758651],[-73.834909,42.758416],[-73.83508999999999,42.758357],[-73.835341,42.75826],[-73.835533,42.758174],[-73.83570899999999,42.758094],[-73.835831,42.758053],[-73.836039,42.758004],[-73.836145,42.757989],[-73.83620500000001,42.757981],[-73.83643499999999,42.757971],[-73.836718,42.75797],[-73.83768600000001,42.757966],[-73.839569,42.757985],[-73.839607,42.758257],[-73.839607,42.758505],[-73.839584,42.758872],[-73.839511,42.759738],[-73.839479,42.75996],[-73.839299,42.760683],[-73.83903100000001,42.761684],[-73.838978,42.761925],[-73.838954,42.762136],[-73.838962,42.762261],[-73.838993,42.76238],[-73.839358,42.763478],[-73.839381,42.763541],[-73.84004,42.765367],[-73.840806,42.767035],[-73.84086499999999,42.767163],[-73.84110800000001,42.76771],[-73.841166,42.767885],[-73.841184,42.768194]]],"type":"Polygon"}
}