{
  "id": "360810208002",
  "type": "Feature",
  "properties": {
    "area_land":312129,
    "area_water":0,
    "geoid":"360810208002",
    "name":"Block Group 2",
    "state":"ny"
},
  "bbox": [
    -73.808547,
    40.695452,
    -73.798687,
    40.701852
],
  "geometry": {"coordinates":[[[-73.808547,40.698434],[-73.806957,40.699016],[-73.807261,40.699596],[-73.80745899999999,40.700007],[-73.807742,40.700582],[-73.80676200000001,40.700806],[-73.806044,40.700939],[-73.805262,40.70116],[-73.804129,40.70146],[-73.803303,40.701639],[-73.802409,40.701852],[-73.802076,40.701575],[-73.801823,40.701387],[-73.801574,40.701214],[-73.799156,40.699972],[-73.798687,40.699715],[-73.799341,40.699291],[-73.79955200000001,40.699157],[-73.800282,40.69872],[-73.801053,40.698419],[-73.802367,40.697874],[-73.803532,40.696968],[-73.803572,40.696935],[-73.804226,40.696382],[-73.80449,40.696169],[-73.804891,40.695852],[-73.80495000000001,40.69596],[-73.805751,40.69571],[-73.806645,40.695452],[-73.807402,40.696643],[-73.808139,40.697796],[-73.808547,40.698434]]],"type":"Polygon"}
}