{
  "id": "360070119012",
  "type": "Feature",
  "properties": {
    "area_land":43455224,
    "area_water":4890875,
    "geoid":"360070119012",
    "name":"Block Group 2",
    "state":"ny"
},
  "bbox": [
    -75.98656,
    42.322556,
    -75.898339,
    42.413858
],
  "geometry": {"coordinates":[[[-75.98656,42.409989],[-75.98148,42.410153],[-75.981306,42.410159],[-75.97906,42.410232],[-75.979032,42.410233],[-75.97900799999999,42.410234],[-75.978964,42.410235],[-75.977981,42.410267],[-75.977783,42.410274],[-75.97282300000001,42.410479],[-75.965001,42.410803],[-75.962377,42.410917],[-75.95255299999999,42.411345],[-75.95180499999999,42.41142],[-75.95173,42.411423],[-75.951629,42.411427],[-75.948358,42.411557],[-75.94723,42.411602],[-75.944833,42.411697],[-75.94252400000001,42.411792],[-75.941948,42.411816],[-75.941772,42.411823],[-75.94168000000001,42.411826],[-75.9376,42.411984],[-75.933971,42.412129],[-75.925303,42.412475],[-75.919723,42.4127],[-75.916797,42.412818],[-75.91316399999999,42.413077],[-75.91237599999999,42.413133],[-75.91229199999999,42.413139],[-75.912142,42.41315],[-75.91207,42.413154],[-75.906829,42.413435],[-75.90477,42.413525],[-75.89833900000001,42.413858],[-75.898366,42.413798],[-75.89854,42.41361],[-75.899084,42.412907],[-75.899922,42.41168],[-75.900244,42.41116],[-75.900432,42.410749],[-75.90072600000001,42.409803],[-75.900767,42.40959],[-75.900887,42.409179],[-75.900961,42.408827],[-75.90114199999999,42.408074],[-75.901203,42.407767],[-75.90127699999999,42.407113],[-75.901357,42.405717],[-75.90149099999999,42.404033],[-75.901543,42.403655],[-75.901582,42.402837],[-75.90172200000001,42.400449],[-75.901833,42.399213],[-75.90202600000001,42.397728],[-75.902073,42.39739],[-75.902227,42.396516],[-75.902654,42.394435],[-75.90310599999999,42.391579],[-75.903291,42.390264],[-75.90364700000001,42.38888],[-75.903701,42.388567],[-75.90375400000001,42.387472],[-75.903789,42.386856],[-75.903795,42.385925],[-75.90373,42.385002],[-75.903537,42.383108],[-75.903442,42.381919],[-75.903423,42.381476],[-75.90342099999999,42.381146],[-75.90347199999999,42.380648],[-75.90366299999999,42.379325],[-75.90376000000001,42.378386],[-75.90383300000001,42.377904],[-75.90389999999999,42.377644],[-75.90427800000001,42.376364],[-75.904771,42.375108],[-75.905827,42.372529],[-75.90596600000001,42.372428],[-75.906111,42.372361],[-75.90625300000001,42.372323],[-75.906819,42.372292],[-75.908664,42.37218],[-75.90961799999999,42.372133],[-75.910471,42.372108],[-75.91130699999999,42.372064],[-75.912986,42.371989],[-75.913848,42.371971],[-75.915533,42.371874],[-75.916387,42.37184],[-75.918505,42.371729],[-75.9187,42.371737],[-75.918948,42.371765],[-75.91916399999999,42.371815],[-75.919601,42.371999],[-75.919884,42.372135],[-75.920261,42.372288],[-75.92055000000001,42.372379],[-75.921272,42.372564],[-75.92177599999999,42.372706],[-75.92246799999999,42.372889],[-75.92287,42.372952],[-75.92315499999999,42.372962],[-75.92355499999999,42.372946],[-75.92425299999999,42.372895],[-75.92501799999999,42.372825],[-75.926778,42.372634],[-75.92735999999999,42.372538],[-75.928522,42.372309],[-75.92880100000001,42.372237],[-75.929193,42.372105],[-75.930499,42.371519],[-75.930955,42.371333],[-75.931275,42.371258],[-75.931618,42.371222],[-75.93592599999999,42.371041],[-75.93750900000001,42.37098],[-75.93762,42.370992],[-75.937766,42.371036],[-75.938146,42.370766],[-75.938911,42.370293],[-75.940336,42.369435],[-75.941394,42.368782],[-75.942086,42.368318],[-75.942846,42.367763],[-75.943712,42.367129],[-75.943984,42.366918],[-75.94535,42.365691],[-75.945525,42.365539],[-75.94614199999999,42.365052],[-75.946601,42.364716],[-75.947213,42.364353],[-75.94905,42.363376],[-75.949377,42.363231],[-75.949742,42.363098],[-75.949961,42.363038],[-75.951072,42.362763],[-75.951954,42.362516],[-75.95300400000001,42.362242],[-75.95418600000001,42.361932],[-75.955136,42.361712],[-75.95651700000001,42.3613],[-75.956971,42.361154],[-75.957888,42.360841],[-75.958326,42.360721],[-75.959715,42.360369],[-75.960014,42.360275],[-75.960219,42.3602],[-75.96055,42.360062],[-75.960987,42.359898],[-75.961725,42.359668],[-75.962963,42.35936],[-75.963142,42.359301],[-75.96347299999999,42.359149],[-75.963725,42.359007],[-75.964168,42.358733],[-75.96533599999999,42.357931],[-75.966204,42.357352],[-75.966469,42.35719],[-75.966921,42.356936],[-75.967659,42.356565],[-75.969345,42.355814],[-75.96905099999999,42.355121],[-75.96839199999999,42.353568],[-75.968245,42.353252],[-75.967795,42.3522],[-75.967305,42.351007],[-75.967083,42.350443],[-75.967073,42.35042],[-75.96683400000001,42.349893],[-75.96613499999999,42.34827],[-75.963809,42.348344],[-75.961519,42.348373],[-75.96015,42.348407],[-75.959405,42.348441],[-75.957177,42.348506],[-75.95646600000001,42.348538],[-75.95475500000001,42.348643],[-75.954481,42.348646],[-75.953761,42.348635],[-75.953011,42.348581],[-75.95251500000001,42.348529],[-75.95126,42.348333],[-75.949776,42.348046],[-75.948263,42.347723],[-75.94779200000001,42.347609],[-75.947378,42.347497],[-75.946978,42.347368],[-75.94613699999999,42.347126],[-75.945905,42.347078],[-75.945695,42.347049],[-75.944185,42.346956],[-75.943715,42.346949],[-75.942268,42.347018],[-75.94023,42.347152],[-75.938289,42.347269],[-75.936707,42.34733],[-75.93648,42.344168],[-75.936455,42.343592],[-75.93646099999999,42.343377],[-75.936485,42.343127],[-75.936545,42.342727],[-75.93674300000001,42.341747],[-75.936857,42.3411],[-75.936905,42.340615],[-75.936913,42.340282],[-75.93688899999999,42.339988],[-75.936792,42.339275],[-75.936708,42.338967],[-75.936617,42.338775],[-75.936415,42.338898],[-75.93617399999999,42.33902],[-75.93567,42.339229],[-75.93537000000001,42.339319],[-75.934729,42.339481],[-75.93104,42.340365],[-75.92920599999999,42.340821],[-75.92912699999999,42.34084],[-75.927114,42.341333],[-75.926355,42.341474],[-75.925765,42.341555],[-75.925279,42.341601],[-75.924891,42.341627],[-75.924471,42.341641],[-75.923732,42.341634],[-75.92328999999999,42.341612],[-75.92281699999999,42.341575],[-75.922472,42.341539],[-75.92187199999999,42.341448],[-75.92115200000001,42.341312],[-75.92059500000001,42.341177],[-75.920135,42.341048],[-75.91980700000001,42.34094],[-75.918854,42.340579],[-75.917867,42.340188],[-75.917529,42.340069],[-75.917175,42.339958],[-75.916731,42.339866],[-75.916749,42.339743],[-75.916754,42.339572],[-75.916741,42.33945],[-75.916421,42.337852],[-75.916105,42.336459],[-75.915986,42.335547],[-75.915965,42.335275],[-75.915936,42.335142],[-75.91588299999999,42.334954],[-75.915733,42.334583],[-75.915662,42.334306],[-75.915662,42.334082],[-75.91571500000001,42.333863],[-75.915808,42.333646],[-75.915952,42.33343],[-75.91604700000001,42.333255],[-75.91627800000001,42.332663],[-75.916426,42.332329],[-75.916544,42.332129],[-75.916856,42.331734],[-75.917265,42.331262],[-75.917447,42.330978],[-75.91752,42.33081],[-75.917571,42.330628],[-75.917614,42.330309],[-75.91762900000001,42.330034],[-75.917514,42.328282],[-75.9175,42.327639],[-75.917469,42.327502],[-75.917396,42.327326],[-75.917186,42.326856],[-75.916647,42.325453],[-75.916304,42.324513],[-75.91607999999999,42.323849],[-75.93092,42.323375],[-75.949253,42.322813],[-75.95583600000001,42.322622],[-75.957171,42.322581],[-75.957522,42.322571],[-75.958079,42.322556],[-75.95808100000001,42.324074],[-75.95835599999999,42.324891],[-75.959261,42.32587],[-75.960566,42.326415],[-75.963097,42.327683],[-75.963888,42.328236],[-75.96485,42.329264],[-75.965102,42.329195],[-75.965429,42.329111],[-75.96568499999999,42.329065],[-75.965846,42.329207],[-75.966059,42.329112],[-75.96628200000001,42.329072],[-75.966402,42.329065],[-75.96677099999999,42.329044],[-75.96722200000001,42.329017],[-75.967646,42.32901],[-75.967804,42.329007],[-75.967861,42.329006],[-75.968783,42.329023],[-75.96935499999999,42.329032],[-75.97167,42.329126],[-75.97248999999999,42.329157],[-75.97265,42.329163],[-75.972764,42.329166],[-75.972945,42.329173],[-75.97399900000001,42.329208],[-75.974102,42.329212],[-75.974667,42.329232],[-75.974988,42.329272],[-75.975123,42.329305],[-75.975206,42.329335],[-75.97533900000001,42.329381],[-75.976009,42.329611],[-75.97634100000001,42.329751],[-75.976547,42.329838],[-75.976868,42.330018],[-75.978033,42.330635],[-75.978131,42.330682],[-75.97873300000001,42.33097],[-75.978993,42.331093],[-75.979208,42.331195],[-75.97985199999999,42.331513],[-75.98000500000001,42.331589],[-75.980592,42.331932],[-75.981223,42.332394],[-75.981848,42.332873],[-75.98212700000001,42.333088],[-75.982412,42.333318],[-75.98253699999999,42.33342],[-75.982589,42.333461],[-75.982662,42.33544],[-75.982664,42.33551],[-75.982679,42.335883],[-75.982705,42.33649],[-75.982821,42.339204],[-75.982839,42.339607],[-75.98284700000001,42.339897],[-75.982896,42.340827],[-75.982641,42.342586],[-75.98309399999999,42.346242],[-75.98312799999999,42.347106],[-75.983166,42.347983],[-75.983699,42.358661],[-75.983745,42.361717],[-75.983881,42.365247],[-75.984207,42.373219],[-75.984376,42.375073],[-75.984497,42.378051],[-75.984742,42.381749],[-75.985139,42.386612],[-75.985327,42.388877],[-75.985721,42.394953],[-75.98582500000001,42.396782],[-75.986063,42.400536],[-75.98632600000001,42.404697],[-75.98641000000001,42.406614],[-75.98656,42.409989]]],"type":"Polygon"}
}