{
  "id": "360430101003",
  "type": "Feature",
  "properties": {
    "area_land":77679279,
    "area_water":157802,
    "geoid":"360430101003",
    "name":"Block Group 3",
    "state":"ny"
},
  "bbox": [
    -75.216006,
    42.930114,
    -75.076826,
    43.022769
],
  "geometry": {"coordinates":[[[-75.21600599999999,43.022569],[-75.21600599999999,43.022769],[-75.209411,43.021051],[-75.20051599999999,43.018957],[-75.17904299999999,43.013939],[-75.178056,43.013678],[-75.167766,43.011223],[-75.15795799999999,43.00887],[-75.156781,43.008588],[-75.14615999999999,43.006039],[-75.14285099999999,43.005194],[-75.129205,43.002103],[-75.10705400000001,42.997056],[-75.10654,42.996958],[-75.098235,42.99499],[-75.09508700000001,42.994268],[-75.088241,42.991352],[-75.087551,42.991044],[-75.081795,42.98861],[-75.076826,42.986495],[-75.07711500000001,42.986079],[-75.081464,42.979409],[-75.084838,42.973724],[-75.085639,42.972391],[-75.086777,42.970653],[-75.08966599999999,42.966244],[-75.090873,42.964392],[-75.092175,42.962219],[-75.09654999999999,42.955606],[-75.099788,42.950719],[-75.10237499999999,42.946781],[-75.109706,42.935707],[-75.110539,42.934496],[-75.11077400000001,42.934144],[-75.11098,42.933829],[-75.11201699999999,42.93228],[-75.11259,42.931248],[-75.113139,42.930447],[-75.113388,42.930114],[-75.114442,42.930231],[-75.116911,42.93053],[-75.118731,42.930755],[-75.119162,42.930807],[-75.124612,42.931496],[-75.14215900000001,42.933467],[-75.156581,42.935034],[-75.162627,42.935704],[-75.171121,42.936648],[-75.171885,42.936729],[-75.177273,42.937309],[-75.186044,42.938285],[-75.194002,42.939155],[-75.194807,42.939243],[-75.19675599999999,42.93946],[-75.203586,42.940193],[-75.207362,42.940574],[-75.20764200000001,42.94357],[-75.20908300000001,42.957954],[-75.209186,42.958978],[-75.20935900000001,42.960706],[-75.209811,42.965212],[-75.210022,42.967357],[-75.210836,42.975435],[-75.21206100000001,42.986419],[-75.21356,43.000069],[-75.213767,43.003119],[-75.213792,43.003307],[-75.21383,43.003608],[-75.214023,43.004816],[-75.21406500000001,43.00505],[-75.214246,43.006637],[-75.21430100000001,43.006953],[-75.214333,43.007111],[-75.21451999999999,43.008027],[-75.214692,43.009014],[-75.214882,43.010375],[-75.214916,43.010538],[-75.214951,43.010704],[-75.214967,43.01091],[-75.214973,43.010982],[-75.214994,43.011279],[-75.21529700000001,43.015582],[-75.215906,43.021769],[-75.21598400000001,43.022235],[-75.21600599999999,43.022368],[-75.21600599999999,43.022569]]],"type":"Polygon"}
}