{
  "id": "360010145032",
  "type": "Feature",
  "properties": {
    "area_land":1264103,
    "area_water":0,
    "geoid":"360010145032",
    "name":"Block Group 2",
    "state":"ny"
},
  "bbox": [
    -73.936969,
    42.639078,
    -73.916773,
    42.650358
],
  "geometry": {"coordinates":[[[-73.936954,42.647906],[-73.936875,42.648097],[-73.936199,42.648137],[-73.93605700000001,42.648161],[-73.93592200000001,42.648199],[-73.935794,42.648264],[-73.93569100000001,42.64834],[-73.935627,42.648416],[-73.935495,42.648609],[-73.935298,42.649036],[-73.935236,42.649127],[-73.93512699999999,42.649272],[-73.934808,42.64938],[-73.934605,42.649429],[-73.932964,42.649678],[-73.93285899999999,42.649695],[-73.932491,42.649727],[-73.932197,42.649742],[-73.93068599999999,42.649857],[-73.93055200000001,42.649867],[-73.93026999999999,42.649892],[-73.929689,42.649934],[-73.929588,42.649939],[-73.92928000000001,42.649955],[-73.92847399999999,42.650025],[-73.92825999999999,42.65005],[-73.927798,42.650135],[-73.927589,42.650182],[-73.92752400000001,42.650205],[-73.92722000000001,42.650314],[-73.92700600000001,42.650358],[-73.926929,42.650356],[-73.926799,42.650344],[-73.926635,42.650303],[-73.925685,42.649925],[-73.92559900000001,42.649891],[-73.92548499999999,42.649845],[-73.925155,42.649757],[-73.924812,42.649695],[-73.92447799999999,42.649636],[-73.923868,42.649567],[-73.922697,42.649373],[-73.922471,42.649333],[-73.922304,42.649317],[-73.92226700000001,42.649314],[-73.92200699999999,42.649261],[-73.92053,42.649023],[-73.920288,42.648975],[-73.919889,42.648859],[-73.919403,42.648709],[-73.91874300000001,42.64849],[-73.917958,42.648245],[-73.91712099999999,42.647952],[-73.91677300000001,42.647834],[-73.917736,42.646025],[-73.917805,42.645822],[-73.917908,42.645632],[-73.918063,42.645518],[-73.918235,42.645493],[-73.91867499999999,42.643163],[-73.918835,42.642148],[-73.91905300000001,42.641261],[-73.919228,42.64015],[-73.920292,42.639852],[-73.920338,42.639839],[-73.921868,42.639413],[-73.92467000000001,42.639078],[-73.925079,42.640181],[-73.92596,42.64255],[-73.92762500000001,42.64423],[-73.9293,42.643682],[-73.932081,42.642773],[-73.935667,42.643534],[-73.9358,42.643719],[-73.935883,42.643884],[-73.93597,42.644088],[-73.936149,42.644672],[-73.936289,42.645221],[-73.93652,42.646092],[-73.93664099999999,42.646429],[-73.93677099999999,42.646868],[-73.93685499999999,42.647281],[-73.936885,42.647356],[-73.93693399999999,42.647544],[-73.936969,42.647768],[-73.936954,42.647906]]],"type":"Polygon"}
}