{
  "id": "360630243031",
  "type": "Feature",
  "properties": {
    "area_land":30889434,
    "area_water":0,
    "geoid":"360630243031",
    "name":"Block Group 1",
    "state":"ny"
},
  "bbox": [
    -78.885612,
    43.163919,
    -78.818843,
    43.22054
],
  "geometry": {"coordinates":[[[-78.88561199999999,43.201725],[-78.885588,43.203967],[-78.88552,43.210695],[-78.885497,43.212938],[-78.88548900000001,43.214421],[-78.885469,43.218871],[-78.885462,43.220355],[-78.884439,43.220358],[-78.881372,43.220367],[-78.88035000000001,43.220371],[-78.876569,43.220372],[-78.865227,43.220376],[-78.861447,43.220378],[-78.859948,43.220389],[-78.855451,43.220423],[-78.853953,43.220435],[-78.851293,43.220456],[-78.84331400000001,43.220518],[-78.840655,43.22054],[-78.83799,43.220538],[-78.82999700000001,43.220533],[-78.827333,43.220532],[-78.82700699999999,43.220531],[-78.826031,43.220528],[-78.825706,43.220528],[-78.825711,43.218936],[-78.825726,43.21416],[-78.825732,43.212569],[-78.825729,43.211348],[-78.825738,43.210525],[-78.82574200000001,43.210242],[-78.825739,43.209209],[-78.82575199999999,43.208503],[-78.825748,43.208059],[-78.82575199999999,43.204395],[-78.825754,43.203211],[-78.825644,43.202359],[-78.82552099999999,43.201507],[-78.825478,43.201208],[-78.825096,43.198985],[-78.825092,43.198961],[-78.824951,43.198113],[-78.824822,43.197368],[-78.82473,43.196837],[-78.824596,43.196123],[-78.824414,43.195243],[-78.82438500000001,43.195146],[-78.82425499999999,43.194701],[-78.824163,43.194425],[-78.823082,43.191119],[-78.82263500000001,43.189749],[-78.82191400000001,43.187503],[-78.821,43.183871],[-78.820573,43.182034],[-78.82032700000001,43.181062],[-78.81987700000001,43.179279],[-78.819503,43.177684],[-78.81938,43.177695],[-78.819243,43.177709],[-78.819013,43.177726],[-78.81889099999999,43.177736],[-78.818911,43.175397],[-78.818899,43.175009],[-78.818895,43.174861],[-78.818921,43.173321],[-78.81891,43.172742],[-78.818907,43.171908],[-78.818882,43.171202],[-78.818872,43.169641],[-78.81885,43.168433],[-78.81884599999999,43.167392],[-78.818844,43.16683],[-78.818843,43.166311],[-78.81887999999999,43.164104],[-78.81947,43.164175],[-78.820021,43.164208],[-78.82280299999999,43.16427],[-78.823283,43.164279],[-78.82963700000001,43.164403],[-78.830111,43.164396],[-78.830736,43.164381],[-78.83108199999999,43.164381],[-78.833026,43.164346],[-78.833583,43.164349],[-78.834716,43.164304],[-78.83650400000001,43.164177],[-78.83717,43.164131],[-78.838888,43.163998],[-78.839905,43.163932],[-78.840192,43.163922],[-78.84090500000001,43.163919],[-78.841216,43.163942],[-78.84214900000001,43.164011],[-78.842218,43.164017],[-78.84246,43.164038],[-78.842578,43.164036],[-78.843414,43.164083],[-78.844534,43.164156],[-78.845108,43.164208],[-78.84560500000001,43.164253],[-78.846667,43.164421],[-78.847255,43.164537],[-78.849009,43.164917],[-78.84974099999999,43.165033],[-78.85046,43.165109],[-78.85119299999999,43.165167],[-78.85292699999999,43.165354],[-78.85298,43.165358],[-78.853629,43.165416],[-78.855068,43.165503],[-78.85563,43.165515],[-78.855816,43.165519],[-78.85596099999999,43.165518],[-78.856955,43.165512],[-78.857287,43.16551],[-78.859272,43.165503],[-78.86000799999999,43.165497],[-78.86308099999999,43.165472],[-78.863456,43.165469],[-78.86373500000001,43.165467],[-78.86485399999999,43.16546],[-78.86521399999999,43.165473],[-78.86554099999999,43.165485],[-78.86599099999999,43.165533],[-78.866387,43.165595],[-78.866921,43.165722],[-78.867456,43.165887],[-78.86798400000001,43.166084],[-78.86807899999999,43.166131],[-78.868505,43.166341],[-78.868933,43.166595],[-78.86901400000001,43.166646],[-78.86947600000001,43.167008],[-78.870152,43.167616],[-78.87027500000001,43.167715],[-78.87044400000001,43.167856],[-78.87075,43.168076],[-78.870768,43.168087],[-78.871025,43.168243],[-78.871133,43.168299],[-78.87162600000001,43.168516],[-78.871898,43.168617],[-78.87248099999999,43.168782],[-78.872556,43.168804],[-78.873081,43.168936],[-78.874369,43.169244],[-78.87469299999999,43.169303],[-78.87495800000001,43.169341],[-78.875015,43.169344],[-78.875309,43.169363],[-78.876037,43.16938],[-78.87684900000001,43.169379],[-78.878252,43.169389],[-78.879321,43.169377],[-78.88095,43.169356],[-78.88105400000001,43.169355],[-78.88160000000001,43.169336],[-78.881759,43.169311],[-78.882358,43.169152],[-78.882885,43.169002],[-78.88333799999999,43.16887],[-78.884698,43.168477],[-78.884978,43.168397],[-78.88515200000001,43.168347],[-78.88515599999999,43.16855],[-78.885169,43.169161],[-78.88517400000001,43.169365],[-78.88519700000001,43.170721],[-78.885249,43.173634],[-78.885272,43.174789],[-78.885299,43.176146],[-78.885344,43.178312],[-78.885344,43.178398],[-78.88538699999999,43.182458],[-78.885402,43.18292],[-78.885429,43.185157],[-78.885458,43.18741],[-78.885465,43.188113],[-78.885486,43.190222],[-78.885493,43.190925],[-78.885518,43.193084],[-78.885594,43.199564],[-78.8856,43.200038],[-78.88561199999999,43.201725]]],"type":"Polygon"}
}