{
  "id": "360470254003",
  "type": "Feature",
  "properties": {
    "area_land":57934,
    "area_water":0,
    "geoid":"360470254003",
    "name":"Block Group 3",
    "state":"ny"
},
  "bbox": [
    -73.988066,
    40.616522,
    -73.984068,
    40.619567
],
  "geometry": {"coordinates":[[[-73.987435,40.618455],[-73.98713600000001,40.618742],[-73.98685399999999,40.619013],[-73.98627500000001,40.619567],[-73.98406799999999,40.618241],[-73.984651,40.617684],[-73.984949,40.617396],[-73.98523299999999,40.617125],[-73.98586,40.616522],[-73.988066,40.617852],[-73.987435,40.618455]]],"type":"Polygon"}
}