{
  "id": "360290142081",
  "type": "Feature",
  "properties": {
    "area_land":4147643,
    "area_water":0,
    "geoid":"360290142081",
    "name":"Block Group 1",
    "state":"ny"
},
  "bbox": [
    -78.697028,
    42.932618,
    -78.677064,
    42.956466
],
  "geometry": {"coordinates":[[[-78.69702700000001,42.95104],[-78.697024,42.951255],[-78.697022,42.951711],[-78.697022,42.951938],[-78.69702100000001,42.952424],[-78.69701499999999,42.956382],[-78.697016,42.956432],[-78.697017,42.956466],[-78.69681300000001,42.956462],[-78.693434,42.956392],[-78.692504,42.956373],[-78.690928,42.956341],[-78.690749,42.956337],[-78.690585,42.956333],[-78.68953399999999,42.956322],[-78.687468,42.956299],[-78.687341,42.956298],[-78.687094,42.956295],[-78.685936,42.956283],[-78.68577999999999,42.95628],[-78.68471700000001,42.956267],[-78.68341100000001,42.95625],[-78.681388,42.956226],[-78.681252,42.956225],[-78.680177,42.956212],[-78.679376,42.956205],[-78.67791800000001,42.956194],[-78.677138,42.956187],[-78.67710700000001,42.950468],[-78.677097,42.949405],[-78.677083,42.947889],[-78.677081,42.947667],[-78.677077,42.947343],[-78.677064,42.946024],[-78.677122,42.945417],[-78.677139,42.944311],[-78.677167,42.942285],[-78.67718600000001,42.939411],[-78.67719099999999,42.938695],[-78.67720300000001,42.936748],[-78.677221,42.935057],[-78.677224,42.93474],[-78.677215,42.933219],[-78.677297,42.933219],[-78.678253,42.933108],[-78.67955499999999,42.93295],[-78.680634,42.932824],[-78.681601,42.932738],[-78.68216200000001,42.932678],[-78.68276400000001,42.932648],[-78.683539,42.932618],[-78.684107,42.932647],[-78.684635,42.932674],[-78.685795,42.932809],[-78.686064,42.932844],[-78.68801000000001,42.933076],[-78.688929,42.933197],[-78.689612,42.933287],[-78.69041900000001,42.933382],[-78.690729,42.933427],[-78.69207,42.933612],[-78.69332199999999,42.933778],[-78.696935,42.93424],[-78.696935,42.934315],[-78.696934,42.935536],[-78.696955,42.93673],[-78.69697499999999,42.937933],[-78.696988,42.938679],[-78.69695400000001,42.940179],[-78.69693700000001,42.941227],[-78.696945,42.942539],[-78.696941,42.944816],[-78.69694,42.945505],[-78.696932,42.947003],[-78.696928,42.947662],[-78.696923,42.948728],[-78.69692499999999,42.949293],[-78.696926,42.949682],[-78.696926,42.949717],[-78.69692499999999,42.949866],[-78.69692499999999,42.949898],[-78.697007,42.950343],[-78.697028,42.950775],[-78.69702700000001,42.95104]]],"type":"Polygon"}
}