{
  "id": "361090019001",
  "type": "Feature",
  "properties": {
    "area_land":86024009,
    "area_water":131233,
    "geoid":"361090019001",
    "name":"Block Group 1",
    "state":"ny"
},
  "bbox": [
    -76.374215,
    42.304394,
    -76.237695,
    42.445792
],
  "geometry": {"coordinates":[[[-76.37409,42.419505],[-76.373547,42.419588],[-76.37309999999999,42.419625],[-76.37244099999999,42.419651],[-76.371233,42.419674],[-76.37086600000001,42.419706],[-76.370678,42.419726],[-76.370544,42.419746],[-76.370476,42.41976],[-76.370402,42.419783],[-76.370153,42.419894],[-76.36974499999999,42.420102],[-76.369179,42.42037],[-76.3691,42.420416],[-76.369028,42.420448],[-76.36881700000001,42.42059],[-76.368692,42.420686],[-76.368531,42.420801],[-76.36837199999999,42.420929],[-76.36820299999999,42.421048],[-76.36805,42.421162],[-76.36781999999999,42.421305],[-76.36727,42.421662],[-76.36691500000001,42.421878],[-76.36657700000001,42.422072],[-76.366125,42.422298],[-76.36573199999999,42.42246],[-76.36551799999999,42.422535],[-76.36445399999999,42.422849],[-76.36417400000001,42.42292],[-76.363435,42.423077],[-76.362965,42.423164],[-76.362679,42.423181],[-76.362405,42.423157],[-76.36215199999999,42.423101],[-76.361864,42.423022],[-76.361468,42.422925],[-76.359864,42.42257],[-76.359607,42.422497],[-76.35934399999999,42.422392],[-76.35874699999999,42.422129],[-76.357513,42.421531],[-76.35718300000001,42.421391],[-76.356995,42.421334],[-76.35683899999999,42.421282],[-76.356627,42.421235],[-76.356228,42.421222],[-76.355724,42.421282],[-76.35543800000001,42.421339],[-76.355011,42.42147],[-76.354805,42.421549],[-76.35462099999999,42.421633],[-76.354434,42.421684],[-76.354198,42.421714],[-76.353956,42.421731],[-76.353003,42.421742],[-76.3527,42.42175],[-76.35236399999999,42.421754],[-76.351912,42.421773],[-76.351555,42.421804],[-76.351277,42.421834],[-76.350914,42.421883],[-76.350126,42.421978],[-76.349807,42.422036],[-76.349577,42.422106],[-76.349332,42.422199],[-76.34903799999999,42.422338],[-76.348748,42.422485],[-76.348124,42.422826],[-76.347824,42.42301],[-76.347257,42.423336],[-76.346936,42.423497],[-76.346715,42.423599],[-76.346569,42.423659],[-76.346407,42.42372],[-76.346189,42.423763],[-76.345747,42.423813],[-76.34532900000001,42.423849],[-76.34495099999999,42.42389],[-76.34452899999999,42.423953],[-76.344416,42.423982],[-76.344307,42.424019],[-76.344202,42.424061],[-76.344106,42.424116],[-76.34401800000001,42.424176],[-76.343937,42.424239],[-76.343771,42.42439],[-76.34354999999999,42.424577],[-76.343248,42.424801],[-76.343035,42.424944],[-76.34280200000001,42.425068],[-76.342552,42.425174],[-76.34229000000001,42.425263],[-76.34214299999999,42.425296],[-76.342016,42.425325],[-76.341735,42.425369],[-76.341449,42.425394],[-76.341161,42.425393],[-76.340819,42.425379],[-76.340203,42.425323],[-76.340057,42.425316],[-76.33973,42.425311],[-76.339313,42.425122],[-76.33921100000001,42.425353],[-76.339063,42.425638],[-76.33894600000001,42.42582],[-76.338767,42.426052],[-76.33861,42.426243],[-76.338283,42.426602],[-76.338075,42.426798],[-76.337799,42.427031],[-76.33750999999999,42.427264],[-76.33722299999999,42.427479],[-76.336765,42.427845],[-76.33642999999999,42.428087],[-76.336163,42.42827],[-76.335904,42.428417],[-76.335702,42.428514],[-76.33558600000001,42.42857],[-76.33517399999999,42.428737],[-76.333877,42.429234],[-76.333489,42.429378],[-76.332426,42.4298],[-76.332138,42.429911],[-76.331638,42.43012],[-76.331237,42.430277],[-76.330789,42.430494],[-76.330116,42.430813],[-76.32852099999999,42.431592],[-76.32814399999999,42.431754],[-76.32786299999999,42.43187],[-76.32744,42.432001],[-76.32674400000001,42.432167],[-76.326486,42.432255],[-76.32578100000001,42.432515],[-76.32525200000001,42.432724],[-76.32498200000001,42.43284],[-76.324851,42.432913],[-76.32471,42.43301],[-76.324471,42.433202],[-76.32423799999999,42.43342],[-76.32397400000001,42.433658],[-76.32369300000001,42.433886],[-76.323351,42.434138],[-76.32317500000001,42.434252],[-76.322782,42.434486],[-76.322506,42.434643],[-76.32241999999999,42.434707],[-76.322048,42.434905],[-76.321534,42.435208],[-76.320881,42.435575],[-76.32022000000001,42.435948],[-76.319821,42.436191],[-76.319675,42.436292],[-76.31953900000001,42.436401],[-76.31936899999999,42.436552],[-76.319046,42.436875],[-76.31767600000001,42.438377],[-76.31595,42.440249],[-76.31498999999999,42.44129],[-76.314832,42.441472],[-76.314396,42.442022],[-76.314369,42.442068],[-76.314357,42.44209],[-76.314213,42.442402],[-76.314136,42.442646],[-76.313799,42.4426],[-76.313722,42.442597],[-76.312685,42.442636],[-76.312558,42.442628],[-76.312433,42.442611],[-76.312297,42.442586],[-76.31219,42.442527],[-76.311914,42.442374],[-76.310479,42.441481],[-76.31041500000001,42.441437],[-76.309597,42.440951],[-76.309303,42.440788],[-76.30920999999999,42.44073],[-76.30870299999999,42.440686],[-76.308477,42.44068],[-76.30829,42.440682],[-76.307875,42.4407],[-76.307457,42.440741],[-76.306596,42.440738],[-76.30628400000001,42.44075],[-76.30566399999999,42.440766],[-76.304734,42.440777],[-76.303904,42.440741],[-76.30321000000001,42.440722],[-76.302972,42.440711],[-76.302451,42.440713],[-76.30108799999999,42.440737],[-76.300791,42.440758],[-76.300037,42.440794],[-76.29954600000001,42.440813],[-76.29888699999999,42.440821],[-76.29861,42.440833],[-76.29739499999999,42.440864],[-76.295723,42.440933],[-76.295016,42.440941],[-76.294544,42.440951],[-76.294374,42.440926],[-76.29356900000001,42.440827],[-76.293502,42.440827],[-76.293435,42.440837],[-76.292627,42.441071],[-76.292027,42.441168],[-76.291293,42.44128],[-76.291169,42.441309],[-76.290543,42.441482],[-76.289922,42.441638],[-76.28952,42.441719],[-76.28943099999999,42.441724],[-76.289356,42.441712],[-76.289343,42.441694],[-76.28850199999999,42.441854],[-76.28788400000001,42.44204],[-76.286779,42.442202],[-76.286727,42.4422],[-76.286536,42.442194],[-76.286171,42.442099],[-76.284717,42.442067],[-76.283503,42.442609],[-76.282726,42.44298],[-76.282168,42.443341],[-76.28122,42.443966],[-76.281091,42.444024],[-76.280895,42.444113],[-76.28077500000001,42.444166],[-76.280743,42.444181],[-76.28068500000001,42.444187],[-76.28054899999999,42.444201],[-76.277356,42.444267],[-76.276169,42.444291],[-76.27242,42.444446],[-76.27125100000001,42.444505],[-76.27118,42.444509],[-76.270978,42.444523],[-76.270826,42.444568],[-76.270633,42.444657],[-76.27047,42.444777],[-76.270134,42.445009],[-76.269048,42.445792],[-76.269007,42.445761],[-76.26897099999999,42.445733],[-76.26850899999999,42.44538],[-76.26613500000001,42.44355],[-76.264937,42.442569],[-76.26266800000001,42.440756],[-76.262095,42.440323],[-76.261712,42.440079],[-76.261439,42.439923],[-76.260666,42.439575],[-76.259457,42.439197],[-76.257863,42.438715],[-76.255366,42.437978],[-76.255295,42.437952],[-76.255197,42.437913],[-76.254946,42.43377],[-76.254829,42.43185],[-76.254813,42.431579],[-76.254249,42.422268],[-76.25421299999999,42.421679],[-76.253952,42.417369],[-76.253912,42.416718],[-76.253877,42.416141],[-76.253489,42.409725],[-76.253468,42.409366],[-76.25343100000001,42.408751],[-76.253407,42.408354],[-76.253399,42.408228],[-76.253359,42.407568],[-76.254042,42.40755],[-76.26133900000001,42.407368],[-76.269718,42.407158],[-76.28883399999999,42.40668],[-76.29045499999999,42.406639],[-76.29289799999999,42.406578],[-76.29316799999999,42.406572],[-76.29318600000001,42.40653],[-76.29318600000001,42.406403],[-76.293171,42.406388],[-76.29316300000001,42.406287],[-76.293149,42.406272],[-76.29314100000001,42.406255],[-76.293119,42.406102],[-76.29313399999999,42.406019],[-76.293156,42.405992],[-76.293223,42.405926],[-76.29326,42.405882],[-76.293282,42.405866],[-76.293282,42.405844],[-76.293319,42.405822],[-76.29332700000001,42.4058],[-76.29334900000001,42.405783],[-76.293364,42.405745],[-76.293401,42.405712],[-76.293401,42.40569],[-76.293451,42.405646],[-76.29349000000001,42.405613],[-76.293533,42.405581],[-76.293549,42.405547],[-76.29357899999999,42.405547],[-76.293623,42.405514],[-76.29365300000001,42.405514],[-76.29367499999999,42.405492],[-76.293727,42.405487],[-76.293786,42.405459],[-76.293927,42.405427],[-76.294208,42.405355],[-76.294349,42.405311],[-76.294393,42.405284],[-76.29442299999999,42.405284],[-76.29449700000001,42.405251],[-76.294571,42.405202],[-76.294697,42.405086],[-76.294764,42.40496],[-76.294786,42.404894],[-76.294786,42.404861],[-76.294802,42.404846],[-76.294831,42.404642],[-76.294831,42.404603],[-76.294847,42.404589],[-76.29486,42.404565],[-76.294882,42.404466],[-76.294912,42.40445],[-76.29491899999999,42.404395],[-76.294956,42.404367],[-76.294965,42.40435],[-76.29498599999999,42.404329],[-76.295001,42.404296],[-76.29503800000001,42.404268],[-76.29503800000001,42.404241],[-76.29506000000001,42.404225],[-76.295097,42.404159],[-76.295134,42.40412],[-76.295186,42.404021],[-76.295208,42.403879],[-76.29520100000001,42.40361],[-76.29518400000001,42.403596],[-76.295164,42.403489],[-76.29512699999999,42.403352],[-76.295098,42.403171],[-76.295098,42.403139],[-76.29508300000001,42.403123],[-76.295068,42.402896],[-76.295068,42.402731],[-76.29510500000001,42.402623],[-76.29510500000001,42.402605],[-76.29512200000001,42.402591],[-76.29515000000001,42.402539],[-76.29517199999999,42.402523],[-76.295187,42.402484],[-76.295209,42.402468],[-76.29521699999999,42.402451],[-76.29540900000001,42.402298],[-76.295417,42.40228],[-76.29549,42.402215],[-76.29549900000001,42.402198],[-76.295535,42.402161],[-76.295536,42.402143],[-76.295579,42.402078],[-76.295587,42.402045],[-76.295616,42.401979],[-76.29561699999999,42.401961],[-76.295653,42.401897],[-76.295653,42.40187],[-76.29572,42.401787],[-76.295739,42.40177],[-76.29583100000001,42.401689],[-76.295839,42.401671],[-76.29592,42.401601],[-76.296046,42.40148],[-76.29606800000001,42.401464],[-76.296076,42.401446],[-76.296187,42.401348],[-76.29629799999999,42.401222],[-76.296335,42.401173],[-76.29637200000001,42.40114],[-76.296387,42.401101],[-76.29641599999999,42.401085],[-76.296424,42.401057],[-76.29646099999999,42.401019],[-76.296476,42.400986],[-76.296505,42.400964],[-76.296542,42.400893],[-76.29652,42.40081],[-76.296491,42.400794],[-76.29648299999999,42.400766],[-76.296409,42.40069],[-76.29637200000001,42.400607],[-76.296402,42.400481],[-76.296402,42.400459],[-76.296446,42.400261],[-76.296468,42.400218],[-76.296498,42.399998],[-76.296526,42.399877],[-76.296543,42.399806],[-76.296543,42.399788],[-76.29658000000001,42.399669],[-76.296581,42.399648],[-76.296617,42.399542],[-76.296617,42.399504],[-76.296661,42.399367],[-76.296661,42.399279],[-76.29667600000001,42.399268],[-76.29669800000001,42.399202],[-76.296728,42.399186],[-76.296733,42.399168],[-76.296772,42.39912],[-76.296802,42.399098],[-76.296891,42.399015],[-76.296891,42.398993],[-76.29692799999999,42.398966],[-76.296931,42.398948],[-76.29695,42.398933],[-76.296995,42.398862],[-76.297032,42.398768],[-76.29704700000001,42.398752],[-76.29706899999999,42.398587],[-76.297076,42.398379],[-76.297113,42.398241],[-76.297128,42.39822],[-76.29714300000001,42.398165],[-76.29716500000001,42.398148],[-76.29718,42.39811],[-76.297202,42.398093],[-76.297217,42.39806],[-76.297254,42.398033],[-76.297254,42.398011],[-76.297291,42.397983],[-76.29729399999999,42.397965],[-76.297321,42.397951],[-76.297336,42.397912],[-76.297358,42.397896],[-76.29737299999999,42.397857],[-76.29739499999999,42.397841],[-76.29741,42.397813],[-76.29741199999999,42.397795],[-76.297432,42.397775],[-76.297462,42.39772],[-76.297484,42.39766],[-76.29749099999999,42.397495],[-76.29747500000001,42.397481],[-76.297454,42.397374],[-76.297438,42.39736],[-76.297417,42.397275],[-76.297425,42.397237],[-76.297409,42.397223],[-76.29739499999999,42.397193],[-76.297425,42.397001],[-76.29744100000001,42.396987],[-76.29749099999999,42.396875],[-76.29751400000001,42.396792],[-76.297543,42.39677],[-76.297558,42.396715],[-76.29758,42.396699],[-76.297595,42.396666],[-76.29763199999999,42.396639],[-76.29763199999999,42.396617],[-76.29765399999999,42.3966],[-76.297662,42.396582],[-76.297691,42.396556],[-76.29770600000001,42.396518],[-76.297847,42.396392],[-76.297899,42.396359],[-76.29790800000001,42.396342],[-76.298062,42.396238],[-76.298232,42.396106],[-76.298314,42.396035],[-76.298351,42.395996],[-76.298366,42.395958],[-76.298388,42.395942],[-76.29844,42.395771],[-76.29843200000001,42.395689],[-76.29840299999999,42.395667],[-76.298395,42.395649],[-76.298247,42.395519],[-76.298203,42.395453],[-76.298151,42.395338],[-76.298151,42.39531],[-76.298129,42.395261],[-76.29812099999999,42.395146],[-76.29810500000001,42.395132],[-76.298084,42.39497],[-76.29805500000001,42.394893],[-76.29804,42.394822],[-76.298024,42.394808],[-76.297995,42.394739],[-76.297966,42.394723],[-76.297966,42.394695],[-76.297944,42.394673],[-76.29793600000001,42.394635],[-76.297899,42.394608],[-76.297898,42.39459],[-76.297788,42.394487],[-76.297787,42.394469],[-76.297766,42.394454],[-76.297729,42.394405],[-76.297714,42.394372],[-76.297692,42.39435],[-76.29767,42.394295],[-76.297647,42.394278],[-76.297618,42.394185],[-76.297625,42.394146],[-76.297648,42.394075],[-76.297648,42.394042],[-76.297664,42.394028],[-76.29767699999999,42.394004],[-76.297679,42.393986],[-76.297681,42.393971],[-76.297685,42.393949],[-76.297696,42.393905],[-76.297718,42.393817],[-76.29772699999999,42.393772],[-76.29772699999999,42.393728],[-76.29772199999999,42.393565],[-76.297707,42.39355],[-76.29769899999999,42.393466],[-76.297684,42.393451],[-76.29767699999999,42.393427],[-76.297603,42.393279],[-76.297588,42.393263],[-76.297566,42.393208],[-76.297544,42.393186],[-76.297544,42.393158],[-76.297526,42.393145],[-76.2975,42.393076],[-76.29747,42.393016],[-76.29747,42.392988],[-76.29743999999999,42.392885],[-76.29743999999999,42.392867],[-76.29742400000001,42.392853],[-76.297381,42.39273],[-76.297366,42.392703],[-76.297359,42.392593],[-76.297344,42.392578],[-76.29732199999999,42.392401],[-76.297344,42.391912],[-76.297313,42.391784],[-76.297241,42.39172],[-76.29713,42.391643],[-76.297105,42.391642],[-76.297085,42.391627],[-76.297061,42.391622],[-76.296982,42.391577],[-76.296937,42.391544],[-76.296915,42.391517],[-76.29689999999999,42.391462],[-76.296937,42.391341],[-76.29694499999999,42.391259],[-76.29692799999999,42.391245],[-76.296915,42.391221],[-76.296908,42.391149],[-76.296819,42.391072],[-76.296567,42.390891],[-76.296567,42.390869],[-76.296549,42.390856],[-76.29653,42.390798],[-76.296537,42.390661],[-76.29656,42.390534],[-76.29656,42.390468],[-76.29654499999999,42.390315],[-76.296528,42.390301],[-76.296515,42.390282],[-76.296493,42.390227],[-76.29645600000001,42.390167],[-76.296449,42.390145],[-76.296412,42.390073],[-76.29639,42.390018],[-76.296353,42.389952],[-76.29633,42.389888],[-76.29633,42.38987],[-76.29631500000001,42.389855],[-76.29629300000001,42.38976],[-76.29629300000001,42.389623],[-76.296375,42.389398],[-76.296375,42.389371],[-76.296391,42.389357],[-76.296412,42.389294],[-76.296412,42.389266],[-76.296431,42.389254],[-76.296442,42.389233],[-76.29645600000001,42.389178],[-76.296493,42.38908],[-76.296494,42.389052],[-76.29651,42.389038],[-76.29652299999999,42.389014],[-76.29654499999999,42.388915],[-76.296575,42.388866],[-76.296575,42.388848],[-76.296649,42.388641],[-76.296694,42.388531],[-76.296693,42.388503],[-76.29673099999999,42.388421],[-76.296745,42.38835],[-76.29678199999999,42.388278],[-76.29678199999999,42.38824],[-76.29682,42.388168],[-76.29682,42.388141],[-76.296864,42.388064],[-76.296864,42.388037],[-76.29690100000001,42.387965],[-76.29690100000001,42.387932],[-76.29691699999999,42.387918],[-76.296982,42.38774],[-76.297005,42.387702],[-76.297034,42.38762],[-76.297057,42.387603],[-76.297057,42.387565],[-76.29707399999999,42.387552],[-76.29713099999999,42.387427],[-76.29713099999999,42.3874],[-76.297146,42.387392],[-76.297175,42.387329],[-76.297212,42.387268],[-76.297212,42.387241],[-76.297228,42.387227],[-76.29738999999999,42.386939],[-76.297405,42.386922],[-76.297427,42.386868],[-76.297583,42.386604],[-76.297597,42.386588],[-76.297664,42.386456],[-76.297686,42.386439],[-76.297686,42.386412],[-76.297703,42.386399],[-76.297723,42.386352],[-76.297775,42.386275],[-76.29781199999999,42.386242],[-76.297813,42.386224],[-76.297842,42.386203],[-76.297901,42.386132],[-76.29804900000001,42.386022],[-76.298153,42.385973],[-76.29819000000001,42.385945],[-76.298214,42.385941],[-76.298294,42.385902],[-76.29844199999999,42.385803],[-76.298731,42.385622],[-76.29877500000001,42.385583],[-76.298968,42.38549],[-76.29919,42.385325],[-76.299198,42.385308],[-76.299308,42.385226],[-76.299316,42.385208],[-76.299419,42.385111],[-76.29943400000001,42.385073],[-76.299471,42.385045],[-76.299474,42.385027],[-76.299493,42.385012],[-76.299582,42.384837],[-76.299582,42.384809],[-76.299598,42.384795],[-76.299612,42.384765],[-76.29964200000001,42.384601],[-76.29964099999999,42.384546],[-76.299627,42.384447],[-76.299604,42.38442],[-76.29959700000001,42.384381],[-76.29956,42.384354],[-76.29955200000001,42.384337],[-76.29950100000001,42.384299],[-76.299477,42.384294],[-76.299412,42.38426],[-76.29933800000001,42.384211],[-76.29919,42.384129],[-76.29907900000001,42.384046],[-76.299071,42.384019],[-76.299071,42.383991],[-76.299057,42.383976],[-76.299094,42.383662],[-76.299057,42.383525],[-76.299072,42.383475],[-76.299183,42.383377],[-76.29919700000001,42.383349],[-76.29919599999999,42.383331],[-76.299153,42.383206],[-76.29912400000001,42.38314],[-76.29912299999999,42.383113],[-76.299115,42.383096],[-76.29910099999999,42.383031],[-76.299117,42.383017],[-76.299131,42.382965],[-76.299153,42.382948],[-76.299198,42.38285],[-76.299198,42.382822],[-76.299183,42.382807],[-76.29917500000001,42.382718],[-76.29914599999999,42.38269],[-76.299138,42.382657],[-76.29910099999999,42.382592],[-76.29910099999999,42.382564],[-76.299086,42.382549],[-76.299064,42.38246],[-76.299064,42.382427],[-76.299042,42.382388],[-76.299035,42.38235],[-76.298998,42.382323],[-76.298997,42.382305],[-76.29896100000001,42.382279],[-76.298827,42.382202],[-76.298731,42.38213],[-76.29870200000001,42.382054],[-76.29870200000001,42.382021],[-76.298731,42.381944],[-76.298731,42.381872],[-76.298694,42.381806],[-76.298598,42.381713],[-76.298613,42.381697],[-76.298591,42.381686],[-76.298429,42.381546],[-76.298406,42.381538],[-76.298383,42.381521],[-76.29832399999999,42.38151],[-76.298221,42.38151],[-76.29813900000001,42.381516],[-76.29792399999999,42.381625],[-76.29785800000001,42.381631],[-76.297813,42.381631],[-76.297687,42.381614],[-76.297539,42.381576],[-76.297495,42.381543],[-76.29745800000001,42.381543],[-76.29728799999999,42.381449],[-76.29714,42.381378],[-76.29707999999999,42.381345],[-76.297043,42.38134],[-76.297014,42.381318],[-76.296989,42.381317],[-76.29682099999999,42.381274],[-76.296747,42.381263],[-76.296384,42.381296],[-76.296288,42.38129],[-76.296229,42.381279],[-76.296192,42.381263],[-76.296155,42.381235],[-76.296133,42.381191],[-76.296155,42.381125],[-76.296192,42.381054],[-76.29623599999999,42.380928],[-76.29623599999999,42.380889],[-76.296221,42.380874],[-76.29621400000001,42.380807],[-76.29619700000001,42.380793],[-76.29618499999999,42.380769],[-76.296177,42.38073],[-76.29613999999999,42.380697],[-76.29613999999999,42.380675],[-76.29611800000001,42.380659],[-76.296088,42.380615],[-76.295948,42.380494],[-76.29585899999999,42.380445],[-76.295711,42.380417],[-76.29562900000001,42.380368],[-76.295592,42.380324],[-76.29557,42.380176],[-76.295481,42.38011],[-76.29523,42.380082],[-76.29495,42.380066],[-76.294926,42.380055],[-76.29473400000001,42.380038],[-76.294715,42.380026],[-76.294571,42.38],[-76.294326,42.37994],[-76.29418099999999,42.379913],[-76.294156,42.379912],[-76.29413700000001,42.3799],[-76.294045,42.379879],[-76.293897,42.379863],[-76.29387800000001,42.379851],[-76.293845,42.379841],[-76.29369,42.37983],[-76.293623,42.379813],[-76.293097,42.379786],[-76.292697,42.37978],[-76.292357,42.379813],[-76.29233600000001,42.379824],[-76.29224600000001,42.379829],[-76.292227,42.379841],[-76.292046,42.379862],[-76.291994,42.379873],[-76.291809,42.37989],[-76.291786,42.379896],[-76.291646,42.379906],[-76.29158700000001,42.379923],[-76.29156500000001,42.379912],[-76.291473,42.379918],[-76.29130600000001,42.379928],[-76.291017,42.379922],[-76.29064700000001,42.379857],[-76.29062399999999,42.379835],[-76.29057299999999,42.379824],[-76.29055,42.379807],[-76.290526,42.379802],[-76.290173,42.37962],[-76.290148,42.379618],[-76.290121,42.379598],[-76.289973,42.37956],[-76.28985400000001,42.37956],[-76.289766,42.379571],[-76.289677,42.379604],[-76.289506,42.37973],[-76.28949799999999,42.379747],[-76.289151,42.380015],[-76.289055,42.380065],[-76.288944,42.380081],[-76.288855,42.380076],[-76.288685,42.380032],[-76.28858099999999,42.379999],[-76.288462,42.379982],[-76.28835100000001,42.379977],[-76.28833,42.379988],[-76.288151,42.379993],[-76.287818,42.379966],[-76.287655,42.379933],[-76.287559,42.379905],[-76.287448,42.379839],[-76.28741100000001,42.379812],[-76.28740500000001,42.379794],[-76.28731500000001,42.379691],[-76.287233,42.379625],[-76.287145,42.379609],[-76.287063,42.379603],[-76.28704399999999,42.379615],[-76.286952,42.379631],[-76.28679700000001,42.379675],[-76.28672299999999,42.379691],[-76.28661099999999,42.379708],[-76.28649299999999,42.379691],[-76.286367,42.379653],[-76.286315,42.379642],[-76.286293,42.379625],[-76.286182,42.379592],[-76.286108,42.379559],[-76.28604900000001,42.379548],[-76.286027,42.379526],[-76.28599,42.379521],[-76.285768,42.379449],[-76.285597,42.379405],[-76.285471,42.379383],[-76.285397,42.379383],[-76.285374,42.379389],[-76.285338,42.379389],[-76.28522,42.379471],[-76.285034,42.379641],[-76.284997,42.379669],[-76.28482,42.37974],[-76.284746,42.379756],[-76.284598,42.379773],[-76.284479,42.379773],[-76.284458,42.379762],[-76.284412,42.379762],[-76.284395,42.379749],[-76.284368,42.379745],[-76.284294,42.379723],[-76.284183,42.379658],[-76.284109,42.379592],[-76.283998,42.379482],[-76.283976,42.379465],[-76.283917,42.379443],[-76.283806,42.379443],[-76.28376799999999,42.37946],[-76.283739,42.379481],[-76.283717,42.379504],[-76.283687,42.379734],[-76.283665,42.379751],[-76.28364999999999,42.379855],[-76.28362,42.379871],[-76.28360499999999,42.379899],[-76.283457,42.379987],[-76.28325700000001,42.380042],[-76.283072,42.380058],[-76.282926,42.380047],[-76.282776,42.380036],[-76.282759,42.380023],[-76.282554,42.379992],[-76.282275,42.379937],[-76.28225,42.379937],[-76.282231,42.379925],[-76.282065,42.379904],[-76.282006,42.379915],[-76.28193899999999,42.379942],[-76.281902,42.379948],[-76.281828,42.379992],[-76.28182099999999,42.38001],[-76.28175400000001,42.380074],[-76.28175299999999,42.380092],[-76.281651,42.380156],[-76.28156199999999,42.380173],[-76.281493,42.380173],[-76.28147300000001,42.380161],[-76.281295,42.38014],[-76.28116900000001,42.380167],[-76.28111800000001,42.380195],[-76.281093,42.380196],[-76.281058,42.380211],[-76.281036,42.380228],[-76.280947,42.380255],[-76.280799,42.380271],[-76.280688,42.38026],[-76.28065100000001,42.380244],[-76.280599,42.380233],[-76.28057699999999,42.380217],[-76.28048800000001,42.380194],[-76.280466,42.380178],[-76.280303,42.380118],[-76.280148,42.380079],[-76.280022,42.380063],[-76.279977,42.380063],[-76.279703,42.38003],[-76.279684,42.380018],[-76.279555,42.379991],[-76.27949599999999,42.379964],[-76.279422,42.379909],[-76.279422,42.379898],[-76.27940700000001,42.379887],[-76.279399,42.379851],[-76.279394,42.379828],[-76.27937799999999,42.37975],[-76.27937799999999,42.379717],[-76.27940700000001,42.379585],[-76.279408,42.379552],[-76.279416,42.379535],[-76.279445,42.379393],[-76.279437,42.379239],[-76.27945200000001,42.379195],[-76.27963699999999,42.379031],[-76.279652,42.379003],[-76.27965500000001,42.378985],[-76.279674,42.37897],[-76.279689,42.378921],[-76.279689,42.378833],[-76.27963,42.378756],[-76.27958599999999,42.378718],[-76.27951899999999,42.37869],[-76.279201,42.378679],[-76.279104,42.378613],[-76.279082,42.378564],[-76.279082,42.378536],[-76.279045,42.378503],[-76.279045,42.378481],[-76.279023,42.378454],[-76.278875,42.378361],[-76.27881600000001,42.378344],[-76.278764,42.378317],[-76.27869,42.378295],[-76.278594,42.378251],[-76.278413,42.378149],[-76.278395,42.378132],[-76.278356,42.378114],[-76.27822399999999,42.378026],[-76.27806099999999,42.377877],[-76.27789799999999,42.377773],[-76.277506,42.377767],[-76.277439,42.377756],[-76.277343,42.377729],[-76.277261,42.377679],[-76.277224,42.377652],[-76.27719999999999,42.377648],[-76.276906,42.377504],[-76.27667700000001,42.377355],[-76.276551,42.377279],[-76.276492,42.377251],[-76.276369,42.377225],[-76.27634399999999,42.377224],[-76.276325,42.377212],[-76.276196,42.377185],[-76.276099,42.377152],[-76.27578800000001,42.377075],[-76.275633,42.377059],[-76.275285,42.377015],[-76.27526400000001,42.377003],[-76.275122,42.376987],[-76.274833,42.376943],[-76.27481,42.376937],[-76.274671,42.376927],[-76.274652,42.376915],[-76.27447100000001,42.376894],[-76.274452,42.376881],[-76.274204,42.376844],[-76.27416700000001,42.376844],[-76.274146,42.376832],[-76.273945,42.376811],[-76.273922,42.376805],[-76.27376,42.376784],[-76.273741,42.376772],[-76.273701,42.376767],[-76.273664,42.376756],[-76.27359,42.376745],[-76.27323,42.376669],[-76.273205,42.376668],[-76.273188,42.376655],[-76.27305699999999,42.37663],[-76.27296,42.376619],[-76.272941,42.376607],[-76.27279799999999,42.376586],[-76.272761,42.376586],[-76.272724,42.376597],[-76.272679,42.376569],[-76.272578,42.376548],[-76.272553,42.376547],[-76.272532,42.376536],[-76.272316,42.37652],[-76.272299,42.376507],[-76.272257,42.376498],[-76.272013,42.376487],[-76.271989,42.376492],[-76.271946,42.376492],[-76.27179099999999,42.376536],[-76.271598,42.376657],[-76.271524,42.376717],[-76.27139099999999,42.376805],[-76.271367,42.37681],[-76.271339,42.376827],[-76.271309,42.376832],[-76.271265,42.37686],[-76.27122799999999,42.37687],[-76.27106499999999,42.376887],[-76.27080599999999,42.376865],[-76.270769,42.376843],[-76.270717,42.376832],[-76.270695,42.376815],[-76.27067,42.376814],[-76.270613,42.376788],[-76.270562,42.376777],[-76.27051299999999,42.376751],[-76.270488,42.376749],[-76.270448,42.376738],[-76.270391,42.376711],[-76.27028799999999,42.376684],[-76.27024299999999,42.376656],[-76.270218,42.376654],[-76.270169,42.376623],[-76.270144,42.376622],[-76.269947,42.376524],[-76.26988799999999,42.376502],[-76.269718,42.376398],[-76.269693,42.376396],[-76.269533,42.376315],[-76.269508,42.376314],[-76.26944399999999,42.376288],[-76.269311,42.376255],[-76.269177,42.376255],[-76.26915700000001,42.376266],[-76.268963,42.376282],[-76.26864399999999,42.376277],[-76.268624,42.376266],[-76.268585,42.376266],[-76.26836299999999,42.376227],[-76.268215,42.376194],[-76.26819,42.376193],[-76.268126,42.376178],[-76.26788500000001,42.37614],[-76.26786,42.376139],[-76.267839,42.376127],[-76.26774899999999,42.376117],[-76.26773,42.376105],[-76.26763800000001,42.37609],[-76.26735600000001,42.376018],[-76.26732699999999,42.376002],[-76.267302,42.376],[-76.26728199999999,42.375985],[-76.267149,42.375919],[-76.266949,42.37576],[-76.266942,42.375742],[-76.266794,42.37559],[-76.266772,42.375573],[-76.266639,42.375518],[-76.266454,42.375474],[-76.26641600000001,42.375474],[-76.26631999999999,42.375447],[-76.26612,42.375425],[-76.266097,42.375418],[-76.26582399999999,42.375397],[-76.26554299999999,42.375365],[-76.265531,42.375369],[-76.265513,42.375375],[-76.265469,42.375342],[-76.26537999999999,42.375326],[-76.26535800000001,42.375315],[-76.265269,42.375298],[-76.26518799999999,42.375249],[-76.265062,42.375155],[-76.265006,42.375073],[-76.26504300000001,42.375002],[-76.26492500000001,42.374354],[-76.264895,42.374272],[-76.26487299999999,42.374255],[-76.264866,42.374217],[-76.26482900000001,42.374157],[-76.264718,42.37408],[-76.26462100000001,42.374069],[-76.264577,42.374052],[-76.264399,42.37403],[-76.26424400000001,42.374003],[-76.264214,42.373992],[-76.26402899999999,42.373964],[-76.263977,42.373953],[-76.263829,42.373887],[-76.26367399999999,42.373761],[-76.263637,42.373684],[-76.263571,42.373624],[-76.263474,42.373569],[-76.263363,42.373514],[-76.263178,42.373464],[-76.262897,42.373426],[-76.262793,42.373415],[-76.26269000000001,42.373393],[-76.26226,42.373277],[-76.262075,42.373255],[-76.261972,42.373222],[-76.261927,42.373217],[-76.261861,42.373189],[-76.26165399999999,42.373123],[-76.26160900000001,42.373112],[-76.26154200000001,42.373085],[-76.261498,42.373074],[-76.261409,42.373041],[-76.261357,42.373013],[-76.261246,42.372986],[-76.261195,42.37298],[-76.261039,42.372947],[-76.260825,42.372914],[-76.260773,42.372898],[-76.260588,42.372876],[-76.260366,42.372815],[-76.260262,42.372782],[-76.26015099999999,42.372733],[-76.26005499999999,42.372673],[-76.25995899999999,42.372585],[-76.25984800000001,42.372469],[-76.25980300000001,42.372321],[-76.25953,42.372074],[-76.259456,42.372019],[-76.259396,42.371992],[-76.25927799999999,42.37192],[-76.25916700000001,42.371871],[-76.25909299999999,42.371838],[-76.259078,42.37181],[-76.258893,42.371613],[-76.25888500000001,42.371595],[-76.258686,42.371415],[-76.25864900000001,42.371387],[-76.258538,42.371338],[-76.25845700000001,42.371349],[-76.25842,42.371349],[-76.258353,42.371365],[-76.25827200000001,42.371393],[-76.257983,42.37153],[-76.25789399999999,42.371541],[-76.25775299999999,42.371464],[-76.25770199999999,42.371431],[-76.257679,42.371382],[-76.257576,42.371294],[-76.257531,42.371211],[-76.25751700000001,42.371173],[-76.25747200000001,42.371107],[-76.257413,42.371068],[-76.257361,42.371041],[-76.25725,42.371008],[-76.25668,42.370898],[-76.256621,42.370876],[-76.256547,42.37081],[-76.25654,42.370684],[-76.256488,42.370645],[-76.25629600000001,42.370634],[-76.25615500000001,42.370667],[-76.255933,42.3707],[-76.255837,42.370689],[-76.255696,42.370607],[-76.255563,42.370469],[-76.255481,42.370414],[-76.25543,42.370409],[-76.25537799999999,42.370381],[-76.25505200000001,42.370293],[-76.254904,42.370277],[-76.25483800000001,42.370249],[-76.25481499999999,42.370233],[-76.254756,42.370211],[-76.254645,42.370145],[-76.254571,42.370057],[-76.254475,42.369964],[-76.25445999999999,42.36992],[-76.25443799999999,42.369898],[-76.254423,42.369848],[-76.254401,42.369826],[-76.254386,42.369744],[-76.254364,42.369728],[-76.25435,42.369645],[-76.254327,42.369618],[-76.25432000000001,42.3696],[-76.254283,42.369398],[-76.25424599999999,42.369354],[-76.254254,42.369294],[-76.25424599999999,42.369261],[-76.25422399999999,42.369245],[-76.25421299999999,42.369179],[-76.254209,42.369151],[-76.254172,42.36908],[-76.254091,42.368992],[-76.253728,42.368822],[-76.253632,42.368794],[-76.253558,42.368756],[-76.253461,42.368717],[-76.25335099999999,42.368673],[-76.253203,42.368596],[-76.25306999999999,42.368552],[-76.25288500000001,42.368459],[-76.252618,42.368294],[-76.25236700000001,42.368157],[-76.252234,42.368091],[-76.252145,42.368074],[-76.252115,42.368058],[-76.252049,42.368047],[-76.25199000000001,42.368019],[-76.251969,42.368015],[-76.251915,42.368003],[-76.251656,42.367871],[-76.251153,42.367475],[-76.251043,42.367404],[-76.25098300000001,42.367376],[-76.250872,42.367311],[-76.25079100000001,42.367272],[-76.25062800000001,42.367124],[-76.250473,42.366965],[-76.250406,42.366871],[-76.250399,42.366833],[-76.250362,42.3668],[-76.250347,42.366734],[-76.250325,42.366717],[-76.25031799999999,42.366646],[-76.250266,42.366531],[-76.25014,42.366404],[-76.250022,42.366316],[-76.249911,42.366278],[-76.249837,42.36624],[-76.249652,42.36619],[-76.249578,42.366183],[-76.249349,42.366172],[-76.24916399999999,42.36615],[-76.24909,42.366134],[-76.24906,42.366139],[-76.248949,42.366096],[-76.248875,42.366079],[-76.248853,42.366057],[-76.248801,42.366052],[-76.24874199999999,42.366024],[-76.248609,42.365986],[-76.24852,42.365942],[-76.248423,42.365915],[-76.248357,42.365876],[-76.24827500000001,42.365849],[-76.24806100000001,42.36575],[-76.248001,42.365734],[-76.24794900000001,42.365706],[-76.247905,42.365695],[-76.247764,42.365635],[-76.247609,42.365597],[-76.247394,42.36558],[-76.246965,42.365586],[-76.246906,42.365581],[-76.246765,42.365553],[-76.24663200000001,42.365509],[-76.24657999999999,42.365482],[-76.246506,42.36546],[-76.246387,42.3654],[-76.246172,42.365274],[-76.246076,42.365197],[-76.245913,42.365038],[-76.24578700000001,42.364945],[-76.245743,42.364934],[-76.245721,42.364917],[-76.245498,42.364901],[-76.245454,42.364906],[-76.24541000000001,42.364901],[-76.245313,42.364879],[-76.24524700000001,42.364846],[-76.24517299999999,42.36478],[-76.245136,42.36472],[-76.24512799999999,42.364681],[-76.245091,42.364643],[-76.245076,42.364599],[-76.24503900000001,42.364533],[-76.245002,42.364489],[-76.24494300000001,42.364434],[-76.244876,42.364402],[-76.24478000000001,42.364374],[-76.244721,42.364319],[-76.244721,42.364281],[-76.244669,42.364242],[-76.244469,42.364221],[-76.244336,42.364155],[-76.24402499999999,42.36393],[-76.243987,42.363908],[-76.243869,42.363908],[-76.24376599999999,42.363935],[-76.243691,42.363936],[-76.243573,42.363903],[-76.243492,42.363897],[-76.243388,42.363903],[-76.24327700000001,42.36393],[-76.243247,42.363947],[-76.243099,42.364013],[-76.242966,42.364013],[-76.24275900000001,42.364029],[-76.24269200000001,42.364024],[-76.24261799999999,42.363985],[-76.242485,42.363876],[-76.242374,42.363832],[-76.242322,42.363821],[-76.24230300000001,42.363808],[-76.242166,42.363717],[-76.24212900000001,42.363678],[-76.242085,42.363536],[-76.242063,42.363514],[-76.24204,42.363459],[-76.24200999999999,42.363414],[-76.24198800000001,42.363393],[-76.24196600000001,42.363086],[-76.241944,42.363064],[-76.241929,42.363009],[-76.241907,42.362992],[-76.241884,42.362861],[-76.24189200000001,42.362811],[-76.24189200000001,42.362767],[-76.241855,42.362685],[-76.24170599999999,42.362531],[-76.241692,42.362493],[-76.24170599999999,42.362465],[-76.241832,42.362394],[-76.24195,42.362355],[-76.242002,42.362344],[-76.24212799999999,42.362284],[-76.24215,42.362262],[-76.24215,42.362218],[-76.242172,42.362202],[-76.24218,42.362103],[-76.242209,42.362026],[-76.242209,42.362015],[-76.242187,42.361988],[-76.242172,42.361955],[-76.24215,42.361922],[-76.242135,42.361889],[-76.242098,42.361845],[-76.241928,42.361691],[-76.241913,42.361669],[-76.241839,42.361587],[-76.24182999999999,42.36157],[-76.241468,42.361263],[-76.241387,42.361214],[-76.24133500000001,42.361208],[-76.241209,42.361137],[-76.24109799999999,42.361055],[-76.24091300000001,42.36089],[-76.24081700000001,42.360819],[-76.24070500000001,42.360682],[-76.24067599999999,42.360632],[-76.24065400000001,42.360605],[-76.24063099999999,42.360545],[-76.24060900000001,42.360523],[-76.240594,42.360479],[-76.24053499999999,42.360407],[-76.24044600000001,42.360325],[-76.24035000000001,42.360254],[-76.240098,42.360117],[-76.240002,42.36004],[-76.23992800000001,42.359963],[-76.239913,42.359936],[-76.23985399999999,42.35987],[-76.239839,42.359815],[-76.239817,42.359798],[-76.239802,42.359727],[-76.239779,42.359705],[-76.23976500000001,42.359606],[-76.239772,42.359458],[-76.239801,42.359387],[-76.239831,42.35926],[-76.239801,42.359189],[-76.239757,42.359129],[-76.23974200000001,42.359079],[-76.239705,42.359046],[-76.23969,42.359024],[-76.239712,42.358953],[-76.23969700000001,42.358865],[-76.239682,42.358816],[-76.23969,42.358706],[-76.23966799999999,42.358679],[-76.23963000000001,42.358646],[-76.23950499999999,42.358503],[-76.239482,42.358448],[-76.239445,42.358382],[-76.239349,42.358278],[-76.23931899999999,42.358223],[-76.23929699999999,42.358201],[-76.239282,42.358146],[-76.239238,42.358037],[-76.239223,42.35802],[-76.239163,42.357834],[-76.239119,42.357614],[-76.239052,42.357438],[-76.23902200000001,42.357411],[-76.238985,42.35734],[-76.238963,42.357312],[-76.23894799999999,42.357274],[-76.23892600000001,42.357257],[-76.238911,42.357219],[-76.23885199999999,42.357137],[-76.238822,42.357082],[-76.2388,42.357065],[-76.23878499999999,42.357027],[-76.238741,42.356972],[-76.238704,42.35689],[-76.238652,42.356818],[-76.238637,42.35678],[-76.23859299999999,42.356736],[-76.23859299999999,42.356719],[-76.23858199999999,42.356692],[-76.23855500000001,42.356621],[-76.23852599999999,42.356401],[-76.23854,42.356154],[-76.23856000000001,42.355929],[-76.238562,42.355918],[-76.23855500000001,42.355869],[-76.23857700000001,42.355836],[-76.238584,42.355786],[-76.238614,42.355671],[-76.238636,42.355622],[-76.238643,42.355594],[-76.23866599999999,42.35555],[-76.238677,42.355512],[-76.23871,42.355396],[-76.238747,42.355314],[-76.238784,42.355056],[-76.238776,42.354941],[-76.238747,42.354897],[-76.238776,42.354858],[-76.23876799999999,42.354743],[-76.23871699999999,42.354491],[-76.238702,42.354463],[-76.238687,42.354359],[-76.238665,42.354337],[-76.23865000000001,42.354227],[-76.23862800000001,42.354211],[-76.238598,42.354013],[-76.238568,42.353914],[-76.23853800000001,42.353755],[-76.238516,42.353739],[-76.23848599999999,42.353514],[-76.23846399999999,42.353481],[-76.238412,42.353234],[-76.238404,42.353129],[-76.238367,42.352959],[-76.238308,42.35274],[-76.238241,42.352553],[-76.238219,42.352504],[-76.238212,42.352476],[-76.23818900000001,42.352443],[-76.238167,42.352377],[-76.238145,42.352361],[-76.238034,42.35218],[-76.23799699999999,42.352142],[-76.23799699999999,42.352114],[-76.237967,42.352087],[-76.23796,42.352059],[-76.23792299999999,42.352015],[-76.237914,42.351998],[-76.237886,42.351971],[-76.237848,42.351889],[-76.23781099999999,42.351834],[-76.237773,42.351733],[-76.23772700000001,42.351564],[-76.23772099999999,42.351496],[-76.23769799999999,42.351393],[-76.237695,42.351358],[-76.237709,42.351326],[-76.237702,42.351291],[-76.237702,42.351257],[-76.237724,42.351225],[-76.237719,42.35119],[-76.237737,42.351123],[-76.237818,42.350998],[-76.23787299999999,42.35094],[-76.23796299999999,42.35086],[-76.23818799999999,42.350735],[-76.238257,42.350691],[-76.238299,42.350674],[-76.238366,42.350625],[-76.238478,42.350563],[-76.23851999999999,42.350545],[-76.238586,42.350498],[-76.238767,42.350397],[-76.239063,42.350274],[-76.239108,42.350262],[-76.239172,42.350229],[-76.239327,42.350181],[-76.239408,42.350132],[-76.23944299999999,42.350124],[-76.239513,42.350097],[-76.23960099999999,42.350063],[-76.239653,42.350033],[-76.239801,42.349879],[-76.23983699999999,42.349813],[-76.239867,42.349687],[-76.239867,42.349659],[-76.239851,42.349586],[-76.239846,42.349558],[-76.23980899999999,42.349457],[-76.239763,42.349414],[-76.23976399999999,42.349354],[-76.23978200000001,42.349256],[-76.239812,42.349229],[-76.23998,42.349164],[-76.240008,42.349097],[-76.24001800000001,42.348992],[-76.240008,42.34889],[-76.23998899999999,42.348857],[-76.23996699999999,42.348717],[-76.239966,42.348578],[-76.239985,42.348546],[-76.239986,42.34851],[-76.239998,42.348442],[-76.24001699999999,42.348411],[-76.24001199999999,42.348377],[-76.240105,42.348218],[-76.240134,42.34819],[-76.240184,42.348091],[-76.240216,42.348065],[-76.240374,42.347815],[-76.24038899999999,42.347783],[-76.24042,42.34776],[-76.240405,42.347644],[-76.24038299999999,42.347562],[-76.240346,42.347496],[-76.240331,42.347441],[-76.240329,42.347428],[-76.24030500000001,42.347302],[-76.240303,42.347268],[-76.240318,42.347236],[-76.240345,42.347207],[-76.240409,42.347154],[-76.240478,42.347108],[-76.240505,42.34708],[-76.24060900000001,42.347008],[-76.240649,42.346989],[-76.240695,42.346977],[-76.24077800000001,42.346943],[-76.240816,42.346921],[-76.24086200000001,42.346911],[-76.240908,42.346911],[-76.240954,42.346902],[-76.24102000000001,42.346874],[-76.241088,42.346899],[-76.24127,42.346914],[-76.241364,42.346909],[-76.241445,42.346874],[-76.241484,42.346853],[-76.241668,42.34669],[-76.24174600000001,42.346603],[-76.241765,42.34657],[-76.241753,42.346536],[-76.241764,42.346504],[-76.24175099999999,42.346471],[-76.241648,42.346398],[-76.241625,42.34637],[-76.241573,42.346337],[-76.241573,42.346272],[-76.24160999999999,42.346162],[-76.24164,42.346107],[-76.241758,42.345942],[-76.24181,42.345898],[-76.241906,42.345788],[-76.241935,42.34576],[-76.242034,42.345685],[-76.24213399999999,42.345597],[-76.24221900000001,42.345522],[-76.242299,42.345437],[-76.242366,42.345344],[-76.242392,42.345245],[-76.242389,42.34521],[-76.24241600000001,42.345151],[-76.242431,42.345036],[-76.24245999999999,42.344965],[-76.242497,42.344921],[-76.24260099999999,42.344855],[-76.242638,42.344838],[-76.24267500000001,42.344827],[-76.242812,42.344789],[-76.242852,42.34477],[-76.242903,42.34471],[-76.24294500000001,42.344609],[-76.242952,42.344539],[-76.242966,42.344467],[-76.242993,42.34433],[-76.243037,42.344156],[-76.243054,42.344124],[-76.24307899999999,42.344056],[-76.24308499999999,42.344021],[-76.24310199999999,42.343988],[-76.24315,42.343928],[-76.243178,42.34386],[-76.243208,42.343835],[-76.24321999999999,42.343802],[-76.243314,42.343725],[-76.243488,42.343517],[-76.24355,42.343421],[-76.24359200000001,42.343321],[-76.243601,42.343286],[-76.243595,42.343216],[-76.24360900000001,42.343182],[-76.243606,42.343146],[-76.24358700000001,42.343114],[-76.24359800000001,42.342949],[-76.24359800000001,42.342906],[-76.24364199999999,42.342768],[-76.243679,42.342724],[-76.243694,42.342697],[-76.24389499999999,42.34255],[-76.243966,42.342505],[-76.244043,42.342468],[-76.24419399999999,42.342383],[-76.244252,42.34236],[-76.24427799999999,42.34235],[-76.24432400000001,42.342338],[-76.244494,42.342272],[-76.24453099999999,42.342251],[-76.244574,42.342237],[-76.24462200000001,42.342229],[-76.244708,42.342203],[-76.24474600000001,42.342182],[-76.24483600000001,42.342158],[-76.244883,42.342153],[-76.24501600000001,42.342111],[-76.245054,42.342091],[-76.245239,42.342051],[-76.245278,42.342031],[-76.245321,42.341999],[-76.24534300000001,42.341982],[-76.24538,42.341982],[-76.245491,42.341862],[-76.245513,42.341752],[-76.245513,42.341686],[-76.245499,42.341652],[-76.245437,42.341377],[-76.24543199999999,42.341309],[-76.245437,42.341274],[-76.24543199999999,42.34117],[-76.245452,42.341068],[-76.24547200000001,42.341001],[-76.24556200000001,42.340801],[-76.245604,42.340743],[-76.24575400000001,42.340567],[-76.24586499999999,42.340453],[-76.245938,42.340362],[-76.245975,42.340297],[-76.24600100000001,42.340267],[-76.246064,42.340172],[-76.246073,42.340137],[-76.246116,42.340036],[-76.24612500000001,42.340001],[-76.246134,42.339646],[-76.24608000000001,42.339511],[-76.24604600000001,42.339337],[-76.246011,42.339271],[-76.246004,42.339203],[-76.24600700000001,42.339167],[-76.245971,42.338999],[-76.245968,42.338895],[-76.245976,42.33886],[-76.245982,42.338791],[-76.24596699999999,42.338688],[-76.245955,42.338656],[-76.24587,42.338569],[-76.245805,42.338518],[-76.245738,42.338472],[-76.24569700000001,42.338454],[-76.245625,42.338409],[-76.245549,42.338322],[-76.245519,42.338297],[-76.245476,42.338233],[-76.245464,42.338166],[-76.245464,42.338098],[-76.245473,42.338064],[-76.24551700000001,42.337963],[-76.245566,42.337905],[-76.245599,42.337879],[-76.245671,42.33779],[-76.245678,42.337756],[-76.245704,42.337725],[-76.245715,42.337657],[-76.24577499999999,42.337524],[-76.245828,42.337429],[-76.245861,42.337403],[-76.245953,42.337285],[-76.246071,42.33718],[-76.24609,42.337147],[-76.246132,42.337108],[-76.246137,42.337072],[-76.246177,42.337007],[-76.246211,42.336905],[-76.246216,42.336834],[-76.24620299999999,42.3368],[-76.246104,42.336724],[-76.246022,42.336687],[-76.245977,42.336674],[-76.245931,42.336668],[-76.245681,42.336566],[-76.245589,42.336486],[-76.245575,42.336416],[-76.24557900000001,42.336381],[-76.24559499999999,42.336348],[-76.245644,42.336289],[-76.245673,42.336261],[-76.24570799999999,42.336236],[-76.24576500000001,42.336179],[-76.24578700000001,42.336075],[-76.245771,42.335933],[-76.245744,42.33576],[-76.24574800000001,42.335656],[-76.24576500000001,42.335588],[-76.24578200000001,42.335555],[-76.24580899999999,42.335525],[-76.24581499999999,42.33549],[-76.245845,42.335463],[-76.245914,42.335417],[-76.246003,42.335388],[-76.24609700000001,42.335372],[-76.246144,42.33537],[-76.24627,42.335425],[-76.246315,42.335436],[-76.24641099999999,42.335434],[-76.246458,42.335424],[-76.24654,42.335386],[-76.24660799999999,42.335336],[-76.246668,42.335282],[-76.24674,42.335191],[-76.246773,42.335164],[-76.24677800000001,42.335129],[-76.24681200000001,42.335104],[-76.246835,42.335072],[-76.246841,42.335038],[-76.246972,42.33489],[-76.247097,42.334783],[-76.24724000000001,42.334641],[-76.247264,42.334611],[-76.247272,42.334576],[-76.24727900000001,42.33447],[-76.24729000000001,42.334399],[-76.247264,42.334322],[-76.247252,42.334285],[-76.24709199999999,42.333809],[-76.246955,42.333322],[-76.246937,42.333289],[-76.246881,42.333231],[-76.24672700000001,42.333144],[-76.246516,42.333056],[-76.246471,42.333045],[-76.246422,42.333042],[-76.24635600000001,42.333056],[-76.24626000000001,42.333034],[-76.24619300000001,42.333001],[-76.246134,42.332952],[-76.246112,42.332891],[-76.24611899999999,42.332738],[-76.246111,42.332672],[-76.246082,42.332655],[-76.246082,42.332628],[-76.246045,42.332562],[-76.246045,42.332507],[-76.245985,42.332441],[-76.24597,42.332397],[-76.24597,42.332315],[-76.24600700000001,42.332255],[-76.24607399999999,42.332189],[-76.246081,42.332134],[-76.246185,42.332008],[-76.24619199999999,42.33198],[-76.246229,42.331942],[-76.246318,42.331815],[-76.246332,42.331777],[-76.24635499999999,42.33176],[-76.246369,42.331722],[-76.246414,42.331662],[-76.246443,42.331607],[-76.246465,42.331585],[-76.246488,42.331524],[-76.246539,42.331431],[-76.246554,42.331393],[-76.246576,42.331371],[-76.246591,42.331338],[-76.24666499999999,42.331239],[-76.246702,42.3312],[-76.246702,42.331162],[-76.24673900000001,42.331091],[-76.24673900000001,42.331052],[-76.246775,42.330898],[-76.24685700000001,42.330745],[-76.246869,42.330726],[-76.246872,42.330708],[-76.24688999999999,42.330691],[-76.246945,42.330602],[-76.246967,42.330508],[-76.24699699999999,42.330465],[-76.24699699999999,42.330432],[-76.24701899999999,42.330399],[-76.247108,42.330053],[-76.2471,42.330014],[-76.24711499999999,42.329817],[-76.247107,42.329663],[-76.24706999999999,42.329553],[-76.24706999999999,42.329504],[-76.24704,42.329487],[-76.247033,42.3294],[-76.24700300000001,42.329378],[-76.246996,42.329268],[-76.246966,42.329251],[-76.246966,42.329103],[-76.246996,42.329048],[-76.24709199999999,42.328949],[-76.247129,42.328905],[-76.24716600000001,42.328878],[-76.247328,42.328796],[-76.247373,42.328785],[-76.247424,42.328757],[-76.247484,42.328752],[-76.247513,42.32873],[-76.247558,42.328724],[-76.247624,42.328697],[-76.247868,42.328631],[-76.248105,42.328598],[-76.248401,42.328575],[-76.248586,42.328553],[-76.24905200000001,42.328449],[-76.249244,42.328421],[-76.24942900000001,42.328383],[-76.249532,42.328372],[-76.249606,42.328333],[-76.249651,42.328329],[-76.249747,42.328307],[-76.249782,42.328279],[-76.249825,42.328243],[-76.249888,42.328192],[-76.249925,42.32811],[-76.24994,42.328093],[-76.24999200000001,42.327797],[-76.249962,42.327775],[-76.249962,42.327726],[-76.249933,42.327676],[-76.24989600000001,42.327594],[-76.24975499999999,42.327473],[-76.249757,42.327412],[-76.249763,42.327197],[-76.249763,42.327182],[-76.24979999999999,42.327116],[-76.249934,42.32699],[-76.249971,42.326963],[-76.250089,42.326891],[-76.25050299999999,42.326683],[-76.25064399999999,42.326551],[-76.250652,42.326518],[-76.25071800000001,42.326452],[-76.250733,42.32642],[-76.25077,42.326398],[-76.250792,42.326287],[-76.250815,42.326189],[-76.250844,42.326162],[-76.25085900000001,42.326052],[-76.250896,42.325981],[-76.250933,42.325931],[-76.250941,42.325898],[-76.250978,42.32586],[-76.251007,42.325816],[-76.251059,42.325761],[-76.251081,42.325695],[-76.251074,42.325563],[-76.251096,42.325366],[-76.251119,42.325349],[-76.251171,42.325223],[-76.251274,42.325113],[-76.251282,42.325075],[-76.251311,42.325058],[-76.251356,42.324965],[-76.251363,42.324894],[-76.251319,42.32463],[-76.251283,42.324257],[-76.25125300000001,42.324186],[-76.251231,42.324169],[-76.251209,42.324114],[-76.251009,42.323911],[-76.250972,42.323851],[-76.250891,42.323746],[-76.250854,42.323691],[-76.250839,42.323647],[-76.250854,42.32351],[-76.250891,42.323488],[-76.250906,42.323444],[-76.250928,42.323428],[-76.250958,42.323373],[-76.25098,42.323357],[-76.251017,42.323291],[-76.25100999999999,42.323186],[-76.250973,42.323099],[-76.25084699999999,42.322978],[-76.25028500000001,42.322555],[-76.25013800000001,42.322417],[-76.25011499999999,42.322362],[-76.25009300000001,42.322335],[-76.250079,42.322308],[-76.250056,42.322291],[-76.250056,42.322264],[-76.25004199999999,42.322214],[-76.25002000000001,42.32217],[-76.250012,42.322099],[-76.249961,42.321951],[-76.24995,42.321817],[-76.249939,42.321693],[-76.249909,42.321676],[-76.24990200000001,42.32161],[-76.24988,42.321594],[-76.24988,42.321555],[-76.249865,42.321418],[-76.249871,42.321379],[-76.24988,42.321325],[-76.24991,42.321133],[-76.249954,42.321072],[-76.249984,42.320946],[-76.250028,42.320891],[-76.25004300000001,42.320853],[-76.25008,42.32082],[-76.25015399999999,42.320727],[-76.250221,42.320661],[-76.25022800000001,42.320628],[-76.250339,42.320518],[-76.250354,42.32048],[-76.25048,42.320375],[-76.25064999999999,42.320178],[-76.250665,42.32014],[-76.250687,42.320123],[-76.25076900000001,42.320024],[-76.250776,42.319986],[-76.250843,42.319926],[-76.25085,42.319887],[-76.250924,42.319816],[-76.250991,42.319739],[-76.251006,42.319706],[-76.25102800000001,42.319684],[-76.25105000000001,42.319624],[-76.25108,42.319602],[-76.251087,42.319541],[-76.251087,42.319465],[-76.251065,42.319421],[-76.251024,42.319401],[-76.25095399999999,42.319352],[-76.250913,42.319334],[-76.25082,42.319311],[-76.250787,42.319289],[-76.250754,42.319185],[-76.25073399999999,42.319079],[-76.25073500000001,42.318972],[-76.25074499999999,42.318865],[-76.250738,42.31883],[-76.250737,42.318794],[-76.250782,42.318583],[-76.250782,42.318547],[-76.250771,42.318477],[-76.25076199999999,42.318371],[-76.25071800000001,42.318161],[-76.25067799999999,42.318022],[-76.250651,42.317955],[-76.250647,42.317919],[-76.250597,42.317748],[-76.250578,42.317715],[-76.250575,42.31768],[-76.25055500000001,42.317648],[-76.250553,42.317612],[-76.25046399999999,42.317449],[-76.2504,42.317354],[-76.250265,42.317206],[-76.250235,42.317179],[-76.250167,42.317084],[-76.250108,42.316988],[-76.250092,42.316921],[-76.25006500000001,42.316813],[-76.250067,42.316743],[-76.250056,42.316672],[-76.250035,42.31662],[-76.250012,42.31648],[-76.249968,42.316341],[-76.24994700000001,42.31631],[-76.249916,42.316242],[-76.249905,42.316207],[-76.24982900000001,42.316077],[-76.24975499999999,42.315985],[-76.249723,42.315958],[-76.249685,42.315936],[-76.249601,42.315899],[-76.249509,42.315878],[-76.249466,42.31586],[-76.249404,42.315806],[-76.249364,42.315741],[-76.249359,42.315705],[-76.24936,42.315601],[-76.24936,42.315527],[-76.249387,42.315422],[-76.249405,42.315282],[-76.249448,42.31518],[-76.249528,42.31505],[-76.249566,42.315028],[-76.24960900000001,42.31501],[-76.249746,42.314979],[-76.249858,42.31491],[-76.24995699999999,42.314833],[-76.25001,42.314774],[-76.25004300000001,42.314748],[-76.25009300000001,42.314688],[-76.250129,42.314622],[-76.250134,42.314587],[-76.250146,42.314552],[-76.250167,42.31452],[-76.25017699999999,42.31445],[-76.250201,42.314418],[-76.25020499999999,42.314384],[-76.25024000000001,42.31428],[-76.25027300000001,42.31414],[-76.250303,42.314074],[-76.250314,42.314004],[-76.250334,42.313972],[-76.250407,42.313768],[-76.250456,42.31367],[-76.25048200000001,42.31364],[-76.250486,42.313396],[-76.250473,42.313362],[-76.250472,42.313327],[-76.25048700000001,42.313162],[-76.25050899999999,42.313146],[-76.250524,42.313097],[-76.250546,42.31308],[-76.250561,42.313036],[-76.250598,42.312998],[-76.250635,42.312937],[-76.25072400000001,42.312855],[-76.250857,42.312751],[-76.25088700000001,42.312696],[-76.250783,42.312624],[-76.250709,42.312608],[-76.25062800000001,42.31257],[-76.25053200000001,42.312542],[-76.250421,42.312476],[-76.25031,42.312394],[-76.25027300000001,42.31235],[-76.25022199999999,42.312048],[-76.25019899999999,42.312026],[-76.250185,42.311883],[-76.25015500000001,42.311779],[-76.25012599999999,42.311762],[-76.25010399999999,42.311696],[-76.25008099999999,42.311543],[-76.25005899999999,42.311499],[-76.25005899999999,42.311458],[-76.25005899999999,42.311367],[-76.25017099999999,42.311175],[-76.250208,42.311131],[-76.250237,42.311076],[-76.25026,42.310774],[-76.250326,42.310692],[-76.25043700000001,42.310632],[-76.250497,42.31061],[-76.25057099999999,42.310577],[-76.25062200000001,42.310511],[-76.250637,42.31044],[-76.250674,42.310401],[-76.250682,42.310374],[-76.250756,42.310308],[-76.25085900000001,42.310253],[-76.250933,42.310237],[-76.25104399999999,42.310193],[-76.25114000000001,42.310165],[-76.251266,42.310094],[-76.251318,42.310045],[-76.251355,42.309984],[-76.251414,42.30994],[-76.251407,42.309913],[-76.251437,42.309403],[-76.25141499999999,42.309139],[-76.251386,42.308579],[-76.251349,42.308458],[-76.25132000000001,42.308327],[-76.25129699999999,42.308299],[-76.251283,42.308272],[-76.251261,42.308244],[-76.251238,42.308156],[-76.25122399999999,42.308134],[-76.251172,42.307767],[-76.251195,42.307476],[-76.25117299999999,42.307272],[-76.251099,42.307113],[-76.250936,42.30697],[-76.250899,42.306943],[-76.250641,42.306789],[-76.250471,42.306646],[-76.250449,42.306613],[-76.250416,42.306576],[-76.25045900000001,42.306551],[-76.250744,42.306341],[-76.251,42.306113],[-76.252122,42.305029],[-76.252343,42.304842],[-76.252557,42.3047],[-76.252773,42.304585],[-76.253017,42.304479],[-76.25314,42.304437],[-76.253225,42.304414],[-76.253364,42.304394],[-76.25340300000001,42.304398],[-76.253473,42.304397],[-76.253846,42.304421],[-76.254148,42.30444],[-76.254277,42.304461],[-76.25448299999999,42.304508],[-76.254642,42.30456],[-76.254687,42.304579],[-76.25476,42.304609],[-76.255808,42.305074],[-76.256005,42.305158],[-76.256274,42.305276],[-76.257099,42.305664],[-76.25717299999999,42.305703],[-76.258106,42.306252],[-76.262523,42.309288],[-76.26402899999999,42.310316],[-76.26536900000001,42.311273],[-76.26576300000001,42.311553],[-76.26590899999999,42.311664],[-76.266014,42.311739],[-76.26819500000001,42.313291],[-76.269576,42.314348],[-76.271717,42.316057],[-76.273465,42.317542],[-76.273534,42.317591],[-76.275305,42.319117],[-76.275356,42.31916],[-76.276115,42.319813],[-76.277096,42.320667],[-76.278148,42.321583],[-76.27885499999999,42.322188],[-76.284418,42.326831],[-76.284781,42.327129],[-76.287406,42.329256],[-76.287797,42.329549],[-76.28909899999999,42.330448],[-76.293192,42.33328],[-76.293441,42.33347],[-76.293716,42.333728],[-76.293954,42.334005],[-76.294152,42.3343],[-76.29429500000001,42.334586],[-76.29517199999999,42.336647],[-76.296069,42.338804],[-76.296826,42.340596],[-76.29691699999999,42.340784],[-76.297076,42.341039],[-76.29727099999999,42.341285],[-76.297498,42.341507],[-76.297523,42.341527],[-76.297951,42.341873],[-76.297982,42.341898],[-76.29837499999999,42.342218],[-76.298558,42.342351],[-76.298704,42.342435],[-76.298862,42.342509],[-76.299029,42.342571],[-76.29920300000001,42.342618],[-76.299384,42.342648],[-76.299605,42.342672],[-76.301292,42.342797],[-76.301563,42.342807],[-76.302054,42.342824],[-76.303365,42.342814],[-76.303579,42.342825],[-76.304013,42.342861],[-76.304401,42.342928],[-76.306414,42.343387],[-76.30860199999999,42.343948],[-76.310461,42.344525],[-76.31079099999999,42.344648],[-76.31112899999999,42.34481],[-76.31140499999999,42.344969],[-76.31240200000001,42.345606],[-76.31428099999999,42.346787],[-76.314566,42.346991],[-76.314905,42.347289],[-76.315078,42.347476],[-76.3152,42.347605],[-76.315467,42.347976],[-76.31571099999999,42.348347],[-76.315842,42.348561],[-76.316123,42.349157],[-76.31626199999999,42.349403],[-76.316457,42.349662],[-76.317267,42.350693],[-76.317486,42.350942],[-76.31773099999999,42.351165],[-76.3186,42.351889],[-76.318704,42.351996],[-76.318842,42.352116],[-76.319242,42.352534],[-76.31953300000001,42.352855],[-76.31983099999999,42.353207],[-76.319937,42.353341],[-76.320279,42.353797],[-76.32040499999999,42.353949],[-76.320424,42.353971],[-76.32061899999999,42.354162],[-76.320841,42.35434],[-76.321196,42.354583],[-76.321646,42.354853],[-76.322063,42.355068],[-76.32236,42.355205],[-76.322654,42.355309],[-76.322947,42.355396],[-76.32373,42.355653],[-76.323982,42.355744],[-76.32425499999999,42.355867],[-76.324471,42.355986],[-76.326791,42.35742],[-76.32771,42.357989],[-76.32836500000001,42.358422],[-76.32923099999999,42.358971],[-76.32934400000001,42.359032],[-76.329605,42.359192],[-76.32980999999999,42.359347],[-76.32999100000001,42.35952],[-76.33060500000001,42.360157],[-76.33075700000001,42.360286],[-76.330962,42.360432],[-76.331186,42.36056],[-76.33136500000001,42.360643],[-76.331819,42.360881],[-76.331908,42.360939],[-76.33224800000001,42.36116],[-76.333861,42.362249],[-76.335149,42.363126],[-76.335376,42.363271],[-76.335663,42.363421],[-76.33596900000001,42.363548],[-76.336136,42.3636],[-76.336209,42.363627],[-76.336636,42.363768],[-76.337132,42.363931],[-76.338088,42.364213],[-76.338823,42.364425],[-76.339009,42.364464],[-76.339529,42.3646],[-76.34145599999999,42.364962],[-76.34153499999999,42.364978],[-76.342285,42.36515],[-76.342553,42.365187],[-76.342862,42.36521],[-76.34325200000001,42.365206],[-76.343684,42.365138],[-76.343926,42.36513],[-76.344047,42.365138],[-76.344165,42.365159],[-76.344281,42.365185],[-76.344391,42.365224],[-76.34449600000001,42.365268],[-76.344594,42.365321],[-76.344685,42.365383],[-76.34476600000001,42.365449],[-76.344807,42.365489],[-76.345353,42.366082],[-76.34572300000001,42.366423],[-76.34703,42.367629],[-76.348326,42.368794],[-76.348483,42.368922],[-76.34869399999999,42.369064],[-76.348923,42.369187],[-76.349169,42.369292],[-76.349428,42.369379],[-76.35195,42.370016],[-76.353041,42.370291],[-76.35326499999999,42.370352],[-76.35326000000001,42.370534],[-76.353221,42.372081],[-76.353194,42.373217],[-76.35324900000001,42.373977],[-76.35341099999999,42.374727],[-76.35362499999999,42.375498],[-76.35399099999999,42.376809],[-76.354118,42.377194],[-76.354226,42.377523],[-76.354568,42.37823],[-76.355029,42.379006],[-76.35520099999999,42.379294],[-76.35539799999999,42.37963],[-76.355524,42.379844],[-76.35671600000001,42.381875],[-76.357542,42.383211],[-76.358295,42.384391],[-76.358504,42.384672],[-76.358752,42.384939],[-76.359036,42.385184],[-76.359353,42.38541],[-76.35969900000001,42.385604],[-76.360072,42.38577],[-76.360108,42.385819],[-76.360026,42.386046],[-76.360016,42.386086],[-76.360012,42.386131],[-76.360024,42.386217],[-76.36005900000001,42.386297],[-76.360107,42.38636],[-76.36124100000001,42.387517],[-76.36160599999999,42.387918],[-76.361891,42.388311],[-76.362028,42.388548],[-76.362244,42.388951],[-76.36242900000001,42.389358],[-76.362543,42.389753],[-76.36260299999999,42.390149],[-76.36271600000001,42.391931],[-76.362804,42.39334],[-76.362807,42.393393],[-76.362832,42.393802],[-76.36324399999999,42.393806],[-76.364058,42.393787],[-76.36429099999999,42.393772],[-76.364666,42.393749],[-76.365554,42.39368],[-76.366829,42.393638],[-76.367242,42.393655],[-76.36734300000001,42.396522],[-76.367439,42.398588],[-76.367464,42.398867],[-76.36752799999999,42.399145],[-76.367631,42.399413],[-76.367733,42.399615],[-76.36827700000001,42.40064],[-76.368534,42.401105],[-76.36881099999999,42.401593],[-76.369061,42.402067],[-76.36978000000001,42.403346],[-76.370272,42.404174],[-76.37046100000001,42.404459],[-76.37059499999999,42.40467],[-76.370717,42.404835],[-76.370856,42.405036],[-76.370988,42.405214],[-76.371183,42.405509],[-76.371359,42.405822],[-76.371415,42.40597],[-76.37148999999999,42.406091],[-76.371555,42.406225],[-76.37162600000001,42.406395],[-76.37168699999999,42.406557],[-76.37173900000001,42.40675],[-76.371792,42.406979],[-76.371838,42.407244],[-76.37197999999999,42.408152],[-76.372016,42.408475],[-76.372123,42.409298],[-76.372174,42.409734],[-76.372337,42.410935],[-76.37245900000001,42.412356],[-76.372574,42.413625],[-76.372589,42.413813],[-76.37263400000001,42.414376],[-76.372663,42.415582],[-76.37267199999999,42.416429],[-76.372696,42.416982],[-76.37271699999999,42.417126],[-76.372754,42.417265],[-76.372865,42.41757],[-76.37308299999999,42.418054],[-76.373251,42.418344],[-76.37339799999999,42.418554],[-76.373592,42.418795],[-76.37393899999999,42.419165],[-76.37421500000001,42.419472],[-76.37409,42.419505]]],"type":"Polygon"}
}