{
  "id": "360670057001",
  "type": "Feature",
  "properties": {
    "area_land":563237,
    "area_water":0,
    "geoid":"360670057001",
    "name":"Block Group 1",
    "state":"ny"
},
  "bbox": [
    -76.175494,
    43.009748,
    -76.16145,
    43.01993
],
  "geometry": {"coordinates":[[[-76.175494,43.019512],[-76.174357,43.019425],[-76.17392100000001,43.019414],[-76.173162,43.019452],[-76.17178699999999,43.019565],[-76.17054899999999,43.019645],[-76.16911500000001,43.019756],[-76.167903,43.019849],[-76.166828,43.01993],[-76.166692,43.019929],[-76.165446,43.019865],[-76.16310300000001,43.019688],[-76.16297400000001,43.019658],[-76.162659,43.019542],[-76.162345,43.019425],[-76.162058,43.019309],[-76.161888,43.019209],[-76.161733,43.019075],[-76.16165100000001,43.018985],[-76.16145,43.018726],[-76.161835,43.01862],[-76.162638,43.018375],[-76.162695,43.018353],[-76.162729,43.018325],[-76.163054,43.017901],[-76.163146,43.017809],[-76.163312,43.017791],[-76.16505100000001,43.017721],[-76.165111,43.017708],[-76.165154,43.017683],[-76.16517899999999,43.017656],[-76.165409,43.01714],[-76.16546099999999,43.016902],[-76.165476,43.016548],[-76.165449,43.016022],[-76.165368,43.014723],[-76.164534,43.014762],[-76.165282,43.013902],[-76.16646,43.012522],[-76.16675600000001,43.01218],[-76.16694699999999,43.012025],[-76.167081,43.011941],[-76.16766,43.011633],[-76.16819700000001,43.011313],[-76.169607,43.01037],[-76.17036,43.009895],[-76.17061699999999,43.009748],[-76.17074700000001,43.012866],[-76.17073000000001,43.013703],[-76.1708,43.014455],[-76.170998,43.016597],[-76.17445499999999,43.017341],[-76.175467,43.017557],[-76.17510799999999,43.017754],[-76.174682,43.018121],[-76.175494,43.019512]]],"type":"Polygon"}
}