{
  "id": "360710110002",
  "type": "Feature",
  "properties": {
    "area_land":10318651,
    "area_water":119577,
    "geoid":"360710110002",
    "name":"Block Group 2",
    "state":"ny"
},
  "bbox": [
    -74.410685,
    41.49498,
    -74.346076,
    41.53755
],
  "geometry": {"coordinates":[[[-74.410674,41.509021],[-74.41065999999999,41.509081],[-74.410622,41.509183],[-74.410518,41.50934],[-74.41044599999999,41.509417],[-74.410391,41.50946],[-74.410157,41.509639],[-74.40938800000001,41.510178],[-74.408839,41.510537],[-74.408658,41.510686],[-74.408496,41.510863],[-74.408276,41.511148],[-74.407709,41.512004],[-74.40769299999999,41.512097],[-74.407701,41.512203],[-74.407734,41.512297],[-74.407822,41.512478],[-74.408,41.512797],[-74.40804799999999,41.512937],[-74.40806000000001,41.51305],[-74.408055,41.51312],[-74.40799699999999,41.513349],[-74.40782299999999,41.513899],[-74.407465,41.514884],[-74.407342,41.515303],[-74.407134,41.515907],[-74.407,41.516145],[-74.406802,41.51644],[-74.406251,41.517162],[-74.406144,41.517266],[-74.406026,41.51738],[-74.40549799999999,41.517893],[-74.405382,41.518046],[-74.405323,41.518155],[-74.40522900000001,41.518385],[-74.40509,41.518658],[-74.40505,41.518756],[-74.404824,41.519037],[-74.404022,41.519769],[-74.403015,41.520751],[-74.402417,41.521232],[-74.40231199999999,41.521305],[-74.401685,41.521695],[-74.40022999999999,41.522543],[-74.39962800000001,41.522926],[-74.399508,41.523028],[-74.399344,41.523305],[-74.39918299999999,41.523494],[-74.398841,41.5238],[-74.398279,41.524088],[-74.397823,41.524303],[-74.39746,41.524415],[-74.39681,41.524555],[-74.396281,41.524648],[-74.396081,41.524703],[-74.39598700000001,41.524742],[-74.395903,41.524793],[-74.39578400000001,41.524908],[-74.395281,41.524986],[-74.3947,41.525561],[-74.39418499999999,41.526089],[-74.39365599999999,41.526609],[-74.393038,41.527264],[-74.392263,41.528039],[-74.391807,41.528522],[-74.391276,41.52904],[-74.390798,41.529532],[-74.390118,41.530119],[-74.389527,41.530552],[-74.38919799999999,41.530582],[-74.38888300000001,41.530623],[-74.388667,41.530684],[-74.38824200000001,41.530865],[-74.38761,41.531203],[-74.387412,41.531119],[-74.386781,41.530881],[-74.386534,41.530762],[-74.386239,41.5306],[-74.38594000000001,41.530459],[-74.385473,41.530265],[-74.384933,41.530093],[-74.384379,41.529932],[-74.383584,41.52974],[-74.383121,41.529647],[-74.382479,41.529545],[-74.38139,41.529343],[-74.381112,41.529277],[-74.38066999999999,41.529146],[-74.38002400000001,41.528914],[-74.379632,41.528801],[-74.379379,41.528754],[-74.379047,41.528707],[-74.37868400000001,41.52872],[-74.37850299999999,41.528744],[-74.378399,41.528779],[-74.378299,41.528829],[-74.37750699999999,41.529355],[-74.37740599999999,41.529392],[-74.377241,41.52942],[-74.376859,41.529406],[-74.376119,41.529378],[-74.375764,41.529345],[-74.37572400000001,41.529332],[-74.37558,41.529288],[-74.37542500000001,41.529213],[-74.375062,41.529007],[-74.374729,41.528849],[-74.374505,41.528758],[-74.37393899999999,41.528531],[-74.373811,41.528724],[-74.373722,41.52891],[-74.37366299999999,41.529079],[-74.373583,41.529434],[-74.373396,41.530607],[-74.373351,41.530838],[-74.373271,41.531251],[-74.37316199999999,41.531713],[-74.37301100000001,41.532153],[-74.372975,41.532257],[-74.37282500000001,41.532537],[-74.37268299999999,41.532738],[-74.372353,41.533089],[-74.372096,41.533324],[-74.371841,41.533532],[-74.371139,41.534049],[-74.369694,41.53503],[-74.369243,41.535355],[-74.368827,41.535716],[-74.368613,41.535926],[-74.36835600000001,41.536234],[-74.368171,41.536469],[-74.367862,41.536888],[-74.367457,41.537428],[-74.367352,41.53755],[-74.363029,41.535276],[-74.36125699999999,41.534274],[-74.35465600000001,41.530591],[-74.35290500000001,41.529606],[-74.351821,41.529027],[-74.350387,41.528228],[-74.347737,41.526754],[-74.346993,41.526337],[-74.34693,41.526302],[-74.346158,41.525857],[-74.346076,41.525809],[-74.346715,41.525857],[-74.347207,41.525884],[-74.347262,41.525887],[-74.347353,41.525904],[-74.34749600000001,41.525937],[-74.347531,41.525945],[-74.34789600000001,41.526065],[-74.34833500000001,41.526256],[-74.349752,41.525365],[-74.350083,41.525103],[-74.350551,41.524676],[-74.35096900000001,41.524323],[-74.35119899999999,41.52418],[-74.351947,41.523663],[-74.352335,41.523407],[-74.353195,41.522783],[-74.353613,41.522467],[-74.35416600000001,41.52215],[-74.354311,41.522081],[-74.35445199999999,41.522015],[-74.35467300000001,41.521943],[-74.35480800000001,41.52192],[-74.355018,41.521913],[-74.355806,41.521994],[-74.356534,41.522079],[-74.356696,41.522109],[-74.357017,41.522186],[-74.35793099999999,41.52245],[-74.358064,41.522461],[-74.358242,41.522455],[-74.358574,41.522408],[-74.359595,41.522189],[-74.35976599999999,41.52216],[-74.35990700000001,41.522153],[-74.36008200000001,41.522166],[-74.360276,41.522209],[-74.36038499999999,41.522262],[-74.36049,41.522334],[-74.360612,41.522433],[-74.361158,41.522968],[-74.361278,41.523051],[-74.361441,41.523134],[-74.361797,41.523257],[-74.36219699999999,41.523356],[-74.36238299999999,41.523402],[-74.362697,41.523465],[-74.363692,41.523655],[-74.363743,41.52366],[-74.363786,41.523653],[-74.36384200000001,41.523604],[-74.364312,41.522535],[-74.364707,41.521576],[-74.364859,41.521234],[-74.364974,41.521003],[-74.365139,41.520727],[-74.365497,41.520178],[-74.36603599999999,41.519544],[-74.36649300000001,41.519078],[-74.366761,41.518804],[-74.36763000000001,41.517835],[-74.36774800000001,41.517683],[-74.36810699999999,41.517184],[-74.368222,41.517052],[-74.368407,41.516888],[-74.368673,41.516691],[-74.36938499999999,41.516115],[-74.369559,41.515947],[-74.371386,41.514079],[-74.372114,41.513398],[-74.373076,41.512432],[-74.373418,41.512101],[-74.373558,41.511929],[-74.373603,41.511849],[-74.37375299999999,41.511519],[-74.37389899999999,41.511121],[-74.373969,41.510821],[-74.37397199999999,41.510722],[-74.374042,41.510729],[-74.37414099999999,41.510723],[-74.375001,41.510535],[-74.37543700000001,41.510538],[-74.37631,41.510564],[-74.37861700000001,41.510657],[-74.37934199999999,41.510694],[-74.379431,41.510876],[-74.37948799999999,41.510992],[-74.37949999999999,41.511016],[-74.379645,41.511241],[-74.379803,41.511406],[-74.379841,41.51144],[-74.380107,41.511078],[-74.38014099999999,41.511028],[-74.380563,41.510406],[-74.380752,41.510095],[-74.380966,41.509723],[-74.381523,41.508664],[-74.38171699999999,41.508256],[-74.38184800000001,41.508051],[-74.382003,41.507843],[-74.382352,41.507469],[-74.383657,41.506154],[-74.384473,41.505337],[-74.385047,41.504801],[-74.385519,41.504335],[-74.385819,41.504045],[-74.386793,41.502986],[-74.38727799999999,41.502488],[-74.38745,41.502339],[-74.38769600000001,41.502164],[-74.38806099999999,41.501956],[-74.388944,41.501511],[-74.389591,41.501187],[-74.389871,41.501047],[-74.3903,41.500846],[-74.39099400000001,41.500505],[-74.39116799999999,41.500402],[-74.391188,41.500388],[-74.39148400000001,41.500226],[-74.392211,41.499858],[-74.392554,41.499692],[-74.392985,41.499485],[-74.39307700000001,41.49944],[-74.393658,41.499148],[-74.393902,41.499025],[-74.395904,41.498019],[-74.396118,41.497926],[-74.396278,41.497869],[-74.396506,41.497809],[-74.397385,41.497637],[-74.39759599999999,41.49758],[-74.397735,41.497524],[-74.39780399999999,41.49748],[-74.398127,41.49724],[-74.39824900000001,41.497154],[-74.398494,41.496952],[-74.398836,41.497192],[-74.39900900000001,41.49727],[-74.399238,41.497346],[-74.399271,41.497246],[-74.399407,41.496985],[-74.39963,41.496673],[-74.399835,41.496432],[-74.400243,41.496019],[-74.40059100000001,41.495686],[-74.400651,41.49561],[-74.40131700000001,41.49498],[-74.401701,41.495473],[-74.402333,41.496262],[-74.40325900000001,41.497416],[-74.40442,41.498815],[-74.40464,41.499087],[-74.405115,41.499675],[-74.405556,41.500221],[-74.40613999999999,41.500934],[-74.408016,41.503253],[-74.40836299999999,41.503671],[-74.40893,41.504372],[-74.409285,41.504863],[-74.409453,41.50512],[-74.409245,41.50513],[-74.408187,41.504866],[-74.40829600000001,41.505038],[-74.408677,41.505638],[-74.40876900000001,41.505746],[-74.40893699999999,41.505892],[-74.409412,41.506196],[-74.40964,41.50637],[-74.40978,41.50651],[-74.409852,41.506599],[-74.40991099999999,41.506693],[-74.409976,41.506842],[-74.41055,41.508396],[-74.410658,41.508685],[-74.410685,41.508856],[-74.410674,41.509021]]],"type":"Polygon"}
}