{
  "id": "360470550003",
  "type": "Feature",
  "properties": {
    "area_land":54339,
    "area_water":0,
    "geoid":"360470550003",
    "name":"Block Group 3",
    "state":"ny"
},
  "bbox": [
    -73.954796,
    40.606217,
    -73.952577,
    40.611037
],
  "geometry": {"coordinates":[[[-73.954796,40.61082],[-73.953599,40.61095],[-73.95257700000001,40.611037],[-73.95354399999999,40.610653],[-73.953192,40.608807],[-73.952724,40.606349],[-73.95392200000001,40.606217],[-73.95438900000001,40.608675],[-73.954695,40.610266],[-73.954796,40.61082]]],"type":"Polygon"}
}