{
  "id": "361190092004",
  "type": "Feature",
  "properties": {
    "area_land":238521,
    "area_water":0,
    "geoid":"361190092004",
    "name":"Block Group 4",
    "state":"ny"
},
  "bbox": [
    -73.779458,
    41.023051,
    -73.771209,
    41.028329
],
  "geometry": {"coordinates":[[[-73.778864,41.026368],[-73.778476,41.026702],[-73.77750399999999,41.027297],[-73.77666499999999,41.027809],[-73.775809,41.028329],[-73.775158,41.027745],[-73.77493800000001,41.027571],[-73.77467300000001,41.027462],[-73.77433600000001,41.027549],[-73.77397499999999,41.027636],[-73.77311400000001,41.027825],[-73.77172400000001,41.028127],[-73.771573,41.027236],[-73.77146500000001,41.026677],[-73.771305,41.026003],[-73.771209,41.025477],[-73.771942,41.024993],[-73.772173,41.024863],[-73.773374,41.024158],[-73.773678,41.023987],[-73.77422199999999,41.023656],[-73.774507,41.023478],[-73.77488200000001,41.02329],[-73.775396,41.023051],[-73.775941,41.02353],[-73.776169,41.02371],[-73.776371,41.02387],[-73.77694200000001,41.024282],[-73.777203,41.024437],[-73.77775800000001,41.024826],[-73.77813399999999,41.025048],[-73.778316,41.02512],[-73.77842200000001,41.025162],[-73.778724,41.025355],[-73.77945800000001,41.025858],[-73.778864,41.026368]]],"type":"Polygon"}
}