{
  "id": "361119514002",
  "type": "Feature",
  "properties": {
    "area_land":2897990,
    "area_water":38219,
    "geoid":"361119514002",
    "name":"Block Group 2",
    "state":"ny"
},
  "bbox": [
    -74.0125,
    41.955508,
    -73.991741,
    41.976011
],
  "geometry": {"coordinates":[[[-74.0125,41.968531],[-74.012286,41.969195],[-74.011983,41.969713],[-74.011717,41.970118],[-74.01091700000001,41.970617],[-74.01020699999999,41.971028],[-74.00628500000001,41.971948],[-74.003979,41.973049],[-74.003405,41.97361],[-74.003117,41.974339],[-74.003158,41.974845],[-74.003758,41.976011],[-74.003359,41.975989],[-74.00265,41.975946],[-74.001497,41.975855],[-74.00008699999999,41.97572],[-73.99934,41.975644],[-73.998788,41.975573],[-73.99693600000001,41.975349],[-73.991741,41.974709],[-73.991786,41.97336],[-73.991876,41.971113],[-73.992115,41.964762],[-73.99215599999999,41.963564],[-73.992178,41.963016],[-73.99221799999999,41.962002],[-73.99234199999999,41.959004],[-73.992496,41.958872],[-73.99298400000001,41.958428],[-73.993325,41.958071],[-73.993589,41.957737],[-73.993799,41.957412],[-73.993976,41.957093],[-73.99413699999999,41.956736],[-73.99430099999999,41.956201],[-73.99434100000001,41.956013],[-73.99439,41.955645],[-73.995018,41.955622],[-73.99516,41.955633],[-73.995384,41.955671],[-73.995975,41.955839],[-73.99723299999999,41.956176],[-73.998543,41.956534],[-73.999503,41.956797],[-73.999854,41.956362],[-73.999973,41.956213],[-74.000185,41.955963],[-74.000258,41.955891],[-74.000325,41.955845],[-74.000433,41.95582],[-74.00095,41.955814],[-74.001485,41.955804],[-74.002533,41.95574],[-74.00824900000001,41.955508],[-74.008413,41.955508],[-74.008619,41.955532],[-74.009064,41.955631],[-74.009637,41.955792],[-74.01040399999999,41.956056],[-74.008275,41.961948],[-74.008301,41.961955],[-74.009066,41.962165],[-74.008838,41.962363],[-74.00857499999999,41.962654],[-74.00848999999999,41.962765],[-74.00806799999999,41.96356],[-74.00797300000001,41.963788],[-74.007887,41.964029],[-74.007828,41.964359],[-74.007836,41.964739],[-74.00787099999999,41.965165],[-74.00789399999999,41.965262],[-74.007915,41.965349],[-74.007907,41.965655],[-74.007915,41.965714],[-74.008256,41.96632],[-74.00833900000001,41.966414],[-74.008566,41.966535],[-74.00881,41.966677],[-74.009096,41.966749],[-74.009822,41.966898],[-74.010246,41.966951],[-74.010533,41.966971],[-74.010772,41.967002],[-74.011047,41.967096],[-74.01129400000001,41.967163],[-74.011415,41.967221],[-74.011624,41.967146],[-74.01176700000001,41.96719],[-74.012473,41.967849],[-74.0125,41.968531]]],"type":"Polygon"}
}