{
  "id": "360730404003",
  "type": "Feature",
  "properties": {
    "area_land":1662274,
    "area_water":0,
    "geoid":"360730404003",
    "name":"Block Group 3",
    "state":"ny"
},
  "bbox": [
    -78.412291,
    43.217386,
    -78.390991,
    43.231574
],
  "geometry": {"coordinates":[[[-78.412291,43.217386],[-78.412184,43.217689],[-78.411866,43.218599],[-78.411761,43.218904],[-78.411613,43.219325],[-78.411326,43.220147],[-78.41085,43.220149],[-78.410403,43.220152],[-78.409617,43.220152],[-78.409088,43.220154],[-78.40946700000001,43.219281],[-78.40859399999999,43.219325],[-78.40781,43.219366],[-78.40783999999999,43.219333],[-78.407876,43.219296],[-78.407931,43.219236],[-78.407962,43.219204],[-78.40768300000001,43.219176],[-78.407134,43.219123],[-78.40710799999999,43.218835],[-78.407083,43.218557],[-78.40681499999999,43.218565],[-78.406021,43.218593],[-78.405756,43.218605],[-78.405755,43.219052],[-78.40575200000001,43.220394],[-78.40575200000001,43.220842],[-78.405751,43.221329],[-78.405751,43.221468],[-78.405751,43.221489],[-78.405748,43.22279],[-78.40574700000001,43.223278],[-78.40574599999999,43.223383],[-78.40574599999999,43.2237],[-78.40574599999999,43.223806],[-78.405767,43.223863],[-78.405795,43.223939],[-78.40591999999999,43.224281],[-78.405935,43.224343],[-78.40597,43.224482],[-78.405975,43.224539],[-78.405968,43.224556],[-78.405957,43.224587],[-78.405917,43.224634],[-78.405807,43.22471],[-78.405765,43.224741],[-78.405745,43.224754],[-78.405748,43.225885],[-78.405759,43.229278],[-78.40576299999999,43.23041],[-78.405727,43.231244],[-78.405721,43.231393],[-78.403363,43.231463],[-78.402528,43.231489],[-78.40239099999999,43.231493],[-78.40161500000001,43.231507],[-78.398876,43.231557],[-78.397963,43.231574],[-78.397971,43.231441],[-78.397982,43.231276],[-78.39798500000001,43.231044],[-78.397988,43.230912],[-78.397976,43.230734],[-78.397916,43.230484],[-78.397784,43.230181],[-78.397621,43.229931],[-78.39751,43.229797],[-78.397201,43.229527],[-78.396806,43.229233],[-78.394904,43.227849],[-78.393851,43.227109],[-78.3931,43.226576],[-78.392731,43.226327],[-78.39235100000001,43.226091],[-78.39197799999999,43.225908],[-78.391885,43.225845],[-78.391824,43.225772],[-78.39178800000001,43.225698],[-78.391761,43.225487],[-78.39174,43.225186],[-78.391727,43.224601],[-78.391713,43.223968],[-78.391693,43.223329],[-78.391687,43.223173],[-78.39167,43.222706],[-78.391665,43.222551],[-78.39165800000001,43.222395],[-78.391638,43.22193],[-78.391632,43.221775],[-78.391627,43.22163],[-78.39161300000001,43.221195],[-78.391609,43.221051],[-78.391604,43.220905],[-78.39158999999999,43.220468],[-78.391586,43.220323],[-78.391581,43.220194],[-78.391569,43.219809],[-78.391565,43.219681],[-78.391561,43.219549],[-78.391552,43.219153],[-78.391549,43.219022],[-78.391442,43.219024],[-78.39112299999999,43.219031],[-78.39101700000001,43.219034],[-78.391012,43.218884],[-78.39100000000001,43.218435],[-78.390997,43.218286],[-78.390995,43.218231],[-78.390991,43.218066],[-78.390991,43.218032],[-78.390991,43.218012],[-78.391865,43.217989],[-78.39448899999999,43.217921],[-78.395364,43.217899],[-78.396417,43.217846],[-78.39957699999999,43.217688],[-78.400631,43.217636],[-78.400835,43.217632],[-78.401448,43.217624],[-78.401653,43.217621],[-78.40180100000001,43.217614],[-78.403136,43.217549],[-78.405902,43.217414],[-78.409623,43.217406],[-78.411773,43.217425],[-78.41187600000001,43.217416],[-78.412187,43.217393],[-78.412291,43.217386]]],"type":"Polygon"}
}