{
  "id": "360470878003",
  "type": "Feature",
  "properties": {
    "area_land":46155,
    "area_water":0,
    "geoid":"360470878003",
    "name":"Block Group 3",
    "state":"ny"
},
  "bbox": [
    -73.931083,
    40.65661,
    -73.927995,
    40.658478
],
  "geometry": {"coordinates":[[[-73.931083,40.658296],[-73.930076,40.65836],[-73.929143,40.658418],[-73.928172,40.658478],[-73.927995,40.656802],[-73.92896399999999,40.656742],[-73.92989799999999,40.656684],[-73.930903,40.65661],[-73.931083,40.658296]]],"type":"Polygon"}
}