{
  "id": "360270603012",
  "type": "Feature",
  "properties": {
    "area_land":1199369,
    "area_water":13734,
    "geoid":"360270603012",
    "name":"Block Group 2",
    "state":"ny"
},
  "bbox": [
    -73.88484,
    41.542275,
    -73.868478,
    41.55611
],
  "geometry": {"coordinates":[[[-73.88484,41.554692],[-73.878507,41.555475],[-73.874504,41.55597],[-73.873378,41.55611],[-73.87328599999999,41.555566],[-73.873278,41.555469],[-73.8733,41.555265],[-73.873356,41.555127],[-73.873711,41.554464],[-73.873784,41.554354],[-73.873818,41.554242],[-73.873824,41.554161],[-73.87379199999999,41.554005],[-73.873732,41.553857],[-73.873547,41.55366],[-73.87284699999999,41.55307],[-73.87225599999999,41.552563],[-73.87213300000001,41.552439],[-73.872027,41.552298],[-73.871988,41.55222],[-73.871859,41.55185],[-73.87176599999999,41.551494],[-73.871729,41.551377],[-73.87166499999999,41.551233],[-73.871551,41.551035],[-73.87139500000001,41.550831],[-73.87123200000001,41.550694],[-73.871092,41.550608],[-73.87042099999999,41.550305],[-73.870467,41.550242],[-73.87052300000001,41.550143],[-73.87053400000001,41.550055],[-73.87049500000001,41.549918],[-73.87029,41.549449],[-73.87022399999999,41.549254],[-73.870041,41.548443],[-73.869972,41.548291],[-73.869849,41.548142],[-73.869789,41.548073],[-73.86941400000001,41.547719],[-73.869141,41.547424],[-73.869035,41.54724],[-73.868965,41.547004],[-73.868953,41.546876],[-73.868903,41.546359],[-73.86880499999999,41.546052],[-73.86866000000001,41.545759],[-73.868593,41.545591],[-73.868478,41.545381],[-73.86899,41.545094],[-73.869193,41.544983],[-73.86940199999999,41.544888],[-73.869613,41.544815],[-73.86973399999999,41.544772],[-73.87027399999999,41.544621],[-73.870591,41.544595],[-73.871222,41.544521],[-73.872257,41.544409],[-73.872395,41.544393],[-73.872743,41.544356],[-73.872784,41.544349],[-73.872929,41.544323],[-73.87323000000001,41.544276],[-73.874116,41.544098],[-73.87460799999999,41.543978],[-73.875354,41.543785],[-73.876076,41.543594],[-73.87675400000001,41.543372],[-73.877472,41.543101],[-73.87808,41.542846],[-73.87881400000001,41.542504],[-73.879228,41.542275],[-73.879339,41.542579],[-73.879389,41.542718],[-73.879496,41.543136],[-73.879554,41.543367],[-73.879767,41.544002],[-73.87988799999999,41.544332],[-73.880135,41.544901],[-73.880301,41.545316],[-73.880399,41.54565],[-73.880601,41.546693],[-73.88063,41.54678],[-73.880719,41.546956],[-73.88088,41.547147],[-73.881244,41.547466],[-73.88137999999999,41.547628],[-73.88154900000001,41.547874],[-73.881619,41.54802],[-73.88165499999999,41.548116],[-73.88171,41.548391],[-73.881739,41.54889],[-73.881736,41.549129],[-73.881714,41.549334],[-73.88161100000001,41.549962],[-73.881607,41.5502],[-73.881648,41.550413],[-73.881713,41.550562],[-73.881739,41.550611],[-73.88182,41.55071],[-73.88200399999999,41.550886],[-73.882188,41.551037],[-73.88293299999999,41.551602],[-73.88311299999999,41.551767],[-73.88327,41.551949],[-73.883774,41.552516],[-73.88428500000001,41.55312],[-73.88435800000001,41.553213],[-73.884435,41.55336],[-73.884483,41.553477],[-73.88464,41.553952],[-73.884693,41.55413],[-73.884725,41.554237],[-73.884826,41.554634],[-73.88484,41.554692]]],"type":"Polygon"}
}