{
  "id": "361190135003",
  "type": "Feature",
  "properties": {
    "area_land":296082,
    "area_water":0,
    "geoid":"361190135003",
    "name":"Block Group 3",
    "state":"ny"
},
  "bbox": [
    -73.857372,
    41.165721,
    -73.848276,
    41.173283
],
  "geometry": {"coordinates":[[[-73.8573,41.165846],[-73.857091,41.166236],[-73.85697399999999,41.166402],[-73.856447,41.167148],[-73.856286,41.167339],[-73.85605200000001,41.167622],[-73.85568499999999,41.168101],[-73.855592,41.168205],[-73.855227,41.168583],[-73.8549,41.168912],[-73.85427300000001,41.169549],[-73.853909,41.169946],[-73.8535,41.170377],[-73.853342,41.170565],[-73.85260599999999,41.172103],[-73.85232999999999,41.172624],[-73.852304,41.172751],[-73.852295,41.172881],[-73.85227399999999,41.172971],[-73.852255,41.173002],[-73.85222899999999,41.173044],[-73.852137,41.173148],[-73.851992,41.17317],[-73.850607,41.173283],[-73.85049600000001,41.1732],[-73.850177,41.173101],[-73.849919,41.173009],[-73.849734,41.172943],[-73.84948799999999,41.172823],[-73.849311,41.172721],[-73.849074,41.172655],[-73.84868899999999,41.172575],[-73.84841400000001,41.172496],[-73.848276,41.172427],[-73.848326,41.172356],[-73.84849699999999,41.171976],[-73.84866100000001,41.171544],[-73.848724,41.171341],[-73.848983,41.170489],[-73.849118,41.170041],[-73.849251,41.169695],[-73.8494,41.169374],[-73.84961699999999,41.169027],[-73.849677,41.16894],[-73.84957300000001,41.168878],[-73.849537,41.168702],[-73.849537,41.16836],[-73.849594,41.168081],[-73.84993,41.167067],[-73.850026,41.166978],[-73.850836,41.167053],[-73.850993,41.167078],[-73.85160500000001,41.167173],[-73.851921,41.167207],[-73.85225699999999,41.167208],[-73.85267899999999,41.167188],[-73.852788,41.167173],[-73.852881,41.167162],[-73.853088,41.167107],[-73.853104,41.167103],[-73.853233,41.167051],[-73.85374,41.166757],[-73.85399,41.166633],[-73.85407600000001,41.166598],[-73.854435,41.166475],[-73.855322,41.16627],[-73.856544,41.165994],[-73.856999,41.165908],[-73.8571,41.165882],[-73.857215,41.165838],[-73.857372,41.165721],[-73.8573,41.165846]]],"type":"Polygon"}
}