{
  "id": "360630227111",
  "type": "Feature",
  "properties": {
    "area_land":961733,
    "area_water":0,
    "geoid":"360630227111",
    "name":"Block Group 1",
    "state":"ny"
},
  "bbox": [
    -78.927195,
    43.094768,
    -78.902889,
    43.105501
],
  "geometry": {"coordinates":[[[-78.927126,43.099175],[-78.92700499999999,43.099223],[-78.926884,43.099271],[-78.926523,43.099407],[-78.92616700000001,43.099527],[-78.925872,43.099628],[-78.923851,43.100181],[-78.923224,43.100352],[-78.922989,43.100414],[-78.921927,43.1007],[-78.92085400000001,43.10099],[-78.917636,43.10186],[-78.91656399999999,43.102151],[-78.916568,43.102481],[-78.91658,43.103471],[-78.916584,43.103802],[-78.916585,43.103966],[-78.91659,43.104458],[-78.916591,43.1045],[-78.916577,43.104622],[-78.91653100000001,43.104681],[-78.916465,43.104713],[-78.916088,43.104806],[-78.91606,43.104814],[-78.91530899999999,43.105018],[-78.91453799999999,43.105236],[-78.914276,43.105311],[-78.914057,43.105354],[-78.914017,43.105359],[-78.913774,43.105375],[-78.91335100000001,43.105385],[-78.911798,43.105425],[-78.91135300000001,43.105428],[-78.910687,43.105434],[-78.909903,43.105445],[-78.908001,43.105473],[-78.90755299999999,43.105484],[-78.906903,43.105501],[-78.906819,43.105497],[-78.906772,43.105486],[-78.906733,43.105471],[-78.90669699999999,43.105428],[-78.90668700000001,43.10535],[-78.906682,43.105301],[-78.90667000000001,43.104821],[-78.906666,43.104645],[-78.906661,43.10449],[-78.90664700000001,43.104029],[-78.906643,43.103875],[-78.905873,43.103884],[-78.905697,43.103887],[-78.903565,43.103931],[-78.90308899999999,43.103941],[-78.902941,43.103928],[-78.902917,43.103913],[-78.90289300000001,43.103866],[-78.902889,43.103803],[-78.902891,43.103655],[-78.90289799999999,43.103214],[-78.902901,43.103067],[-78.903643,43.10306],[-78.903989,43.103057],[-78.905686,43.10304],[-78.905871,43.103036],[-78.906614,43.103021],[-78.90660699999999,43.102711],[-78.906588,43.101781],[-78.906582,43.101471],[-78.90658000000001,43.101415],[-78.906576,43.101247],[-78.906575,43.101191],[-78.907112,43.101197],[-78.91054099999999,43.101139],[-78.910476,43.099467],[-78.910447,43.098633],[-78.910447,43.098617],[-78.910359,43.096709],[-78.911523,43.096699],[-78.912265,43.096713],[-78.91226,43.09539],[-78.91225900000001,43.095253],[-78.912262,43.095225],[-78.912262,43.095139],[-78.912261,43.09478],[-78.912261,43.094768],[-78.9132,43.095138],[-78.91440799999999,43.09558],[-78.91722799999999,43.096566],[-78.920624,43.097719],[-78.920778,43.09776],[-78.92190600000001,43.098065],[-78.922481,43.098212],[-78.92277900000001,43.098282],[-78.92346000000001,43.098418],[-78.925101,43.098715],[-78.92551899999999,43.098799],[-78.926776,43.099052],[-78.927195,43.099137],[-78.927126,43.099175]]],"type":"Polygon"}
}