{
  "id": "361031456023",
  "type": "Feature",
  "properties": {
    "area_land":730107,
    "area_water":0,
    "geoid":"361031456023",
    "name":"Block Group 3",
    "state":"ny"
},
  "bbox": [
    -73.266629,
    40.788829,
    -73.255456,
    40.797904
],
  "geometry": {"coordinates":[[[-73.26662899999999,40.795421],[-73.26545,40.795789],[-73.26314499999999,40.796503],[-73.26257,40.796683],[-73.259354,40.797686],[-73.259151,40.797708],[-73.256507,40.797904],[-73.256423,40.797218],[-73.25635200000001,40.796537],[-73.256265,40.795851],[-73.25618900000001,40.795164],[-73.256108,40.794484],[-73.25605899999999,40.794104],[-73.25602600000001,40.793801],[-73.25594,40.793116],[-73.255854,40.792435],[-73.255775,40.791754],[-73.255696,40.791058],[-73.255618,40.790372],[-73.25554099999999,40.789685],[-73.25549599999999,40.789352],[-73.255456,40.789],[-73.25683600000001,40.788908],[-73.257428,40.788864],[-73.25759499999999,40.788854],[-73.25784400000001,40.788838],[-73.258055,40.788829],[-73.25822700000001,40.788865],[-73.25838299999999,40.788918],[-73.25851400000001,40.788956],[-73.25867,40.78898],[-73.258865,40.788986],[-73.259703,40.788983],[-73.260836,40.788972],[-73.26324200000001,40.788964],[-73.264124,40.78896],[-73.264273,40.788958],[-73.264759,40.790154],[-73.264858,40.790432],[-73.265128,40.791125],[-73.26537,40.791784],[-73.265422,40.791948],[-73.265438,40.792005],[-73.265762,40.792833],[-73.266012,40.793568],[-73.26662899999999,40.795421]]],"type":"Polygon"}
}