{
  "id": "360610199002",
  "type": "Feature",
  "properties": {
    "area_land":23331,
    "area_water":0,
    "geoid":"360610199002",
    "name":"Block Group 2",
    "state":"ny"
},
  "bbox": [
    -73.968048,
    40.804169,
    -73.965764,
    40.806127
],
  "geometry": {"coordinates":[[[-73.967984,40.804735],[-73.96793700000001,40.804799],[-73.96791399999999,40.804862],[-73.96791,40.804925],[-73.96785800000001,40.805186],[-73.96782899999999,40.805279],[-73.96777400000001,40.805384],[-73.96772300000001,40.805453],[-73.967615,40.805604],[-73.967518,40.805768],[-73.967429,40.805961],[-73.96737299999999,40.806127],[-73.966291,40.805674],[-73.96576399999999,40.805453],[-73.965959,40.805191],[-73.96605,40.805068],[-73.96622499999999,40.804833],[-73.966701,40.804169],[-73.968048,40.804684],[-73.967984,40.804735]]],"type":"Polygon"}
}