{
  "id": "361070203001",
  "type": "Feature",
  "properties": {
    "area_land":49356587,
    "area_water":297972,
    "geoid":"361070203001",
    "name":"Block Group 1",
    "state":"ny"
},
  "bbox": [
    -76.206048,
    42.107547,
    -76.111106,
    42.185783
],
  "geometry": {"coordinates":[[[-76.206035,42.150357],[-76.205996,42.15044],[-76.205741,42.150764],[-76.205473,42.151004],[-76.20502399999999,42.15131],[-76.204638,42.151554],[-76.203828,42.152013],[-76.203514,42.152156],[-76.203024,42.152348],[-76.20137200000001,42.152939],[-76.201081,42.153037],[-76.200946,42.153081],[-76.200418,42.153256],[-76.200123,42.153308],[-76.199918,42.153324],[-76.19949200000001,42.153323],[-76.19914199999999,42.153308],[-76.198581,42.153308],[-76.19847799999999,42.153318],[-76.198301,42.153367],[-76.198179,42.153411],[-76.19807,42.153464],[-76.19785,42.153616],[-76.197714,42.153746],[-76.197593,42.153929],[-76.19730300000001,42.154582],[-76.197155,42.154864],[-76.196844,42.155289],[-76.196358,42.155865],[-76.196139,42.156151],[-76.195887,42.156482],[-76.19571500000001,42.156692],[-76.195505,42.156881],[-76.19532599999999,42.157026],[-76.195109,42.1572],[-76.194761,42.15748],[-76.194506,42.157746],[-76.19449400000001,42.15776],[-76.194327,42.157982],[-76.194283,42.158059],[-76.19419499999999,42.158217],[-76.19416,42.158297],[-76.194125,42.15838],[-76.19407699999999,42.158495],[-76.193877,42.159081],[-76.19321600000001,42.161241],[-76.193134,42.161427],[-76.193051,42.161569],[-76.19292299999999,42.161729],[-76.192609,42.162054],[-76.192353,42.16229],[-76.19168999999999,42.162815],[-76.190962,42.163339],[-76.190663,42.163557],[-76.190635,42.163578],[-76.190521,42.163649],[-76.19018699999999,42.163869],[-76.189526,42.164388],[-76.189476,42.164431],[-76.18930899999999,42.164572],[-76.18913000000001,42.164759],[-76.189059,42.164835],[-76.18837000000001,42.165774],[-76.188267,42.165902],[-76.188191,42.165999],[-76.187954,42.166263],[-76.18772,42.166523],[-76.18769,42.166558],[-76.187168,42.167098],[-76.186999,42.167285],[-76.18676600000001,42.167546],[-76.186348,42.168012],[-76.186025,42.168406],[-76.185867,42.168644],[-76.185772,42.168837],[-76.185717,42.168995],[-76.18565099999999,42.169364],[-76.185636,42.169575],[-76.185636,42.16982],[-76.185621,42.170016],[-76.185605,42.170254],[-76.18555499999999,42.170452],[-76.185484,42.170651],[-76.185435,42.17074],[-76.185295,42.170958],[-76.18517,42.171085],[-76.18500299999999,42.171224],[-76.18489099999999,42.171308],[-76.184382,42.171637],[-76.18408599999999,42.171841],[-76.18373200000001,42.172133],[-76.183559,42.172297],[-76.183047,42.172824],[-76.182793,42.173054],[-76.182402,42.173345],[-76.182182,42.173538],[-76.18207700000001,42.173655],[-76.181887,42.173959],[-76.181695,42.174393],[-76.181494,42.174787],[-76.181376,42.174967],[-76.18124899999999,42.175113],[-76.1807,42.175578],[-76.18037699999999,42.175823],[-76.18002300000001,42.176117],[-76.179164,42.176832],[-76.17865,42.17728],[-76.177887,42.177976],[-76.177556,42.178212],[-76.17665,42.178757],[-76.176592,42.178793],[-76.176462,42.178893],[-76.17628499999999,42.179079],[-76.176196,42.179227],[-76.176152,42.179358],[-76.176016,42.179925],[-76.17586799999999,42.180362],[-76.17577799999999,42.180536],[-76.17543999999999,42.181088],[-76.175027,42.181711],[-76.174847,42.181935],[-76.174481,42.182359],[-76.17441599999999,42.182447],[-76.173609,42.183565],[-76.17355999999999,42.183635],[-76.168215,42.18383],[-76.167304,42.183864],[-76.152185,42.184489],[-76.149069,42.184618],[-76.14684200000001,42.184706],[-76.146625,42.184715],[-76.145978,42.184744],[-76.145762,42.184754],[-76.14528,42.184771],[-76.143834,42.184826],[-76.143353,42.184844],[-76.140659,42.18495],[-76.132577,42.185272],[-76.129884,42.185379],[-76.128754,42.1854],[-76.125366,42.185467],[-76.12464900000001,42.185481],[-76.12423699999999,42.185469],[-76.12389,42.185457],[-76.12387,42.185458],[-76.123848,42.185459],[-76.123558,42.185471],[-76.123147,42.185488],[-76.122469,42.185517],[-76.122393,42.18552],[-76.12237500000001,42.185521],[-76.12234599999999,42.185522],[-76.122299,42.185521],[-76.122215,42.185521],[-76.12200199999999,42.185545],[-76.121833,42.185552],[-76.120738,42.185596],[-76.120537,42.185605],[-76.118375,42.185693],[-76.118255,42.185698],[-76.11746599999999,42.18573],[-76.11743300000001,42.185732],[-76.11736500000001,42.185736],[-76.117276,42.18574],[-76.117257,42.18574],[-76.116983,42.185751],[-76.116316,42.185778],[-76.116213,42.185783],[-76.116225,42.18561],[-76.116257,42.185146],[-76.11624,42.18483],[-76.11620600000001,42.184274],[-76.116237,42.184266],[-76.116247,42.184238],[-76.116241,42.183943],[-76.11615,42.18016],[-76.11577800000001,42.177884],[-76.115762,42.177706],[-76.115741,42.177071],[-76.11546,42.172968],[-76.114593,42.16033],[-76.11403300000001,42.153418],[-76.11401600000001,42.152944],[-76.114007,42.152791],[-76.113895,42.150896],[-76.11386400000001,42.150382],[-76.11351500000001,42.144681],[-76.113392,42.142929],[-76.11285100000001,42.136529],[-76.111875,42.123008],[-76.11171400000001,42.120903],[-76.111144,42.112874],[-76.11110600000001,42.112436],[-76.111127,42.112439],[-76.11132600000001,42.112465],[-76.111628,42.112504],[-76.112284,42.112614],[-76.112634,42.112686],[-76.112836,42.112736],[-76.113118,42.112823],[-76.11332299999999,42.112896],[-76.113653,42.113047],[-76.11447,42.113475],[-76.114942,42.113676],[-76.115359,42.113789],[-76.116181,42.113953],[-76.11662800000001,42.114075],[-76.11694799999999,42.114192],[-76.117665,42.114502],[-76.118313,42.114788],[-76.118757,42.114953],[-76.118934,42.115013],[-76.11945299999999,42.115149],[-76.120329,42.115362],[-76.120589,42.115418],[-76.122107,42.11579],[-76.12281,42.115948],[-76.123206,42.116012],[-76.123661,42.11605],[-76.12418,42.116061],[-76.124917,42.116052],[-76.125299,42.116047],[-76.12644400000001,42.116032],[-76.12682700000001,42.116028],[-76.12716899999999,42.11602],[-76.12819399999999,42.115999],[-76.12853699999999,42.115992],[-76.12874100000001,42.115987],[-76.12884200000001,42.115985],[-76.129355,42.115965],[-76.12956,42.115958],[-76.129904,42.115945],[-76.130613,42.115919],[-76.13093499999999,42.115881],[-76.131157,42.115856],[-76.131277,42.115834],[-76.13164399999999,42.11574],[-76.13195899999999,42.115627],[-76.132391,42.115437],[-76.133915,42.114617],[-76.1345,42.114329],[-76.135024,42.11411],[-76.13523000000001,42.114025],[-76.135728,42.113846],[-76.1361,42.113724],[-76.136765,42.113536],[-76.13700300000001,42.113481],[-76.13740199999999,42.11341],[-76.13798199999999,42.113339],[-76.138862,42.113263],[-76.139843,42.113208],[-76.141302,42.113135],[-76.142686,42.113039],[-76.143697,42.112944],[-76.144018,42.112904],[-76.144474,42.112812],[-76.14478099999999,42.112727],[-76.14518200000001,42.112582],[-76.14546,42.112453],[-76.14576099999999,42.112282],[-76.146607,42.111738],[-76.146962,42.111516],[-76.147195,42.111372],[-76.14749399999999,42.11121],[-76.14792199999999,42.111015],[-76.14834999999999,42.110827],[-76.14959,42.110313],[-76.15052900000001,42.109925],[-76.15074300000001,42.109851],[-76.15084400000001,42.109821],[-76.15104100000001,42.109764],[-76.151149,42.109741],[-76.151253,42.109721],[-76.15138399999999,42.109702],[-76.15201399999999,42.109638],[-76.153093,42.109568],[-76.156094,42.109375],[-76.15862199999999,42.109219],[-76.16001300000001,42.109134],[-76.160466,42.109104],[-76.16097600000001,42.10907],[-76.161265,42.109052],[-76.16250700000001,42.108967],[-76.16301799999999,42.108933],[-76.16357000000001,42.108893],[-76.163639,42.108889],[-76.165227,42.108788],[-76.16578,42.108753],[-76.166434,42.108719],[-76.168398,42.108618],[-76.16905300000001,42.108585],[-76.169577,42.108559],[-76.171153,42.108483],[-76.171678,42.108458],[-76.172425,42.108429],[-76.174916,42.108306],[-76.176669,42.10822],[-76.18003299999999,42.10807],[-76.181262,42.108004],[-76.18170600000001,42.107957],[-76.18276,42.107804],[-76.183279,42.107752],[-76.184562,42.10766],[-76.18461600000001,42.107658],[-76.18785699999999,42.107547],[-76.187602,42.107771],[-76.187341,42.108035],[-76.185844,42.109554],[-76.185345,42.110061],[-76.185092,42.110317],[-76.185031,42.110376],[-76.18407999999999,42.111312],[-76.183763,42.111625],[-76.183457,42.111925],[-76.18318499999999,42.112193],[-76.182959,42.112438],[-76.18286999999999,42.112563],[-76.182807,42.112675],[-76.182698,42.112944],[-76.18253799999999,42.113342],[-76.182518,42.113389],[-76.18246000000001,42.113534],[-76.182441,42.113582],[-76.182301,42.113982],[-76.18228000000001,42.114101],[-76.182271,42.114345],[-76.182317,42.114587],[-76.182647,42.115654],[-76.18274700000001,42.115977],[-76.182846,42.11646],[-76.182867,42.116744],[-76.182856,42.117214],[-76.182816,42.117495],[-76.182715,42.11788],[-76.181883,42.120241],[-76.181585,42.121193],[-76.181411,42.121861],[-76.181093,42.123089],[-76.180982,42.123418],[-76.18085600000001,42.123685],[-76.180725,42.123889],[-76.180482,42.124278],[-76.18040999999999,42.12442],[-76.180345,42.124657],[-76.180328,42.124882],[-76.180342,42.125076],[-76.180347,42.125111],[-76.18035999999999,42.1252],[-76.180577,42.126022],[-76.18069199999999,42.126369],[-76.18078800000001,42.12657],[-76.180925,42.126772],[-76.18134000000001,42.127231],[-76.18143600000001,42.127367],[-76.181532,42.127547],[-76.181596,42.127712],[-76.181617,42.12786],[-76.18162100000001,42.128087],[-76.181608,42.128515],[-76.181594,42.12873],[-76.18153700000001,42.129674],[-76.1815,42.130046],[-76.18188600000001,42.130079],[-76.181905,42.130078],[-76.182413,42.130076],[-76.183126,42.130049],[-76.183533,42.130035],[-76.183682,42.130025],[-76.18413,42.129997],[-76.18428,42.129988],[-76.184494,42.129989],[-76.18463,42.130017],[-76.184721,42.130069],[-76.184792,42.130141],[-76.18483500000001,42.130206],[-76.185394,42.131589],[-76.185761,42.132444],[-76.186576,42.134345],[-76.186806,42.13482],[-76.187001,42.135164],[-76.18747500000001,42.135916],[-76.187549,42.136109],[-76.187586,42.136323],[-76.187645,42.136988],[-76.187673,42.137069],[-76.18774999999999,42.13719],[-76.187853,42.137292],[-76.187999,42.137366],[-76.188101,42.137401],[-76.188309,42.137438],[-76.188532,42.137428],[-76.189001,42.137376],[-76.19021600000001,42.137221],[-76.19063199999999,42.137177],[-76.19081199999999,42.137168],[-76.191005,42.137178],[-76.191166,42.137199],[-76.191417,42.137258],[-76.191607,42.13733],[-76.19162,42.137337],[-76.191799,42.137438],[-76.19193300000001,42.137544],[-76.19205700000001,42.137686],[-76.19220900000001,42.13791],[-76.19334600000001,42.139823],[-76.19341799999999,42.139946],[-76.193634,42.140315],[-76.193707,42.140439],[-76.193865,42.140703],[-76.19429100000001,42.14141],[-76.194345,42.141493],[-76.194377,42.141541],[-76.19451599999999,42.14175],[-76.194526,42.141765],[-76.19455600000001,42.141811],[-76.19456700000001,42.141827],[-76.194992,42.142363],[-76.195244,42.142669],[-76.19526,42.142688],[-76.197385,42.145238],[-76.198094,42.146089],[-76.19838,42.146428],[-76.19874299999999,42.1468],[-76.19919899999999,42.147219],[-76.19970000000001,42.147679],[-76.20030800000001,42.148213],[-76.200608,42.148432],[-76.20089,42.148605],[-76.201138,42.148739],[-76.201579,42.148956],[-76.202946,42.149655],[-76.20318,42.149742],[-76.203238,42.149764],[-76.20350500000001,42.149838],[-76.20461400000001,42.149981],[-76.20474,42.149994],[-76.20500699999999,42.150021],[-76.20511999999999,42.150033],[-76.20547999999999,42.150089],[-76.205797,42.15017],[-76.20592600000001,42.150218],[-76.206048,42.150277],[-76.206035,42.150357]]],"type":"Polygon"}
}