{
  "id": "361190149013",
  "type": "Feature",
  "properties": {
    "area_land":8437397,
    "area_water":9437,
    "geoid":"361190149013",
    "name":"Block Group 3",
    "state":"ny"
},
  "bbox": [
    -73.752315,
    41.274652,
    -73.707584,
    41.311277
],
  "geometry": {"coordinates":[[[-73.752219,41.28701],[-73.751715,41.288833],[-73.75157,41.289671],[-73.75146100000001,41.290043],[-73.751289,41.290356],[-73.750792,41.291113],[-73.75021700000001,41.291759],[-73.749583,41.292546],[-73.749286,41.292887],[-73.74899600000001,41.293199],[-73.74865699999999,41.29353],[-73.74820099999999,41.293863],[-73.74756499999999,41.294306],[-73.74536500000001,41.295779],[-73.744867,41.296129],[-73.742164,41.297967],[-73.741165,41.298634],[-73.741017,41.298723],[-73.740933,41.298752],[-73.740775,41.29877],[-73.74060299999999,41.298745],[-73.740337,41.298664],[-73.73994500000001,41.298565],[-73.739727,41.29854],[-73.73954999999999,41.298545],[-73.73928600000001,41.298629],[-73.738674,41.298901],[-73.73626400000001,41.300128],[-73.736099,41.300242],[-73.73595400000001,41.300449],[-73.735783,41.300879],[-73.735243,41.30226],[-73.735212,41.302493],[-73.73527300000001,41.303006],[-73.735669,41.30458],[-73.735855,41.305149],[-73.736068,41.305548],[-73.73669,41.306483],[-73.73692800000001,41.306816],[-73.737109,41.307055],[-73.737286,41.307381],[-73.73733199999999,41.307583],[-73.73736700000001,41.308363],[-73.73738299999999,41.309033],[-73.736492,41.309186],[-73.735663,41.309245],[-73.73492400000001,41.309309],[-73.733555,41.309391],[-73.733316,41.309373],[-73.732946,41.30925],[-73.73278500000001,41.309188],[-73.732176,41.308959],[-73.732041,41.308927],[-73.73171499999999,41.308918],[-73.73080299999999,41.308987],[-73.729826,41.309088],[-73.72812500000001,41.309317],[-73.727626,41.3094],[-73.72726900000001,41.309477],[-73.726963,41.309516],[-73.726494,41.309536],[-73.726332,41.309556],[-73.726198,41.30959],[-73.72600799999999,41.309671],[-73.725826,41.309819],[-73.725264,41.310538],[-73.725143,41.310615],[-73.72495499999999,41.310669],[-73.72474800000001,41.310679],[-73.72463500000001,41.310664],[-73.724191,41.310546],[-73.723865,41.310442],[-73.72373399999999,41.310415],[-73.723266,41.310415],[-73.722911,41.310405],[-73.722846,41.31042],[-73.722694,41.310455],[-73.722492,41.310533],[-73.722095,41.310605],[-73.721508,41.310693],[-73.721069,41.310743],[-73.71971000000001,41.310854],[-73.718982,41.31093],[-73.718538,41.310965],[-73.71808900000001,41.311038],[-73.71700199999999,41.311277],[-73.716894,41.310633],[-73.71682300000001,41.310222],[-73.71658499999999,41.308925],[-73.716461,41.308195],[-73.71623599999999,41.306994],[-73.716174,41.306694],[-73.71606300000001,41.306072],[-73.71599000000001,41.305488],[-73.715934,41.305041],[-73.715901,41.304593],[-73.715875,41.304415],[-73.715827,41.304181],[-73.71557199999999,41.303242],[-73.715474,41.302728],[-73.715416,41.302265],[-73.71534200000001,41.301726],[-73.715318,41.301555],[-73.71525099999999,41.301097],[-73.715188,41.300655],[-73.71518399999999,41.300528],[-73.71520099999999,41.300418],[-73.71523999999999,41.300295],[-73.71531400000001,41.300168],[-73.715546,41.299823],[-73.715751,41.299523],[-73.716415,41.298512],[-73.716674,41.298022],[-73.716787,41.297715],[-73.717026,41.296477],[-73.71709300000001,41.29613],[-73.717123,41.295864],[-73.71711500000001,41.295736],[-73.71708599999999,41.295616],[-73.717061,41.295542],[-73.716989,41.295418],[-73.71691300000001,41.295335],[-73.71676600000001,41.295227],[-73.716466,41.295074],[-73.716233,41.294946],[-73.71603500000001,41.294792],[-73.715987,41.29474],[-73.715953,41.294679],[-73.715788,41.294312],[-73.715615,41.293883],[-73.715138,41.292651],[-73.71502599999999,41.292346],[-73.71492000000001,41.292009],[-73.71481799999999,41.29163],[-73.714669,41.291068],[-73.71440699999999,41.290157],[-73.714377,41.290007],[-73.71432900000001,41.289848],[-73.714251,41.289618],[-73.714174,41.289439],[-73.713469,41.288134],[-73.7133,41.287904],[-73.713201,41.287764],[-73.71310200000001,41.287667],[-73.712596,41.287141],[-73.712406,41.286927],[-73.712194,41.286674],[-73.712125,41.286573],[-73.712086,41.286485],[-73.712,41.286313],[-73.711806,41.286039],[-73.71166700000001,41.285889],[-73.711348,41.285584],[-73.711265,41.2855],[-73.71118199999999,41.285403],[-73.711084,41.285274],[-73.711006,41.285108],[-73.710972,41.284869],[-73.71078300000001,41.284305],[-73.710607,41.284018],[-73.710356,41.283721],[-73.710138,41.283485],[-73.709861,41.283211],[-73.709744,41.283113],[-73.709643,41.283038],[-73.70953,41.282965],[-73.709262,41.282848],[-73.708983,41.282737],[-73.70881300000001,41.282653],[-73.70871,41.282582],[-73.708651,41.282516],[-73.708596,41.282431],[-73.708504,41.282311],[-73.707728,41.279409],[-73.70765299999999,41.279101],[-73.707606,41.278874],[-73.707584,41.278706],[-73.707599,41.27847],[-73.707628,41.278244],[-73.707689,41.278046],[-73.707752,41.277892],[-73.707915,41.277596],[-73.70808,41.277367],[-73.70907800000001,41.276208],[-73.709183,41.276085],[-73.709585,41.275591],[-73.709731,41.275424],[-73.709771,41.275365],[-73.71001200000001,41.275074],[-73.710267,41.274759],[-73.71035500000001,41.274652],[-73.71094600000001,41.275096],[-73.711449,41.275442],[-73.711635,41.275556],[-73.712019,41.275757],[-73.71226299999999,41.275864],[-73.712457,41.27594],[-73.712678,41.276013],[-73.712941,41.276089],[-73.713336,41.276196],[-73.713596,41.276256],[-73.713965,41.276335],[-73.714468,41.276431],[-73.714805,41.276511],[-73.71510000000001,41.276598],[-73.71538700000001,41.276701],[-73.715681,41.276825],[-73.715954,41.276948],[-73.71623700000001,41.277099],[-73.716269,41.277149],[-73.71638299999999,41.277219],[-73.716832,41.277524],[-73.717338,41.277899],[-73.717815,41.278279],[-73.71831299999999,41.278686],[-73.71844900000001,41.278783],[-73.718541,41.278842],[-73.718712,41.278927],[-73.718827,41.27897],[-73.71904000000001,41.279061],[-73.720088,41.279474],[-73.72034499999999,41.279602],[-73.720573,41.279731],[-73.72070100000001,41.279817],[-73.72296799999999,41.281429],[-73.724137,41.282302],[-73.724294,41.282409],[-73.724451,41.282506],[-73.72457900000001,41.282575],[-73.72467899999999,41.282618],[-73.72477000000001,41.282642],[-73.724875,41.282655],[-73.724994,41.282659],[-73.72544000000001,41.282628],[-73.725932,41.282575],[-73.728284,41.282351],[-73.72925600000001,41.28225],[-73.730735,41.282109],[-73.730862,41.282089],[-73.730977,41.28206],[-73.731093,41.282019],[-73.73119,41.281967],[-73.731781,41.281587],[-73.73194100000001,41.281491],[-73.732063,41.281438],[-73.732179,41.281403],[-73.732285,41.281386],[-73.73247499999999,41.281375],[-73.73266,41.281379],[-73.73417999999999,41.281435],[-73.735619,41.281462],[-73.736003,41.281458],[-73.736244,41.281444],[-73.736407,41.28143],[-73.736653,41.281395],[-73.73700100000001,41.281334],[-73.737302,41.28126],[-73.73753600000001,41.28119],[-73.73779500000001,41.281102],[-73.73832899999999,41.280898],[-73.7385,41.280843],[-73.73884200000001,41.280745],[-73.73920699999999,41.280655],[-73.739526,41.280586],[-73.74023099999999,41.280452],[-73.741107,41.280297],[-73.74127799999999,41.280262],[-73.741394,41.280231],[-73.74149800000001,41.280189],[-73.741579,41.280151],[-73.74169000000001,41.280088],[-73.742076,41.279831],[-73.74301699999999,41.279151],[-73.743183,41.279043],[-73.743391,41.278921],[-73.743562,41.278834],[-73.743747,41.278751],[-73.743904,41.278695],[-73.74405,41.278653],[-73.744208,41.278615],[-73.744356,41.278591],[-73.744536,41.278573],[-73.744716,41.278566],[-73.745096,41.278576],[-73.745322,41.278601],[-73.745468,41.278622],[-73.74563000000001,41.278657],[-73.74576399999999,41.278692],[-73.745892,41.278732],[-73.746106,41.27882],[-73.74628199999999,41.278914],[-73.74640599999999,41.278988],[-73.746499,41.279057],[-73.746661,41.279189],[-73.746787,41.279318],[-73.74688500000001,41.279436],[-73.746961,41.27956],[-73.747035,41.279713],[-73.747128,41.279953],[-73.747249,41.280326],[-73.747361,41.280669],[-73.74748599999999,41.281016],[-73.747606,41.281301],[-73.74773500000001,41.281552],[-73.747805,41.281659],[-73.74788599999999,41.281761],[-73.747978,41.281854],[-73.74807300000001,41.281934],[-73.74817,41.282007],[-73.748295,41.282083],[-73.748434,41.282149],[-73.74856800000001,41.282205],[-73.74872999999999,41.28226],[-73.74902899999999,41.282347],[-73.749247,41.282406],[-73.749464,41.282472],[-73.749658,41.282542],[-73.749797,41.282605],[-73.750074,41.282771],[-73.750238,41.282882],[-73.750455,41.283073],[-73.750557,41.283192],[-73.75065600000001,41.283409],[-73.750696,41.283528],[-73.750815,41.283974],[-73.75111800000001,41.284916],[-73.75116,41.285023],[-73.751216,41.285142],[-73.751384,41.28542],[-73.751527,41.285643],[-73.751829,41.286071],[-73.752315,41.28671],[-73.752219,41.28701]]],"type":"Polygon"}
}