{
  "id": "360670115002",
  "type": "Feature",
  "properties": {
    "area_land":6809926,
    "area_water":0,
    "geoid":"360670115002",
    "name":"Block Group 2",
    "state":"ny"
},
  "bbox": [
    -76.32166,
    43.142047,
    -76.277397,
    43.175377
],
  "geometry": {"coordinates":[[[-76.32165999999999,43.161173],[-76.32011199999999,43.161794],[-76.319101,43.162204],[-76.31811500000001,43.162606],[-76.317981,43.162661],[-76.317849,43.162714],[-76.317435,43.162885],[-76.317159,43.162999],[-76.316023,43.163469],[-76.313883,43.164356],[-76.313209,43.164607],[-76.31272199999999,43.16475],[-76.312288,43.164861],[-76.311601,43.16502],[-76.311303,43.165093],[-76.31118600000001,43.165122],[-76.31107799999999,43.165149],[-76.310942,43.165182],[-76.310755,43.165229],[-76.309954,43.16544],[-76.30933899999999,43.165584],[-76.30900099999999,43.165663],[-76.30632900000001,43.166397],[-76.30448,43.166912],[-76.302144,43.167575],[-76.300876,43.167921],[-76.300389,43.168067],[-76.300174,43.168129],[-76.299162,43.168425],[-76.298196,43.168681],[-76.296998,43.169014],[-76.294118,43.169823],[-76.294079,43.169834],[-76.28856399999999,43.171391],[-76.285203,43.172345],[-76.284842,43.172459],[-76.284564,43.17255],[-76.284369,43.172626],[-76.28377399999999,43.172871],[-76.283235,43.173134],[-76.28200099999999,43.173841],[-76.280826,43.17449],[-76.280315,43.174728],[-76.27980700000001,43.174923],[-76.279528,43.175019],[-76.278261,43.175377],[-76.278248,43.175151],[-76.278268,43.174536],[-76.278296,43.174238],[-76.278329,43.173355],[-76.278369,43.172814],[-76.278367,43.172117],[-76.278396,43.168703],[-76.278434,43.166499],[-76.27844399999999,43.165362],[-76.278447,43.164998],[-76.278448,43.164925],[-76.278454,43.164328],[-76.27846700000001,43.162904],[-76.278445,43.16113],[-76.278311,43.158748],[-76.278148,43.156318],[-76.27799899999999,43.154285],[-76.277995,43.154213],[-76.27784200000001,43.152179],[-76.27764999999999,43.14959],[-76.277579,43.148735],[-76.277451,43.147418],[-76.27743599999999,43.147213],[-76.277399,43.146708],[-76.27739699999999,43.146634],[-76.27741899999999,43.146226],[-76.277637,43.144579],[-76.27792100000001,43.142694],[-76.27799400000001,43.14227],[-76.278041,43.142124],[-76.278094,43.142047],[-76.283232,43.144235],[-76.28498399999999,43.145002],[-76.288155,43.14637],[-76.28916700000001,43.146807],[-76.29207700000001,43.148049],[-76.292823,43.148366],[-76.29593,43.149697],[-76.29855499999999,43.150822],[-76.298608,43.150845],[-76.301922,43.152274],[-76.303574,43.152987],[-76.305234,43.153701],[-76.30702599999999,43.154469],[-76.307529,43.154647],[-76.307737,43.154709],[-76.307902,43.154751],[-76.308291,43.154852],[-76.308655,43.154927],[-76.309254,43.15502],[-76.310019,43.15513],[-76.31119,43.155297],[-76.31531099999999,43.155901],[-76.315675,43.155954],[-76.316002,43.156003],[-76.316225,43.156036],[-76.317047,43.156159],[-76.317351,43.156203],[-76.31935799999999,43.156492],[-76.319079,43.157461],[-76.319057,43.1576],[-76.319059,43.157748],[-76.319132,43.157894],[-76.32018600000001,43.159255],[-76.32079,43.16003],[-76.32165999999999,43.161173]]],"type":"Polygon"}
}