{
  "id": "360650251002",
  "type": "Feature",
  "properties": {
    "area_land":565380,
    "area_water":0,
    "geoid":"360650251002",
    "name":"Block Group 2",
    "state":"ny"
},
  "bbox": [
    -75.297323,
    43.062668,
    -75.283714,
    43.073343
],
  "geometry": {"coordinates":[[[-75.297225,43.072032],[-75.297101,43.072085],[-75.296764,43.072196],[-75.296544,43.072249],[-75.296454,43.072265],[-75.296316,43.072276],[-75.296138,43.072265],[-75.29602300000001,43.072249],[-75.295878,43.072217],[-75.295181,43.072011],[-75.294696,43.071874],[-75.29438399999999,43.071828],[-75.29398,43.071827],[-75.293902,43.071828],[-75.29315,43.071889],[-75.292653,43.071951],[-75.29254299999999,43.071967],[-75.29138399999999,43.072217],[-75.29100200000001,43.072308],[-75.29078,43.072367],[-75.290459,43.072438],[-75.29007900000001,43.072542],[-75.289209,43.072826],[-75.288628,43.073021],[-75.288293,43.07314],[-75.288032,43.073238],[-75.28779400000001,43.073343],[-75.28776499999999,43.073276],[-75.287389,43.072588],[-75.28728099999999,43.072359],[-75.28625700000001,43.069795],[-75.28600900000001,43.06919],[-75.285855,43.068786],[-75.28565999999999,43.068324],[-75.285493,43.067877],[-75.285346,43.067489],[-75.285105,43.066927],[-75.28498999999999,43.066635],[-75.28483900000001,43.06626],[-75.284536,43.065496],[-75.28402,43.064093],[-75.283874,43.063696],[-75.28376799999999,43.063391],[-75.283714,43.063155],[-75.28412299999999,43.062668],[-75.284814,43.063169],[-75.284992,43.063134],[-75.28801199999999,43.062777],[-75.28801300000001,43.063258],[-75.288023,43.063572],[-75.28767000000001,43.063615],[-75.28738199999999,43.063678],[-75.28561000000001,43.063769],[-75.287983,43.064795],[-75.28805,43.064982],[-75.2882,43.065353],[-75.290345,43.066239],[-75.292153,43.067648],[-75.292497,43.067563],[-75.292753,43.067498],[-75.293128,43.067455],[-75.293224,43.067608],[-75.294678,43.069672],[-75.295028,43.069971],[-75.29732300000001,43.071971],[-75.297225,43.072032]]],"type":"Polygon"}
}