{
  "id": "360290147021",
  "type": "Feature",
  "properties": {
    "area_land":2691798,
    "area_water":0,
    "geoid":"360290147021",
    "name":"Block Group 1",
    "state":"ny"
},
  "bbox": [
    -78.619753,
    42.975649,
    -78.58726,
    42.988308
],
  "geometry": {"coordinates":[[[-78.619753,42.985605],[-78.61967799999999,42.985737],[-78.618443,42.987057],[-78.617316,42.988286],[-78.617254,42.988287],[-78.61641400000001,42.988301],[-78.615092,42.988308],[-78.613899,42.988304],[-78.61232099999999,42.988304],[-78.611537,42.988305],[-78.610069,42.9883],[-78.60739100000001,42.988281],[-78.607026,42.988279],[-78.60627700000001,42.988267],[-78.60578,42.988252],[-78.604933,42.988227],[-78.602868,42.988153],[-78.60239799999999,42.988141],[-78.600756,42.988096],[-78.599705,42.988061],[-78.598934,42.988036],[-78.597702,42.988006],[-78.59393900000001,42.987894],[-78.59356699999999,42.987882],[-78.591657,42.987821],[-78.587479,42.9877],[-78.587457,42.986646],[-78.58739300000001,42.985294],[-78.587328,42.983132],[-78.58729700000001,42.982064],[-78.587283,42.981643],[-78.58728000000001,42.981538],[-78.58726,42.980951],[-78.587391,42.980941],[-78.58817500000001,42.980882],[-78.58869900000001,42.98085],[-78.588871,42.98084],[-78.59064499999999,42.980724],[-78.591314,42.980679],[-78.591854,42.98064],[-78.592945,42.980561],[-78.593712,42.980506],[-78.595446,42.980381],[-78.597714,42.980214],[-78.59893,42.98012],[-78.598974,42.980117],[-78.599278,42.980073],[-78.600352,42.97982],[-78.601325,42.979597],[-78.601439,42.979571],[-78.601991,42.979445],[-78.60386099999999,42.979038],[-78.60596099999999,42.978575],[-78.60736199999999,42.978276],[-78.60739700000001,42.978269],[-78.609673,42.97779],[-78.613332,42.97702],[-78.61340300000001,42.977005],[-78.615218,42.976621],[-78.615891,42.976479],[-78.616283,42.976396],[-78.616709,42.976301],[-78.61769700000001,42.976081],[-78.619561,42.975665],[-78.619635,42.975649],[-78.619677,42.976877],[-78.61968899999999,42.978272],[-78.61969499999999,42.978885],[-78.619709,42.980264],[-78.619722,42.981038],[-78.619739,42.984405],[-78.619749,42.98547],[-78.619753,42.985605]]],"type":"Polygon"}
}