{
  "id": "360910621001",
  "type": "Feature",
  "properties": {
    "area_land":3258267,
    "area_water":527123,
    "geoid":"360910621001",
    "name":"Block Group 1",
    "state":"ny"
},
  "bbox": [
    -73.664038,
    42.932534,
    -73.628879,
    42.959656
],
  "geometry": {"coordinates":[[[-73.66403800000001,42.934209],[-73.662524,42.935696],[-73.661258,42.936804],[-73.66116700000001,42.937103],[-73.66108699999999,42.937369],[-73.660882,42.938034],[-73.66082,42.938193],[-73.660433,42.938879],[-73.66028,42.939283],[-73.66016,42.939645],[-73.660127,42.939706],[-73.66053100000001,42.939751],[-73.66059799999999,42.939758],[-73.66118,42.939867],[-73.659893,42.940724],[-73.659848,42.940798],[-73.659736,42.940974],[-73.659627,42.94113],[-73.659245,42.941338],[-73.658536,42.941705],[-73.658383,42.941752],[-73.65699600000001,42.942514],[-73.651753,42.945335],[-73.650706,42.9459],[-73.650279,42.946133],[-73.648473,42.947197],[-73.648368,42.947609],[-73.648168,42.94894],[-73.64803999999999,42.949843],[-73.648021,42.950127],[-73.648025,42.950455],[-73.648083,42.951121],[-73.648385,42.952615],[-73.648605,42.953505],[-73.648681,42.953956],[-73.648736,42.954338],[-73.648826,42.954956],[-73.648878,42.955634],[-73.64895,42.957258],[-73.649021,42.958283],[-73.649068,42.958501],[-73.649193,42.958905],[-73.6491,42.959056],[-73.648883,42.959519],[-73.64883500000001,42.959562],[-73.64875000000001,42.959616],[-73.64866000000001,42.959652],[-73.648568,42.959656],[-73.648437,42.959641],[-73.647943,42.959557],[-73.646638,42.959228],[-73.64586,42.959066],[-73.64439299999999,42.958762],[-73.643737,42.958585],[-73.64282900000001,42.958353],[-73.642078,42.958229],[-73.64155700000001,42.95812],[-73.64035800000001,42.95785],[-73.63983,42.957746],[-73.639646,42.957709],[-73.63843300000001,42.957446],[-73.637427,42.95722],[-73.63663200000001,42.957051],[-73.636521,42.957015],[-73.63645200000001,42.956975],[-73.633442,42.956502],[-73.63232499999999,42.95629],[-73.63098100000001,42.955988],[-73.630342,42.955821],[-73.628879,42.955457],[-73.628882,42.955405],[-73.629006,42.953651],[-73.62932000000001,42.951503],[-73.629653,42.950265],[-73.63027599999999,42.948678],[-73.63105,42.94701],[-73.631242,42.946322],[-73.632305,42.944379],[-73.63323800000001,42.943179],[-73.634006,42.942337],[-73.63494799999999,42.941615],[-73.635463,42.94129],[-73.63625399999999,42.940793],[-73.63771,42.940118],[-73.638812,42.939764],[-73.638884,42.939742],[-73.638902,42.939736],[-73.638988,42.93971],[-73.639157,42.939659],[-73.63995199999999,42.939418],[-73.641679,42.939267],[-73.644341,42.939134],[-73.644401,42.939131],[-73.647144,42.938994],[-73.648268,42.938786],[-73.648431,42.938756],[-73.64844600000001,42.938753],[-73.64847,42.938748],[-73.64850300000001,42.938742],[-73.648563,42.938731],[-73.649738,42.938551],[-73.650654,42.938278],[-73.65081499999999,42.938185],[-73.650897,42.938138],[-73.651669,42.937704],[-73.652985,42.936983],[-73.653423,42.936727],[-73.657599,42.93443],[-73.65779999999999,42.934284],[-73.658367,42.934038],[-73.65857200000001,42.933949],[-73.658705,42.933917],[-73.658788,42.93385],[-73.658975,42.933747],[-73.65967499999999,42.933364],[-73.659835,42.933213],[-73.660433,42.932534],[-73.663147,42.933769],[-73.663444,42.933904],[-73.66403800000001,42.934209]]],"type":"Polygon"}
}