{
  "id": "361119521001",
  "type": "Feature",
  "properties": {
    "area_land":794585,
    "area_water":0,
    "geoid":"361119521001",
    "name":"Block Group 1",
    "state":"ny"
},
  "bbox": [
    -74.012886,
    41.914481,
    -73.997615,
    41.928693
],
  "geometry": {"coordinates":[[[-74.012742,41.924469],[-74.01217,41.924689],[-74.01146799999999,41.924958],[-74.01094500000001,41.925153],[-74.01015599999999,41.925465],[-74.009091,41.925922],[-74.007328,41.926591],[-74.006422,41.926937],[-74.005954,41.927115],[-74.004231,41.927785],[-74.00278,41.928347],[-74.00264799999999,41.928408],[-74.002247,41.928693],[-74.00203,41.928609],[-74.00199499999999,41.928596],[-74.001282,41.928319],[-74.000523,41.92803],[-74.00013199999999,41.927881],[-73.999983,41.927825],[-73.99984499999999,41.927773],[-73.999582,41.927685],[-73.99848,41.927324],[-73.998295,41.927264],[-73.997615,41.927055],[-73.99782399999999,41.9268],[-73.997889,41.926731],[-73.99919300000001,41.925344],[-73.999589,41.924933],[-74.000001,41.92445],[-74.000691,41.923714],[-74.000974,41.923401],[-74.001761,41.922552],[-74.002797,41.921435],[-74.003553,41.920629],[-74.00387000000001,41.920291],[-74.00407199999999,41.92005],[-74.00413500000001,41.919943],[-74.004229,41.919691],[-74.004272,41.919498],[-74.00431399999999,41.919032],[-74.00433200000001,41.918778],[-74.004396,41.918273],[-74.004452,41.918082],[-74.004507,41.917978],[-74.004583,41.917844],[-74.004873,41.917545],[-74.005169,41.917268],[-74.00561,41.916589],[-74.005657,41.916545],[-74.005776,41.916465],[-74.00626099999999,41.916228],[-74.006725,41.915922],[-74.00679100000001,41.915876],[-74.007041,41.915672],[-74.00714499999999,41.915541],[-74.00715700000001,41.915512],[-74.007305,41.915166],[-74.007402,41.91502],[-74.007819,41.914654],[-74.008044,41.914481],[-74.008444,41.91507],[-74.008703,41.91537],[-74.00896299999999,41.915659],[-74.009007,41.915734],[-74.009148,41.916125],[-74.009231,41.916288],[-74.009332,41.916416],[-74.00954900000001,41.916594],[-74.009618,41.916679],[-74.009714,41.916924],[-74.009756,41.917129],[-74.00975200000001,41.917337],[-74.009699,41.917459],[-74.009607,41.917592],[-74.009325,41.917903],[-74.00922300000001,41.918027],[-74.009131,41.918174],[-74.009064,41.918309],[-74.009001,41.918467],[-74.008849,41.918954],[-74.00881,41.919127],[-74.008779,41.919396],[-74.00881,41.919647],[-74.00885700000001,41.91997],[-74.00883399999999,41.920726],[-74.00885599999999,41.921152],[-74.008878,41.921341],[-74.008892,41.92162],[-74.00887299999999,41.921805],[-74.008809,41.922086],[-74.008422,41.923482],[-74.008404,41.923655],[-74.00842900000001,41.923765],[-74.008492,41.923862],[-74.008678,41.924048],[-74.00885599999999,41.924198],[-74.009283,41.924602],[-74.00972400000001,41.925042],[-74.009765,41.925082],[-74.00997599999999,41.924797],[-74.010374,41.923903],[-74.010491,41.923441],[-74.010847,41.921851],[-74.010836,41.921987],[-74.01087200000001,41.922149],[-74.01091099999999,41.922209],[-74.011286,41.922579],[-74.01169899999999,41.923021],[-74.01174899999999,41.923063],[-74.01203700000001,41.923402],[-74.012344,41.923843],[-74.012697,41.924399],[-74.01288599999999,41.924413],[-74.012742,41.924469]]],"type":"Polygon"}
}