{
  "id": "361031803001",
  "type": "Feature",
  "properties": {
    "area_land":14614168,
    "area_water":28999150,
    "geoid":"361031803001",
    "name":"Block Group 1",
    "state":"ny"
},
  "bbox": [
    -72.395651,
    41.023876,
    -72.264069,
    41.115323
],
  "geometry": {"coordinates":[[[-72.395651,41.075906],[-72.372423,41.076055],[-72.359955,41.088216],[-72.359759,41.088379],[-72.348561,41.097734],[-72.344961,41.101194],[-72.342102,41.103943],[-72.339527,41.106419],[-72.338791,41.107315],[-72.33805099999999,41.10825],[-72.337377,41.109059],[-72.33564200000001,41.111616],[-72.332711,41.115323],[-72.311302,41.106756],[-72.31022299999999,41.106331],[-72.30198900000001,41.103086],[-72.26406900000001,41.08813],[-72.26406900000001,41.08573],[-72.264117,41.083922],[-72.26416500000001,41.082498],[-72.264197,41.080402],[-72.264261,41.078162],[-72.264325,41.076802],[-72.264325,41.075906],[-72.26438899999999,41.07373],[-72.264341,41.071554],[-72.264325,41.069378],[-72.26438899999999,41.066978],[-72.264415,41.066575],[-72.282085,41.068818],[-72.284931,41.0692],[-72.304022,41.071763],[-72.30871,41.074723],[-72.319833,41.084358],[-72.323639,41.084369],[-72.323829,41.084354],[-72.32405900000001,41.084369],[-72.324265,41.084419],[-72.324455,41.084434],[-72.324868,41.084369],[-72.325096,41.084354],[-72.325355,41.08443],[-72.32614599999999,41.083409],[-72.326505,41.082906],[-72.327032,41.082231],[-72.327122,41.082104],[-72.327477,41.081531],[-72.328198,41.080337],[-72.328338,41.080154],[-72.328711,41.07957],[-72.328812,41.079411],[-72.329724,41.078332],[-72.329773,41.07827],[-72.329793,41.078221],[-72.33022099999999,41.077497],[-72.330462,41.077195],[-72.330811,41.076799],[-72.331166,41.07642],[-72.331565,41.075977],[-72.33209100000001,41.075425],[-72.3322,41.075372],[-72.33315899999999,41.075416],[-72.333679,41.075442],[-72.334581,41.075494],[-72.335306,41.075473],[-72.335403,41.075469],[-72.336456,41.075429],[-72.336693,41.075419],[-72.337205,41.075398],[-72.338431,41.075346],[-72.339636,41.075295],[-72.34191,41.075159],[-72.34269,41.075123],[-72.343946,41.075029],[-72.344303,41.075043],[-72.34456,41.075127],[-72.344826,41.075233],[-72.345288,41.07559],[-72.345488,41.075736],[-72.34585199999999,41.076013],[-72.346187,41.076084],[-72.346373,41.076116],[-72.34783299999999,41.076397],[-72.34802000000001,41.076434],[-72.348224,41.076501],[-72.348575,41.076428],[-72.34902599999999,41.076335],[-72.350172,41.076069],[-72.35169399999999,41.075706],[-72.35243199999999,41.075533],[-72.354125,41.075123],[-72.354428,41.075064],[-72.355856,41.07486],[-72.35579,41.074777],[-72.355546,41.074266],[-72.355262,41.07372],[-72.355006,41.073299],[-72.354698,41.072849],[-72.354484,41.072557],[-72.354315,41.072358],[-72.35417,41.072208],[-72.35408700000001,41.072109],[-72.35402999999999,41.072025],[-72.353961,41.071902],[-72.353934,41.071829],[-72.35337800000001,41.070321],[-72.353005,41.069354],[-72.352902,41.069092],[-72.352268,41.067395],[-72.351845,41.066252],[-72.351161,41.064481],[-72.35058600000001,41.063002],[-72.350342,41.062373],[-72.35020900000001,41.062003],[-72.34985,41.061035],[-72.34951100000001,41.060148],[-72.349442,41.059967],[-72.349198,41.059321],[-72.348686,41.057957],[-72.34831800000001,41.056999],[-72.34821100000001,41.056726],[-72.347894,41.055899],[-72.34784000000001,41.055752],[-72.347515,41.05489],[-72.346953,41.053422],[-72.34663999999999,41.052584],[-72.346301,41.051677],[-72.34631400000001,41.051396],[-72.34493399999999,41.052177],[-72.34401,41.052437],[-72.343842,41.052158],[-72.343881,41.051621],[-72.34144499999999,41.050923],[-72.34007200000001,41.050549],[-72.339479,41.050609],[-72.339096,41.051204],[-72.338645,41.05117],[-72.338746,41.050819],[-72.338005,41.050018],[-72.336947,41.049745],[-72.333428,41.048837],[-72.331253,41.047619],[-72.32976499999999,41.046021],[-72.329735,41.045826],[-72.329399,41.044163],[-72.32751500000001,41.043346],[-72.326999,41.043437],[-72.32579800000001,41.043652],[-72.32352400000001,41.043518],[-72.322678,41.043381],[-72.321259,41.043301],[-72.320502,41.043426],[-72.318665,41.043426],[-72.31811500000001,41.043716],[-72.317801,41.044353],[-72.317046,41.044434],[-72.315935,41.041911],[-72.318118,41.041219],[-72.32263,41.039907],[-72.32549400000001,41.039059],[-72.325802,41.038969],[-72.328294,41.038243],[-72.330983,41.037331],[-72.333133,41.036186],[-72.34353299999999,41.032733],[-72.370197,41.023876],[-72.374166,41.033176],[-72.376581,41.038832],[-72.385396,41.055976],[-72.393878,41.072461],[-72.395651,41.075906]]],"type":"Polygon"}
}