{
  "id": "360594106006",
  "type": "Feature",
  "properties": {
    "area_land":239359,
    "area_water":0,
    "geoid":"360594106006",
    "name":"Block Group 6",
    "state":"ny"
},
  "bbox": [
    -73.697626,
    40.668333,
    -73.688834,
    40.673459
],
  "geometry": {"coordinates":[[[-73.697626,40.672285],[-73.697378,40.672979],[-73.69600699999999,40.673027],[-73.695868,40.673042],[-73.69573099999999,40.673014],[-73.69424600000001,40.6726],[-73.692707,40.672171],[-73.69239899999999,40.672816],[-73.69219,40.673259],[-73.692083,40.673459],[-73.690575,40.673039],[-73.689042,40.672613],[-73.68927499999999,40.672121],[-73.689333,40.672025],[-73.689351,40.67197],[-73.68965799999999,40.671326],[-73.689967,40.670679],[-73.69027699999999,40.670036],[-73.690585,40.669391],[-73.688834,40.668904],[-73.689408,40.668333],[-73.69089200000001,40.668747],[-73.692418,40.66917],[-73.69394200000001,40.669593],[-73.695482,40.670021],[-73.696425,40.670283],[-73.69632300000001,40.670438],[-73.69623900000001,40.670591],[-73.69617700000001,40.670778],[-73.696152,40.670965],[-73.69682400000001,40.670938],[-73.696935,40.671312],[-73.697577,40.671315],[-73.697586,40.671596],[-73.697626,40.672285]]],"type":"Polygon"}
}