{
  "id": "360710127002",
  "type": "Feature",
  "properties": {
    "area_land":749103,
    "area_water":24837,
    "geoid":"360710127002",
    "name":"Block Group 2",
    "state":"ny"
},
  "bbox": [
    -74.034321,
    41.482371,
    -74.021222,
    41.492798
],
  "geometry": {"coordinates":[[[-74.03432100000001,41.488817],[-74.034297,41.489114],[-74.03424099999999,41.489413],[-74.034184,41.489633],[-74.033978,41.490112],[-74.03384699999999,41.490367],[-74.033599,41.490727],[-74.033428,41.490921],[-74.033115,41.491254],[-74.033023,41.491339],[-74.032597,41.491671],[-74.032264,41.491882],[-74.03193400000001,41.49206],[-74.03139400000001,41.492294],[-74.030978,41.492435],[-74.030643,41.492533],[-74.03010399999999,41.492668],[-74.02971100000001,41.492744],[-74.029332,41.492798],[-74.02925399999999,41.492698],[-74.029072,41.492578],[-74.028963,41.492527],[-74.028824,41.492498],[-74.028682,41.492505],[-74.028583,41.492523],[-74.028434,41.492578],[-74.028294,41.492609],[-74.028126,41.492643],[-74.027824,41.492636],[-74.026816,41.492438],[-74.026622,41.4923],[-74.026501,41.492185],[-74.02638,41.492135],[-74.025982,41.492114],[-74.02583300000001,41.492083],[-74.025706,41.492035],[-74.025588,41.49194],[-74.025496,41.491845],[-74.0254,41.491709],[-74.02531399999999,41.491618],[-74.025222,41.49159],[-74.02504399999999,41.491552],[-74.024942,41.491561],[-74.02483100000001,41.491602],[-74.024739,41.491652],[-74.02452599999999,41.491797],[-74.024382,41.491866],[-74.02423899999999,41.491911],[-74.02395300000001,41.491945],[-74.023775,41.491952],[-74.02352999999999,41.49194],[-74.02331,41.491911],[-74.023107,41.491866],[-74.022897,41.491807],[-74.022732,41.491728],[-74.022147,41.49132],[-74.02201700000001,41.491278],[-74.021953,41.491275],[-74.021874,41.491273],[-74.021705,41.490989],[-74.021466,41.490648],[-74.02122199999999,41.490344],[-74.021266,41.490324],[-74.021333,41.490317],[-74.02149,41.490321],[-74.02161,41.49003],[-74.021609,41.489753],[-74.021621,41.489653],[-74.021674,41.48947],[-74.021844,41.489041],[-74.02189300000001,41.488952],[-74.02197,41.488971],[-74.02264099999999,41.488232],[-74.022983,41.487865],[-74.02376700000001,41.487006],[-74.024215,41.48653],[-74.024342,41.486397],[-74.024721,41.485964],[-74.025001,41.485593],[-74.025261,41.485262],[-74.02537700000001,41.485135],[-74.02557299999999,41.484973],[-74.025705,41.484893],[-74.02617100000001,41.484674],[-74.02634999999999,41.484574],[-74.02650800000001,41.484467],[-74.02661000000001,41.484375],[-74.02679999999999,41.484139],[-74.026993,41.4839],[-74.027351,41.483428],[-74.0277,41.482945],[-74.028012,41.482483],[-74.028091,41.482371],[-74.028362,41.482496],[-74.029101,41.482806],[-74.030569,41.483376],[-74.030985,41.483552],[-74.03219199999999,41.484066],[-74.032257,41.484105],[-74.032297,41.484148],[-74.032326,41.484198],[-74.03234,41.48426],[-74.032346,41.484371],[-74.032293,41.484848],[-74.03216500000001,41.485696],[-74.031953,41.486744],[-74.031924,41.48694],[-74.031937,41.48707],[-74.031994,41.48721],[-74.03209,41.487334],[-74.032152,41.487387],[-74.032355,41.487536],[-74.03251299999999,41.487623],[-74.032619,41.487679],[-74.033016,41.487841],[-74.033677,41.488075],[-74.034075,41.488249],[-74.03419599999999,41.488309],[-74.03424699999999,41.488334],[-74.034301,41.48836],[-74.03432100000001,41.488817]]],"type":"Polygon"}
}