{
  "id": "360690522001",
  "type": "Feature",
  "properties": {
    "area_land":43608329,
    "area_water":0,
    "geoid":"360690522001",
    "name":"Block Group 1",
    "state":"ny"
},
  "bbox": [
    -77.487348,
    42.610356,
    -77.366843,
    42.670296
],
  "geometry": {"coordinates":[[[-77.487335,42.663531],[-77.487298,42.663957],[-77.487286,42.6641],[-77.487264,42.664405],[-77.48719800000001,42.66532],[-77.487177,42.665626],[-77.48716400000001,42.665707],[-77.487127,42.665953],[-77.487115,42.666035],[-77.487116,42.666075],[-77.487084,42.666626],[-77.486982,42.668401],[-77.486949,42.668993],[-77.48693400000001,42.66925],[-77.48688900000001,42.670021],[-77.486875,42.670279],[-77.486698,42.670282],[-77.48617,42.670292],[-77.48599400000001,42.670296],[-77.484433,42.67029],[-77.479753,42.670273],[-77.47869900000001,42.67027],[-77.478193,42.670262],[-77.47792200000001,42.670258],[-77.47711,42.670246],[-77.47684,42.670243],[-77.476072,42.670218],[-77.475188,42.67019],[-77.47376800000001,42.670153],[-77.473001,42.670134],[-77.47162299999999,42.67012],[-77.46749,42.670078],[-77.46611300000001,42.670065],[-77.46262,42.670104],[-77.45214199999999,42.670223],[-77.44865,42.670264],[-77.448622,42.66867],[-77.44860799999999,42.667802],[-77.44469700000001,42.667797],[-77.44310400000001,42.667795],[-77.44309199999999,42.66776],[-77.443056,42.667656],[-77.443044,42.667622],[-77.442902,42.667633],[-77.44248,42.667666],[-77.442339,42.667678],[-77.43758200000001,42.667634],[-77.423312,42.667503],[-77.418556,42.66746],[-77.41784,42.667434],[-77.41648600000001,42.667391],[-77.41527600000001,42.6674],[-77.41398599999999,42.667396],[-77.413166,42.667406],[-77.412831,42.667398],[-77.412668,42.667375],[-77.41251800000001,42.667336],[-77.41241599999999,42.66731],[-77.412115,42.667191],[-77.41156100000001,42.666898],[-77.41103200000001,42.666586],[-77.410951,42.666547],[-77.41081200000001,42.666505],[-77.41066600000001,42.666474],[-77.410524,42.666455],[-77.410366,42.666451],[-77.410173,42.666474],[-77.40994999999999,42.66652],[-77.409592,42.666639],[-77.409255,42.666849],[-77.40870099999999,42.667253],[-77.408528,42.667334],[-77.408316,42.66738],[-77.408103,42.667402],[-77.407788,42.667411],[-77.40625,42.667458],[-77.404999,42.667462],[-77.40392199999999,42.667478],[-77.403244,42.667499],[-77.40240900000001,42.667499],[-77.40177,42.667479],[-77.39970700000001,42.667496],[-77.397809,42.667543],[-77.396759,42.667547],[-77.39391000000001,42.667606],[-77.392269,42.66762],[-77.390877,42.667633],[-77.38950699999999,42.667658],[-77.388538,42.667664],[-77.387097,42.667712],[-77.38420600000001,42.667691],[-77.375533,42.667629],[-77.374748,42.667624],[-77.372646,42.667736],[-77.371538,42.667762],[-77.36821399999999,42.66784],[-77.36710600000001,42.667866],[-77.367102,42.66741],[-77.367091,42.666042],[-77.367088,42.665586],[-77.367075,42.664123],[-77.36703900000001,42.659736],[-77.36702699999999,42.658274],[-77.36702,42.657633],[-77.367002,42.65571],[-77.366996,42.65507],[-77.366985,42.653656],[-77.366969,42.651507],[-77.366953,42.649416],[-77.36694300000001,42.648003],[-77.366936,42.647245],[-77.36693,42.646545],[-77.366924,42.645615],[-77.366894,42.642171],[-77.366893,42.641977],[-77.366884,42.640714],[-77.366879,42.64016],[-77.366876,42.639784],[-77.366874,42.639505],[-77.36685199999999,42.637242],[-77.36685,42.636994],[-77.366846,42.636064],[-77.366844,42.636013],[-77.366843,42.635865],[-77.366844,42.635817],[-77.366935,42.635752],[-77.36709399999999,42.635641],[-77.367189,42.63556],[-77.36727,42.635492],[-77.367305,42.635463],[-77.36741000000001,42.635376],[-77.367445,42.635347],[-77.368381,42.63452],[-77.369153,42.633853],[-77.369823,42.633251],[-77.370378,42.632755],[-77.370706,42.632452],[-77.371477,42.631787],[-77.372981,42.630578],[-77.374511,42.629376],[-77.37473799999999,42.629172],[-77.375291,42.628641],[-77.37573399999999,42.628145],[-77.37609,42.627763],[-77.37634,42.627532],[-77.37697900000001,42.627007],[-77.377562,42.626529],[-77.377816,42.626349],[-77.378055,42.626202],[-77.37830099999999,42.626087],[-77.37858799999999,42.625999],[-77.378753,42.625968],[-77.378942,42.625945],[-77.37926899999999,42.625929],[-77.379836,42.625935],[-77.38186399999999,42.625958],[-77.382193,42.625962],[-77.38249500000001,42.625966],[-77.383911,42.62597],[-77.38639499999999,42.625995],[-77.387951,42.626012],[-77.38997999999999,42.626034],[-77.390006,42.626034],[-77.390084,42.626034],[-77.390111,42.626034],[-77.390147,42.626034],[-77.39025599999999,42.626034],[-77.390293,42.626035],[-77.39031199999999,42.626035],[-77.39037,42.626035],[-77.39039,42.626035],[-77.391316,42.626019],[-77.392493,42.625999],[-77.393378,42.625989],[-77.394097,42.625972],[-77.39435899999999,42.625966],[-77.394848,42.625967],[-77.395022,42.625995],[-77.39527699999999,42.626072],[-77.39570399999999,42.626202],[-77.395742,42.626199],[-77.395782,42.626184],[-77.39595300000001,42.626032],[-77.39597999999999,42.625996],[-77.396146,42.625787],[-77.396749,42.625817],[-77.396981,42.625829],[-77.397199,42.625861],[-77.397666,42.625983],[-77.39785000000001,42.626049],[-77.398004,42.626128],[-77.39808499999999,42.626182],[-77.39823699999999,42.62633],[-77.39836,42.626486],[-77.398405,42.626544],[-77.39855,42.626697],[-77.398685,42.626777],[-77.398844,42.626816],[-77.398979,42.626823],[-77.39904,42.626818],[-77.399079,42.626816],[-77.399299,42.626768],[-77.399489,42.626727],[-77.39961700000001,42.62669],[-77.399807,42.626637],[-77.399895,42.626609],[-77.40016199999999,42.626524],[-77.400251,42.626497],[-77.40045499999999,42.62631],[-77.400542,42.62624],[-77.400848,42.625998],[-77.40121000000001,42.625625],[-77.401392,42.625444],[-77.40167,42.625172],[-77.402332,42.624527],[-77.40257699999999,42.624305],[-77.40275800000001,42.624124],[-77.40296600000001,42.623847],[-77.403158,42.623656],[-77.404527,42.622497],[-77.406007,42.621288],[-77.406206,42.621125],[-77.406969,42.620534],[-77.407208,42.620311],[-77.407281,42.620221],[-77.407335,42.620071],[-77.407354,42.619411],[-77.407358,42.619307],[-77.407408,42.617275],[-77.405467,42.617271],[-77.404658,42.617258],[-77.40467599999999,42.617088],[-77.404737,42.616892],[-77.404825,42.616618],[-77.404957,42.616204],[-77.405072,42.615815],[-77.405179,42.615455],[-77.405271,42.615138],[-77.40529100000001,42.61507],[-77.40558299999999,42.614198],[-77.405688,42.613885],[-77.40611800000001,42.613956],[-77.40664700000001,42.614045],[-77.407415,42.614132],[-77.407849,42.614182],[-77.407866,42.613733],[-77.407867,42.613597],[-77.407875,42.612938],[-77.407864,42.612857],[-77.407842,42.612824],[-77.40778299999999,42.612774],[-77.40703600000001,42.612277],[-77.40655,42.611954],[-77.40638199999999,42.611844],[-77.405879,42.611514],[-77.40571199999999,42.611405],[-77.406217,42.610891],[-77.40640500000001,42.610711],[-77.40678200000001,42.610356],[-77.406863,42.610396],[-77.40695599999999,42.610416],[-77.408038,42.610466],[-77.408385,42.610479],[-77.40875800000001,42.610518],[-77.409279,42.610628],[-77.409425,42.610667],[-77.409553,42.610702],[-77.41010900000001,42.610855],[-77.410348,42.610939],[-77.410732,42.611136],[-77.41122300000001,42.611466],[-77.412013,42.612005],[-77.41210700000001,42.612071],[-77.4123,42.612206],[-77.41239,42.612268],[-77.412485,42.612334],[-77.413955,42.613354],[-77.414332,42.613627],[-77.41441500000001,42.61368],[-77.41478600000001,42.613918],[-77.415114,42.614096],[-77.415385,42.614222],[-77.415814,42.614397],[-77.416292,42.614561],[-77.416574,42.614644],[-77.418378,42.615076],[-77.419144,42.615275],[-77.419867,42.615501],[-77.42085,42.615846],[-77.421074,42.615931],[-77.421803,42.616208],[-77.422178,42.616363],[-77.42318899999999,42.616827],[-77.42324000000001,42.616851],[-77.42339699999999,42.616925],[-77.42386999999999,42.61715],[-77.42402800000001,42.617225],[-77.42465300000001,42.617526],[-77.42590800000001,42.61813],[-77.42653799999999,42.618411],[-77.426626,42.618451],[-77.427065,42.618625],[-77.427184,42.618665],[-77.42723599999999,42.618682],[-77.427392,42.618736],[-77.42744500000001,42.618754],[-77.42784899999999,42.618882],[-77.42810900000001,42.618952],[-77.42832799999999,42.619012],[-77.430132,42.61944],[-77.430807,42.619601],[-77.430998,42.619652],[-77.43141300000001,42.619765],[-77.43156999999999,42.619817],[-77.431759,42.619881],[-77.432348,42.620093],[-77.432665,42.620221],[-77.433014,42.620362],[-77.43346699999999,42.620533],[-77.433757,42.620633],[-77.434281,42.620783],[-77.434506,42.620837],[-77.43482899999999,42.620897],[-77.43545399999999,42.620981],[-77.436419,42.621068],[-77.436888,42.621105],[-77.43750300000001,42.621154],[-77.43829599999999,42.621208],[-77.438497,42.621222],[-77.438766,42.621238],[-77.43891499999999,42.621247],[-77.439365,42.621274],[-77.439515,42.621284],[-77.44002999999999,42.621311],[-77.441576,42.621393],[-77.442092,42.621421],[-77.44308599999999,42.621485],[-77.44319900000001,42.6215],[-77.443502,42.621541],[-77.443867,42.621622],[-77.44426900000001,42.621755],[-77.444553,42.621876],[-77.444841,42.622028],[-77.44516,42.622228],[-77.44614900000001,42.62294],[-77.447051,42.623589],[-77.447777,42.624115],[-77.449956,42.625694],[-77.450683,42.626221],[-77.451502,42.626802],[-77.452124,42.627256],[-77.452133,42.627263],[-77.45578399999999,42.629897],[-77.45614500000001,42.63019],[-77.456238,42.630266],[-77.45643200000001,42.630456],[-77.456712,42.63073],[-77.457679,42.631736],[-77.458349,42.632451],[-77.45868,42.632786],[-77.459328,42.633473],[-77.459396,42.633542],[-77.459698,42.63385],[-77.460027,42.63421],[-77.461522,42.635766],[-77.464147,42.638315],[-77.46467800000001,42.638836],[-77.464837,42.638992],[-77.46509500000001,42.639226],[-77.46587,42.639993],[-77.46647,42.64057],[-77.46680499999999,42.640896],[-77.46740200000001,42.641477],[-77.467799,42.641886],[-77.467912,42.642002],[-77.468114,42.642233],[-77.468756,42.64293],[-77.469143,42.64335],[-77.469736,42.643927],[-77.470234,42.644367],[-77.470839,42.644859],[-77.471592,42.645444],[-77.47196700000001,42.645727],[-77.472481,42.646115],[-77.47308700000001,42.646586],[-77.47345900000001,42.646875],[-77.473491,42.6469],[-77.4735,42.646907],[-77.47382899999999,42.64716],[-77.474816,42.647922],[-77.475146,42.648176],[-77.475477,42.64844],[-77.475701,42.648643],[-77.475714,42.648655],[-77.47586800000001,42.648809],[-77.47623,42.649242],[-77.47657599999999,42.649754],[-77.47692000000001,42.650432],[-77.477135,42.650853],[-77.477262,42.651073],[-77.477351,42.651202],[-77.47749,42.651403],[-77.47763399999999,42.651577],[-77.477735,42.651698],[-77.47794,42.65193],[-77.478094,42.652089],[-77.478129,42.652126],[-77.478808,42.652716],[-77.479315,42.653115],[-77.479499,42.65326],[-77.479741,42.653434],[-77.480176,42.653752],[-77.48035900000001,42.653877],[-77.481397,42.65459],[-77.482039,42.655044],[-77.482214,42.655207],[-77.48253800000001,42.655507],[-77.482758,42.65574],[-77.483144,42.656216],[-77.483311,42.656422],[-77.484089,42.657366],[-77.484309,42.657638],[-77.484696,42.658115],[-77.48502499999999,42.658511],[-77.485266,42.6588],[-77.485477,42.659077],[-77.485703,42.659408],[-77.485906,42.659766],[-77.48591,42.659776],[-77.486107,42.660253],[-77.486355,42.66088],[-77.487099,42.662761],[-77.487348,42.663389],[-77.487335,42.663531]]],"type":"Polygon"}
}