{
  "id": "360850207004",
  "type": "Feature",
  "properties": {
    "area_land":273891,
    "area_water":0,
    "geoid":"360850207004",
    "name":"Block Group 4",
    "state":"ny"
},
  "bbox": [
    -74.134092,
    40.634334,
    -74.126888,
    40.641489
],
  "geometry": {"coordinates":[[[-74.13365400000001,40.6376],[-74.133503,40.637798],[-74.1332,40.638213],[-74.13269,40.638879],[-74.132605,40.638985],[-74.13217400000001,40.639543],[-74.131563,40.640356],[-74.131157,40.640925],[-74.130819,40.6412],[-74.129846,40.641489],[-74.12925,40.641272],[-74.128578,40.641285],[-74.12786,40.640717],[-74.127815,40.63991],[-74.127466,40.639878],[-74.127469,40.640159],[-74.12696200000001,40.640181],[-74.127015,40.639319],[-74.127032,40.638377],[-74.126959,40.637827],[-74.126915,40.637429],[-74.12688799999999,40.63721],[-74.127847,40.637277],[-74.12867,40.637348],[-74.128725,40.637088],[-74.12884699999999,40.636436],[-74.128856,40.635574],[-74.129001,40.634334],[-74.13018099999999,40.634487],[-74.13086800000001,40.634727],[-74.130686,40.635509],[-74.131907,40.636039],[-74.132997,40.63651],[-74.134092,40.636984],[-74.13365400000001,40.6376]]],"type":"Polygon"}
}