{
  "id": "360670032001",
  "type": "Feature",
  "properties": {
    "area_land":745526,
    "area_water":0,
    "geoid":"360670032001",
    "name":"Block Group 1",
    "state":"ny"
},
  "bbox": [
    -76.158162,
    43.042381,
    -76.14872,
    43.054407
],
  "geometry": {"coordinates":[[[-76.15812699999999,43.052228],[-76.158086,43.052328],[-76.15803,43.052425],[-76.157934,43.052543],[-76.157827,43.052629],[-76.157478,43.053003],[-76.156713,43.053591],[-76.15657400000001,43.053751],[-76.15648899999999,43.053852],[-76.156441,43.053946],[-76.15643300000001,43.054096],[-76.156443,43.054228],[-76.156448,43.054311],[-76.15647199999999,43.054407],[-76.155753,43.054354],[-76.154816,43.054291],[-76.154354,43.054253],[-76.153671,43.054175],[-76.15344899999999,43.054138],[-76.152798,43.054011],[-76.152359,43.053893],[-76.152175,43.053835],[-76.15213,43.053819],[-76.15205899999999,43.053795],[-76.151824,43.053711],[-76.15145099999999,43.053548],[-76.151203,43.053419],[-76.15088299999999,43.053247],[-76.149992,43.052757],[-76.150424,43.052537],[-76.15054499999999,43.052475],[-76.150488,43.052422],[-76.150227,43.052232],[-76.15006,43.052123],[-76.149794,43.051977],[-76.149522,43.05185],[-76.149708,43.051758],[-76.149852,43.051688],[-76.150083,43.051575],[-76.14952,43.051033],[-76.14942600000001,43.050961],[-76.149325,43.050894],[-76.149311,43.050611],[-76.149317,43.050486],[-76.149305,43.049529],[-76.149278,43.048651],[-76.14928999999999,43.048156],[-76.14926699999999,43.047298],[-76.14927299999999,43.047027],[-76.14872,43.047019],[-76.14877300000001,43.046943],[-76.14879000000001,43.046897],[-76.14880599999999,43.046628],[-76.148798,43.045989],[-76.148816,43.045478],[-76.148842,43.044725],[-76.148843,43.044274],[-76.14884499999999,43.043465],[-76.148867,43.042751],[-76.15015200000001,43.042762],[-76.150873,43.042768],[-76.15129899999999,43.042772],[-76.15154,43.042766],[-76.151622,43.04276],[-76.152793,43.042506],[-76.15303900000001,43.042454],[-76.153262,43.042409],[-76.153547,43.042381],[-76.153755,43.042382],[-76.153879,43.042387],[-76.154174,43.042474],[-76.153935,43.042767],[-76.153902,43.042839],[-76.153875,43.042969],[-76.153869,43.043171],[-76.153871,43.043255],[-76.153891,43.043516],[-76.15392,43.04365],[-76.15396200000001,43.043841],[-76.154027,43.043979],[-76.154185,43.044194],[-76.154318,43.044354],[-76.154532,43.04461],[-76.154668,43.044727],[-76.15494200000001,43.044904],[-76.155142,43.045004],[-76.155581,43.045165],[-76.15608899999999,43.045347],[-76.156453,43.045479],[-76.156645,43.045575],[-76.15698,43.045875],[-76.157022,43.045924],[-76.157073,43.045983],[-76.15711899999999,43.046067],[-76.15715299999999,43.046202],[-76.15717100000001,43.0467],[-76.15715899999999,43.046816],[-76.157078,43.046954],[-76.156938,43.047146],[-76.156795,43.047248],[-76.156772,43.047364],[-76.156791,43.047667],[-76.15683799999999,43.047848],[-76.15690499999999,43.047992],[-76.157051,43.048308],[-76.157121,43.048485],[-76.15717100000001,43.048726],[-76.157252,43.04915],[-76.157355,43.049555],[-76.157465,43.049984],[-76.15751299999999,43.050169],[-76.15757499999999,43.050211],[-76.15762700000001,43.050254],[-76.15767,43.050704],[-76.15767200000001,43.050724],[-76.157808,43.051],[-76.158162,43.051879],[-76.15812699999999,43.052228]]],"type":"Polygon"}
}