{
  "id": "360470064002",
  "type": "Feature",
  "properties": {
    "area_land":60803,
    "area_water":0,
    "geoid":"360470064002",
    "name":"Block Group 2",
    "state":"ny"
},
  "bbox": [
    -74.031957,
    40.627833,
    -74.025958,
    40.629931
],
  "geometry": {"coordinates":[[[-74.03165799999999,40.629199],[-74.03136000000001,40.629931],[-74.028678,40.629294],[-74.025958,40.628648],[-74.026263,40.62792],[-74.028976,40.628564],[-74.029275,40.627833],[-74.03195700000001,40.628471],[-74.03165799999999,40.629199]]],"type":"Polygon"}
}