{
  "id": "360510308005",
  "type": "Feature",
  "properties": {
    "area_land":83226258,
    "area_water":275159,
    "geoid":"360510308005",
    "name":"Block Group 5",
    "state":"ny"
},
  "bbox": [
    -78.015381,
    42.609449,
    -77.840973,
    42.734016
],
  "geometry": {"coordinates":[[[-78.015381,42.609449],[-78.01478400000001,42.610811],[-78.013733,42.612051],[-78.013329,42.61215],[-78.01257699999999,42.612336],[-78.01054499999999,42.612206],[-78.00959899999999,42.611922],[-78.00865400000001,42.611431],[-78.007487,42.610321],[-78.006596,42.610111],[-78.005531,42.610264],[-78.005281,42.610328],[-78.003259,42.610708],[-78.00296,42.610858],[-78.001718,42.611483],[-77.99972699999999,42.612663],[-77.99972699999999,42.612681],[-77.99972699999999,42.612738],[-77.99972699999999,42.612757],[-77.999152,42.612963],[-77.99835400000001,42.614006],[-77.99834799999999,42.614015],[-77.997545,42.615524],[-77.997477,42.615588],[-77.99720499999999,42.615844],[-77.996804,42.615986],[-77.996494,42.616096],[-77.995751,42.616051],[-77.994389,42.6158],[-77.993786,42.61544],[-77.99293400000001,42.614932],[-77.99206700000001,42.61459],[-77.99098600000001,42.614651],[-77.99039999999999,42.61486],[-77.990047,42.615187],[-77.989125,42.616046],[-77.98801899999999,42.617539],[-77.98730999999999,42.619367],[-77.98724799999999,42.620098],[-77.98734899999999,42.620836],[-77.987374,42.621013],[-77.987747,42.622109],[-77.988181,42.62284],[-77.98821,42.622963],[-77.9883,42.623335],[-77.988328,42.623453],[-77.98864,42.624217],[-77.98890400000001,42.625263],[-77.989131,42.625625],[-77.98889,42.626214],[-77.988829,42.626365],[-77.988411,42.627125],[-77.987965,42.627941],[-77.98754,42.628493],[-77.987223,42.628746],[-77.986597,42.629219],[-77.985536,42.629963],[-77.98423099999999,42.630062],[-77.98342599999999,42.630187],[-77.98266099999999,42.630367],[-77.981987,42.630645],[-77.981657,42.630861],[-77.98137699999999,42.63113],[-77.981194,42.631444],[-77.981072,42.631758],[-77.981047,42.632171],[-77.98110800000001,42.632449],[-77.981279,42.632746],[-77.981523,42.633024],[-77.981926,42.633311],[-77.982438,42.633528],[-77.98285300000001,42.63376],[-77.983121,42.633966],[-77.983389,42.634289],[-77.98352300000001,42.634621],[-77.983547,42.634863],[-77.98352300000001,42.635222],[-77.98337600000001,42.635617],[-77.98314499999999,42.636021],[-77.982681,42.636469],[-77.982242,42.636756],[-77.981717,42.637026],[-77.981205,42.637205],[-77.98059499999999,42.637385],[-77.980034,42.637492],[-77.979546,42.637528],[-77.978948,42.637537],[-77.977715,42.637501],[-77.977386,42.637519],[-77.977069,42.637582],[-77.97688599999999,42.637636],[-77.976618,42.637793],[-77.976439,42.638013],[-77.97626,42.638364],[-77.97612599999999,42.638748],[-77.97606500000001,42.639122],[-77.976066,42.639681],[-77.976099,42.640168],[-77.97622699999999,42.640705],[-77.97638600000001,42.641136],[-77.97670100000001,42.641756],[-77.976856,42.642019],[-77.976972,42.642216],[-77.977187,42.642581],[-77.9773,42.642821],[-77.97739799999999,42.643029],[-77.977557,42.643621],[-77.977569,42.64421],[-77.977535,42.644469],[-77.97750000000001,42.644742],[-77.977305,42.645206],[-77.977053,42.645602],[-77.976743,42.645914],[-77.976435,42.646125],[-77.975987,42.646294],[-77.975368,42.646496],[-77.97466900000001,42.646664],[-77.974193,42.646746],[-77.97403799999999,42.646774],[-77.97326099999999,42.646929],[-77.97275399999999,42.64701],[-77.972194,42.647165],[-77.97175799999999,42.647351],[-77.97152800000001,42.647554],[-77.971497,42.647603],[-77.971161,42.648153],[-77.970978,42.648626],[-77.970966,42.648972],[-77.971012,42.649293],[-77.971104,42.649605],[-77.971276,42.649833],[-77.97152800000001,42.650027],[-77.971965,42.650272],[-77.972875,42.650702],[-77.97328400000001,42.650896],[-77.97362800000001,42.651183],[-77.97398099999999,42.651564],[-77.974085,42.651727],[-77.974345,42.652133],[-77.974386,42.652225],[-77.974467,42.652402],[-77.974563,42.652614],[-77.974586,42.652721],[-77.974689,42.653179],[-77.974746,42.653711],[-77.974745,42.653734],[-77.974733,42.654077],[-77.974723,42.65436],[-77.97462,42.654943],[-77.974413,42.655373],[-77.97434699999999,42.655451],[-77.974104,42.655744],[-77.973598,42.656098],[-77.971407,42.65728],[-77.971155,42.657541],[-77.97093700000001,42.657896],[-77.970906,42.657987],[-77.970833,42.658208],[-77.970592,42.659406],[-77.97056499999999,42.659579],[-77.970484,42.660097],[-77.97045799999999,42.660271],[-77.970293,42.660887],[-77.970069,42.661347],[-77.969764,42.661795],[-77.969567,42.662025],[-77.9693,42.662337],[-77.968757,42.662803],[-77.968424,42.663031],[-77.968022,42.663251],[-77.967609,42.663428],[-77.96713800000001,42.663572],[-77.966598,42.663656],[-77.966162,42.663656],[-77.96575799999999,42.66361],[-77.96544900000001,42.663554],[-77.96513299999999,42.663445],[-77.96480699999999,42.663285],[-77.964474,42.663057],[-77.96429500000001,42.662889],[-77.964026,42.662635],[-77.963751,42.662356],[-77.963498,42.662162],[-77.963326,42.662061],[-77.963165,42.661993],[-77.96293799999999,42.66196],[-77.962626,42.661985],[-77.96231,42.662114],[-77.962036,42.662337],[-77.961747,42.662687],[-77.961658,42.662816],[-77.960464,42.664562],[-77.960048,42.665158],[-77.95961,42.665625],[-77.959288,42.665913],[-77.959153,42.666035],[-77.95869,42.666382],[-77.95821599999999,42.66665],[-77.958101,42.666704],[-77.958071,42.666718],[-77.957661,42.666913],[-77.957638,42.666921],[-77.957517,42.666966],[-77.957489,42.666976],[-77.95740600000001,42.667006],[-77.957241,42.667067],[-77.957159,42.667096],[-77.957077,42.667127],[-77.95702799999999,42.667139],[-77.95688,42.667178],[-77.95683200000001,42.667191],[-77.956732,42.667217],[-77.956433,42.667295],[-77.95641000000001,42.667302],[-77.956334,42.667322],[-77.95627,42.667339],[-77.955472,42.667589],[-77.955034,42.66775],[-77.954486,42.668056],[-77.954104,42.668483],[-77.953885,42.668821],[-77.953754,42.669304],[-77.95371,42.669836],[-77.953644,42.671043],[-77.953885,42.673394],[-77.953985,42.674161],[-77.954083,42.674907],[-77.95417,42.676244],[-77.95417,42.676473],[-77.95417,42.676824],[-77.954105,42.677242],[-77.953918,42.677711],[-77.95379800000001,42.678015],[-77.953382,42.678804],[-77.953214,42.679047],[-77.952928,42.679463],[-77.952528,42.680044],[-77.951877,42.680692],[-77.951542,42.681027],[-77.951126,42.681397],[-77.950512,42.681816],[-77.949921,42.682106],[-77.948792,42.682303],[-77.94810099999999,42.683396],[-77.948013,42.683536],[-77.94723399999999,42.684769],[-77.947176,42.684779],[-77.94708900000001,42.684827],[-77.946522,42.685398],[-77.946099,42.685979],[-77.945729,42.6867],[-77.945447,42.687122],[-77.945218,42.687351],[-77.944321,42.68809],[-77.94350900000001,42.688911],[-77.942576,42.689644],[-77.941776,42.690332],[-77.941107,42.690842],[-77.940088,42.69162],[-77.939266,42.692143],[-77.93854,42.69245],[-77.937996,42.692728],[-77.93764,42.692861],[-77.93711999999999,42.693026],[-77.936745,42.693157],[-77.936418,42.693194],[-77.936074,42.693219],[-77.935911,42.693251],[-77.935877,42.693263],[-77.925397,42.694331],[-77.92527800000001,42.695625],[-77.925645,42.696615],[-77.925737,42.696665],[-77.925878,42.697066],[-77.926699,42.698423],[-77.92710099999999,42.699299],[-77.927716,42.701086],[-77.927943,42.701652],[-77.92793399999999,42.702626],[-77.927296,42.70355],[-77.926039,42.704284],[-77.92527699999999,42.704483],[-77.923883,42.704701],[-77.92212600000001,42.705322],[-77.920913,42.706499],[-77.92031799999999,42.707168],[-77.91946799999999,42.708662],[-77.919386,42.710583],[-77.91850100000001,42.712888],[-77.91843799999999,42.713614],[-77.917953,42.71391],[-77.917793,42.714034],[-77.917389,42.715614],[-77.917514,42.718428],[-77.91799,42.719955],[-77.91819700000001,42.720285],[-77.918666,42.720655],[-77.919426,42.720942],[-77.922708,42.721388],[-77.924353,42.721743],[-77.92571100000001,42.722275],[-77.926417,42.722878],[-77.92652200000001,42.723092],[-77.926481,42.723841],[-77.925862,42.72485],[-77.925659,42.725023],[-77.92527,42.725295],[-77.92480399999999,42.725566],[-77.924307,42.725729],[-77.9237,42.725908],[-77.922558,42.726063],[-77.921876,42.726034],[-77.921091,42.725902],[-77.920563,42.725762],[-77.920214,42.725598],[-77.919949,42.725467],[-77.91900099999999,42.724963],[-77.917867,42.724287],[-77.91725,42.723852],[-77.91705399999999,42.723656],[-77.917016,42.723545],[-77.91695900000001,42.723528],[-77.91688499999999,42.723562],[-77.916557,42.723751],[-77.916455,42.72382],[-77.916354,42.723891],[-77.916229,42.724053],[-77.91604,42.724437],[-77.915915,42.724867],[-77.91590600000001,42.725297],[-77.916005,42.726424],[-77.91604,42.727051],[-77.91607500000001,42.727128],[-77.916201,42.727262],[-77.916201,42.727304],[-77.916112,42.727378],[-77.91607999999999,42.727443],[-77.91599600000001,42.728393],[-77.915944,42.728672],[-77.915801,42.729142],[-77.915717,42.729536],[-77.91557400000001,42.730057],[-77.915398,42.730359],[-77.91506200000001,42.730845],[-77.91474100000001,42.731261],[-77.91459,42.731396],[-77.91378899999999,42.732307],[-77.913183,42.732754],[-77.912359,42.733259],[-77.911709,42.733519],[-77.911045,42.733736],[-77.91017100000001,42.733849],[-77.91007,42.733863],[-77.90912,42.73394],[-77.908766,42.733999],[-77.90843599999999,42.734016],[-77.908247,42.733999],[-77.90807599999999,42.733922],[-77.90793499999999,42.733804],[-77.907781,42.733775],[-77.907616,42.733769],[-77.90748600000001,42.733734],[-77.90736200000001,42.733675],[-77.907268,42.733521],[-77.907094,42.733038],[-77.90623100000001,42.733248],[-77.906245,42.732979],[-77.906289,42.732174],[-77.90630400000001,42.731906],[-77.90617899999999,42.731911],[-77.905627,42.731973],[-77.90542600000001,42.732013],[-77.904899,42.73212],[-77.904725,42.732133],[-77.904673,42.732124],[-77.904574,42.732085],[-77.904482,42.732034],[-77.904359,42.731939],[-77.904268,42.731817],[-77.904246,42.731761],[-77.904231,42.731641],[-77.904259,42.731516],[-77.904336,42.731375],[-77.904376,42.731333],[-77.904506,42.731228],[-77.90464299999999,42.731163],[-77.90514400000001,42.731003],[-77.90598799999999,42.730734],[-77.905924,42.730566],[-77.90583100000001,42.730323],[-77.90571799999999,42.73007],[-77.905646,42.729907],[-77.90568500000001,42.729892],[-77.90580199999999,42.72985],[-77.90584200000001,42.729836],[-77.90625,42.729682],[-77.906491,42.729571],[-77.90669800000001,42.729477],[-77.906986,42.729324],[-77.90729899999999,42.72913],[-77.907534,42.728954],[-77.90821699999999,42.728383],[-77.908377,42.728251],[-77.908728,42.727903],[-77.909025,42.727596],[-77.909437,42.727139],[-77.90964099999999,42.726883],[-77.909661,42.726859],[-77.91014300000001,42.726206],[-77.91065999999999,42.725335],[-77.910912,42.72484],[-77.91108,42.724434],[-77.91129100000001,42.723813],[-77.91145,42.723233],[-77.911508,42.723027],[-77.91158799999999,42.722661],[-77.911666,42.721885],[-77.9117,42.720997],[-77.91168399999999,42.720656],[-77.91163400000001,42.720226],[-77.911463,42.71932],[-77.911451,42.719256],[-77.91131900000001,42.718753],[-77.911208,42.718412],[-77.910821,42.717444],[-77.910348,42.716492],[-77.909955,42.715812],[-77.909724,42.715448],[-77.90916300000001,42.71463],[-77.908762,42.714113],[-77.908192,42.713444],[-77.90770500000001,42.712903],[-77.907537,42.712737],[-77.90723,42.712432],[-77.90620800000001,42.711567],[-77.90586399999999,42.711329],[-77.905529,42.711122],[-77.904796,42.710699],[-77.90478,42.710691],[-77.904201,42.710427],[-77.903441,42.710137],[-77.902934,42.709977],[-77.902342,42.709841],[-77.901501,42.709649],[-77.90154099999999,42.709535],[-77.901662,42.709196],[-77.901703,42.709084],[-77.90200299999999,42.708199],[-77.902078,42.707987],[-77.902338,42.707261],[-77.902582,42.706517],[-77.903211,42.704701],[-77.90359100000001,42.703607],[-77.903598,42.703584],[-77.903621,42.703519],[-77.903629,42.703497],[-77.903893,42.70273],[-77.903955,42.702553],[-77.904675,42.700428],[-77.90493600000001,42.699661],[-77.90494700000001,42.699625],[-77.904984,42.699519],[-77.904996,42.699484],[-77.90506999999999,42.699276],[-77.906397,42.695468],[-77.906516,42.695127],[-77.906717,42.694515],[-77.907405,42.692554],[-77.908779,42.688526],[-77.90913999999999,42.687503],[-77.90958000000001,42.686329],[-77.91054699999999,42.683505],[-77.91058,42.683413],[-77.910894,42.682556],[-77.91197,42.679394],[-77.912075,42.679082],[-77.912392,42.678147],[-77.912498,42.677836],[-77.912603,42.677535],[-77.912864,42.676793],[-77.91291699999999,42.67663],[-77.913017,42.676328],[-77.913138,42.675958],[-77.91317600000001,42.675844],[-77.91352000000001,42.674856],[-77.91364799999999,42.674489],[-77.915532,42.668936],[-77.91627099999999,42.666735],[-77.916349,42.666505],[-77.916467,42.666156],[-77.91682299999999,42.665112],[-77.91694200000001,42.664764],[-77.917145,42.664174],[-77.91742000000001,42.663381],[-77.917744,42.662402],[-77.91794,42.66181],[-77.916922,42.661812],[-77.915057,42.661816],[-77.913871,42.661825],[-77.91285499999999,42.661834],[-77.912126,42.661835],[-77.909943,42.661839],[-77.909215,42.661841],[-77.908255,42.661843],[-77.907577,42.661845],[-77.905378,42.661858],[-77.904419,42.661864],[-77.9034,42.66187],[-77.902252,42.661877],[-77.90077100000001,42.661903],[-77.900345,42.661904],[-77.899327,42.661909],[-77.89802899999999,42.661914],[-77.895715,42.661924],[-77.894138,42.661934],[-77.892842,42.661944],[-77.89215799999999,42.661948],[-77.890126,42.661962],[-77.890107,42.661961],[-77.88942400000001,42.661956],[-77.88834799999999,42.661963],[-77.88774100000001,42.661968],[-77.88512,42.661968],[-77.884044,42.661968],[-77.88276999999999,42.661968],[-77.87894900000001,42.661972],[-77.87767599999999,42.661974],[-77.877155,42.661978],[-77.876302,42.661985],[-77.875592,42.661979],[-77.875072,42.661975],[-77.872741,42.661972],[-77.871961,42.661971],[-77.86984200000001,42.661947],[-77.869285,42.661951],[-77.86766799999999,42.661934],[-77.865751,42.661942],[-77.86532099999999,42.661945],[-77.863422,42.661924],[-77.863308,42.662507],[-77.863119,42.663483],[-77.86296299999999,42.664257],[-77.862847,42.66484],[-77.862819,42.664975],[-77.862737,42.665383],[-77.862711,42.665519],[-77.862588,42.665518],[-77.86222100000001,42.665516],[-77.862099,42.665516],[-77.857449,42.665501],[-77.855835,42.665497],[-77.854102,42.665501],[-77.852774,42.665494],[-77.84901000000001,42.665501],[-77.84884700000001,42.665515],[-77.848702,42.665547],[-77.84853200000001,42.6656],[-77.848376,42.665664],[-77.848264,42.665724],[-77.84808700000001,42.665851],[-77.847517,42.66634],[-77.847337,42.666456],[-77.847212,42.66652],[-77.846445,42.666814],[-77.845929,42.66703],[-77.845505,42.667245],[-77.845164,42.667444],[-77.844945,42.667603],[-77.84425899999999,42.668153],[-77.844195,42.668205],[-77.843543,42.668747],[-77.843129,42.669115],[-77.84278,42.669462],[-77.842564,42.669713],[-77.84244700000001,42.669876],[-77.842371,42.670003],[-77.842275,42.670219],[-77.84197,42.67103],[-77.841638,42.671857],[-77.841643,42.670643],[-77.841662,42.667001],[-77.841669,42.665788],[-77.841645,42.665721],[-77.841573,42.665521],[-77.84155,42.665455],[-77.841554,42.664699],[-77.841568,42.662433],[-77.841573,42.661678],[-77.84156299999999,42.660387],[-77.841536,42.65681],[-77.841534,42.656514],[-77.841525,42.655224],[-77.841523,42.655051],[-77.84152,42.654532],[-77.84151900000001,42.654359],[-77.841509,42.652521],[-77.84147900000001,42.64701],[-77.841472,42.645546],[-77.841359,42.645191],[-77.84135000000001,42.644448],[-77.841323,42.642221],[-77.84131499999999,42.641479],[-77.841301,42.640457],[-77.841273,42.638347],[-77.841275,42.637392],[-77.841279,42.636371],[-77.841247,42.633607],[-77.841195,42.630273],[-77.841204,42.629522],[-77.84122499999999,42.629174],[-77.841219,42.628902],[-77.841217,42.62878],[-77.84120900000001,42.628376],[-77.841204,42.628065],[-77.84120900000001,42.627916],[-77.841204,42.627782],[-77.841184,42.627573],[-77.841159,42.627353],[-77.84116899999999,42.626983],[-77.84112,42.62569],[-77.841115,42.625531],[-77.841106,42.625058],[-77.841103,42.624888],[-77.841095,42.623517],[-77.84107299999999,42.619017],[-77.841069,42.618894],[-77.841032,42.6176],[-77.84106300000001,42.617434],[-77.841098,42.617366],[-77.841093,42.61727],[-77.84108000000001,42.616984],[-77.841076,42.616889],[-77.84106800000001,42.616602],[-77.84104600000001,42.615742],[-77.84103899999999,42.615456],[-77.840999,42.615247],[-77.84099999999999,42.61494],[-77.84100100000001,42.614702],[-77.840982,42.614453],[-77.840982,42.613381],[-77.84098299999999,42.613217],[-77.84099399999999,42.612862],[-77.84098899999999,42.61237],[-77.840977,42.610894],[-77.84097300000001,42.610402],[-77.843625,42.610396],[-77.85158199999999,42.610379],[-77.854235,42.610374],[-77.857287,42.610367],[-77.866446,42.610349],[-77.869499,42.610343],[-77.869699,42.610342],[-77.870299,42.610342],[-77.87050000000001,42.610342],[-77.870923,42.610348],[-77.87119,42.610352],[-77.872195,42.610353],[-77.872619,42.610354],[-77.87539,42.610351],[-77.876035,42.610351],[-77.87641600000001,42.610361],[-77.879869,42.610333],[-77.880566,42.610345],[-77.882273,42.610327],[-77.88310300000001,42.610333],[-77.883703,42.610331],[-77.885434,42.610326],[-77.88647400000001,42.610342],[-77.888952,42.610333],[-77.893216,42.61032],[-77.894076,42.610329],[-77.895815,42.610319],[-77.89638600000001,42.610317],[-77.898865,42.61031],[-77.899036,42.610308],[-77.899551,42.610305],[-77.89972299999999,42.610305],[-77.900499,42.610315],[-77.900631,42.610317],[-77.90232399999999,42.610323],[-77.90283100000001,42.610315],[-77.903577,42.610305],[-77.90360800000001,42.610304],[-77.904419,42.610313],[-77.90495199999999,42.610319],[-77.906852,42.610347],[-77.907663,42.610359],[-77.90915699999999,42.610378],[-77.913642,42.610437],[-77.913718,42.610438],[-77.915138,42.610456],[-77.91560800000001,42.610462],[-77.917018,42.61048],[-77.917489,42.610487],[-77.918261,42.610485],[-77.920579,42.610482],[-77.921352,42.610482],[-77.922054,42.610479],[-77.923877,42.610476],[-77.930853,42.610465],[-77.93145199999999,42.610457],[-77.933977,42.610426],[-77.93416499999999,42.610424],[-77.934732,42.610421],[-77.934921,42.61042],[-77.93826300000001,42.610406],[-77.94072300000001,42.610397],[-77.94829,42.610294],[-77.951633,42.610249],[-77.952376,42.610241],[-77.954607,42.61022],[-77.95535099999999,42.610214],[-77.958427,42.610202],[-77.958581,42.610202],[-77.96393,42.610154],[-77.967658,42.61012],[-77.970735,42.610093],[-77.97153,42.610084],[-77.972616,42.610065],[-77.97825899999999,42.609971],[-77.979557,42.60995],[-77.980141,42.609937],[-77.980234,42.609925],[-77.980513,42.609891],[-77.98060700000001,42.60988],[-77.98296999999999,42.609844],[-77.986065,42.609797],[-77.990061,42.609759],[-77.992425,42.609737],[-77.999729,42.609681],[-78.003281,42.609622],[-78.014787,42.60946],[-78.015381,42.609449]]],"type":"Polygon"}
}