{
  "id": "360010140023",
  "type": "Feature",
  "properties": {
    "area_land":783742,
    "area_water":0,
    "geoid":"360010140023",
    "name":"Block Group 3",
    "state":"ny"
},
  "bbox": [
    -73.795168,
    42.681853,
    -73.777945,
    42.69677
],
  "geometry": {"coordinates":[[[-73.795168,42.694078],[-73.794044,42.69479],[-73.791883,42.696115],[-73.790826,42.69677],[-73.78992700000001,42.696022],[-73.789637,42.695762],[-73.789097,42.69529],[-73.788697,42.694908],[-73.788377,42.694637],[-73.78753500000001,42.693905],[-73.787009,42.693455],[-73.786694,42.693172],[-73.78595,42.692495],[-73.78341899999999,42.690263],[-73.782489,42.689439],[-73.78179,42.688806],[-73.780635,42.687805],[-73.779763,42.687086],[-73.779229,42.68671],[-73.778758,42.686324],[-73.778597,42.686153],[-73.778097,42.685691],[-73.778018,42.68558],[-73.778006,42.685554],[-73.777978,42.685497],[-73.777945,42.685347],[-73.77795,42.685278],[-73.778006,42.685064],[-73.77818600000001,42.684523],[-73.778419,42.683775],[-73.778621,42.682985],[-73.778858,42.683076],[-73.779117,42.683188],[-73.77926100000001,42.683255],[-73.77983500000001,42.682331],[-73.78009299999999,42.681853],[-73.78173,42.68266],[-73.781789,42.682587],[-73.781893,42.682641],[-73.782313,42.682844],[-73.782569,42.682956],[-73.782646,42.682994],[-73.783129,42.683233],[-73.784127,42.683729],[-73.784031,42.683873],[-73.783698,42.684304],[-73.78364999999999,42.684355],[-73.78321,42.684859],[-73.78318,42.684973],[-73.78308699999999,42.685081],[-73.785017,42.686028],[-73.785714,42.686383],[-73.78601399999999,42.686598],[-73.786676,42.687114],[-73.788973,42.688851],[-73.789911,42.689554],[-73.790606,42.69014],[-73.791011,42.690502],[-73.791859,42.691263],[-73.792407,42.691755],[-73.79273000000001,42.69202],[-73.793357,42.692568],[-73.79414,42.693223],[-73.795168,42.694078]]],"type":"Polygon"}
}