{
  "id": "360210010002",
  "type": "Feature",
  "properties": {
    "area_land":32579039,
    "area_water":180673,
    "geoid":"360210010002",
    "name":"Block Group 2",
    "state":"ny"
},
  "bbox": [
    -73.718251,
    42.163704,
    -73.628988,
    42.253314
],
  "geometry": {"coordinates":[[[-73.718251,42.224754],[-73.717799,42.224814],[-73.717271,42.224903],[-73.716864,42.224971],[-73.716556,42.225001],[-73.71599399999999,42.225034],[-73.715931,42.225038],[-73.715745,42.225058],[-73.715693,42.225069],[-73.71557,42.225094],[-73.71540899999999,42.225149],[-73.71513299999999,42.225278],[-73.714372,42.225691],[-73.712932,42.226504],[-73.712279,42.226884],[-73.71207,42.226982],[-73.71196,42.227025],[-73.711652,42.227099],[-73.71126700000001,42.227145],[-73.70722600000001,42.227381],[-73.706951,42.227424],[-73.706765,42.227472],[-73.70659000000001,42.227531],[-73.706292,42.227665],[-73.705834,42.227943],[-73.70552600000001,42.228153],[-73.705215,42.228407],[-73.705096,42.228525],[-73.70483400000001,42.228829],[-73.704555,42.229232],[-73.704049,42.23],[-73.703457,42.230879],[-73.70338099999999,42.230978],[-73.703132,42.231227],[-73.70281,42.231473],[-73.70263300000001,42.231576],[-73.702417,42.231684],[-73.702212,42.231768],[-73.70193,42.231868],[-73.701545,42.231954],[-73.70031,42.232113],[-73.69989,42.232172],[-73.69970499999999,42.232205],[-73.6995,42.232258],[-73.699263,42.232335],[-73.69900800000001,42.232431],[-73.69765599999999,42.233049],[-73.696529,42.233564],[-73.69624,42.233714],[-73.69613699999999,42.233778],[-73.69600699999999,42.233867],[-73.69583900000001,42.234027],[-73.69572700000001,42.234168],[-73.695592,42.234364],[-73.695351,42.234775],[-73.695103,42.235099],[-73.694535,42.235757],[-73.69398200000001,42.236378],[-73.693906,42.236483],[-73.69377,42.236672],[-73.69357100000001,42.236971],[-73.69334600000001,42.237254],[-73.693282,42.23733],[-73.692871,42.237819],[-73.692789,42.237916],[-73.69264099999999,42.238075],[-73.692537,42.238188],[-73.691964,42.238786],[-73.69175799999999,42.238971],[-73.691501,42.239167],[-73.691138,42.239415],[-73.69041,42.23993],[-73.69017100000001,42.240069],[-73.69000699999999,42.24014],[-73.68894,42.240555],[-73.68858299999999,42.240692],[-73.6875,42.241106],[-73.687037,42.241266],[-73.686447,42.241495],[-73.68442400000001,42.242257],[-73.683907,42.242463],[-73.68377599999999,42.242522],[-73.683532,42.242629],[-73.682901,42.242943],[-73.682204,42.243303],[-73.681901,42.243466],[-73.681759,42.243543],[-73.681608,42.243625],[-73.677753,42.245673],[-73.67678600000001,42.246166],[-73.676287,42.246457],[-73.675864,42.246741],[-73.67551899999999,42.247004],[-73.675206,42.247262],[-73.67491099999999,42.247543],[-73.674277,42.248239],[-73.674048,42.248512],[-73.673776,42.248863],[-73.67344,42.249267],[-73.673125,42.249563],[-73.672988,42.249663],[-73.67283,42.249763],[-73.67230600000001,42.250071],[-73.67224299999999,42.250112],[-73.670886,42.251145],[-73.670699,42.251267],[-73.67042600000001,42.251423],[-73.669451,42.25189],[-73.669084,42.252052],[-73.66853,42.252266],[-73.668224,42.252356],[-73.66723500000001,42.252611],[-73.666301,42.252842],[-73.665826,42.252991],[-73.665601,42.253081],[-73.66513399999999,42.253236],[-73.664913,42.253285],[-73.664732,42.253306],[-73.664563,42.253314],[-73.66444300000001,42.253309],[-73.664222,42.253272],[-73.664063,42.253227],[-73.663106,42.252838],[-73.662599,42.25266],[-73.66217899999999,42.252547],[-73.661529,42.252414],[-73.661503,42.252409],[-73.661208,42.25234],[-73.66114899999999,42.252322],[-73.660757,42.252206],[-73.660507,42.252099],[-73.66041300000001,42.252047],[-73.660217,42.251926],[-73.660043,42.251776],[-73.659989,42.251688],[-73.659915,42.251517],[-73.659797,42.250703],[-73.65972600000001,42.250422],[-73.65964099999999,42.250167],[-73.659272,42.249205],[-73.659218,42.249105],[-73.659114,42.248949],[-73.659042,42.248884],[-73.659209,42.248352],[-73.65929,42.248096],[-73.65932599999999,42.247988],[-73.65933099999999,42.247889],[-73.65931,42.247816],[-73.659268,42.247756],[-73.65918000000001,42.247701],[-73.658923,42.247577],[-73.658833,42.247512],[-73.658125,42.246756],[-73.65794200000001,42.246508],[-73.657893,42.246404],[-73.657877,42.246334],[-73.657887,42.246175],[-73.657956,42.245955],[-73.658356,42.245058],[-73.658475,42.244837],[-73.65860600000001,42.244648],[-73.659204,42.243897],[-73.659757,42.243285],[-73.660066,42.243012],[-73.660296,42.242851],[-73.66045,42.242755],[-73.660522,42.242688],[-73.66055900000001,42.242634],[-73.660777,42.242121],[-73.660893,42.241928],[-73.66119399999999,42.241528],[-73.661293,42.241382],[-73.661461,42.241057],[-73.661545,42.24083],[-73.66155500000001,42.240728],[-73.661536,42.240572],[-73.66138100000001,42.240582],[-73.66122799999999,42.24056],[-73.661102,42.240507],[-73.660937,42.240383],[-73.660659,42.240009],[-73.660543,42.239915],[-73.660381,42.239817],[-73.66025,42.239753],[-73.660111,42.239704],[-73.65988400000001,42.23966],[-73.65974900000001,42.239651],[-73.65952799999999,42.239664],[-73.659317,42.239703],[-73.65903900000001,42.23977],[-73.658466,42.239862],[-73.65792399999999,42.239936],[-73.65763200000001,42.239944],[-73.657315,42.239942],[-73.65697,42.239917],[-73.65669200000001,42.239878],[-73.65654499999999,42.239833],[-73.655998,42.239539],[-73.655709,42.239391],[-73.655479,42.239249],[-73.65535199999999,42.239144],[-73.65508699999999,42.238951],[-73.654746,42.238769],[-73.65438399999999,42.238655],[-73.65416999999999,42.238602],[-73.653999,42.238555],[-73.653826,42.238534],[-73.653612,42.238524],[-73.653391,42.238525],[-73.65226199999999,42.238601],[-73.65206999999999,42.238643],[-73.65177799999999,42.238769],[-73.651607,42.238866],[-73.650717,42.239357],[-73.650554,42.239429],[-73.650443,42.239465],[-73.65028,42.239498],[-73.65016900000001,42.23951],[-73.650007,42.239501],[-73.64984699999999,42.239479],[-73.649621,42.239386],[-73.649216,42.239135],[-73.64869400000001,42.238787],[-73.64821499999999,42.238454],[-73.6477,42.238116],[-73.647471,42.237982],[-73.64736600000001,42.237925],[-73.647203,42.237868],[-73.64706,42.237835],[-73.646747,42.237814],[-73.646472,42.23784],[-73.64575499999999,42.238009],[-73.64560400000001,42.238034],[-73.64545699999999,42.238064],[-73.64519799999999,42.238096],[-73.64498399999999,42.238109],[-73.64492,42.238113],[-73.64487699999999,42.238113],[-73.64444399999999,42.238109],[-73.644256,42.238113],[-73.64415099999999,42.23811],[-73.64398799999999,42.238106],[-73.64366099999999,42.238118],[-73.643457,42.23814],[-73.643373,42.238048],[-73.64328,42.237926],[-73.64325599999999,42.237894],[-73.643119,42.237639],[-73.643096,42.237595],[-73.642926,42.237327],[-73.64282,42.237188],[-73.642734,42.237109],[-73.642642,42.237054],[-73.64254800000001,42.237033],[-73.642353,42.237011],[-73.641932,42.237006],[-73.64163000000001,42.237026],[-73.64093099999999,42.237045],[-73.640726,42.237043],[-73.64051600000001,42.237025],[-73.64045299999999,42.237008],[-73.64038499999999,42.236989],[-73.64026800000001,42.236946],[-73.640113,42.23687],[-73.638803,42.236108],[-73.637643,42.235465],[-73.637376,42.235346],[-73.63702499999999,42.235224],[-73.63627700000001,42.235051],[-73.63610199999999,42.234979],[-73.63593899999999,42.234836],[-73.635633,42.234463],[-73.635549,42.234377],[-73.635492,42.234318],[-73.63527499999999,42.234137],[-73.635136,42.234046],[-73.634969,42.233947],[-73.63457099999999,42.233745],[-73.63440900000001,42.233678],[-73.634225,42.233627],[-73.634057,42.233606],[-73.63388399999999,42.233604],[-73.63372200000001,42.233619],[-73.633532,42.233656],[-73.633386,42.233703],[-73.632935,42.233881],[-73.632583,42.234031],[-73.632031,42.234271],[-73.63171,42.234397],[-73.631575,42.234419],[-73.631468,42.23441],[-73.631382,42.234387],[-73.63127900000001,42.234312],[-73.630989,42.233931],[-73.630826,42.233766],[-73.63066600000001,42.233623],[-73.630245,42.233298],[-73.63000099999999,42.233079],[-73.62956,42.232597],[-73.629414,42.23242],[-73.629198,42.232067],[-73.629058,42.231782],[-73.629007,42.231613],[-73.62898800000001,42.231504],[-73.629009,42.23134],[-73.629046,42.23125],[-73.629234,42.230969],[-73.629451,42.230682],[-73.629583,42.230473],[-73.62967399999999,42.23027],[-73.630038,42.229198],[-73.630168,42.228878],[-73.630263,42.22861],[-73.630292,42.228466],[-73.630309,42.228173],[-73.63027200000001,42.227886],[-73.630233,42.227754],[-73.630166,42.227583],[-73.630088,42.227436],[-73.629937,42.227174],[-73.629868,42.227058],[-73.6298,42.22696],[-73.630027,42.226635],[-73.63054099999999,42.225748],[-73.630914,42.22498],[-73.631078,42.224605],[-73.631263,42.224123],[-73.631366,42.223822],[-73.632144,42.221758],[-73.632385,42.221086],[-73.632437,42.220945],[-73.632555,42.220627],[-73.633225,42.218806],[-73.63359800000001,42.21785],[-73.634489,42.215782],[-73.63495899999999,42.214672],[-73.63499899999999,42.214579],[-73.635293,42.21392],[-73.635723,42.212871],[-73.63591599999999,42.212348],[-73.636129,42.211715],[-73.636292,42.211104],[-73.636325,42.21095],[-73.63640100000001,42.210656],[-73.636437,42.210516],[-73.636554,42.20998],[-73.636562,42.209936],[-73.636762,42.208807],[-73.63683,42.208329],[-73.63684499999999,42.208068],[-73.636906,42.207491],[-73.636931,42.206829],[-73.63693499999999,42.206051],[-73.636911,42.205485],[-73.636701,42.202256],[-73.63669,42.201633],[-73.63669400000001,42.200879],[-73.636729,42.200287],[-73.63679500000001,42.199571],[-73.63696899999999,42.198434],[-73.63713,42.197721],[-73.63726699999999,42.197196],[-73.63752700000001,42.196362],[-73.637756,42.195718],[-73.63834900000001,42.194352],[-73.63898500000001,42.193167],[-73.639633,42.192129],[-73.640416,42.191036],[-73.640806,42.190583],[-73.641481,42.189869],[-73.641948,42.189417],[-73.643263,42.188265],[-73.643591,42.187992],[-73.643692,42.187915],[-73.64388,42.187757],[-73.644775,42.187067],[-73.644969,42.186932],[-73.64523199999999,42.186732],[-73.646512,42.185855],[-73.647074,42.185483],[-73.647677,42.185107],[-73.6481,42.184861],[-73.64859199999999,42.184623],[-73.64904199999999,42.18443],[-73.64962300000001,42.184219],[-73.650232,42.184049],[-73.650645,42.183963],[-73.651291,42.183854],[-73.651886,42.183794],[-73.65257099999999,42.183771],[-73.65299899999999,42.183769],[-73.654903,42.183885],[-73.655438,42.18389],[-73.65609499999999,42.183857],[-73.656526,42.183812],[-73.65707,42.183727],[-73.657411,42.183647],[-73.658688,42.183651],[-73.665346,42.183671],[-73.66506200000001,42.180759],[-73.664303,42.172972],[-73.664255,42.172556],[-73.663599,42.165942],[-73.66330499999999,42.163704],[-73.663774,42.163799],[-73.672377,42.165606],[-73.67254,42.165629],[-73.672557,42.16577],[-73.672534,42.165975],[-73.67247500000001,42.166144],[-73.672381,42.166345],[-73.67224299999999,42.16655],[-73.67197400000001,42.1669],[-73.671842,42.167129],[-73.671752,42.167385],[-73.67153500000001,42.168196],[-73.671519,42.168317],[-73.671556,42.168942],[-73.67165300000001,42.17012],[-73.67169800000001,42.170439],[-73.671755,42.170709],[-73.671835,42.170914],[-73.67200800000001,42.171248],[-73.672104,42.171453],[-73.672318,42.172287],[-73.67247500000001,42.172722],[-73.673272,42.174453],[-73.673513,42.175109],[-73.673813,42.176084],[-73.67393300000001,42.176525],[-73.674052,42.177057],[-73.674212,42.177608],[-73.674526,42.178478],[-73.674606,42.178665],[-73.674756,42.178931],[-73.67482099999999,42.179025],[-73.675183,42.179457],[-73.675212,42.179493],[-73.675494,42.17984],[-73.675602,42.179986],[-73.676175,42.1808],[-73.676585,42.181352],[-73.676776,42.181622],[-73.676914,42.181885],[-73.676948,42.181992],[-73.676952,42.182005],[-73.677076,42.182551],[-73.677183,42.183269],[-73.677204,42.183608],[-73.67722000000001,42.184703],[-73.677193,42.184997],[-73.677057,42.185742],[-73.677035,42.185821],[-73.676941,42.186167],[-73.676892,42.186412],[-73.676878,42.186769],[-73.676914,42.187122],[-73.676997,42.187499],[-73.67710099999999,42.187752],[-73.677165,42.187845],[-73.67718499999999,42.187873],[-73.67746200000001,42.188119],[-73.677795,42.188351],[-73.67851,42.188809],[-73.678665,42.188941],[-73.67872,42.188989],[-73.67883,42.18912],[-73.6789,42.189239],[-73.67895900000001,42.18937],[-73.679008,42.189523],[-73.67905500000001,42.189741],[-73.679078,42.19052],[-73.679053,42.190706],[-73.679016,42.190976],[-73.67893599999999,42.191506],[-73.678932,42.191527],[-73.678888,42.191734],[-73.678797,42.19195],[-73.678704,42.192071],[-73.678473,42.192327],[-73.678054,42.192729],[-73.677898,42.192864],[-73.677662,42.193034],[-73.67746200000001,42.193145],[-73.676264,42.193811],[-73.67586300000001,42.194095],[-73.67571,42.194214],[-73.675586,42.194358],[-73.67554199999999,42.19442],[-73.67546900000001,42.194597],[-73.67540700000001,42.194875],[-73.67527200000001,42.195338],[-73.67524,42.195427],[-73.675135,42.195634],[-73.674727,42.196313],[-73.674674,42.196513],[-73.67466400000001,42.19727],[-73.674648,42.197563],[-73.67462999999999,42.197887],[-73.674612,42.198812],[-73.674578,42.199373],[-73.67456199999999,42.19962],[-73.67458000000001,42.199836],[-73.674612,42.200209],[-73.674722,42.200746],[-73.674871,42.201384],[-73.674961,42.201651],[-73.675167,42.202154],[-73.67532799999999,42.202504],[-73.67540700000001,42.202705],[-73.675704,42.203708],[-73.67591299999999,42.204413],[-73.676029,42.204805],[-73.676272,42.205488],[-73.676331,42.20571],[-73.67656100000001,42.207372],[-73.676647,42.207359],[-73.67685400000001,42.207307],[-73.677519,42.207085],[-73.678434,42.206749],[-73.678639,42.206659],[-73.678854,42.206544],[-73.67905,42.206426],[-73.679154,42.206353],[-73.679344,42.20621],[-73.679776,42.205848],[-73.68004999999999,42.205669],[-73.68015,42.205618],[-73.68042199999999,42.20548],[-73.68087300000001,42.205318],[-73.680993,42.205291],[-73.68121600000001,42.205256],[-73.681398,42.20525],[-73.68156,42.20526],[-73.683367,42.205614],[-73.684046,42.205762],[-73.684603,42.205921],[-73.685042,42.206056],[-73.68582000000001,42.206323],[-73.686031,42.206368],[-73.68606200000001,42.20637],[-73.686172,42.206378],[-73.68635399999999,42.206361],[-73.686464,42.206333],[-73.686668,42.206257],[-73.68736,42.205899],[-73.68752600000001,42.205821],[-73.68821199999999,42.205556],[-73.688478,42.205467],[-73.688626,42.205401],[-73.68871799999999,42.20534],[-73.688878,42.205171],[-73.688999,42.2051],[-73.689215,42.204996],[-73.68929799999999,42.204972],[-73.689385,42.204965],[-73.689627,42.204975],[-73.68977700000001,42.205],[-73.690977,42.205298],[-73.69131299999999,42.20536],[-73.691463,42.205374],[-73.69159999999999,42.205374],[-73.691823,42.205374],[-73.692179,42.205353],[-73.692373,42.205332],[-73.69323300000001,42.205201],[-73.694283,42.205069],[-73.695082,42.205015],[-73.69519,42.205008],[-73.695342,42.204998],[-73.695999,42.20512],[-73.696072,42.205168],[-73.69617599999999,42.205217],[-73.696259,42.205272],[-73.696403,42.205393],[-73.696555,42.205548],[-73.69884399999999,42.207886],[-73.700864,42.209979],[-73.70134299999999,42.210569],[-73.70162000000001,42.21083],[-73.702713,42.211974],[-73.70316800000001,42.212398],[-73.703678,42.21289],[-73.703721,42.212931],[-73.704913,42.214092],[-73.70563300000001,42.21483],[-73.70619600000001,42.215443],[-73.706215,42.215464],[-73.706441,42.215716],[-73.706689,42.215982],[-73.707414,42.2167],[-73.709273,42.21851],[-73.711034,42.220173],[-73.71133399999999,42.220415],[-73.711527,42.220571],[-73.712118,42.221035],[-73.712259,42.221146],[-73.71231400000001,42.221189],[-73.712569,42.221388],[-73.713064,42.221773],[-73.713885,42.222422],[-73.714378,42.222802],[-73.71463,42.223006],[-73.715368,42.223589],[-73.715703,42.223853],[-73.71606,42.224108],[-73.716416,42.224313],[-73.71669,42.224413],[-73.717066,42.224532],[-73.71726200000001,42.224587],[-73.717726,42.224689],[-73.71786400000001,42.22471],[-73.718251,42.224754]]],"type":"Polygon"}
}