{
  "id": "360271600033",
  "type": "Feature",
  "properties": {
    "area_land":15368635,
    "area_water":87445,
    "geoid":"360271600033",
    "name":"Block Group 3",
    "state":"ny"
},
  "bbox": [
    -73.908573,
    41.928472,
    -73.821467,
    41.974383
],
  "geometry": {"coordinates":[[[-73.90830699999999,41.974329],[-73.908131,41.974294],[-73.90727699999999,41.974123],[-73.90712000000001,41.974091],[-73.90705699999999,41.974079],[-73.906865,41.974041],[-73.90665799999999,41.973999],[-73.906074,41.973883],[-73.90571799999999,41.973812],[-73.90536,41.97374],[-73.905011,41.973671],[-73.904659,41.973601],[-73.904296,41.973528],[-73.903941,41.973458],[-73.90360200000001,41.973389],[-73.90324699999999,41.973319],[-73.90289300000001,41.973248],[-73.902542,41.973179],[-73.90218,41.973106],[-73.90183500000001,41.973038],[-73.901477,41.972966],[-73.900611,41.972792],[-73.90010599999999,41.972688],[-73.899959,41.972658],[-73.89933499999999,41.97253],[-73.89927400000001,41.972518],[-73.899214,41.972505],[-73.899182,41.972499],[-73.89905299999999,41.972472],[-73.899041,41.972469],[-73.898639,41.972386],[-73.897959,41.972245],[-73.89711,41.972067],[-73.896468,41.971932],[-73.89621099999999,41.971878],[-73.89613799999999,41.971863],[-73.89599200000001,41.971832],[-73.89568199999999,41.971768],[-73.894807,41.971587],[-73.894772,41.97158],[-73.89436600000001,41.971496],[-73.89413399999999,41.971448],[-73.893906,41.971401],[-73.893416,41.9713],[-73.892883,41.97119],[-73.89245699999999,41.971101],[-73.892375,41.971084],[-73.892197,41.971047],[-73.891936,41.970992],[-73.891642,41.970931],[-73.890708,41.97075],[-73.885588,41.96976],[-73.885493,41.969742],[-73.88535299999999,41.969715],[-73.884871,41.969614],[-73.88431,41.969497],[-73.88386800000001,41.969372],[-73.873902,41.967374],[-73.86923299999999,41.967725],[-73.864011,41.968244],[-73.86314,41.968321],[-73.85878700000001,41.968702],[-73.85751,41.968753],[-73.856427,41.968845],[-73.856284,41.968859],[-73.856041,41.96888],[-73.854883,41.968981],[-73.85354,41.969087],[-73.85301699999999,41.969134],[-73.851669,41.969267],[-73.845153,41.969802],[-73.84027399999999,41.9702],[-73.83597399999999,41.970669],[-73.827314,41.971899],[-73.82451399999999,41.971286],[-73.821467,41.97063],[-73.821477,41.970523],[-73.821597,41.970312],[-73.823897,41.970394],[-73.824482,41.970404],[-73.824905,41.970427],[-73.826741,41.970453],[-73.827361,41.970478],[-73.82816800000001,41.970488],[-73.82845399999999,41.970487],[-73.829139,41.970494],[-73.82965299999999,41.970473],[-73.830068,41.970413],[-73.83034499999999,41.970352],[-73.830704,41.970259],[-73.83103699999999,41.970154],[-73.83132500000001,41.970037],[-73.83147599999999,41.969967],[-73.831754,41.969822],[-73.832027,41.969664],[-73.83205700000001,41.969643],[-73.83219,41.969551],[-73.832346,41.969431],[-73.83242,41.969363],[-73.83280999999999,41.969051],[-73.832976,41.968917],[-73.833371,41.968589],[-73.833837,41.968198],[-73.8351,41.967168],[-73.835416,41.966903],[-73.836118,41.966315],[-73.836518,41.965994],[-73.836859,41.965704],[-73.838781,41.964133],[-73.839298,41.963714],[-73.839817,41.963211],[-73.839893,41.963132],[-73.840045,41.962959],[-73.840141,41.962833],[-73.84021300000001,41.962751],[-73.840884,41.961776],[-73.841145,41.961374],[-73.841601,41.960674],[-73.84182300000001,41.960327],[-73.842054,41.960001],[-73.842398,41.959579],[-73.842628,41.959324],[-73.843008,41.958923],[-73.84375799999999,41.958168],[-73.844528,41.957407],[-73.84521100000001,41.956709],[-73.845868,41.956067],[-73.84625800000001,41.955667],[-73.84643,41.955505],[-73.846507,41.955418],[-73.84676899999999,41.955175],[-73.84683800000001,41.955097],[-73.846959,41.954962],[-73.84698899999999,41.954928],[-73.847199,41.954687],[-73.847354,41.954491],[-73.847571,41.954211],[-73.847782,41.953932],[-73.848086,41.953545],[-73.848674,41.95279],[-73.848831,41.952585],[-73.849119,41.952213],[-73.849222,41.952078],[-73.849429,41.951841],[-73.849583,41.951685],[-73.84988199999999,41.951346],[-73.850173,41.951056],[-73.850775,41.950535],[-73.851347,41.950083],[-73.852542,41.949161],[-73.852931,41.948855],[-73.85379500000001,41.948188],[-73.854114,41.947938],[-73.85458199999999,41.947573],[-73.85487000000001,41.947351],[-73.85533,41.946977],[-73.855597,41.946734],[-73.855717,41.946588],[-73.85580400000001,41.946465],[-73.85591599999999,41.946313],[-73.855975,41.946205],[-73.856082,41.945996],[-73.856262,41.945642],[-73.85641,41.94536],[-73.856532,41.945139],[-73.85664300000001,41.944936],[-73.85672599999999,41.944804],[-73.856945,41.944494],[-73.85705299999999,41.944385],[-73.857242,41.944217],[-73.857446,41.944061],[-73.857697,41.943893],[-73.857907,41.943785],[-73.85826400000001,41.943632],[-73.85860599999999,41.943515],[-73.858901,41.943442],[-73.859195,41.943395],[-73.859644,41.943345],[-73.860218,41.94328],[-73.86048,41.943261],[-73.86165800000001,41.943143],[-73.862689,41.943019],[-73.863219,41.942934],[-73.86326099999999,41.942926],[-73.863776,41.942839],[-73.86555300000001,41.942519],[-73.865791,41.942462],[-73.866579,41.942328],[-73.86762,41.94213],[-73.86806300000001,41.942063],[-73.86832200000001,41.942036],[-73.86917699999999,41.941963],[-73.870155,41.941912],[-73.87068499999999,41.941883],[-73.87137,41.941875],[-73.87201399999999,41.941883],[-73.872995,41.941911],[-73.874368,41.941944],[-73.875258,41.941976],[-73.87599899999999,41.941992],[-73.87637599999999,41.941996],[-73.876628,41.941984],[-73.876948,41.941952],[-73.877228,41.941911],[-73.87752,41.941858],[-73.87792899999999,41.941763],[-73.87863400000001,41.941496],[-73.878865,41.941381],[-73.87966299999999,41.940887],[-73.880899,41.939998],[-73.881202,41.939775],[-73.88151499999999,41.939551],[-73.88203900000001,41.939186],[-73.882166,41.939088],[-73.882409,41.938916],[-73.882464,41.938884],[-73.882643,41.938704],[-73.882904,41.93842],[-73.88301,41.938266],[-73.883134,41.938048],[-73.88345,41.937503],[-73.883959,41.93664],[-73.884089,41.936411],[-73.88415999999999,41.936274],[-73.88422199999999,41.936172],[-73.884547,41.93564],[-73.884592,41.935569],[-73.88462699999999,41.935514],[-73.885091,41.934782],[-73.885417,41.93426],[-73.885745,41.933759],[-73.886019,41.933402],[-73.886584,41.932815],[-73.887443,41.932006],[-73.88784800000001,41.931658],[-73.888412,41.931219],[-73.888758,41.93097],[-73.889306,41.93069],[-73.88959699999999,41.930564],[-73.889737,41.930518],[-73.88988500000001,41.930472],[-73.890309,41.930348],[-73.891458,41.930084],[-73.892129,41.929927],[-73.89292,41.929738],[-73.89326800000001,41.929663],[-73.893548,41.929594],[-73.89371800000001,41.92955],[-73.893958,41.929485],[-73.894144,41.929416],[-73.89444,41.929298],[-73.894991,41.929067],[-73.89521000000001,41.928978],[-73.895506,41.928873],[-73.89589100000001,41.928763],[-73.896912,41.928472],[-73.89691000000001,41.928534],[-73.89690899999999,41.928576],[-73.89690899999999,41.928591],[-73.896902,41.928795],[-73.896896,41.929226],[-73.896894,41.929699],[-73.89689199999999,41.929785],[-73.89688700000001,41.930057],[-73.89688099999999,41.930332],[-73.896877,41.930568],[-73.89687600000001,41.930606],[-73.89687600000001,41.930621],[-73.896873,41.930812],[-73.896866,41.931416],[-73.89686500000001,41.931713],[-73.896863,41.932169],[-73.896863,41.932205],[-73.89686,41.93256],[-73.89683100000001,41.933872],[-73.896849,41.934308],[-73.896849,41.934326],[-73.896849,41.935393],[-73.89684,41.935738],[-73.896824,41.936422],[-73.89681,41.937035],[-73.896738,41.937501],[-73.89672899999999,41.937616],[-73.89673500000001,41.937716],[-73.89677500000001,41.937876],[-73.899237,41.938087],[-73.899331,41.938096],[-73.901612,41.938299],[-73.903189,41.938454],[-73.90411400000001,41.938546],[-73.90456399999999,41.93859],[-73.90634900000001,41.938771],[-73.90645499999999,41.938781],[-73.907208,41.938847],[-73.907579,41.938884],[-73.90802600000001,41.938928],[-73.90790699999999,41.939083],[-73.90723,41.939964],[-73.905794,41.941848],[-73.90536899999999,41.94239],[-73.904652,41.94334],[-73.904061,41.944092],[-73.90388,41.944322],[-73.903419,41.944925],[-73.90334,41.945028],[-73.902596,41.946006],[-73.902314,41.946362],[-73.90213199999999,41.946598],[-73.901749,41.94709],[-73.901516,41.947379],[-73.900948,41.948114],[-73.90073,41.948398],[-73.90020800000001,41.949105],[-73.90012400000001,41.949214],[-73.899703,41.949762],[-73.89957099999999,41.949928],[-73.899176,41.950448],[-73.89896400000001,41.950715],[-73.898718,41.951044],[-73.89846300000001,41.95138],[-73.897723,41.952315],[-73.89747699999999,41.952654],[-73.897402,41.952745],[-73.897266,41.952926],[-73.89699,41.953283],[-73.896866,41.953445],[-73.89651600000001,41.953906],[-73.896359,41.954107],[-73.896264,41.954236],[-73.89593600000001,41.954654],[-73.89557000000001,41.955121],[-73.89510900000001,41.95574],[-73.894203,41.956892],[-73.894899,41.957986],[-73.895174,41.958403],[-73.895303,41.958588],[-73.89619,41.959911],[-73.896671,41.960581],[-73.89729,41.961394],[-73.898445,41.962846],[-73.898657,41.963114],[-73.89890200000001,41.963412],[-73.899029,41.963585],[-73.901342,41.96649],[-73.90246399999999,41.967897],[-73.90328100000001,41.968921],[-73.90380399999999,41.969564],[-73.904248,41.970095],[-73.90448499999999,41.970353],[-73.904866,41.970759],[-73.905124,41.97101],[-73.90608,41.971952],[-73.90718099999999,41.973047],[-73.907398,41.973263],[-73.907771,41.973633],[-73.907805,41.973666],[-73.908205,41.974053],[-73.908573,41.974383],[-73.90830699999999,41.974329]]],"type":"Polygon"}
}