{
  "id": "360470374013",
  "type": "Feature",
  "properties": {
    "area_land":55523,
    "area_water":0,
    "geoid":"360470374013",
    "name":"Block Group 3",
    "state":"ny"
},
  "bbox": [
    -73.969423,
    40.584,
    -73.96615,
    40.586669
],
  "geometry": {"coordinates":[[[-73.96942300000001,40.586307],[-73.96850000000001,40.586412],[-73.967569,40.586519],[-73.966784,40.586601],[-73.966459,40.586635],[-73.96615,40.586669],[-73.96633,40.585896],[-73.966497,40.585142],[-73.96661400000001,40.584575],[-73.96691300000001,40.584566],[-73.967815,40.584539],[-73.96906300000001,40.584],[-73.96914700000001,40.584873],[-73.96928,40.585574],[-73.96942300000001,40.586307]]],"type":"Polygon"}
}