{
  "id": "360610034004",
  "type": "Feature",
  "properties": {
    "area_land":36708,
    "area_water":0,
    "geoid":"360610034004",
    "name":"Block Group 4",
    "state":"ny"
},
  "bbox": [
    -73.983543,
    40.729086,
    -73.980338,
    40.731361
],
  "geometry": {"coordinates":[[[-73.98307699999999,40.730659],[-73.982564,40.731361],[-73.980338,40.730448],[-73.980858,40.729725],[-73.981325,40.729086],[-73.983543,40.730021],[-73.98307699999999,40.730659]]],"type":"Polygon"}
}