{
  "id": "360050351001",
  "type": "Feature",
  "properties": {
    "area_land":126768,
    "area_water":0,
    "geoid":"360050351001",
    "name":"Block Group 1",
    "state":"ny"
},
  "bbox": [
    -73.902925,
    40.888895,
    -73.897888,
    40.893414
],
  "geometry": {"coordinates":[[[-73.902924,40.889741],[-73.902901,40.889921],[-73.902854,40.890114],[-73.902787,40.890293],[-73.90232399999999,40.891076],[-73.90172200000001,40.892021],[-73.90107999999999,40.893414],[-73.900946,40.893209],[-73.90074,40.893076],[-73.900581,40.893056],[-73.900336,40.89305],[-73.90008400000001,40.893063],[-73.899897,40.893054],[-73.899653,40.892997],[-73.899434,40.892917],[-73.899321,40.892831],[-73.899237,40.892728],[-73.899062,40.892606],[-73.89877799999999,40.892502],[-73.89788799999999,40.89237],[-73.89808499999999,40.892146],[-73.898241,40.891821],[-73.898398,40.891321],[-73.89840599999999,40.891227],[-73.89843399999999,40.890936],[-73.898447,40.890495],[-73.899798,40.889613],[-73.89988700000001,40.889567],[-73.900126,40.889428],[-73.900328,40.889293],[-73.900547,40.889124],[-73.9007,40.888988],[-73.900723,40.888974],[-73.900812,40.888936],[-73.900914,40.888908],[-73.90101199999999,40.888896],[-73.901101,40.888895],[-73.901188,40.888905],[-73.901292,40.88893],[-73.901385,40.888968],[-73.90145699999999,40.88901],[-73.901504,40.88904],[-73.901612,40.889091],[-73.90172200000001,40.889126],[-73.901837,40.889148],[-73.901957,40.889157],[-73.902084,40.88915],[-73.90219500000001,40.88913],[-73.9023,40.889114],[-73.90244,40.889105],[-73.90259,40.889111],[-73.902739,40.889133],[-73.90285900000001,40.889165],[-73.902871,40.889204],[-73.902907,40.889373],[-73.902925,40.889536],[-73.902924,40.889741]]],"type":"Polygon"}
}