{
  "id": "360594067011",
  "type": "Feature",
  "properties": {
    "area_land":418044,
    "area_water":12386,
    "geoid":"360594067011",
    "name":"Block Group 1",
    "state":"ny"
},
  "bbox": [
    -73.636473,
    40.693554,
    -73.626645,
    40.704226
],
  "geometry": {"coordinates":[[[-73.634773,40.696501],[-73.633273,40.697701],[-73.633094,40.698503],[-73.633126,40.698542],[-73.63314,40.698588],[-73.63318200000001,40.69892],[-73.633385,40.70076],[-73.63343,40.701131],[-73.633557,40.702291],[-73.633651,40.70316],[-73.633696,40.703569],[-73.633656,40.703732],[-73.632761,40.70385],[-73.632231,40.703921],[-73.63173999999999,40.704009],[-73.630787,40.704189],[-73.630608,40.704226],[-73.63024,40.703525],[-73.62994,40.702952],[-73.629743,40.702577],[-73.62971400000001,40.702467],[-73.62965699999999,40.702075],[-73.628699,40.702159],[-73.627353,40.702281],[-73.62724799999999,40.702283],[-73.626645,40.702134],[-73.62701300000001,40.701585],[-73.627205,40.701298],[-73.627746,40.700585],[-73.628032,40.700192],[-73.62825100000001,40.699891],[-73.62871199999999,40.699178],[-73.628839,40.698948],[-73.62909999999999,40.698477],[-73.629395,40.697938],[-73.629788,40.697219],[-73.63014200000001,40.69665],[-73.630844,40.695526],[-73.631288,40.694699],[-73.631405,40.694486],[-73.6318,40.693554],[-73.632373,40.693788],[-73.632773,40.693902],[-73.63327099999999,40.69399],[-73.634382,40.694311],[-73.636473,40.694902],[-73.634773,40.696501]]],"type":"Polygon"}
}