{
  "id": "360470608003",
  "type": "Feature",
  "properties": {
    "area_land":101655,
    "area_water":24030,
    "geoid":"360470608003",
    "name":"Block Group 3",
    "state":"ny"
},
  "bbox": [
    -73.956851,
    40.582435,
    -73.949409,
    40.584923
],
  "geometry": {"coordinates":[[[-73.956851,40.582859],[-73.956217,40.583726],[-73.95632500000001,40.584345],[-73.956412,40.584866],[-73.955657,40.584911],[-73.955512,40.584923],[-73.955352,40.584919],[-73.955214,40.584903],[-73.955089,40.584877],[-73.954958,40.584839],[-73.95490100000001,40.584816],[-73.954826,40.584785],[-73.954714,40.584726],[-73.954678,40.58471],[-73.95463700000001,40.584751],[-73.95454100000001,40.584842],[-73.954436,40.58488],[-73.95424,40.584897],[-73.954047,40.584889],[-73.95392699999999,40.584877],[-73.95383699999999,40.584845],[-73.953727,40.584771],[-73.953705,40.584687],[-73.95368999999999,40.584565],[-73.952771,40.584652],[-73.95143899999999,40.584306],[-73.95090399999999,40.584356],[-73.949747,40.584275],[-73.949609,40.583539],[-73.94958200000001,40.583361],[-73.949409,40.582435],[-73.951082,40.582514],[-73.953419,40.582609],[-73.953813,40.582543],[-73.954032,40.582517],[-73.954086,40.582795],[-73.954143,40.583105],[-73.954365,40.583081],[-73.955174,40.582916],[-73.956041,40.582736],[-73.956288,40.582697],[-73.956536,40.582659],[-73.95677499999999,40.582818],[-73.956851,40.582859]]],"type":"Polygon"}
}