{
  "id": "360730406002",
  "type": "Feature",
  "properties": {
    "area_land":92697371,
    "area_water":315715,
    "geoid":"360730406002",
    "name":"Block Group 2",
    "state":"ny"
},
  "bbox": [
    -78.310427,
    43.201561,
    -78.191032,
    43.306188
],
  "geometry": {"coordinates":[[[-78.310427,43.21875],[-78.309354,43.218753],[-78.306136,43.218763],[-78.305848,43.218764],[-78.305064,43.218775],[-78.304671,43.218779],[-78.303495,43.218798],[-78.30316999999999,43.218803],[-78.303104,43.218804],[-78.302284,43.218815],[-78.299825,43.218852],[-78.29900600000001,43.218864],[-78.29903899999999,43.21894],[-78.29908,43.219097],[-78.299086,43.219242],[-78.299088,43.219276],[-78.29903899999999,43.220414],[-78.299029,43.220675],[-78.299025,43.220805],[-78.29901599999999,43.221061],[-78.29899,43.221829],[-78.298982,43.222086],[-78.298979,43.222172],[-78.298965,43.222541],[-78.298914,43.223907],[-78.29889799999999,43.224363],[-78.298891,43.224539],[-78.298879,43.224852],[-78.298877,43.225068],[-78.298877,43.225245],[-78.298856,43.226205],[-78.298796,43.229048],[-78.298795,43.229085],[-78.29878100000001,43.230046],[-78.29876299999999,43.230686],[-78.29871300000001,43.232608],[-78.298705,43.232918],[-78.298697,43.233249],[-78.298644,43.23549],[-78.29857699999999,43.238333],[-78.298498,43.242217],[-78.298461,43.244055],[-78.298446,43.24446],[-78.29842499999999,43.244955],[-78.29838100000001,43.2462],[-78.298379,43.246441],[-78.29837499999999,43.246938],[-78.29840299999999,43.24792],[-78.298464,43.250058],[-78.29844300000001,43.250866],[-78.298418,43.251849],[-78.298372,43.25344],[-78.298236,43.258216],[-78.298191,43.259808],[-78.298174,43.260382],[-78.298125,43.262107],[-78.298109,43.262682],[-78.297663,43.278278],[-78.297568,43.280247],[-78.297566,43.28031],[-78.29748499999999,43.283291],[-78.297245,43.292238],[-78.29716500000001,43.29522],[-78.297127,43.29661],[-78.297014,43.300783],[-78.296977,43.302175],[-78.29697,43.302408],[-78.296953,43.303107],[-78.296948,43.303342],[-78.296932,43.30391],[-78.296886,43.305614],[-78.296871,43.306183],[-78.29604500000001,43.306175],[-78.29356799999999,43.306154],[-78.292743,43.306148],[-78.292705,43.306148],[-78.29259399999999,43.306149],[-78.292557,43.30615],[-78.292242,43.30615],[-78.291299,43.30615],[-78.29098500000001,43.30615],[-78.290792,43.30615],[-78.290216,43.30615],[-78.290024,43.306151],[-78.288285,43.306152],[-78.283069,43.306158],[-78.28144399999999,43.30616],[-78.28133099999999,43.306159],[-78.27865,43.306154],[-78.270607,43.306139],[-78.267927,43.306134],[-78.26772,43.306133],[-78.267101,43.306132],[-78.26689500000001,43.306132],[-78.263735,43.306123],[-78.254255,43.306098],[-78.251096,43.30609],[-78.250749,43.30608],[-78.249711,43.30605],[-78.249365,43.30604],[-78.248915,43.306074],[-78.248015,43.306129],[-78.246296,43.306145],[-78.246036,43.306148],[-78.243382,43.306153],[-78.240675,43.306167],[-78.237926,43.306158],[-78.237081,43.306159],[-78.235057,43.306164],[-78.23401,43.306175],[-78.232398,43.306188],[-78.22786499999999,43.306145],[-78.226663,43.306144],[-78.22194,43.306145],[-78.213037,43.30617],[-78.211343,43.306159],[-78.20133199999999,43.306124],[-78.199676,43.306119],[-78.19927199999999,43.306118],[-78.19309199999999,43.306114],[-78.19103200000001,43.306113],[-78.191063,43.305433],[-78.19108,43.30493],[-78.191193,43.302247],[-78.191418,43.296909],[-78.19167299999999,43.290652],[-78.191762,43.288499],[-78.19183,43.286787],[-78.191863,43.285553],[-78.192049,43.281962],[-78.192104,43.281066],[-78.192142,43.280233],[-78.19228,43.277857],[-78.19241599999999,43.275239],[-78.192544,43.272562],[-78.192736,43.268899],[-78.192802,43.267493],[-78.19291699999999,43.264805],[-78.19292,43.264739],[-78.192932,43.26452],[-78.192938,43.264399],[-78.192972,43.263743],[-78.19305300000001,43.263173],[-78.193129,43.262832],[-78.193153,43.262663],[-78.19315899999999,43.262443],[-78.193192,43.261273],[-78.193203,43.260884],[-78.19338399999999,43.260788],[-78.19348599999999,43.260759],[-78.193821,43.260745],[-78.19394200000001,43.260723],[-78.194047,43.260683],[-78.194335,43.260461],[-78.194434,43.260395],[-78.194554,43.260359],[-78.194919,43.260359],[-78.195035,43.260326],[-78.195148,43.26026],[-78.19515800000001,43.260247],[-78.195241,43.260158],[-78.195267,43.260056],[-78.195274,43.25987],[-78.195307,43.259801],[-78.195358,43.259743],[-78.195446,43.259696],[-78.195537,43.259674],[-78.19569,43.259677],[-78.195927,43.25971],[-78.19613099999999,43.259768],[-78.196297,43.259852],[-78.19637299999999,43.259911],[-78.196476,43.259965],[-78.196603,43.259994],[-78.196738,43.259998],[-78.19719000000001,43.259907],[-78.197799,43.259736],[-78.197959,43.259656],[-78.198103,43.259554],[-78.198195,43.259473],[-78.198669,43.25888],[-78.19907000000001,43.258508],[-78.199168,43.258435],[-78.199292,43.25838],[-78.199586,43.258311],[-78.19999,43.258304],[-78.200486,43.258318],[-78.20060100000001,43.258322],[-78.200714,43.258304],[-78.200802,43.258264],[-78.20090399999999,43.258166],[-78.20096599999999,43.258125],[-78.20103899999999,43.258096],[-78.201307,43.258064],[-78.202039,43.257929],[-78.20208700000001,43.2579],[-78.20209800000001,43.25786],[-78.202079,43.257805],[-78.201928,43.257615],[-78.20189999999999,43.25759],[-78.201883,43.257566],[-78.201886,43.257544],[-78.20190599999999,43.257502],[-78.201965,43.257442],[-78.20252499999999,43.257169],[-78.202697,43.257098],[-78.20327899999999,43.256952],[-78.203563,43.256893],[-78.203582,43.25689],[-78.20396100000001,43.256839],[-78.204429,43.256683],[-78.20452,43.256635],[-78.204601,43.256574],[-78.20466999999999,43.256493],[-78.204746,43.256329],[-78.204798,43.256249],[-78.20484500000001,43.256198],[-78.20489999999999,43.256173],[-78.205155,43.256093],[-78.205217,43.256038],[-78.205319,43.255849],[-78.20537400000001,43.255801],[-78.205676,43.25575],[-78.20581799999999,43.255743],[-78.20594199999999,43.255707],[-78.20602100000001,43.255656],[-78.206065,43.25559],[-78.206079,43.255528],[-78.206075,43.255481],[-78.206046,43.255437],[-78.205933,43.255346],[-78.205884,43.255266],[-78.20581799999999,43.255113],[-78.205811,43.255043],[-78.20581799999999,43.254993],[-78.205848,43.254952],[-78.205997,43.254847],[-78.206012,43.254821],[-78.20600399999999,43.254796],[-78.205946,43.254734],[-78.20593100000001,43.254701],[-78.205928,43.25465],[-78.205961,43.254533],[-78.205961,43.254457],[-78.205935,43.254388],[-78.20582,43.254209],[-78.205715,43.254013],[-78.205704,43.253918],[-78.20571099999999,43.253834],[-78.20571700000001,43.253822],[-78.20575100000001,43.253758],[-78.20578399999999,43.253645],[-78.205791,43.253506],[-78.205811,43.253395],[-78.205851,43.253182],[-78.205837,43.253087],[-78.205764,43.252967],[-78.205662,43.252745],[-78.205647,43.252581],[-78.205669,43.252526],[-78.206119,43.252009],[-78.206247,43.251825],[-78.206293,43.25176],[-78.206407,43.251597],[-78.20647700000001,43.25146],[-78.20663500000001,43.251156],[-78.20686499999999,43.25077],[-78.20702199999999,43.250541],[-78.207127,43.250341],[-78.207329,43.24996],[-78.20741599999999,43.249797],[-78.20745599999999,43.249595],[-78.20745700000001,43.249406],[-78.207463,43.248834],[-78.20749600000001,43.248376],[-78.207544,43.248221],[-78.20763100000001,43.248161],[-78.20783400000001,43.24808],[-78.207995,43.248026],[-78.208035,43.247999],[-78.20813,43.247938],[-78.208225,43.247837],[-78.20834600000001,43.247532],[-78.208426,43.247536],[-78.20866599999999,43.247551],[-78.208746,43.247556],[-78.208821,43.24756],[-78.209339,43.24759],[-78.209474,43.247605],[-78.20993199999999,43.24766],[-78.210748,43.24782],[-78.211495,43.247994],[-78.21162,43.248032],[-78.21231899999999,43.248246],[-78.212614,43.248336],[-78.21265099999999,43.248352],[-78.213244,43.248604],[-78.213604,43.248789],[-78.213915,43.24895],[-78.21409199999999,43.249036],[-78.21448100000001,43.249227],[-78.21462200000001,43.249303],[-78.214797,43.249398],[-78.215586,43.249819],[-78.215926,43.250001],[-78.21722800000001,43.250653],[-78.217934,43.251054],[-78.21796000000001,43.251071],[-78.218182,43.251218],[-78.218689,43.251591],[-78.218733,43.251623],[-78.218868,43.251727],[-78.21940499999999,43.252142],[-78.219584,43.252281],[-78.220337,43.252914],[-78.22106700000001,43.253528],[-78.22202799999999,43.254362],[-78.22256899999999,43.254846],[-78.22258600000001,43.254861],[-78.222983,43.255141],[-78.223392,43.255384],[-78.223523,43.255462],[-78.223992,43.255662],[-78.224407,43.255826],[-78.224925,43.255983],[-78.225154,43.256033],[-78.225392,43.256085],[-78.22591199999999,43.256172],[-78.226236,43.256205],[-78.226737,43.256216],[-78.22712,43.256198],[-78.227667,43.256154],[-78.23034699999999,43.25583],[-78.23077000000001,43.255783],[-78.231487,43.255706],[-78.23263900000001,43.255539],[-78.234948,43.255266],[-78.239361,43.254745],[-78.241867,43.254383],[-78.242698,43.254264],[-78.244174,43.25409],[-78.245968,43.253878],[-78.247103,43.25371],[-78.247649,43.253626],[-78.248153,43.253524],[-78.248716,43.253386],[-78.249306,43.253214],[-78.24969,43.253057],[-78.25066099999999,43.252624],[-78.253135,43.251739],[-78.25314,43.251607],[-78.252679,43.251616],[-78.251152,43.25162],[-78.249743,43.251604],[-78.249698,43.251604],[-78.24891599999999,43.251591],[-78.248137,43.251593],[-78.247924,43.251594],[-78.243785,43.251551],[-78.24332,43.251551],[-78.241715,43.251555],[-78.240549,43.251558],[-78.238068,43.251534],[-78.237303,43.251527],[-78.2362,43.251528],[-78.23296000000001,43.251509],[-78.22712900000001,43.251496],[-78.22691399999999,43.251496],[-78.223483,43.251502],[-78.22316600000001,43.251501],[-78.222217,43.251501],[-78.221901,43.251501],[-78.221532,43.251492],[-78.22117299999999,43.251473],[-78.220932,43.251457],[-78.220816,43.251442],[-78.220241,43.251374],[-78.219641,43.251259],[-78.219206,43.251154],[-78.218808,43.251041],[-78.218408,43.250892],[-78.217905,43.250658],[-78.217704,43.250552],[-78.21674299999999,43.250046],[-78.216404,43.249866],[-78.21538700000001,43.249331],[-78.215048,43.249154],[-78.214935,43.249094],[-78.214804,43.249024],[-78.214598,43.248914],[-78.21448599999999,43.248854],[-78.21444,43.248829],[-78.214302,43.248756],[-78.21425600000001,43.248732],[-78.21322499999999,43.248211],[-78.21220700000001,43.247698],[-78.21199799999999,43.247591],[-78.210111,43.246696],[-78.21003399999999,43.24666],[-78.209086,43.246233],[-78.20905999999999,43.246221],[-78.209002,43.246195],[-78.208849,43.246126],[-78.208831,43.246117],[-78.20877400000001,43.246092],[-78.20877400000001,43.246061],[-78.20877400000001,43.245967],[-78.208775,43.245937],[-78.208806,43.245936],[-78.208853,43.245935],[-78.208899,43.245933],[-78.20893,43.245933],[-78.20942100000001,43.245921],[-78.209729,43.245915],[-78.20998299999999,43.245895],[-78.210093,43.24586],[-78.21019,43.245785],[-78.210239,43.245696],[-78.210266,43.245563],[-78.210269,43.245125],[-78.210272,43.244829],[-78.210292,43.244635],[-78.21028,43.244255],[-78.210278,43.244182],[-78.21030500000001,43.243482],[-78.21032700000001,43.243117],[-78.21035000000001,43.242739],[-78.21117599999999,43.242724],[-78.213021,43.242693],[-78.213657,43.242682],[-78.21393399999999,43.242678],[-78.214484,43.242659],[-78.214484,43.242572],[-78.214488,43.242311],[-78.21449,43.242225],[-78.214493,43.241995],[-78.214502,43.241416],[-78.21450299999999,43.241307],[-78.21450400000001,43.241254],[-78.214506,43.241078],[-78.214507,43.241005],[-78.21450900000001,43.240905],[-78.21451,43.240786],[-78.214512,43.240714],[-78.213391,43.240716],[-78.212435,43.240719],[-78.210967,43.240708],[-78.210289,43.240715],[-78.210031,43.240719],[-78.208957,43.240739],[-78.208912,43.24074],[-78.20878399999999,43.240741],[-78.208403,43.240745],[-78.208276,43.240747],[-78.20751199999999,43.240756],[-78.20631,43.240772],[-78.20522099999999,43.240793],[-78.204458,43.240808],[-78.203913,43.240818],[-78.20356,43.240826],[-78.20228,43.240851],[-78.201736,43.240862],[-78.201742,43.240233],[-78.20174400000001,43.240162],[-78.201761,43.239709],[-78.201785,43.239038],[-78.201806,43.238064],[-78.20182200000001,43.237365],[-78.20183400000001,43.236729],[-78.201837,43.236579],[-78.20184999999999,43.235864],[-78.201869,43.234824],[-78.201881,43.234189],[-78.20135399999999,43.234196],[-78.19977799999999,43.234216],[-78.199254,43.234224],[-78.198779,43.23423],[-78.197355,43.234247],[-78.196881,43.234254],[-78.196314,43.234261],[-78.195623,43.23427],[-78.194614,43.234295],[-78.19427,43.234304],[-78.194048,43.234295],[-78.19405999999999,43.233764],[-78.194067,43.233463],[-78.194081,43.232844],[-78.194091,43.232412],[-78.194096,43.232172],[-78.194109,43.231642],[-78.194113,43.230815],[-78.194114,43.230797],[-78.194187,43.228338],[-78.19421199999999,43.227513],[-78.194214,43.227416],[-78.19422299999999,43.227129],[-78.194226,43.227033],[-78.194228,43.226936],[-78.194238,43.226647],[-78.19424100000001,43.226551],[-78.194281,43.22504],[-78.19436,43.222097],[-78.19439199999999,43.220507],[-78.194424,43.218996],[-78.19443,43.217797],[-78.19443099999999,43.217769],[-78.19441399999999,43.2142],[-78.19440899999999,43.213001],[-78.194577,43.212994],[-78.195238,43.212989],[-78.195454,43.212988],[-78.196099,43.212968],[-78.196592,43.21293],[-78.196808,43.2129],[-78.19749299999999,43.212781],[-78.19770699999999,43.212728],[-78.198486,43.212547],[-78.198515,43.212534],[-78.20044900000001,43.212042],[-78.20094400000001,43.211898],[-78.20142300000001,43.211763],[-78.202433,43.211462],[-78.203372,43.211167],[-78.203968,43.211008],[-78.20439500000001,43.21092],[-78.20477099999999,43.210853],[-78.205541,43.210754],[-78.205848,43.210734],[-78.207182,43.210677],[-78.20832799999999,43.210637],[-78.210841,43.210555],[-78.211151,43.210544],[-78.212311,43.210467],[-78.212806,43.210429],[-78.21341200000001,43.210305],[-78.21486400000001,43.210008],[-78.22005299999999,43.208872],[-78.221002,43.208675],[-78.22110600000001,43.208654],[-78.22318799999999,43.208206],[-78.223535,43.208142],[-78.223619,43.208125],[-78.223874,43.208078],[-78.22395899999999,43.208063],[-78.22601299999999,43.207732],[-78.226106,43.207717],[-78.22995299999999,43.207137],[-78.230884,43.207015],[-78.231797,43.20688],[-78.23251999999999,43.206795],[-78.232564,43.20679],[-78.232855,43.206762],[-78.233768,43.206725],[-78.234737,43.206712],[-78.236238,43.206688],[-78.237939,43.206662],[-78.240588,43.206586],[-78.240742,43.206572],[-78.241297,43.206526],[-78.241997,43.206435],[-78.242232,43.206391],[-78.24257,43.206322],[-78.243109,43.206187],[-78.243346,43.206128],[-78.24571299999999,43.205464],[-78.24658100000001,43.205222],[-78.247303,43.205012],[-78.247452,43.204969],[-78.24843,43.204704],[-78.24869,43.204626],[-78.249363,43.204435],[-78.249478,43.204403],[-78.24999200000001,43.204261],[-78.250204,43.204204],[-78.250281,43.204183],[-78.250394,43.204153],[-78.25051499999999,43.20412],[-78.25059299999999,43.2041],[-78.25138699999999,43.203886],[-78.251935,43.203739],[-78.252875,43.203495],[-78.253773,43.203251],[-78.25456800000001,43.203036],[-78.25652100000001,43.202501],[-78.257435,43.202251],[-78.257867,43.202169],[-78.258268,43.202117],[-78.261596,43.201883],[-78.262539,43.201782],[-78.263352,43.201696],[-78.264555,43.201589],[-78.26475000000001,43.201574],[-78.26510500000001,43.201561],[-78.26545,43.201565],[-78.26612900000001,43.201588],[-78.267623,43.201713],[-78.268142,43.201758],[-78.271083,43.202018],[-78.272974,43.2022],[-78.274906,43.202369],[-78.275893,43.202468],[-78.276809,43.202549],[-78.278706,43.202718],[-78.27935100000001,43.202786],[-78.279871,43.20283],[-78.280317,43.20285],[-78.280613,43.202846],[-78.282535,43.202821],[-78.282843,43.202814],[-78.283586,43.202798],[-78.28517600000001,43.202764],[-78.28532800000001,43.202761],[-78.289945,43.202601],[-78.291535,43.202547],[-78.294121,43.202466],[-78.29528000000001,43.202438],[-78.297045,43.202396],[-78.29979899999999,43.202357],[-78.302693,43.202367],[-78.304295,43.202338],[-78.305639,43.202259],[-78.306515,43.202192],[-78.306636,43.202183],[-78.30848,43.202053],[-78.308616,43.20205],[-78.309207,43.202051],[-78.309702,43.202098],[-78.309883,43.202131],[-78.310244,43.202211],[-78.310265,43.202216],[-78.31032999999999,43.202231],[-78.31035199999999,43.202237],[-78.310351,43.202483],[-78.310351,43.203224],[-78.310351,43.203471],[-78.31035,43.203651],[-78.310348,43.205097],[-78.31034699999999,43.205133],[-78.310373,43.210122],[-78.310378,43.210874],[-78.310395,43.211785],[-78.310395,43.211865],[-78.31039699999999,43.212107],[-78.31039800000001,43.212188],[-78.31039800000001,43.212233],[-78.3104,43.2135],[-78.310405,43.215434],[-78.310418,43.217437],[-78.310427,43.21875]]],"type":"Polygon"}
}