{
  "id": "360470824003",
  "type": "Feature",
  "properties": {
    "area_land":79318,
    "area_water":0,
    "geoid":"360470824003",
    "name":"Block Group 3",
    "state":"ny"
},
  "bbox": [
    -73.952363,
    40.646771,
    -73.949152,
    40.64978
],
  "geometry": {"coordinates":[[[-73.95236300000001,40.649669],[-73.95129300000001,40.649715],[-73.949465,40.64978],[-73.94937,40.648923],[-73.949285,40.648141],[-73.949152,40.646886],[-73.950125,40.646847],[-73.951061,40.646811],[-73.95205,40.646771],[-73.952189,40.648021],[-73.95227,40.648795],[-73.95236300000001,40.649669]]],"type":"Polygon"}
}