{
  "id": "361031111003",
  "type": "Feature",
  "properties": {
    "area_land":393084,
    "area_water":0,
    "geoid":"361031111003",
    "name":"Block Group 3",
    "state":"ny"
},
  "bbox": [
    -73.429444,
    40.833763,
    -73.420059,
    40.839523
],
  "geometry": {"coordinates":[[[-73.429438,40.837784],[-73.42936,40.838385],[-73.426682,40.83871],[-73.426072,40.838798],[-73.424019,40.839046],[-73.422769,40.839199],[-73.42151699999999,40.839354],[-73.420265,40.839523],[-73.42025,40.838875],[-73.42021200000001,40.838061],[-73.420203,40.837527],[-73.42017300000001,40.837333],[-73.42008199999999,40.837082],[-73.42005899999999,40.836715],[-73.42008199999999,40.836479],[-73.42030200000001,40.835708],[-73.42029599999999,40.835552],[-73.42027299999999,40.835316],[-73.420205,40.834746],[-73.422997,40.834403],[-73.425675,40.834067],[-73.42809200000001,40.833763],[-73.428506,40.83466],[-73.42897499999999,40.835588],[-73.429136,40.83595],[-73.429305,40.836518],[-73.429389,40.836956],[-73.429444,40.837394],[-73.429438,40.837784]]],"type":"Polygon"}
}