{
  "id": "360610091001",
  "type": "Feature",
  "properties": {
    "area_land":89492,
    "area_water":0,
    "geoid":"360610091001",
    "name":"Block Group 1",
    "state":"ny"
},
  "bbox": [
    -73.996129,
    40.742233,
    -73.991419,
    40.746004
],
  "geometry": {"coordinates":[[[-73.995645,40.744099],[-73.995161,40.744763],[-73.99503,40.744941],[-73.994934,40.745073],[-73.994709,40.745383],[-73.99426200000001,40.746004],[-73.99141899999999,40.744802],[-73.991871,40.744186],[-73.992063,40.743919],[-73.992318,40.743568],[-73.992805,40.742901],[-73.993292,40.742233],[-73.996129,40.743431],[-73.995645,40.744099]]],"type":"Polygon"}
}