{
  "id": "360594046004",
  "type": "Feature",
  "properties": {
    "area_land":249921,
    "area_water":0,
    "geoid":"360594046004",
    "name":"Block Group 4",
    "state":"ny"
},
  "bbox": [
    -73.706429,
    40.716975,
    -73.698523,
    40.723878
],
  "geometry": {"coordinates":[[[-73.70627500000001,40.718055],[-73.706188,40.718143],[-73.70575100000001,40.718447],[-73.705455,40.71863],[-73.704871,40.718993],[-73.704792,40.719136],[-73.70438900000001,40.719921],[-73.704031,40.720622],[-73.703988,40.720692],[-73.703913,40.720815],[-73.70382600000001,40.720961],[-73.70380900000001,40.720989],[-73.702663,40.723215],[-73.702575,40.72337],[-73.702319,40.723878],[-73.701542,40.723544],[-73.70076299999999,40.7232],[-73.699979,40.722855],[-73.69920399999999,40.722513],[-73.69852299999999,40.722213],[-73.698988,40.721605],[-73.699459,40.720987],[-73.69992999999999,40.720371],[-73.700676,40.720701],[-73.700895,40.720806],[-73.70048800000001,40.71991],[-73.700417,40.719762],[-73.700361,40.719631],[-73.699946,40.718726],[-73.700211,40.718217],[-73.70033100000001,40.717988],[-73.70085,40.716975],[-73.701785,40.717121],[-73.702716,40.717266],[-73.703648,40.717412],[-73.70458000000001,40.717557],[-73.705513,40.717703],[-73.706429,40.717852],[-73.70627500000001,40.718055]]],"type":"Polygon"}
}