{
  "id": "360010130001",
  "type": "Feature",
  "properties": {
    "area_land":506570,
    "area_water":0,
    "geoid":"360010130001",
    "name":"Block Group 1",
    "state":"ny"
},
  "bbox": [
    -73.730598,
    42.784875,
    -73.716317,
    42.792244
],
  "geometry": {"coordinates":[[[-73.730064,42.787578],[-73.72591300000001,42.79043],[-73.725257,42.790877],[-73.72489,42.791086],[-73.72448199999999,42.791343],[-73.72306399999999,42.792174],[-73.72291800000001,42.792244],[-73.719684,42.789477],[-73.717696,42.787829],[-73.716317,42.786623],[-73.717904,42.786415],[-73.718498,42.786342],[-73.71968200000001,42.786175],[-73.72134,42.785962],[-73.722443,42.785806],[-73.723367,42.785689],[-73.724496,42.785544],[-73.725409,42.78542],[-73.72712,42.785218],[-73.72725199999999,42.785206],[-73.72883,42.785012],[-73.730011,42.784875],[-73.730598,42.785082],[-73.730064,42.787578]]],"type":"Polygon"}
}