{
  "id": "361031456031",
  "type": "Feature",
  "properties": {
    "area_land":2951537,
    "area_water":0,
    "geoid":"361031456031",
    "name":"Block Group 1",
    "state":"ny"
},
  "bbox": [
    -73.295162,
    40.769214,
    -73.265679,
    40.787055
],
  "geometry": {"coordinates":[[[-73.295162,40.769269],[-73.295152,40.769653],[-73.295098,40.771097],[-73.295097,40.77113],[-73.295078,40.771513],[-73.294962,40.774847],[-73.294966,40.784297],[-73.29496399999999,40.784796],[-73.291032,40.784617],[-73.28866600000001,40.78451],[-73.284785,40.78454],[-73.28252000000001,40.784545],[-73.282376,40.78453],[-73.279743,40.784518],[-73.279492,40.784517],[-73.275856,40.784579],[-73.277047,40.78625],[-73.277337,40.786706],[-73.27391299999999,40.786754],[-73.27208899999999,40.786754],[-73.270391,40.786735],[-73.270095,40.787055],[-73.269642,40.786438],[-73.269065,40.785615],[-73.268827,40.785279],[-73.268559,40.784923],[-73.267886,40.784257],[-73.267528,40.784037],[-73.267079,40.783804],[-73.266909,40.783726],[-73.26567900000001,40.783214],[-73.266283,40.782408],[-73.26635,40.782299],[-73.265991,40.781387],[-73.270326,40.780394],[-73.27239400000001,40.779921],[-73.27430099999999,40.779506],[-73.274546,40.780435],[-73.275148,40.780303],[-73.27624299999999,40.780135],[-73.275852,40.778679],[-73.27576999999999,40.77854],[-73.275654,40.778463],[-73.275491,40.77841],[-73.275277,40.778348],[-73.275087,40.778256],[-73.274902,40.77812],[-73.274759,40.77798],[-73.274649,40.777814],[-73.274581,40.777638],[-73.27453300000001,40.77746],[-73.274208,40.77614],[-73.274066,40.775651],[-73.27404300000001,40.775495],[-73.27407100000001,40.775369],[-73.274156,40.775253],[-73.274243,40.775158],[-73.274298,40.775028],[-73.27426800000001,40.77489],[-73.274185,40.774764],[-73.274036,40.77467],[-73.273865,40.77463],[-73.27367700000001,40.774648],[-73.27309,40.774774],[-73.272994,40.774212],[-73.27995,40.772659],[-73.280051,40.772636],[-73.28455099999999,40.771624],[-73.28570499999999,40.771351],[-73.286483,40.771217],[-73.290969,40.770182],[-73.291028,40.770168],[-73.294248,40.769417],[-73.29471100000001,40.769313],[-73.294996,40.769251],[-73.295162,40.769214],[-73.295162,40.769269]]],"type":"Polygon"}
}