{
  "id": "360810126012",
  "type": "Feature",
  "properties": {
    "area_land":60936,
    "area_water":0,
    "geoid":"360810126012",
    "name":"Block Group 2",
    "state":"ny"
},
  "bbox": [
    -73.839634,
    40.690961,
    -73.836626,
    40.695853
],
  "geometry": {"coordinates":[[[-73.839483,40.695582],[-73.838791,40.695853],[-73.837507,40.693298],[-73.836707,40.691698],[-73.836626,40.691534],[-73.83751100000001,40.691297],[-73.83838299999999,40.69104],[-73.838679,40.690961],[-73.838739,40.691111],[-73.838977,40.691687],[-73.839247,40.692339],[-73.839415,40.69275],[-73.838385,40.693048],[-73.839634,40.695535],[-73.839483,40.695582]]],"type":"Polygon"}
}