{
  "id": "360910623001",
  "type": "Feature",
  "properties": {
    "area_land":283732,
    "area_water":0,
    "geoid":"360910623001",
    "name":"Block Group 1",
    "state":"ny"
},
  "bbox": [
    -73.700075,
    42.904268,
    -73.690628,
    42.910489
],
  "geometry": {"coordinates":[[[-73.699761,42.909223],[-73.69959299999999,42.909687],[-73.699258,42.910489],[-73.698786,42.910264],[-73.697532,42.909671],[-73.69466199999999,42.908326],[-73.694299,42.908144],[-73.693945,42.907943],[-73.693798,42.907867],[-73.693485,42.907656],[-73.69298499999999,42.907373],[-73.692814,42.907252],[-73.69269300000001,42.907167],[-73.692331,42.906906],[-73.691654,42.906327],[-73.691407,42.906084],[-73.691188,42.905824],[-73.691151,42.905768],[-73.69084599999999,42.905399],[-73.690628,42.905069],[-73.690726,42.905061],[-73.691211,42.905004],[-73.691495,42.90498],[-73.692818,42.904856],[-73.69417,42.904755],[-73.69529799999999,42.904654],[-73.696231,42.904565],[-73.69713299999999,42.904487],[-73.69795499999999,42.904433],[-73.698052,42.904449],[-73.698166,42.904376],[-73.698284,42.904268],[-73.698601,42.905369],[-73.699029,42.906325],[-73.699676,42.9076],[-73.69969399999999,42.907656],[-73.69971200000001,42.907731],[-73.699752,42.907804],[-73.699744,42.907834],[-73.699753,42.907897],[-73.700075,42.908589],[-73.699761,42.909223]]],"type":"Polygon"}
}