{
  "id": "360810723003",
  "type": "Feature",
  "properties": {
    "area_land":192725,
    "area_water":0,
    "geoid":"360810723003",
    "name":"Block Group 3",
    "state":"ny"
},
  "bbox": [
    -73.84912,
    40.711706,
    -73.842315,
    40.717159
],
  "geometry": {"coordinates":[[[-73.848714,40.713942],[-73.848309,40.714585],[-73.847902,40.71523],[-73.847497,40.715874],[-73.847099,40.716508],[-73.84668499999999,40.717159],[-73.845584,40.716657],[-73.844509,40.716195],[-73.84389899999999,40.715973],[-73.84363,40.716042],[-73.843225,40.716142],[-73.843081,40.716101],[-73.842923,40.716042],[-73.84287399999999,40.71601],[-73.842856,40.71599],[-73.842834,40.715945],[-73.842848,40.71586],[-73.842845,40.715809],[-73.84278500000001,40.715766],[-73.842315,40.715588],[-73.842355,40.715525],[-73.842826,40.714778],[-73.84298,40.714533],[-73.843523,40.713671],[-73.843947,40.712996],[-73.844356,40.71235],[-73.84475999999999,40.711706],[-73.846942,40.712503],[-73.84912,40.7133],[-73.848714,40.713942]]],"type":"Polygon"}
}