{
  "id": "360594094003",
  "type": "Feature",
  "properties": {
    "area_land":538247,
    "area_water":0,
    "geoid":"360594094003",
    "name":"Block Group 3",
    "state":"ny"
},
  "bbox": [
    -73.503706,
    40.704924,
    -73.491759,
    40.71158
],
  "geometry": {"coordinates":[[[-73.50370599999999,40.704935],[-73.50309900000001,40.706035],[-73.502835,40.706517],[-73.502619,40.706936],[-73.50252,40.707186],[-73.502443,40.707404],[-73.502387,40.707602],[-73.502274,40.708222],[-73.502258,40.708431],[-73.502256,40.708727],[-73.502275,40.709051],[-73.502377,40.710027],[-73.50249100000001,40.711039],[-73.502522,40.71158],[-73.50165,40.711535],[-73.501464,40.71143],[-73.501367,40.711358],[-73.500974,40.710945],[-73.500834,40.710848],[-73.500708,40.710793],[-73.500506,40.710751],[-73.498075,40.710455],[-73.497449,40.71038],[-73.49643500000001,40.710255],[-73.496016,40.710202],[-73.495502,40.710178],[-73.49488700000001,40.710128],[-73.494585,40.710103],[-73.494516,40.710585],[-73.494457,40.710711],[-73.49437,40.710817],[-73.494221,40.710918],[-73.49404800000001,40.710972],[-73.493903,40.710985],[-73.493802,40.710985],[-73.493559,40.710963],[-73.49342,40.710961],[-73.493247,40.710933],[-73.49303999999999,40.710861],[-73.492924,40.710751],[-73.49284900000001,40.71064],[-73.49281000000001,40.71052],[-73.492741,40.710201],[-73.492717,40.70997],[-73.49277600000001,40.70958],[-73.491759,40.709498],[-73.492088,40.70728],[-73.49213399999999,40.706948],[-73.49217,40.706553],[-73.492249,40.705384],[-73.494365,40.705304],[-73.495276,40.705268],[-73.496402,40.705222],[-73.498075,40.705152],[-73.498588,40.705127],[-73.501783,40.704997],[-73.50233900000001,40.704973],[-73.50316599999999,40.704924],[-73.50370599999999,40.704935]]],"type":"Polygon"}
}