{
  "id": "360710105006",
  "type": "Feature",
  "properties": {
    "area_land":2240712,
    "area_water":0,
    "geoid":"360710105006",
    "name":"Block Group 6",
    "state":"ny"
},
  "bbox": [
    -74.13217,
    41.512582,
    -74.11008,
    41.537585
],
  "geometry": {"coordinates":[[[-74.132077,41.512847],[-74.131027,41.515848],[-74.130959,41.516037],[-74.130972,41.516071],[-74.13099699999999,41.516135],[-74.13119399999999,41.516651],[-74.131317,41.51697],[-74.131488,41.517414],[-74.13161100000001,41.517857],[-74.13166099999999,41.518254],[-74.13166699999999,41.518521],[-74.131654,41.518793],[-74.13161599999999,41.519086],[-74.131535,41.519389],[-74.131343,41.519964],[-74.131039,41.520826],[-74.130698,41.521823],[-74.13054,41.522309],[-74.130495,41.522447],[-74.130256,41.52307],[-74.130133,41.523355],[-74.129846,41.524019],[-74.12965,41.524473],[-74.12957299999999,41.524655],[-74.129283,41.525347],[-74.12915099999999,41.525701],[-74.12909999999999,41.52584],[-74.128951,41.526249],[-74.12878499999999,41.52625],[-74.128365,41.527688],[-74.128001,41.528661],[-74.12729899999999,41.530145],[-74.12699499999999,41.530665],[-74.126807,41.531138],[-74.124588,41.536677],[-74.124404,41.537585],[-74.124278,41.537392],[-74.12335400000001,41.535611],[-74.12254299999999,41.534184],[-74.12237500000001,41.53391],[-74.122226,41.533641],[-74.122077,41.533261],[-74.12186199999999,41.532585],[-74.121709,41.531828],[-74.121689,41.531731],[-74.12156400000001,41.53118],[-74.121218,41.530052],[-74.12110800000001,41.529649],[-74.121043,41.529258],[-74.12090000000001,41.526969],[-74.12084299999999,41.526533],[-74.120773,41.526187],[-74.12063499999999,41.525713],[-74.12057799999999,41.525551],[-74.1203,41.524916],[-74.120294,41.524871],[-74.118263,41.524394],[-74.116725,41.524017],[-74.11638000000001,41.523916],[-74.115731,41.523694],[-74.115116,41.523449],[-74.11456,41.523199],[-74.113208,41.522476],[-74.11255199999999,41.522111],[-74.111762,41.521675],[-74.11147099999999,41.521514],[-74.111087,41.521263],[-74.110904,41.521122],[-74.110524,41.520805],[-74.11048099999999,41.520769],[-74.11008,41.520442],[-74.110283,41.520328],[-74.111783,41.519531],[-74.11288999999999,41.518899],[-74.114406,41.518066],[-74.117349,41.516441],[-74.11815,41.516017],[-74.11882900000001,41.515684],[-74.119602,41.51533],[-74.120699,41.514874],[-74.12126600000001,41.514659],[-74.12215,41.514345],[-74.12271699999999,41.51417],[-74.123107,41.51405],[-74.12383199999999,41.513842],[-74.124105,41.513771],[-74.124499,41.513668],[-74.124596,41.513645],[-74.12532899999999,41.513472],[-74.12591999999999,41.513348],[-74.126423,41.513247],[-74.12799200000001,41.512989],[-74.128455,41.512931],[-74.128922,41.512876],[-74.130357,41.512738],[-74.13217,41.512582],[-74.132077,41.512847]]],"type":"Polygon"}
}