{
  "id": "360050083005",
  "type": "Feature",
  "properties": {
    "area_land":19593,
    "area_water":0,
    "geoid":"360050083005",
    "name":"Block Group 5",
    "state":"ny"
},
  "bbox": [
    -73.90418,
    40.811507,
    -73.901093,
    40.812897
],
  "geometry": {"coordinates":[[[-73.90418,40.812125],[-73.90144100000001,40.812897],[-73.901093,40.81218],[-73.903417,40.811507],[-73.90418,40.812125]]],"type":"Polygon"}
}