{
  "id": "360470470001",
  "type": "Feature",
  "properties": {
    "area_land":97720,
    "area_water":0,
    "geoid":"360470470001",
    "name":"Block Group 1",
    "state":"ny"
},
  "bbox": [
    -73.988302,
    40.623183,
    -73.981566,
    40.626756
],
  "geometry": {"coordinates":[[[-73.987719,40.625071],[-73.98714,40.625636],[-73.986777,40.62598],[-73.986554,40.626194],[-73.985966,40.626756],[-73.984942,40.62612],[-73.98476100000001,40.62602],[-73.98326400000001,40.626035],[-73.983831,40.625463],[-73.981566,40.624095],[-73.98214400000001,40.623533],[-73.98440100000001,40.624893],[-73.984962,40.624323],[-73.98553,40.623758],[-73.985637,40.62365],[-73.985731,40.623555],[-73.98610100000001,40.623183],[-73.988302,40.624514],[-73.987719,40.625071]]],"type":"Polygon"}
}