{
  "id": "360099608002",
  "type": "Feature",
  "properties": {
    "area_land":128114287,
    "area_water":202915,
    "geoid":"360099608002",
    "name":"Block Group 2",
    "state":"ny"
},
  "bbox": [
    -78.646277,
    42.214366,
    -78.463662,
    42.393088
],
  "geometry": {"coordinates":[[[-78.64612099999999,42.24993],[-78.645402,42.249223],[-78.64482099999999,42.248691],[-78.644699,42.248565],[-78.644525,42.248624],[-78.64438,42.248661],[-78.644126,42.248686],[-78.643889,42.248723],[-78.641543,42.249083],[-78.64131500000001,42.249109],[-78.640361,42.249217],[-78.63914,42.249355],[-78.637854,42.249533],[-78.637602,42.249583],[-78.637458,42.249647],[-78.637851,42.249963],[-78.638063,42.250163],[-78.638369,42.250501],[-78.638593,42.250773],[-78.639622,42.252155],[-78.63972,42.252297],[-78.639995,42.252797],[-78.640128,42.253118],[-78.64027299999999,42.253575],[-78.64049799999999,42.254672],[-78.640615,42.255146],[-78.64066200000001,42.255291],[-78.640862,42.25571],[-78.64107799999999,42.256012],[-78.641188,42.256157],[-78.641398,42.256372],[-78.641576,42.256538],[-78.642672,42.257407],[-78.642439,42.257497],[-78.641237,42.257692],[-78.639848,42.257905],[-78.63959,42.257977],[-78.639354,42.258074],[-78.639079,42.258241],[-78.63857400000001,42.258617],[-78.637697,42.259307],[-78.637663,42.259336],[-78.6353,42.261357],[-78.63479599999999,42.261786],[-78.63269699999999,42.263357],[-78.631973,42.263898],[-78.631451,42.264253],[-78.630912,42.264585],[-78.630527,42.264818],[-78.629029,42.265694],[-78.62774400000001,42.266543],[-78.625669,42.267936],[-78.624036,42.268984],[-78.623059,42.269576],[-78.622559,42.269857],[-78.622247,42.270005],[-78.621956,42.270106],[-78.620615,42.270529],[-78.62003799999999,42.270739],[-78.619696,42.270894],[-78.61891300000001,42.271309],[-78.618253,42.271682],[-78.617097,42.272355],[-78.61673,42.272627],[-78.616511,42.272829],[-78.616293,42.27308],[-78.61582300000001,42.273825],[-78.615448,42.274442],[-78.61465800000001,42.275816],[-78.614527,42.276003],[-78.614278,42.276259],[-78.613496,42.276861],[-78.61094300000001,42.279106],[-78.610784,42.279259],[-78.610744,42.279312],[-78.610703,42.279364],[-78.610603,42.279519],[-78.610429,42.279848],[-78.61027,42.280211],[-78.61017,42.280604],[-78.610106,42.280964],[-78.61004699999999,42.281302],[-78.610023,42.281492],[-78.60982799999999,42.283059],[-78.609663,42.284025],[-78.609318,42.285225],[-78.609067,42.286003],[-78.608976,42.286247],[-78.608924,42.286388],[-78.609106,42.286516],[-78.609191,42.286561],[-78.609402,42.286641],[-78.610164,42.28684],[-78.610337,42.286909],[-78.610749,42.28714],[-78.611272,42.287485],[-78.611537,42.287698],[-78.6117,42.28786],[-78.61191100000001,42.288103],[-78.612239,42.288515],[-78.61283,42.289258],[-78.61326800000001,42.289744],[-78.61350299999999,42.290039],[-78.613536,42.290108],[-78.61380699999999,42.290673],[-78.614098,42.291376],[-78.614462,42.2922],[-78.614512,42.292397],[-78.614574,42.292778],[-78.614638,42.293476],[-78.614649,42.294888],[-78.61463000000001,42.29631],[-78.61463500000001,42.298067],[-78.614617,42.298479],[-78.614566,42.298957],[-78.614515,42.299125],[-78.61441600000001,42.299286],[-78.614339,42.299383],[-78.614256,42.299465],[-78.613786,42.299867],[-78.61309900000001,42.300414],[-78.61291199999999,42.300581],[-78.61272,42.300773],[-78.61258599999999,42.300952],[-78.612397,42.301282],[-78.61222600000001,42.301631],[-78.61218599999999,42.301738],[-78.612122,42.302009],[-78.611977,42.302738],[-78.611614,42.304146],[-78.611411,42.304876],[-78.611366,42.305057],[-78.6113,42.305454],[-78.61121900000001,42.305924],[-78.612402,42.306137],[-78.612747,42.30621],[-78.6135,42.306394],[-78.613525,42.3064],[-78.614875,42.306679],[-78.61635699999999,42.306957],[-78.61778099999999,42.307249],[-78.618347,42.307335],[-78.619213,42.307424],[-78.620036,42.307455],[-78.620407,42.30746],[-78.62221,42.307409],[-78.62338,42.307368],[-78.623668,42.307344],[-78.623965,42.307288],[-78.624251,42.307192],[-78.624422,42.307118],[-78.62477199999999,42.306942],[-78.624961,42.306886],[-78.625063,42.306878],[-78.625186,42.306889],[-78.625298,42.306918],[-78.625455,42.306985],[-78.62566,42.307097],[-78.6258,42.307173],[-78.625856,42.3072],[-78.62603799999999,42.307295],[-78.623604,42.309734],[-78.623046,42.310317],[-78.622677,42.310757],[-78.622631,42.310813],[-78.622421,42.311064],[-78.62185599999999,42.311747],[-78.621545,42.312086],[-78.621225,42.312363],[-78.620586,42.312742],[-78.620154,42.312966],[-78.61968899999999,42.313222],[-78.618515,42.31391],[-78.618049,42.314197],[-78.617738,42.314382],[-78.616913,42.314863],[-78.615607,42.315662],[-78.614192,42.316534],[-78.61389699999999,42.316704],[-78.61314,42.31717],[-78.613072,42.317208],[-78.612667,42.317439],[-78.61190499999999,42.317912],[-78.610247,42.318901],[-78.609606,42.319288],[-78.608598,42.31992],[-78.607794,42.320441],[-78.60761100000001,42.320571],[-78.607344,42.320733],[-78.607339,42.320878],[-78.607356,42.321162],[-78.60741,42.32147],[-78.607665,42.322405],[-78.607968,42.323354],[-78.608234,42.324414],[-78.608333,42.324698],[-78.608484,42.325016],[-78.608902,42.32578],[-78.609059,42.326185],[-78.60919199999999,42.32665],[-78.60926499999999,42.32703],[-78.609318,42.328041],[-78.609337,42.32899],[-78.60935499999999,42.329383],[-78.609347,42.329792],[-78.609184,42.33113],[-78.609161,42.331358],[-78.609043,42.332012],[-78.609033,42.332297],[-78.60906300000001,42.332517],[-78.609143,42.332766],[-78.60922100000001,42.332904],[-78.60927700000001,42.333006],[-78.609522,42.333328],[-78.609709,42.333554],[-78.610376,42.334361],[-78.610564,42.334621],[-78.610613,42.334707],[-78.610923,42.335405],[-78.611437,42.336601],[-78.611671,42.337092],[-78.61228,42.338487],[-78.612898,42.339678],[-78.613057,42.340057],[-78.613248,42.340624],[-78.61335699999999,42.341051],[-78.61344,42.341697],[-78.613445,42.341884],[-78.61340800000001,42.342171],[-78.613365,42.342361],[-78.613322,42.342478],[-78.613131,42.343002],[-78.61305900000001,42.3432],[-78.612814,42.343753],[-78.612532,42.344284],[-78.61238299999999,42.344521],[-78.612241,42.344706],[-78.61204499999999,42.344932],[-78.61134300000001,42.345598],[-78.610975,42.345985],[-78.61071699999999,42.346304],[-78.61060999999999,42.346462],[-78.610455,42.346692],[-78.610056,42.347384],[-78.609871,42.347735],[-78.60971000000001,42.34796],[-78.60960300000001,42.348083],[-78.609438,42.348245],[-78.608834,42.348784],[-78.60870300000001,42.348938],[-78.60862400000001,42.34903],[-78.608503,42.349199],[-78.608289,42.349555],[-78.607837,42.35057],[-78.607023,42.352564],[-78.606964,42.352707],[-78.606796,42.353164],[-78.60666000000001,42.353626],[-78.60659800000001,42.353893],[-78.606397,42.354838],[-78.606295,42.35555],[-78.606229,42.356227],[-78.60623699999999,42.356572],[-78.60626999999999,42.35677],[-78.606369,42.357098],[-78.606588,42.357656],[-78.60673199999999,42.358126],[-78.606791,42.358349],[-78.606831,42.358698],[-78.60682,42.360467],[-78.606799,42.361173],[-78.60674,42.362502],[-78.606694,42.36299],[-78.606578,42.364677],[-78.60641699999999,42.366497],[-78.60638899999999,42.366864],[-78.606205,42.368889],[-78.606112,42.369252],[-78.60548900000001,42.370733],[-78.605192,42.371545],[-78.605064,42.372021],[-78.604997,42.372334],[-78.604812,42.373499],[-78.60459,42.375],[-78.604281,42.376954],[-78.60418,42.377691],[-78.604024,42.378589],[-78.603706,42.380109],[-78.603677,42.380465],[-78.603683,42.380587],[-78.603746,42.380955],[-78.604265,42.383059],[-78.604403,42.383442],[-78.604724,42.384158],[-78.604902,42.38452],[-78.605087,42.384856],[-78.605473,42.385502],[-78.60574800000001,42.38601],[-78.606118,42.386604],[-78.606438,42.387082],[-78.606717,42.387529],[-78.606914,42.387878],[-78.607079,42.388236],[-78.60733999999999,42.388757],[-78.60772900000001,42.389589],[-78.607927,42.390037],[-78.608541,42.39137],[-78.606413,42.391418],[-78.605171,42.391436],[-78.602811,42.39145],[-78.60155,42.391478],[-78.59971299999999,42.391482],[-78.598708,42.391501],[-78.59787,42.391505],[-78.597725,42.391505],[-78.596807,42.391508],[-78.59596999999999,42.391521],[-78.59472700000001,42.391511],[-78.593636,42.391528],[-78.59289699999999,42.391531],[-78.592134,42.391548],[-78.59165299999999,42.391542],[-78.59028499999999,42.391571],[-78.58982399999999,42.391602],[-78.589591,42.391617],[-78.589297,42.391647],[-78.588989,42.391696],[-78.588779,42.391735],[-78.588757,42.391739],[-78.588086,42.391914],[-78.587667,42.392036],[-78.586911,42.392279],[-78.58626700000001,42.392474],[-78.58537800000001,42.392772],[-78.584401,42.393088],[-78.584399,42.39178],[-78.584418,42.386484],[-78.584354,42.381542],[-78.584345,42.380752],[-78.584272,42.374991],[-78.584243,42.366135],[-78.58430199999999,42.363357],[-78.584318,42.362528],[-78.58436,42.362404],[-78.58438099999999,42.362092],[-78.58434200000001,42.35865],[-78.58436500000001,42.357538],[-78.584371,42.356652],[-78.584351,42.355186],[-78.58438099999999,42.353473],[-78.58434800000001,42.352513],[-78.584378,42.350457],[-78.584352,42.349297],[-78.584377,42.348455],[-78.584192,42.348455],[-78.584073,42.348457],[-78.584085,42.34858],[-78.57249299999999,42.348628],[-78.571415,42.348633],[-78.569878,42.348643],[-78.567752,42.348658],[-78.55550100000001,42.348756],[-78.55261900000001,42.348774],[-78.549978,42.348789],[-78.542377,42.348838],[-78.54168900000001,42.348843],[-78.5167,42.349072],[-78.515973,42.349075],[-78.51594,42.348755],[-78.515941,42.347343],[-78.51598799999999,42.345424],[-78.51602800000001,42.343752],[-78.516024,42.343096],[-78.516014,42.342569],[-78.51601700000001,42.341847],[-78.51599299999999,42.341139],[-78.516006,42.340242],[-78.51602699999999,42.339899],[-78.51490200000001,42.339951],[-78.51402,42.339991],[-78.51216599999999,42.340056],[-78.511837,42.340068],[-78.510758,42.340139],[-78.509106,42.340299],[-78.508618,42.340354],[-78.508049,42.340445],[-78.507312,42.340603],[-78.50653200000001,42.340785],[-78.503231,42.34151],[-78.503041,42.34154],[-78.502747,42.34157],[-78.502122,42.341615],[-78.50078999999999,42.341663],[-78.49832600000001,42.34172],[-78.497685,42.341714],[-78.497445,42.341699],[-78.497032,42.341658],[-78.496105,42.341476],[-78.49487000000001,42.341196],[-78.494218,42.341028],[-78.493709,42.340855],[-78.49316,42.340619],[-78.492773,42.340428],[-78.49231899999999,42.340188],[-78.491996,42.34],[-78.491742,42.339826],[-78.491449,42.339555],[-78.491022,42.33907],[-78.490709,42.33876],[-78.49041699999999,42.338543],[-78.489688,42.338105],[-78.488568,42.337466],[-78.487887,42.337048],[-78.48717000000001,42.336637],[-78.486334,42.336749],[-78.484994,42.336964],[-78.482944,42.337357],[-78.48237,42.337437],[-78.48189499999999,42.337463],[-78.48158100000001,42.337471],[-78.480234,42.337443],[-78.47923900000001,42.337393],[-78.478184,42.337357],[-78.47795600000001,42.337354],[-78.477273,42.337348],[-78.476152,42.337282],[-78.475369,42.337261],[-78.47498899999999,42.337271],[-78.47481000000001,42.337285],[-78.474439,42.337346],[-78.473849,42.337485],[-78.473507,42.337548],[-78.473274,42.337579],[-78.47305799999999,42.337597],[-78.472745,42.337591],[-78.471447,42.337538],[-78.47035200000001,42.337463],[-78.469764,42.337399],[-78.469166,42.3373],[-78.468103,42.337081],[-78.468248,42.336703],[-78.468609,42.335499],[-78.468863,42.334761],[-78.469565,42.332566],[-78.469808,42.331857],[-78.47002999999999,42.33112],[-78.47011999999999,42.330734],[-78.47017200000001,42.330446],[-78.47018,42.330038],[-78.470158,42.329863],[-78.470107,42.329657],[-78.46991199999999,42.329014],[-78.469804,42.328693],[-78.46965,42.328297],[-78.469477,42.327965],[-78.46906799999999,42.327267],[-78.468892,42.326851],[-78.46866199999999,42.326113],[-78.468464,42.325399],[-78.46790900000001,42.323262],[-78.46766,42.321871],[-78.467551,42.321384],[-78.46750299999999,42.321171],[-78.467406,42.320822],[-78.46736900000001,42.320649],[-78.467305,42.319713],[-78.46718300000001,42.3182],[-78.46713200000001,42.317543],[-78.467089,42.316863],[-78.466915,42.314734],[-78.46674299999999,42.312305],[-78.466673,42.311553],[-78.46666500000001,42.311294],[-78.466679,42.310831],[-78.466815,42.309866],[-78.46693500000001,42.309163],[-78.467071,42.30846],[-78.467578,42.306117],[-78.468008,42.304178],[-78.46803,42.304006],[-78.46803199999999,42.303849],[-78.468008,42.303527],[-78.467966,42.303244],[-78.467862,42.302761],[-78.467691,42.302066],[-78.46754900000001,42.301549],[-78.467389,42.301153],[-78.466416,42.299379],[-78.46577499999999,42.298102],[-78.465711,42.297942],[-78.46561,42.29762],[-78.465506,42.297137],[-78.465182,42.29574],[-78.465086,42.295438],[-78.464918,42.29499],[-78.464608,42.294284],[-78.46425499999999,42.293394],[-78.463937,42.292499],[-78.463836,42.292163],[-78.463745,42.291791],[-78.463729,42.291625],[-78.46373199999999,42.29074],[-78.4637,42.290045],[-78.463662,42.286504],[-78.463696,42.285805],[-78.463711,42.285608],[-78.463748,42.285425],[-78.463825,42.285222],[-78.463904,42.285096],[-78.464004,42.284987],[-78.46422699999999,42.284794],[-78.46441799999999,42.284666],[-78.46456999999999,42.284588],[-78.464822,42.284495],[-78.46917999999999,42.283262],[-78.469426,42.283199],[-78.469936,42.283045],[-78.47077,42.282747],[-78.472236,42.282153],[-78.47306399999999,42.281833],[-78.473865,42.281509],[-78.47549100000001,42.280882],[-78.47626099999999,42.280565],[-78.476753,42.280386],[-78.477125,42.280281],[-78.478239,42.279934],[-78.478979,42.279752],[-78.479356,42.279679],[-78.479901,42.279632],[-78.480401,42.279615],[-78.48081500000001,42.279631],[-78.48103399999999,42.279655],[-78.481544,42.279745],[-78.482652,42.279991],[-78.48300500000001,42.280079],[-78.48323000000001,42.280144],[-78.484814,42.28072],[-78.485591,42.280987],[-78.485861,42.281063],[-78.487168,42.281342],[-78.488794,42.281688],[-78.492031,42.2824],[-78.492863,42.282564],[-78.49334899999999,42.282647],[-78.493543,42.282667],[-78.493816,42.282681],[-78.494743,42.28267],[-78.498036,42.282674],[-78.49914,42.282683],[-78.50130299999999,42.282715],[-78.50238299999999,42.282714],[-78.502916,42.282689],[-78.503376,42.282667],[-78.50526600000001,42.282519],[-78.505441,42.282497],[-78.50550699999999,42.282486],[-78.505656,42.28246],[-78.506238,42.282336],[-78.50786600000001,42.281913],[-78.508962,42.281618],[-78.509551,42.28144],[-78.509693,42.281389],[-78.509974,42.281261],[-78.51116500000001,42.280567],[-78.51173900000001,42.280215],[-78.512518,42.279737],[-78.513222,42.279341],[-78.51457600000001,42.278613],[-78.514679,42.278557],[-78.516465,42.27753],[-78.517488,42.276902],[-78.51927499999999,42.275846],[-78.519564,42.275698],[-78.52023199999999,42.275412],[-78.52034,42.275374],[-78.52129499999999,42.275037],[-78.52164999999999,42.274925],[-78.52308600000001,42.274409],[-78.524033,42.27415],[-78.525048,42.273836],[-78.525897,42.273555],[-78.526084,42.273496],[-78.526442,42.273413],[-78.526824,42.27336],[-78.527091,42.27335],[-78.52934,42.273337],[-78.531251,42.273297],[-78.533064,42.273281],[-78.534181,42.273282],[-78.53528900000001,42.27326],[-78.535741,42.273238],[-78.536053,42.273201],[-78.53639,42.273127],[-78.537346,42.272877],[-78.537734,42.272783],[-78.537803,42.27278],[-78.537997,42.272798],[-78.53965100000001,42.270494],[-78.540441,42.269406],[-78.540594,42.269224],[-78.541037,42.268741],[-78.541195,42.268569],[-78.54143500000001,42.268341],[-78.54303,42.266883],[-78.54377100000001,42.266184],[-78.54574599999999,42.26429],[-78.546604,42.263483],[-78.54695599999999,42.263204],[-78.547274,42.262982],[-78.54786199999999,42.262641],[-78.549919,42.261543],[-78.55037,42.261321],[-78.550771,42.26116],[-78.55147599999999,42.260925],[-78.55150500000001,42.260916],[-78.55185299999999,42.260806],[-78.553245,42.260358],[-78.553641,42.26021],[-78.55397499999999,42.260059],[-78.555021,42.259499],[-78.555595,42.259161],[-78.555897,42.258954],[-78.556707,42.258357],[-78.561044,42.255146],[-78.561683,42.254659],[-78.562062,42.254389],[-78.56312200000001,42.253605],[-78.56362,42.253239],[-78.564026,42.252919],[-78.564499,42.252507],[-78.565337,42.251801],[-78.567431,42.250001],[-78.56811999999999,42.249296],[-78.568409,42.249],[-78.568782,42.248637],[-78.568985,42.248483],[-78.56948800000001,42.248138],[-78.572327,42.246335],[-78.57262900000001,42.246159],[-78.573227,42.24584],[-78.574145,42.24539],[-78.58071700000001,42.242241],[-78.58233199999999,42.241448],[-78.582461,42.241386],[-78.58367800000001,42.240798],[-78.584031,42.240626],[-78.58556,42.239913],[-78.586142,42.239668],[-78.586676,42.239486],[-78.587616,42.239223],[-78.58856,42.239014],[-78.591016,42.23853],[-78.591673,42.238387],[-78.59225499999999,42.238261],[-78.594392,42.237798],[-78.59575700000001,42.23751],[-78.596602,42.237384],[-78.59890300000001,42.237133],[-78.605424,42.236334],[-78.606337,42.236185],[-78.607153,42.235985],[-78.60935000000001,42.23536],[-78.609866,42.2352],[-78.611069,42.234845],[-78.611373,42.234766],[-78.61193900000001,42.2346],[-78.61233900000001,42.234499],[-78.613541,42.234126],[-78.61470799999999,42.233714],[-78.616891,42.232971],[-78.617806,42.232647],[-78.618251,42.232501],[-78.62031,42.23178],[-78.62136099999999,42.23142],[-78.62229000000001,42.231119],[-78.62249,42.231063],[-78.622805,42.230984],[-78.623558,42.230863],[-78.62412999999999,42.230787],[-78.62429,42.230756],[-78.62447899999999,42.230708],[-78.62500199999999,42.230494],[-78.62533999999999,42.230322],[-78.625772,42.23005],[-78.62649,42.229522],[-78.62678,42.229253],[-78.62948299999999,42.226267],[-78.629864,42.225825],[-78.63016,42.225438],[-78.630331,42.225136],[-78.63059,42.224512],[-78.631704,42.221618],[-78.631924,42.221012],[-78.632239,42.219867],[-78.632446,42.219311],[-78.632762,42.218607],[-78.63296699999999,42.218177],[-78.633163,42.217876],[-78.633646,42.217283],[-78.63423299999999,42.216629],[-78.634687,42.216163],[-78.635644,42.215216],[-78.636533,42.214366],[-78.6367,42.214537],[-78.63672200000001,42.214568],[-78.636835,42.214737],[-78.63689599999999,42.214852],[-78.636962,42.215044],[-78.636993,42.215316],[-78.63699099999999,42.215632],[-78.636994,42.216874],[-78.637023,42.219024],[-78.637024,42.219059],[-78.637033,42.219512],[-78.637078,42.221635],[-78.63711600000001,42.221863],[-78.637232,42.222258],[-78.637372,42.222597],[-78.637452,42.222752],[-78.637602,42.223006],[-78.63782,42.223295],[-78.638075,42.22358],[-78.638403,42.223884],[-78.63857400000001,42.224028],[-78.637776,42.229144],[-78.63772899999999,42.229471],[-78.637692,42.229904],[-78.6377,42.230402],[-78.637739,42.230819],[-78.63781899999999,42.231298],[-78.638205,42.23323],[-78.63850100000001,42.234662],[-78.638783,42.236085],[-78.63890000000001,42.236552],[-78.639034,42.237021],[-78.63916399999999,42.237396],[-78.63936,42.237878],[-78.63972,42.238595],[-78.639978,42.239053],[-78.64230000000001,42.243109],[-78.643432,42.24509],[-78.646277,42.250057],[-78.64612099999999,42.24993]]],"type":"Polygon"}
}