{
  "id": "360610060003",
  "type": "Feature",
  "properties": {
    "area_land":31074,
    "area_water":0,
    "geoid":"360610060003",
    "name":"Block Group 3",
    "state":"ny"
},
  "bbox": [
    -73.976983,
    40.732536,
    -73.974243,
    40.73517
],
  "geometry": {"coordinates":[[[-73.976851,40.733855],[-73.976798,40.734003],[-73.97677899999999,40.734113],[-73.97681,40.734154],[-73.97685199999999,40.734216],[-73.97630100000001,40.734471],[-73.976721,40.735057],[-73.976376,40.73517],[-73.976249,40.735145],[-73.976094,40.735059],[-73.97573199999999,40.734687],[-73.975616,40.734514],[-73.975556,40.734425],[-73.975245,40.7342],[-73.975138,40.734176],[-73.974872,40.734208],[-73.97481999999999,40.734217],[-73.974772,40.734221],[-73.97467,40.734253],[-73.97463999999999,40.734132],[-73.974256,40.732587],[-73.974243,40.732536],[-73.97436,40.732572],[-73.974412,40.732592],[-73.974492,40.732622],[-73.974649,40.732691],[-73.974828,40.732764],[-73.97542,40.733005],[-73.97616499999999,40.733385],[-73.976983,40.73373],[-73.976851,40.733855]]],"type":"Polygon"}
}