{
  "id": "360957408001",
  "type": "Feature",
  "properties": {
    "area_land":86319561,
    "area_water":3779850,
    "geoid":"360957408001",
    "name":"Block Group 1",
    "state":"ny"
},
  "bbox": [
    -74.477121,
    42.355017,
    -74.326113,
    42.501994
],
  "geometry": {"coordinates":[[[-74.477114,42.418833],[-74.47705999999999,42.419207],[-74.47698699999999,42.419518],[-74.476947,42.419655],[-74.47681900000001,42.420005],[-74.47558600000001,42.422947],[-74.475272,42.42369],[-74.474974,42.424331],[-74.474847,42.424558],[-74.474744,42.424712],[-74.474558,42.424959],[-74.474458,42.425085],[-74.474194,42.425377],[-74.474037,42.42552],[-74.47349199999999,42.426052],[-74.473162,42.426419],[-74.47284500000001,42.42682],[-74.47277099999999,42.426945],[-74.472657,42.427193],[-74.47259200000001,42.427369],[-74.47253000000001,42.42765],[-74.472477,42.428024],[-74.472453,42.428407],[-74.472472,42.428702],[-74.472433,42.428935],[-74.472376,42.429046],[-74.47235000000001,42.429211],[-74.47237199999999,42.429399],[-74.47243899999999,42.429676],[-74.47246800000001,42.429794],[-74.472494,42.430008],[-74.472472,42.430279],[-74.472522,42.430711],[-74.47250200000001,42.430961],[-74.47243,42.431222],[-74.472329,42.431456],[-74.458735,42.43221],[-74.452108,42.432579],[-74.450243,42.43263],[-74.449646,42.433325],[-74.44886,42.434588],[-74.448556,42.435514],[-74.448571,42.436457],[-74.448803,42.437868],[-74.447839,42.437917],[-74.447683,42.437911],[-74.44737000000001,42.437946],[-74.444738,42.438118],[-74.434281,42.438768],[-74.434347,42.439219],[-74.43462599999999,42.442026],[-74.435148,42.442081],[-74.435383,42.442189],[-74.435558,42.442296],[-74.43565599999999,42.442413],[-74.435783,42.442609],[-74.43580300000001,42.442833],[-74.435715,42.443097],[-74.435676,42.443205],[-74.435705,42.443322],[-74.43576400000001,42.44342],[-74.436027,42.443527],[-74.436311,42.443596],[-74.435695,42.444104],[-74.435045,42.443801],[-74.435191,42.447585],[-74.435209,42.447769],[-74.435256,42.448301],[-74.43678199999999,42.465596],[-74.43651699999999,42.466094],[-74.435755,42.467609],[-74.433779,42.47144],[-74.43276899999999,42.473398],[-74.43269100000001,42.473635],[-74.429227,42.480444],[-74.413641,42.489622],[-74.41463,42.499358],[-74.414703,42.500076],[-74.414812,42.501935],[-74.402126,42.501917],[-74.40087,42.501892],[-74.394831,42.501928],[-74.39435899999999,42.501926],[-74.390728,42.501881],[-74.390019,42.501914],[-74.382516,42.501955],[-74.37810500000001,42.501994],[-74.378235,42.5019],[-74.378686,42.501566],[-74.378745,42.501507],[-74.378815,42.501346],[-74.378823,42.501236],[-74.378822,42.50121],[-74.378815,42.501083],[-74.37851999999999,42.500001],[-74.37870700000001,42.49948],[-74.37870700000001,42.499262],[-74.378692,42.499176],[-74.378614,42.499035],[-74.37850400000001,42.498926],[-74.378371,42.49884],[-74.378231,42.498785],[-74.37804300000001,42.498739],[-74.377903,42.498676],[-74.37777699999999,42.498575],[-74.377746,42.498504],[-74.37773799999999,42.498411],[-74.37777,42.498184],[-74.37781699999999,42.498106],[-74.37785599999999,42.497966],[-74.377892,42.497871],[-74.37790200000001,42.497815],[-74.377866,42.497744],[-74.377775,42.497658],[-74.377551,42.497541],[-74.37748499999999,42.497495],[-74.37732200000001,42.497424],[-74.376777,42.497286],[-74.376538,42.49721],[-74.37609999999999,42.497098],[-74.375693,42.49691],[-74.37539700000001,42.496757],[-74.375148,42.496671],[-74.375091,42.496666],[-74.375023,42.49666],[-74.37460400000001,42.496624],[-74.37390600000001,42.496118],[-74.37350000000001,42.495916],[-74.373029,42.495373],[-74.372827,42.49514],[-74.371599,42.494863],[-74.371471,42.494835],[-74.371228,42.494849],[-74.370701,42.494881],[-74.37059600000001,42.494887],[-74.370107,42.494917],[-74.369806,42.495166],[-74.36969499999999,42.495156],[-74.369282,42.495174],[-74.369218,42.495149],[-74.369057,42.495046],[-74.36899,42.494978],[-74.368911,42.494925],[-74.368801,42.494872],[-74.36864300000001,42.494774],[-74.36852500000001,42.494688],[-74.36837199999999,42.494446],[-74.368301,42.494382],[-74.368162,42.494222],[-74.36800100000001,42.494094],[-74.367816,42.493927],[-74.367651,42.493729],[-74.36743300000001,42.493434],[-74.367138,42.492993],[-74.36682999999999,42.492631],[-74.36672299999999,42.492482],[-74.36660500000001,42.492418],[-74.366423,42.492347],[-74.366282,42.492315],[-74.365747,42.492201],[-74.365464,42.492124],[-74.365072,42.49206],[-74.36478,42.492067],[-74.36465200000001,42.49211],[-74.36419600000001,42.49216],[-74.3633,42.492126],[-74.362679,42.492071],[-74.362483,42.492032],[-74.36233300000001,42.491982],[-74.36224,42.491975],[-74.361998,42.491975],[-74.361906,42.492014],[-74.36172000000001,42.492035],[-74.361332,42.491989],[-74.360921,42.491927],[-74.36081799999999,42.491888],[-74.360714,42.491809],[-74.360575,42.491685],[-74.36024399999999,42.491535],[-74.360134,42.491457],[-74.360055,42.49129],[-74.360027,42.491165],[-74.360032,42.491113],[-74.360061,42.491039],[-74.360125,42.49096],[-74.36017099999999,42.49085],[-74.36015999999999,42.490647],[-74.36013199999999,42.490558],[-74.360043,42.490476],[-74.359932,42.490348],[-74.35988999999999,42.490274],[-74.35987900000001,42.490209],[-74.359877,42.49004],[-74.35992,42.489838],[-74.35999099999999,42.489553],[-74.35999099999999,42.489489],[-74.35995200000001,42.489418],[-74.35976700000001,42.489279],[-74.359103,42.488971],[-74.358679,42.488854],[-74.358649,42.488844],[-74.35808,42.48875],[-74.356747,42.488485],[-74.35590500000001,42.488358],[-74.353847,42.488001],[-74.351562,42.487367],[-74.35084500000001,42.486687],[-74.350003,42.484273],[-74.35017499999999,42.483939],[-74.350797,42.483166],[-74.351091,42.481456],[-74.350831,42.480447],[-74.350686,42.479909],[-74.350143,42.479396],[-74.34964600000001,42.479124],[-74.349643,42.479113],[-74.34963500000001,42.478963],[-74.34961300000001,42.4789],[-74.34958899999999,42.478842],[-74.349294,42.478394],[-74.348865,42.47786],[-74.34871800000001,42.477773],[-74.348665,42.477709],[-74.34864,42.477645],[-74.348615,42.477463],[-74.348642,42.47738],[-74.34870600000001,42.477323],[-74.348795,42.477284],[-74.34887000000001,42.477262],[-74.348945,42.477191],[-74.348962,42.477148],[-74.349019,42.476874],[-74.34908299999999,42.47676],[-74.349137,42.476718],[-74.349169,42.476668],[-74.34917299999999,42.476613],[-74.34916699999999,42.476342],[-74.349121,42.476015],[-74.34905000000001,42.475855],[-74.348882,42.475705],[-74.348854,42.475655],[-74.34885,42.475552],[-74.348923,42.475362],[-74.34892600000001,42.474892],[-74.348952,42.474668],[-74.34895400000001,42.474514],[-74.348876,42.474442],[-74.34877,42.474285],[-74.348691,42.474189],[-74.34865600000001,42.474171],[-74.348574,42.474152],[-74.34841,42.474114],[-74.348264,42.474011],[-74.34819299999999,42.473986],[-74.347933,42.473958],[-74.34775500000001,42.473982],[-74.347551,42.474075],[-74.347477,42.474079],[-74.34738400000001,42.474111],[-74.347309,42.47416],[-74.347098,42.474205],[-74.34692699999999,42.474212],[-74.34685899999999,42.474176],[-74.346777,42.474152],[-74.346585,42.474141],[-74.346439,42.474184],[-74.34631400000001,42.47428],[-74.346189,42.474422],[-74.346104,42.474436],[-74.34606599999999,42.47442],[-74.346031,42.474388],[-74.345721,42.474388],[-74.34565000000001,42.47437],[-74.345596,42.474342],[-74.34547499999999,42.474328],[-74.34519400000001,42.474335],[-74.345112,42.474321],[-74.34499099999999,42.474256],[-74.344916,42.474203],[-74.344741,42.474107],[-74.344706,42.474032],[-74.344624,42.473958],[-74.34455800000001,42.473934],[-74.344472,42.473934],[-74.34424799999999,42.473906],[-74.344138,42.473877],[-74.344038,42.473867],[-74.343942,42.473838],[-74.343917,42.47381],[-74.343906,42.473646],[-74.343924,42.473607],[-74.343963,42.473586],[-74.34397,42.473522],[-74.343935,42.473493],[-74.343856,42.473465],[-74.343582,42.473443],[-74.343335,42.473456],[-74.34316,42.473367],[-74.34311,42.473281],[-74.343092,42.473157],[-74.343075,42.47311],[-74.34304299999999,42.473071],[-74.342786,42.472993],[-74.342733,42.47295],[-74.342651,42.472836],[-74.34257599999999,42.472762],[-74.34247999999999,42.472708],[-74.342291,42.472573],[-74.342218,42.47255],[-74.34208099999999,42.47255],[-74.34195800000001,42.472553],[-74.34188,42.472539],[-74.341858,42.472521],[-74.34183,42.47244],[-74.34183,42.47238],[-74.34186200000001,42.472265],[-74.341863,42.472225],[-74.341865,42.472183],[-74.34183299999999,42.472105],[-74.341801,42.471949],[-74.341776,42.471909],[-74.34172700000001,42.471906],[-74.34164800000001,42.471863],[-74.34162000000001,42.471813],[-74.341465,42.471701],[-74.34139,42.471555],[-74.34133300000001,42.471491],[-74.34134,42.471441],[-74.341369,42.471388],[-74.341379,42.471338],[-74.341351,42.471274],[-74.341301,42.471242],[-74.341098,42.471185],[-74.341014,42.470899],[-74.34101099999999,42.470746],[-74.340979,42.470514],[-74.340964,42.470087],[-74.340907,42.469902],[-74.34090399999999,42.469756],[-74.34087,42.469658],[-74.340802,42.469644],[-74.340671,42.469644],[-74.340592,42.469623],[-74.340557,42.46958],[-74.340542,42.46942],[-74.34053900000001,42.469288],[-74.340521,42.469224],[-74.340414,42.469114],[-74.340304,42.469053],[-74.34014000000001,42.468993],[-74.339962,42.46889],[-74.339848,42.468858],[-74.33956499999999,42.468831],[-74.33928,42.468849],[-74.33907000000001,42.468891],[-74.338927,42.468891],[-74.338735,42.468799],[-74.338688,42.468724],[-74.33855800000001,42.468388],[-74.33850099999999,42.468178],[-74.33848399999999,42.468164],[-74.33842300000001,42.468156],[-74.338252,42.468171],[-74.33808500000001,42.468149],[-74.337985,42.468121],[-74.33796100000001,42.468101],[-74.337946,42.468089],[-74.337934,42.468044],[-74.33792099999999,42.467979],[-74.337828,42.467776],[-74.337778,42.467747],[-74.337704,42.467719],[-74.33767899999999,42.467673],[-74.337665,42.467533],[-74.33765200000001,42.467272],[-74.33762,42.467165],[-74.337542,42.46708],[-74.337428,42.466991],[-74.337253,42.466909],[-74.337,42.466809],[-74.33676199999999,42.466728],[-74.336555,42.46672],[-74.33633399999999,42.466763],[-74.336286,42.466765],[-74.33624500000001,42.466756],[-74.33622200000001,42.466736],[-74.336215,42.46664],[-74.336254,42.466516],[-74.336275,42.466334],[-74.33627199999999,42.466249],[-74.336215,42.466128],[-74.33617599999999,42.466082],[-74.33615399999999,42.465993],[-74.33617,42.465934],[-74.33616000000001,42.465852],[-74.33611999999999,42.465806],[-74.33610299999999,42.465724],[-74.33594600000001,42.465617],[-74.33589600000001,42.465567],[-74.33586099999999,42.465514],[-74.335864,42.465421],[-74.33590700000001,42.465365],[-74.335903,42.465244],[-74.335882,42.465215],[-74.33581100000001,42.465169],[-74.335814,42.465119],[-74.33588899999999,42.465087],[-74.335903,42.465037],[-74.335903,42.46498],[-74.335886,42.464955],[-74.335886,42.464912],[-74.335902,42.464886],[-74.33593399999999,42.464868],[-74.336016,42.464854],[-74.336033,42.464825],[-74.336162,42.464733],[-74.336212,42.464676],[-74.336218,42.464594],[-74.336186,42.464537],[-74.33619400000001,42.464491],[-74.33622200000001,42.464469],[-74.33624399999999,42.464391],[-74.336226,42.464366],[-74.33614,42.464388],[-74.336023,42.464306],[-74.335959,42.464299],[-74.335909,42.464263],[-74.335891,42.464231],[-74.33578799999999,42.464142],[-74.335773,42.464053],[-74.335752,42.464021],[-74.335731,42.46401],[-74.33563599999999,42.464008],[-74.335601,42.464019],[-74.33559,42.464037],[-74.33556900000001,42.464048],[-74.335508,42.464051],[-74.33541200000001,42.463984],[-74.335341,42.463895],[-74.335302,42.463877],[-74.33520900000001,42.463884],[-74.335177,42.463927],[-74.33516299999999,42.463969],[-74.335187,42.464051],[-74.335187,42.46409],[-74.33508399999999,42.464137],[-74.334913,42.464144],[-74.334806,42.464176],[-74.334689,42.464229],[-74.334586,42.464311],[-74.33437600000001,42.464578],[-74.33428600000001,42.464606],[-74.33395899999999,42.464628],[-74.333827,42.464628],[-74.333809,42.464553],[-74.333777,42.464521],[-74.33370600000001,42.464514],[-74.333564,42.464574],[-74.333482,42.464585],[-74.333321,42.464578],[-74.33321100000001,42.464603],[-74.333001,42.464596],[-74.332801,42.464614],[-74.33274400000001,42.464596],[-74.33273,42.4645],[-74.332705,42.464489],[-74.332605,42.464475],[-74.332534,42.46445],[-74.332459,42.464389],[-74.332381,42.464368],[-74.332356,42.46435],[-74.33232099999999,42.464343],[-74.332274,42.464354],[-74.332228,42.464379],[-74.332185,42.464425],[-74.332128,42.464453],[-74.33204600000001,42.464468],[-74.33178599999999,42.464468],[-74.33171299999999,42.464477],[-74.33147099999999,42.464615],[-74.331396,42.46463],[-74.33122899999999,42.46463],[-74.331101,42.464576],[-74.330834,42.464427],[-74.33063799999999,42.464299],[-74.33037400000001,42.464067],[-74.330208,42.464012],[-74.32956,42.464026],[-74.32946099999999,42.464016],[-74.329386,42.463987],[-74.329354,42.463959],[-74.329325,42.463902],[-74.32933199999999,42.463699],[-74.329318,42.463642],[-74.329286,42.463589],[-74.329204,42.463539],[-74.329008,42.463471],[-74.328953,42.463466],[-74.328885,42.463491],[-74.328796,42.46354],[-74.328693,42.463647],[-74.32861800000001,42.463754],[-74.328579,42.463768],[-74.328543,42.463768],[-74.32847599999999,42.463743],[-74.328262,42.463626],[-74.327924,42.463387],[-74.32768,42.463311],[-74.32753,42.463304],[-74.327484,42.46329],[-74.327459,42.463247],[-74.327495,42.463204],[-74.327495,42.463183],[-74.327455,42.463126],[-74.32737,42.463076],[-74.327331,42.463073],[-74.32728400000001,42.463083],[-74.327235,42.463083],[-74.327085,42.463033],[-74.32699100000001,42.462985],[-74.326976,42.46295],[-74.326976,42.462789],[-74.326948,42.462583],[-74.326916,42.462526],[-74.326852,42.462491],[-74.32682699999999,42.462437],[-74.32682,42.462352],[-74.326787,42.462291],[-74.32669799999999,42.462195],[-74.32665900000001,42.462117],[-74.326616,42.461914],[-74.32649499999999,42.461732],[-74.32633,42.461378],[-74.32626500000001,42.461298],[-74.326314,42.461269],[-74.326487,42.461199],[-74.326595,42.461173],[-74.32687199999999,42.461132],[-74.326363,42.460909],[-74.32611300000001,42.460775],[-74.326127,42.460645],[-74.32626,42.460469],[-74.326335,42.460434],[-74.32680499999999,42.460256],[-74.32722200000001,42.460131],[-74.327457,42.46012],[-74.32748599999999,42.460099],[-74.32750900000001,42.460005],[-74.32758,42.459987],[-74.327608,42.459969],[-74.327619,42.459869],[-74.327769,42.45982],[-74.32781900000001,42.459788],[-74.327861,42.459716],[-74.327865,42.45967],[-74.327811,42.459528],[-74.327868,42.459485],[-74.32790799999999,42.459474],[-74.327932,42.459439],[-74.327943,42.459307],[-74.328018,42.459197],[-74.328125,42.459158],[-74.328171,42.459151],[-74.32820700000001,42.459158],[-74.32823500000001,42.459143],[-74.328312,42.458878],[-74.328424,42.458756],[-74.328452,42.458695],[-74.328481,42.458453],[-74.328502,42.458414],[-74.32854500000001,42.458396],[-74.328581,42.458368],[-74.32860599999999,42.458275],[-74.328638,42.458222],[-74.328659,42.458158],[-74.32866300000001,42.458108],[-74.328688,42.458062],[-74.32878700000001,42.45798],[-74.32879800000001,42.457919],[-74.328827,42.457862],[-74.328923,42.45782],[-74.329019,42.457795],[-74.329026,42.457777],[-74.329019,42.457748],[-74.32898,42.457716],[-74.328969,42.457677],[-74.32902900000001,42.457578],[-74.32907899999999,42.457528],[-74.329126,42.457496],[-74.329211,42.457339],[-74.3292,42.457229],[-74.32914700000001,42.457051],[-74.32914700000001,42.457008],[-74.32917500000001,42.456958],[-74.32926399999999,42.45693],[-74.329296,42.456901],[-74.32930399999999,42.45682],[-74.32929300000001,42.45677],[-74.329307,42.456709],[-74.329339,42.456663],[-74.329385,42.456624],[-74.329528,42.456542],[-74.32956,42.456492],[-74.32958499999999,42.456424],[-74.32960300000001,42.456175],[-74.32958499999999,42.45593],[-74.329596,42.455859],[-74.32961299999999,42.455829],[-74.329587,42.455487],[-74.329207,42.452503],[-74.327392,42.437117],[-74.331718,42.436834],[-74.333262,42.436766],[-74.349543,42.435661],[-74.36742599999999,42.434517],[-74.369455,42.434397],[-74.377139,42.433944],[-74.377396,42.433711],[-74.388232,42.423644],[-74.388893,42.423015],[-74.416352,42.397521],[-74.417891,42.396256],[-74.41794899999999,42.396199],[-74.419923,42.394204],[-74.4218,42.39246],[-74.421909,42.392358],[-74.43104200000001,42.383874],[-74.432278,42.382726],[-74.433065,42.381999],[-74.434746,42.38044],[-74.435355,42.379123],[-74.43605599999999,42.378427],[-74.437591,42.377488],[-74.43828999999999,42.376978],[-74.439305,42.3761],[-74.439689,42.375595],[-74.439943,42.375066],[-74.440241,42.374466],[-74.440754,42.373261],[-74.440985,42.371773],[-74.44074999999999,42.370309],[-74.439865,42.368506],[-74.43829700000001,42.366501],[-74.43746299999999,42.365479],[-74.436784,42.364295],[-74.43641700000001,42.362896],[-74.43638900000001,42.361182],[-74.436893,42.35943],[-74.437416,42.357967],[-74.437743,42.357099],[-74.43815499999999,42.35658],[-74.443506,42.355017],[-74.44436899999999,42.355364],[-74.44448,42.355409],[-74.444667,42.355484],[-74.444693,42.355495],[-74.44544500000001,42.355796],[-74.45622400000001,42.360126],[-74.467889,42.364811],[-74.476195,42.368147],[-74.476274,42.368178],[-74.47623299999999,42.368211],[-74.476125,42.368299],[-74.475855,42.368561],[-74.47569799999999,42.368745],[-74.47548399999999,42.369061],[-74.47457300000001,42.370474],[-74.474345,42.370804],[-74.474222,42.370943],[-74.473996,42.371156],[-74.473776,42.371332],[-74.47350299999999,42.371519],[-74.473336,42.371619],[-74.472965,42.371792],[-74.472504,42.371967],[-74.47213499999999,42.372089],[-74.47162299999999,42.372244],[-74.47107099999999,42.372437],[-74.47084599999999,42.372543],[-74.47074000000001,42.372602],[-74.470505,42.372782],[-74.470153,42.373136],[-74.470039,42.373268],[-74.46984500000001,42.373492],[-74.46966399999999,42.373658],[-74.469205,42.374014],[-74.468903,42.374293],[-74.468788,42.374416],[-74.468504,42.374833],[-74.468371,42.375039],[-74.46819600000001,42.375292],[-74.468068,42.375442],[-74.467777,42.375707],[-74.466494,42.376766],[-74.466347,42.376897],[-74.46624199999999,42.377014],[-74.466177,42.377109],[-74.466117,42.377205],[-74.466065,42.377303],[-74.466024,42.37741],[-74.465992,42.377521],[-74.465965,42.377696],[-74.46596,42.37817],[-74.465947,42.378493],[-74.465932,42.378642],[-74.465918,42.378733],[-74.46587100000001,42.378907],[-74.465813,42.379071],[-74.46575900000001,42.379209],[-74.465703,42.379325],[-74.46565699999999,42.379411],[-74.465588,42.379516],[-74.465519,42.379605],[-74.46541000000001,42.37974],[-74.465322,42.379835],[-74.465186,42.379965],[-74.46507800000001,42.380059],[-74.46496,42.380151],[-74.464826,42.380238],[-74.46469999999999,42.380313],[-74.46447000000001,42.380437],[-74.464063,42.380616],[-74.463256,42.380978],[-74.46299399999999,42.381131],[-74.46297300000001,42.381148],[-74.46284900000001,42.381246],[-74.46269599999999,42.381367],[-74.462521,42.381534],[-74.461499,42.382765],[-74.461189,42.383165],[-74.46091699999999,42.38359],[-74.46084500000001,42.383724],[-74.46072599999999,42.384007],[-74.46063599999999,42.384289],[-74.46055800000001,42.384635],[-74.460533,42.385066],[-74.46056299999999,42.385438],[-74.46067600000001,42.386035],[-74.46072700000001,42.386352],[-74.460747,42.386718],[-74.460736,42.386844],[-74.460686,42.38714],[-74.460554,42.38767],[-74.460424,42.38831],[-74.460397,42.388526],[-74.460387,42.38862],[-74.46038799999999,42.38929],[-74.46041099999999,42.391278],[-74.460424,42.391852],[-74.46045700000001,42.392183],[-74.46053499999999,42.392527],[-74.460624,42.392792],[-74.460667,42.392918],[-74.460797,42.393211],[-74.461054,42.393702],[-74.461217,42.394014],[-74.461624,42.394733],[-74.461861,42.395067],[-74.462136,42.395378],[-74.462817,42.396062],[-74.463123,42.396327],[-74.463494,42.396694],[-74.466036,42.399262],[-74.466745,42.399956],[-74.46709199999999,42.400302],[-74.467463,42.400692],[-74.46769999999999,42.400972],[-74.46798099999999,42.40137],[-74.469582,42.403783],[-74.47012599999999,42.404618],[-74.47035700000001,42.404982],[-74.470467,42.405183],[-74.470607,42.40548],[-74.470814,42.405998],[-74.471334,42.407416],[-74.471765,42.408465],[-74.471914,42.408744],[-74.472076,42.408988],[-74.472763,42.409962],[-74.472943,42.410231],[-74.473088,42.410499],[-74.47321599999999,42.410792],[-74.473339,42.411139],[-74.473544,42.411833],[-74.47373899999999,42.412239],[-74.473939,42.412527],[-74.474163,42.412777],[-74.47495000000001,42.413548],[-74.475207,42.413815],[-74.476111,42.414707],[-74.47633,42.414971],[-74.476501,42.415242],[-74.476648,42.41564],[-74.476752,42.416154],[-74.47708,42.418125],[-74.477121,42.418552],[-74.477114,42.418833]]],"type":"Polygon"}
}