{
  "id": "360810540003",
  "type": "Feature",
  "properties": {
    "area_land":146534,
    "area_water":0,
    "geoid":"360810540003",
    "name":"Block Group 3",
    "state":"ny"
},
  "bbox": [
    -73.741633,
    40.710632,
    -73.734911,
    40.714852
],
  "geometry": {"coordinates":[[[-73.74163299999999,40.714786],[-73.741073,40.714852],[-73.74021500000001,40.7146],[-73.738929,40.714222],[-73.738118,40.713985],[-73.73666,40.713553],[-73.735856,40.713305],[-73.734911,40.713025],[-73.735539,40.71186],[-73.73639799999999,40.712127],[-73.73645500000001,40.712042],[-73.73757000000001,40.711684],[-73.737649,40.711662],[-73.739419,40.7111],[-73.739951,40.710928],[-73.74040100000001,40.710776],[-73.740847,40.710632],[-73.74099200000001,40.7114],[-73.741041,40.711658],[-73.74115500000001,40.712259],[-73.741283,40.712923],[-73.74141,40.713593],[-73.74163299999999,40.714786]]],"type":"Polygon"}
}