{
  "id": "361190021011",
  "type": "Feature",
  "properties": {
    "area_land":247599,
    "area_water":0,
    "geoid":"361190021011",
    "name":"Block Group 1",
    "state":"ny"
},
  "bbox": [
    -73.834346,
    40.979533,
    -73.825437,
    40.986315
],
  "geometry": {"coordinates":[[[-73.834346,40.983114],[-73.83354199999999,40.983528],[-73.832719,40.983937],[-73.83278199999999,40.984061],[-73.832854,40.984182],[-73.832911,40.984304],[-73.83301,40.984517],[-73.83322699999999,40.984937],[-73.833308,40.98505],[-73.83340099999999,40.985147],[-73.831458,40.985567],[-73.830691,40.985329],[-73.830187,40.985629],[-73.82838,40.985882],[-73.82543699999999,40.986315],[-73.82575300000001,40.98589],[-73.825793,40.985836],[-73.82675999999999,40.984738],[-73.827398,40.983922],[-73.827574,40.983726],[-73.828191,40.982977],[-73.828563,40.982515],[-73.82871900000001,40.982312],[-73.828988,40.981961],[-73.82951,40.981353],[-73.829921,40.980798],[-73.82998000000001,40.980692],[-73.83008700000001,40.980498],[-73.830225,40.980167],[-73.830422,40.979533],[-73.83041299999999,40.979856],[-73.830427,40.97996],[-73.830517,40.980276],[-73.830585,40.980586],[-73.830614,40.980874],[-73.830634,40.980959],[-73.830679,40.98108],[-73.830883,40.981627],[-73.83104,40.981575],[-73.831108,40.981539],[-73.83172500000001,40.980996],[-73.831836,40.980935],[-73.83189900000001,40.980917],[-73.832066,40.980888],[-73.83220900000001,40.980892],[-73.832335,40.980917],[-73.83242799999999,40.980956],[-73.832736,40.981169],[-73.832909,40.981288],[-73.833716,40.98189],[-73.833963,40.982084],[-73.83402,40.982113],[-73.833898,40.982254],[-73.833872,40.982333],[-73.833883,40.982509],[-73.833966,40.982661],[-73.834346,40.983114]]],"type":"Polygon"}
}