{
  "id": "360810238004",
  "type": "Feature",
  "properties": {
    "area_land":29032,
    "area_water":0,
    "geoid":"360810238004",
    "name":"Block Group 4",
    "state":"ny"
},
  "bbox": [
    -73.811773,
    40.703052,
    -73.808788,
    40.704848
],
  "geometry": {"coordinates":[[[-73.811773,40.704181],[-73.811054,40.704362],[-73.81017199999999,40.704603],[-73.80972199999999,40.704725],[-73.809268,40.704848],[-73.80878800000001,40.703822],[-73.809229,40.703704],[-73.809693,40.703578],[-73.81057800000001,40.703338],[-73.811632,40.703052],[-73.811713,40.703662],[-73.811773,40.704181]]],"type":"Polygon"}
}