{
  "id": "360290100033",
  "type": "Feature",
  "properties": {
    "area_land":223202,
    "area_water":0,
    "geoid":"360290100033",
    "name":"Block Group 3",
    "state":"ny"
},
  "bbox": [
    -78.749961,
    42.918764,
    -78.737551,
    42.922584
],
  "geometry": {"coordinates":[[[-78.74995699999999,42.919758],[-78.749945,42.920287],[-78.747401,42.92029],[-78.74649599999999,42.920292],[-78.74649599999999,42.920274],[-78.74645,42.920276],[-78.746368,42.920277],[-78.744505,42.920271],[-78.744512,42.920581],[-78.74451000000001,42.920925],[-78.74451000000001,42.921009],[-78.743022,42.921007],[-78.743025,42.921832],[-78.743948,42.921831],[-78.744007,42.921845],[-78.74406500000001,42.921874],[-78.74410899999999,42.921915],[-78.74413300000001,42.921963],[-78.744141,42.922472],[-78.744118,42.922516],[-78.744075,42.922553],[-78.74402499999999,42.922574],[-78.743962,42.922584],[-78.740477,42.922582],[-78.73990000000001,42.921833],[-78.739463,42.921262],[-78.739262,42.921001],[-78.73893200000001,42.920583],[-78.73809900000001,42.91948],[-78.737551,42.918764],[-78.739052,42.918794],[-78.739802,42.918797],[-78.740702,42.918801],[-78.746486,42.918819],[-78.74649100000001,42.919572],[-78.747882,42.919575],[-78.749,42.919571],[-78.749961,42.919577],[-78.74995699999999,42.919758]]],"type":"Polygon"}
}