{
  "id": "360850303012",
  "type": "Feature",
  "properties": {
    "area_land":376491,
    "area_water":0,
    "geoid":"360850303012",
    "name":"Block Group 2",
    "state":"ny"
},
  "bbox": [
    -74.157312,
    40.612322,
    -74.146145,
    40.625104
],
  "geometry": {"coordinates":[[[-74.157084,40.615651],[-74.157048,40.615737],[-74.15675899999999,40.616363],[-74.156136,40.617353],[-74.155778,40.617922],[-74.155243,40.618432],[-74.15500299999999,40.618649],[-74.154792,40.61884],[-74.154291,40.6193],[-74.154175,40.619402],[-74.153707,40.619816],[-74.15364700000001,40.619869],[-74.153547,40.619931],[-74.153177,40.620162],[-74.153116,40.6202],[-74.15299899999999,40.620273],[-74.152394,40.620663],[-74.151793,40.621041],[-74.15154099999999,40.621202],[-74.15130600000001,40.621353],[-74.150948,40.621588],[-74.15067000000001,40.621836],[-74.15032100000001,40.62215],[-74.150006,40.622435],[-74.149614,40.622793],[-74.149503,40.622923],[-74.14939099999999,40.623103],[-74.149241,40.623329],[-74.149151,40.623598],[-74.14909,40.623724],[-74.148988,40.62419],[-74.148768,40.625104],[-74.1467,40.624914],[-74.14632899999999,40.624923],[-74.146145,40.62493],[-74.14633600000001,40.624416],[-74.14648699999999,40.623991],[-74.146742,40.623546],[-74.147054,40.622971],[-74.147389,40.622476],[-74.14769,40.622072],[-74.151983,40.61753],[-74.152496,40.616556],[-74.15304999999999,40.614692],[-74.153144,40.614372],[-74.153558,40.612749],[-74.153689,40.612322],[-74.15382,40.612428],[-74.15470500000001,40.613146],[-74.15491299999999,40.613308],[-74.15599400000001,40.61414],[-74.15638,40.614436],[-74.157312,40.615155],[-74.157084,40.615651]]],"type":"Polygon"}
}