{
  "id": "360290113001",
  "type": "Feature",
  "properties": {
    "area_land":4035346,
    "area_water":91580,
    "geoid":"360290113001",
    "name":"Block Group 1",
    "state":"ny"
},
  "bbox": [
    -78.800245,
    42.849183,
    -78.754514,
    42.871731
],
  "geometry": {"coordinates":[[[-78.800161,42.86152],[-78.800087,42.863752],[-78.800082,42.864425],[-78.80007999999999,42.864844],[-78.800145,42.865986],[-78.800122,42.867135],[-78.79960199999999,42.867313],[-78.799595,42.86862],[-78.79956900000001,42.870072],[-78.799555,42.871212],[-78.799921,42.87123],[-78.799904,42.871731],[-78.79985000000001,42.87173],[-78.79904500000001,42.871719],[-78.79883,42.871715],[-78.798064,42.871698],[-78.797878,42.871694],[-78.797095,42.871676],[-78.796958,42.871673],[-78.796119,42.871655],[-78.796025,42.871653],[-78.795005,42.87163],[-78.793261,42.871592],[-78.792517,42.871575],[-78.792349,42.871571],[-78.79196,42.871568],[-78.79013500000001,42.871561],[-78.789796,42.87156],[-78.789698,42.871555],[-78.789675,42.871554],[-78.788104,42.871512],[-78.787367,42.871492],[-78.78729,42.871489],[-78.785021,42.871403],[-78.784099,42.871217],[-78.78354,42.871104],[-78.782499,42.870826],[-78.780405,42.870008],[-78.779689,42.869703],[-78.77733600000001,42.868728],[-78.77664300000001,42.868435],[-78.776229,42.868264],[-78.77607999999999,42.868175],[-78.77178499999999,42.86513],[-78.771112,42.864652],[-78.770337,42.864103],[-78.765844,42.860906],[-78.76483500000001,42.860192],[-78.76447,42.859934],[-78.763578,42.859303],[-78.763473,42.859228],[-78.761166,42.857598],[-78.759934,42.856739],[-78.758942,42.856358],[-78.75864,42.856267],[-78.757328,42.855872],[-78.75520899999999,42.855249],[-78.754648,42.855153],[-78.754648,42.855084],[-78.754648,42.855043],[-78.754648,42.854752],[-78.754645,42.854678],[-78.754633,42.854341],[-78.75462899999999,42.854126],[-78.754621,42.853868],[-78.754615,42.85367],[-78.75461199999999,42.853574],[-78.754578,42.852511],[-78.754565,42.852024],[-78.75454999999999,42.851495],[-78.754535,42.851178],[-78.754514,42.850452],[-78.754921,42.850457],[-78.75585700000001,42.850461],[-78.756682,42.850472],[-78.75814699999999,42.850485],[-78.759607,42.850507],[-78.760221,42.850516],[-78.761573,42.850537],[-78.76156899999999,42.850626],[-78.761563,42.850746],[-78.761537,42.851795],[-78.76153600000001,42.85183],[-78.76153499999999,42.851868],[-78.761534,42.851922],[-78.761527,42.851978],[-78.76149100000001,42.853554],[-78.762845,42.853541],[-78.763092,42.853534],[-78.76495799999999,42.853532],[-78.76581299999999,42.853526],[-78.766374,42.853528],[-78.767809,42.853516],[-78.768058,42.853517],[-78.768783,42.853683],[-78.77046799999999,42.85123],[-78.77061500000001,42.850977],[-78.770657,42.850892],[-78.770702,42.850784],[-78.770726,42.850659],[-78.77072099999999,42.850493],[-78.770697,42.850299],[-78.770612,42.850083],[-78.77046,42.849842],[-78.77036200000001,42.849713],[-78.77020400000001,42.849548],[-78.76993299999999,42.849386],[-78.769656,42.849261],[-78.769783,42.849183],[-78.769834,42.849188],[-78.770319,42.849267],[-78.771017,42.849403],[-78.772886,42.849967],[-78.773432,42.850132],[-78.775868,42.850869],[-78.78783799999999,42.85449],[-78.787837,42.854545],[-78.787284,42.854533],[-78.786663,42.854519],[-78.785584,42.854496],[-78.78451800000001,42.854476],[-78.78343599999999,42.854457],[-78.782873,42.854445],[-78.77987299999999,42.854377],[-78.77777500000001,42.854332],[-78.777016,42.854315],[-78.77596800000001,42.854291],[-78.77489799999999,42.854267],[-78.773821,42.854243],[-78.772893,42.854223],[-78.771157,42.854187],[-78.771355,42.854315],[-78.77282200000001,42.855254],[-78.773734,42.855987],[-78.77475200000001,42.856816],[-78.77483700000001,42.856886],[-78.775764,42.857644],[-78.776066,42.857888],[-78.77651400000001,42.858252],[-78.77722300000001,42.858829],[-78.77866,42.860003],[-78.77902899999999,42.860304],[-78.77923199999999,42.86047],[-78.78177700000001,42.862566],[-78.78252500000001,42.86318],[-78.783012,42.863396],[-78.783056,42.863422],[-78.78310500000001,42.863441],[-78.784149,42.863734],[-78.784494,42.863829],[-78.78522100000001,42.864028],[-78.785757,42.864175],[-78.786185,42.864267],[-78.787244,42.864496],[-78.787604,42.864546],[-78.788518,42.864674],[-78.789584,42.864827],[-78.790494,42.864958],[-78.790665,42.864911],[-78.79169400000001,42.864633],[-78.791769,42.86264],[-78.791769,42.862294],[-78.791887,42.859536],[-78.79190800000001,42.85806],[-78.791877,42.857562],[-78.79177300000001,42.857097],[-78.791433,42.856017],[-78.791254,42.855523],[-78.791617,42.855633],[-78.792085,42.855774],[-78.79285299999999,42.856007],[-78.796003,42.856959],[-78.79727200000001,42.857342],[-78.797611,42.857445],[-78.79844199999999,42.857687],[-78.798891,42.857848],[-78.799243,42.857983],[-78.799543,42.858129],[-78.799953,42.858352],[-78.800245,42.858477],[-78.800161,42.86152]]],"type":"Polygon"}
}