{
  "id": "361031477012",
  "type": "Feature",
  "properties": {
    "area_land":830914,
    "area_water":0,
    "geoid":"361031477012",
    "name":"Block Group 2",
    "state":"ny"
},
  "bbox": [
    -73.096422,
    40.740342,
    -73.084858,
    40.756922
],
  "geometry": {"coordinates":[[[-73.096422,40.756862],[-73.09554,40.756922],[-73.095063,40.75619],[-73.09327999999999,40.753421],[-73.092885,40.752787],[-73.092446,40.75211],[-73.091899,40.751261],[-73.09147400000001,40.7506],[-73.09089299999999,40.749694],[-73.090152,40.748548],[-73.088238,40.74558],[-73.087941,40.745095],[-73.086955,40.743571],[-73.086885,40.743483],[-73.086085,40.742263],[-73.085117,40.740747],[-73.084858,40.740342],[-73.088098,40.740368],[-73.09068600000001,40.740479],[-73.09276699999999,40.740568],[-73.095518,40.740714],[-73.095541,40.741603],[-73.095564,40.742473],[-73.095595,40.74361],[-73.095647,40.745553],[-73.094894,40.745562],[-73.095156,40.747575],[-73.09544200000001,40.749627],[-73.09573,40.751698],[-73.096422,40.756862]]],"type":"Polygon"}
}