{
  "id": "360850277052",
  "type": "Feature",
  "properties": {
    "area_land":162114,
    "area_water":0,
    "geoid":"360850277052",
    "name":"Block Group 2",
    "state":"ny"
},
  "bbox": [
    -74.161265,
    40.585087,
    -74.153895,
    40.590152
],
  "geometry": {"coordinates":[[[-74.161265,40.588077],[-74.160314,40.589028],[-74.159194,40.590152],[-74.15844199999999,40.589727],[-74.15766000000001,40.589283],[-74.15507100000001,40.587814],[-74.154681,40.587594],[-74.15389500000001,40.58715],[-74.155931,40.585087],[-74.156717,40.585521],[-74.157481,40.585941],[-74.158249,40.586363],[-74.159019,40.586787],[-74.159775,40.587207],[-74.160521,40.587642],[-74.161265,40.588077]]],"type":"Polygon"}
}