{
  "id": "360470370002",
  "type": "Feature",
  "properties": {
    "area_land":55604,
    "area_water":0,
    "geoid":"360470370002",
    "name":"Block Group 2",
    "state":"ny"
},
  "bbox": [
    -73.963369,
    40.587018,
    -73.96035,
    40.589453
],
  "geometry": {"coordinates":[[[-73.963369,40.589136],[-73.962444,40.589239],[-73.960517,40.589453],[-73.96046,40.588724],[-73.960408,40.588034],[-73.96035000000001,40.587307],[-73.962045,40.587122],[-73.962969,40.587018],[-73.963369,40.589136]]],"type":"Polygon"}
}