{
  "id": "360070137001",
  "type": "Feature",
  "properties": {
    "area_land":246147,
    "area_water":21887,
    "geoid":"360070137001",
    "name":"Block Group 1",
    "state":"ny"
},
  "bbox": [
    -76.044257,
    42.096181,
    -76.03614,
    42.102668
],
  "geometry": {"coordinates":[[[-76.044257,42.100355],[-76.04355700000001,42.100673],[-76.043491,42.100703],[-76.043126,42.100871],[-76.04259399999999,42.101099],[-76.041898,42.101429],[-76.041093,42.101801],[-76.04080500000001,42.101926],[-76.040594,42.102019],[-76.04022000000001,42.102174],[-76.039704,42.102353],[-76.03927899999999,42.1025],[-76.038785,42.102668],[-76.03807,42.101516],[-76.037047,42.100177],[-76.036767,42.099925],[-76.03632399999999,42.099548],[-76.03614,42.099207],[-76.036244,42.099183],[-76.041597,42.097091],[-76.04388,42.096199],[-76.043931,42.096181],[-76.04397299999999,42.096635],[-76.044003,42.097308],[-76.044023,42.097796],[-76.044037,42.097943],[-76.044049,42.098075],[-76.044156,42.09925],[-76.04424899999999,42.100266],[-76.044257,42.100355]]],"type":"Polygon"}
}