{
  "id": "360150101002",
  "type": "Feature",
  "properties": {
    "area_land":62309914,
    "area_water":110184,
    "geoid":"360150101002",
    "name":"Block Group 2",
    "state":"ny"
},
  "bbox": [
    -76.726295,
    42.127362,
    -76.611066,
    42.207903
],
  "geometry": {"coordinates":[[[-76.72629499999999,42.171946],[-76.725148,42.171673],[-76.72450000000001,42.171605],[-76.724065,42.17163],[-76.72360399999999,42.171682],[-76.723024,42.171827],[-76.72257999999999,42.172006],[-76.72229799999999,42.172211],[-76.72206799999999,42.17239],[-76.721659,42.172594],[-76.72045199999999,42.173031],[-76.71942300000001,42.173365],[-76.719038,42.173483],[-76.718633,42.173608],[-76.717896,42.173776],[-76.717179,42.173938],[-76.715583,42.174203],[-76.713126,42.174672],[-76.71166100000001,42.174939],[-76.708016,42.175598],[-76.704722,42.176187],[-76.70301499999999,42.176519],[-76.701505,42.176861],[-76.70018,42.177224],[-76.699248,42.177465],[-76.698785,42.177584],[-76.697491,42.177867],[-76.6969,42.177996],[-76.69363,42.178781],[-76.693018,42.178937],[-76.691536,42.179274],[-76.68965799999999,42.179749],[-76.688675,42.180014],[-76.687687,42.18033],[-76.68684399999999,42.180712],[-76.68658600000001,42.180718],[-76.686036,42.180732],[-76.683863,42.180786],[-76.683312,42.1808],[-76.68302199999999,42.1808],[-76.682717,42.180777],[-76.682472,42.180723],[-76.682373,42.180689],[-76.682121,42.180628],[-76.681297,42.180285],[-76.681023,42.180178],[-76.680542,42.179987],[-76.68047199999999,42.17996],[-76.680424,42.179941],[-76.680357,42.179915],[-76.68016799999999,42.179842],[-76.679924,42.179752],[-76.67952699999999,42.179606],[-76.67923,42.179568],[-76.67892399999999,42.179541],[-76.67868799999999,42.179545],[-76.678314,42.179568],[-76.675444,42.179786],[-76.67517700000001,42.179806],[-76.674927,42.179817],[-76.674509,42.179802],[-76.67428200000001,42.179746],[-76.674031,42.179671],[-76.67354,42.179494],[-76.673225,42.179331],[-76.670158,42.178175],[-76.668685,42.177618],[-76.668243,42.177477],[-76.667823,42.177382],[-76.667137,42.177347],[-76.66654200000001,42.177382],[-76.666183,42.177416],[-76.66448200000001,42.177507],[-76.664649,42.177847],[-76.665992,42.180086],[-76.666231,42.180489],[-76.666335,42.180752],[-76.666358,42.18102],[-76.666335,42.18345],[-76.666335,42.185072],[-76.666268,42.185753],[-76.66623800000001,42.186057],[-76.665955,42.188921],[-76.665879,42.189706],[-76.663568,42.189693],[-76.661231,42.191424],[-76.66049099999999,42.19208],[-76.660239,42.192312],[-76.65991099999999,42.192652],[-76.659476,42.193148],[-76.65901100000001,42.193766],[-76.6585,42.19446],[-76.65830099999999,42.194708],[-76.658126,42.194948],[-76.658019,42.195086],[-76.657157,42.19602],[-76.65701199999999,42.196283],[-76.65689,42.196535],[-76.656508,42.197706],[-76.65634,42.197985],[-76.65607300000001,42.198313],[-76.65570700000001,42.198626],[-76.655379,42.19887],[-76.65505899999999,42.199026],[-76.65476099999999,42.199152],[-76.654387,42.199274],[-76.653037,42.199488],[-76.65275099999999,42.199529],[-76.651763,42.199671],[-76.651595,42.199686],[-76.651167,42.19982],[-76.65074799999999,42.20001],[-76.650527,42.20014],[-76.650328,42.200281],[-76.649901,42.200632],[-76.649603,42.200854],[-76.649344,42.201018],[-76.649046,42.201174],[-76.648764,42.201315],[-76.648489,42.201437],[-76.64819199999999,42.201544],[-76.646361,42.201971],[-76.646101,42.202036],[-76.64577300000001,42.20207],[-76.645354,42.202089],[-76.64491099999999,42.202036],[-76.64416300000001,42.201925],[-76.63915799999999,42.201006],[-76.63886100000001,42.200976],[-76.638548,42.200949],[-76.63823499999999,42.201006],[-76.637968,42.201098],[-76.637625,42.201273],[-76.63735,42.201368],[-76.637022,42.201498],[-76.636679,42.201674],[-76.63622100000001,42.201918],[-76.63561,42.20236],[-76.635389,42.202528],[-76.63506099999999,42.202852],[-76.63484699999999,42.203108],[-76.634626,42.203398],[-76.634413,42.203745],[-76.634191,42.204069],[-76.633985,42.204417],[-76.63387899999999,42.204676],[-76.633802,42.205],[-76.633787,42.205267],[-76.633802,42.205652],[-76.633703,42.205744],[-76.63353499999999,42.205828],[-76.631236,42.206857],[-76.63091799999999,42.206999],[-76.627538,42.207819],[-76.626851,42.207895],[-76.626546,42.207903],[-76.62015,42.207825],[-76.619878,42.207814],[-76.61975,42.207761],[-76.619606,42.207665],[-76.61949199999999,42.207527],[-76.619148,42.206761],[-76.61844600000001,42.205921],[-76.61823099999999,42.205697],[-76.618032,42.205599],[-76.617833,42.205549],[-76.616517,42.205525],[-76.61627799999999,42.205526],[-76.616135,42.205502],[-76.61597500000001,42.205431],[-76.615354,42.204945],[-76.61459000000001,42.204546],[-76.61433100000001,42.20439],[-76.61390400000001,42.2041],[-76.61377400000001,42.203959],[-76.613477,42.203577],[-76.613294,42.20339],[-76.612996,42.20318],[-76.612737,42.203005],[-76.61253000000001,42.202917],[-76.612157,42.202585],[-76.611951,42.202421],[-76.61171400000001,42.202189],[-76.611508,42.201971],[-76.611386,42.201822],[-76.61130199999999,42.201654],[-76.611127,42.201452],[-76.61106599999999,42.201407],[-76.611175,42.197365],[-76.611307,42.192732],[-76.611473,42.186895],[-76.611587,42.18291],[-76.611648,42.180734],[-76.611694,42.179076],[-76.611746,42.177247],[-76.61255,42.148867],[-76.612797,42.140158],[-76.61281200000001,42.139386],[-76.613077,42.130191],[-76.61947000000001,42.129879],[-76.619623,42.129871],[-76.62167100000001,42.129866],[-76.621882,42.129865],[-76.624668,42.129874],[-76.629526,42.129748],[-76.630335,42.129728],[-76.63064300000001,42.129721],[-76.632451,42.129675],[-76.64449500000001,42.129369],[-76.647845,42.129284],[-76.65342,42.129142],[-76.654036,42.129124],[-76.659373,42.128988],[-76.66130200000001,42.128943],[-76.670061,42.128722],[-76.67347599999999,42.128636],[-76.67753500000001,42.128532],[-76.68008500000001,42.128468],[-76.683959,42.128368],[-76.690862,42.128198],[-76.69243299999999,42.128153],[-76.695688,42.128073],[-76.698975,42.12799],[-76.70303800000001,42.127887],[-76.70491699999999,42.127838],[-76.705769,42.127818],[-76.706971,42.127789],[-76.712294,42.127654],[-76.72067199999999,42.127442],[-76.723827,42.127362],[-76.72398699999999,42.130342],[-76.72487599999999,42.146046],[-76.72551900000001,42.157417],[-76.725678,42.160796],[-76.725741,42.161801],[-76.725925,42.165095],[-76.72601,42.16661],[-76.726122,42.16862],[-76.726238,42.170649],[-76.72625499999999,42.171023],[-76.726283,42.171588],[-76.726287,42.171691],[-76.72628899999999,42.171754],[-76.72629499999999,42.171946]]],"type":"Polygon"}
}