{
  "id": "360191004005",
  "type": "Feature",
  "properties": {
    "area_land":143582749,
    "area_water":825230,
    "geoid":"360191004005",
    "name":"Block Group 5",
    "state":"ny"
},
  "bbox": [
    -73.907598,
    44.765385,
    -73.765155,
    44.964952
],
  "geometry": {"coordinates":[[[-73.907573,44.799188],[-73.907466,44.799443],[-73.907359,44.799614],[-73.906648,44.800515],[-73.90648899999999,44.800759],[-73.906357,44.801037],[-73.906296,44.801218],[-73.906018,44.802476],[-73.905934,44.802958],[-73.905762,44.805107],[-73.905708,44.805363],[-73.905621,44.805548],[-73.905508,44.8057],[-73.90535199999999,44.805828],[-73.905225,44.805904],[-73.904991,44.806002],[-73.903874,44.806308],[-73.902734,44.806602],[-73.902086,44.806741],[-73.89955999999999,44.807173],[-73.89923899999999,44.807217],[-73.898813,44.807309],[-73.89864300000001,44.807363],[-73.898483,44.807444],[-73.898442,44.807472],[-73.89835100000001,44.807548],[-73.898235,44.807702],[-73.89819300000001,44.807793],[-73.89817499999999,44.807947],[-73.89826600000001,44.811207],[-73.89827,44.811688],[-73.89831,44.812735],[-73.89833900000001,44.81389],[-73.898363,44.814437],[-73.898421,44.815053],[-73.898535,44.81582],[-73.89854800000001,44.815905],[-73.898594,44.816666],[-73.898687,44.820093],[-73.898746,44.82108],[-73.89878299999999,44.821543],[-73.899075,44.824505],[-73.899253,44.826441],[-73.899585,44.829845],[-73.899888,44.833273],[-73.900087,44.835686],[-73.90025799999999,44.837525],[-73.90031,44.838191],[-73.900293,44.838475],[-73.900274,44.838563],[-73.90019599999999,44.83876],[-73.90007300000001,44.838953],[-73.8999,44.839143],[-73.899677,44.839307],[-73.899508,44.839402],[-73.89918299999999,44.839534],[-73.89896400000001,44.839603],[-73.898662,44.839653],[-73.89851299999999,44.839673],[-73.89569899999999,44.839785],[-73.893109,44.839898],[-73.890125,44.84002],[-73.889962,44.840039],[-73.889712,44.840111],[-73.889556,44.840176],[-73.889393,44.840274],[-73.88926499999999,44.840377],[-73.88916399999999,44.840499],[-73.889056,44.840697],[-73.88904100000001,44.840759],[-73.88904700000001,44.841037],[-73.88925399999999,44.842532],[-73.88941,44.84401],[-73.887997,44.844094],[-73.88765600000001,44.844109],[-73.88721200000001,44.844151],[-73.88685099999999,44.844207],[-73.886556,44.844297],[-73.8856,44.844672],[-73.884011,44.845318],[-73.879566,44.84708],[-73.87876799999999,44.847433],[-73.878477,44.847579],[-73.87737199999999,44.848066],[-73.87657,44.848447],[-73.876454,44.848565],[-73.876418,44.848624],[-73.87639299999999,44.848751],[-73.876694,44.849927],[-73.877123,44.851809],[-73.87800799999999,44.855244],[-73.878615,44.857714],[-73.878692,44.858055],[-73.87920699999999,44.860175],[-73.879873,44.862816],[-73.880189,44.864102],[-73.880567,44.865584],[-73.880841,44.86658],[-73.876656,44.867181],[-73.87554,44.867358],[-73.875056,44.867455],[-73.874165,44.867693],[-73.873914,44.867769],[-73.873136,44.868076],[-73.870456,44.869261],[-73.868275,44.870232],[-73.867248,44.870715],[-73.86700399999999,44.870842],[-73.866561,44.871109],[-73.86628,44.871288],[-73.865923,44.871531],[-73.864178,44.872822],[-73.861277,44.874999],[-73.860495,44.875594],[-73.858479,44.877106],[-73.85724999999999,44.878065],[-73.856662,44.878536],[-73.850944,44.883341],[-73.85020400000001,44.883933],[-73.849858,44.884176],[-73.849431,44.884425],[-73.848187,44.885031],[-73.84732,44.885434],[-73.847041,44.885581],[-73.84682100000001,44.885711],[-73.846581,44.885881],[-73.84641000000001,44.886011],[-73.846144,44.886244],[-73.84540800000001,44.886973],[-73.844044,44.888369],[-73.84353900000001,44.888866],[-73.84212599999999,44.890308],[-73.84134,44.89109],[-73.840976,44.89146],[-73.84064499999999,44.891832],[-73.84060100000001,44.892057],[-73.840362,44.89212],[-73.84008799999999,44.892208],[-73.838759,44.892699],[-73.83751599999999,44.893182],[-73.837153,44.893322],[-73.836585,44.893523],[-73.836724,44.894041],[-73.836769,44.894349],[-73.836922,44.895148],[-73.83704899999999,44.895947],[-73.83705500000001,44.89617],[-73.83701000000001,44.896424],[-73.836946,44.896651],[-73.83683600000001,44.896865],[-73.836451,44.897386],[-73.836382,44.8975],[-73.836303,44.897697],[-73.83624399999999,44.89791],[-73.836236,44.898093],[-73.83626099999999,44.898397],[-73.83632799999999,44.898865],[-73.836568,44.900282],[-73.836921,44.902211],[-73.836972,44.902571],[-73.837086,44.903684],[-73.83711700000001,44.903782],[-73.837271,44.904725],[-73.837386,44.905175],[-73.837852,44.907674],[-73.838025,44.908478],[-73.838408,44.910398],[-73.838489,44.910686],[-73.839089,44.913402],[-73.839471,44.915716],[-73.840141,44.918764],[-73.841765,44.926445],[-73.843225,44.933534],[-73.843929,44.936805],[-73.845572,44.944408],[-73.84711,44.951801],[-73.84849,44.958363],[-73.84917299999999,44.961353],[-73.847324,44.9615],[-73.84253,44.961926],[-73.841791,44.961999],[-73.84103,44.962057],[-73.84025099999999,44.962133],[-73.83632299999999,44.962436],[-73.835525,44.962509],[-73.83477499999999,44.962563],[-73.833989,44.962632],[-73.83009,44.962935],[-73.824573,44.963389],[-73.823857,44.963445],[-73.82076600000001,44.963742],[-73.819186,44.963898],[-73.81348699999999,44.964368],[-73.812653,44.964429],[-73.812499,44.964448],[-73.81129300000001,44.964538],[-73.81021200000001,44.964634],[-73.806398,44.964943],[-73.806077,44.964952],[-73.805899,44.964931],[-73.805739,44.964893],[-73.80561,44.964844],[-73.80537,44.964879],[-73.805234,44.964419],[-73.805087,44.963864],[-73.804976,44.963377],[-73.80424600000001,44.96048],[-73.80349200000001,44.957547],[-73.80297400000001,44.955576],[-73.802852,44.955083],[-73.802582,44.954095],[-73.802291,44.952845],[-73.801993,44.951627],[-73.80132500000001,44.948665],[-73.80082299999999,44.946225],[-73.800411,44.944291],[-73.79972100000001,44.940824],[-73.799412,44.939067],[-73.798829,44.936096],[-73.79871900000001,44.935608],[-73.798113,44.932696],[-73.797364,44.928807],[-73.796874,44.926409],[-73.79679,44.925932],[-73.79552700000001,44.91956],[-73.795372,44.918739],[-73.79433400000001,44.913522],[-73.793257,44.908062],[-73.79322000000001,44.907871],[-73.79316900000001,44.907668],[-73.79302300000001,44.907088],[-73.792866,44.906037],[-73.79259,44.904649],[-73.79232399999999,44.903309],[-73.792197,44.902669],[-73.790918,44.896213],[-73.789469,44.88897],[-73.788529,44.884116],[-73.788071,44.881682],[-73.787757,44.879914],[-73.787623,44.879197],[-73.787368,44.877923],[-73.78732100000001,44.877693],[-73.786833,44.875313],[-73.786473,44.873398],[-73.785973,44.870735],[-73.785268,44.866795],[-73.78489,44.86458],[-73.784734,44.863613],[-73.78460699999999,44.862905],[-73.784311,44.86122],[-73.78415099999999,44.860265],[-73.783664,44.857447],[-73.780514,44.841653],[-73.779966,44.838822],[-73.77867500000001,44.83253],[-73.778198,44.830255],[-73.775672,44.818316],[-73.775006,44.815164],[-73.77481299999999,44.814279],[-73.774021,44.81048],[-73.773752,44.809501],[-73.773129,44.807559],[-73.772773,44.806586],[-73.77237700000001,44.805606],[-73.770174,44.800655],[-73.769611,44.79938],[-73.769272,44.798568],[-73.76916,44.798226],[-73.768897,44.797282],[-73.768598,44.795823],[-73.767295,44.78888],[-73.766471,44.784114],[-73.76622500000001,44.782681],[-73.766172,44.78242],[-73.76611800000001,44.782149],[-73.76547600000001,44.778783],[-73.765406,44.778409],[-73.76531,44.777895],[-73.76515499999999,44.777066],[-73.791172,44.774843],[-73.870721,44.767712],[-73.874449,44.76734],[-73.879786,44.766888],[-73.897588,44.765385],[-73.897541,44.768807],[-73.89757299999999,44.769486],[-73.89766299999999,44.77035],[-73.897757,44.770782],[-73.89791700000001,44.771156],[-73.898026,44.771351],[-73.898742,44.772426],[-73.898956,44.772777],[-73.899208,44.773262],[-73.89979599999999,44.774738],[-73.900402,44.776337],[-73.90057899999999,44.776999],[-73.900809,44.778122],[-73.901403,44.781231],[-73.901481,44.781735],[-73.901535,44.782206],[-73.901794,44.785121],[-73.901849,44.785604],[-73.901886,44.786078],[-73.902024,44.788043],[-73.902103,44.788756],[-73.90229600000001,44.789872],[-73.902435,44.790477],[-73.902529,44.790705],[-73.90262300000001,44.790845],[-73.902733,44.790974],[-73.90294400000001,44.791182],[-73.903149,44.791342],[-73.903677,44.791676],[-73.904999,44.792509],[-73.905357,44.79275],[-73.905602,44.792946],[-73.905779,44.793128],[-73.905958,44.793414],[-73.90643300000001,44.794457],[-73.90707,44.795892],[-73.90718699999999,44.796251],[-73.907253,44.796559],[-73.90746900000001,44.797948],[-73.907572,44.798552],[-73.90759799999999,44.798896],[-73.907573,44.799188]]],"type":"Polygon"}
}