{
  "id": "360010138023",
  "type": "Feature",
  "properties": {
    "area_land":2198461,
    "area_water":0,
    "geoid":"360010138023",
    "name":"Block Group 3",
    "state":"ny"
},
  "bbox": [
    -73.872614,
    42.757985,
    -73.838954,
    42.771355
],
  "geometry": {"coordinates":[[[-73.872614,42.767544],[-73.87183400000001,42.767573],[-73.87129400000001,42.767494],[-73.868295,42.767973],[-73.862365,42.768706],[-73.859157,42.769089],[-73.858234,42.769198],[-73.85816199999999,42.76921],[-73.852189,42.76992],[-73.84228400000001,42.771107],[-73.840189,42.771355],[-73.840628,42.770514],[-73.84094899999999,42.769901],[-73.84100100000001,42.769781],[-73.841043,42.769682],[-73.84108000000001,42.769534],[-73.84110200000001,42.76934],[-73.84111300000001,42.768927],[-73.841184,42.768194],[-73.841166,42.767885],[-73.84110800000001,42.76771],[-73.84086499999999,42.767163],[-73.840806,42.767035],[-73.84004,42.765367],[-73.839381,42.763541],[-73.839358,42.763478],[-73.838993,42.76238],[-73.838962,42.762261],[-73.838954,42.762136],[-73.838978,42.761925],[-73.83903100000001,42.761684],[-73.839299,42.760683],[-73.839479,42.75996],[-73.839511,42.759738],[-73.839584,42.758872],[-73.839607,42.758505],[-73.839607,42.758257],[-73.839569,42.757985],[-73.84005999999999,42.758027],[-73.841061,42.75799],[-73.84148399999999,42.75801],[-73.842359,42.758035],[-73.842699,42.758023],[-73.843048,42.758097],[-73.843608,42.758116],[-73.843727,42.758141],[-73.84378700000001,42.758172],[-73.84378700000001,42.758222],[-73.84377000000001,42.758278],[-73.843784,42.758656],[-73.843919,42.759128],[-73.844156,42.759527],[-73.844607,42.760116],[-73.845354,42.760482],[-73.84601499999999,42.760612],[-73.846301,42.760609],[-73.84668000000001,42.760607],[-73.84688300000001,42.76058],[-73.84693900000001,42.76063],[-73.847008,42.760673],[-73.847112,42.760704],[-73.84725899999999,42.760724],[-73.847475,42.760741],[-73.847703,42.760741],[-73.848572,42.760722],[-73.84880099999999,42.76073],[-73.84899900000001,42.76075],[-73.84943199999999,42.760852],[-73.85039,42.761103],[-73.850661,42.76113],[-73.85151,42.761118],[-73.85190799999999,42.761106],[-73.852082,42.76111],[-73.852248,42.761124],[-73.852509,42.761144],[-73.853189,42.76126],[-73.853728,42.761376],[-73.85377200000001,42.761392],[-73.853832,42.76146],[-73.853859,42.761527],[-73.853848,42.761663],[-73.85383299999999,42.761745],[-73.85406399999999,42.761809],[-73.854876,42.761952],[-73.854995,42.761657],[-73.855058,42.761449],[-73.855092,42.76128],[-73.855375,42.761288],[-73.85619699999999,42.761352],[-73.856708,42.761412],[-73.857018,42.761436],[-73.857246,42.761444],[-73.857502,42.761448],[-73.857731,42.761436],[-73.858008,42.761396],[-73.85809500000001,42.761356],[-73.858253,42.761244],[-73.85847,42.761037],[-73.85859000000001,42.760897],[-73.858784,42.7607],[-73.859025,42.760831],[-73.859329,42.76096],[-73.86006999999999,42.761245],[-73.86128100000001,42.761677],[-73.86161,42.761813],[-73.861895,42.761967],[-73.86215300000001,42.762169],[-73.862934,42.762929],[-73.86318799999999,42.763166],[-73.863516,42.763407],[-73.86365600000001,42.763505],[-73.863755,42.763554],[-73.864385,42.763847],[-73.866046,42.764568],[-73.86971,42.766097],[-73.87005499999999,42.766236],[-73.87088300000001,42.766558],[-73.871077,42.766652],[-73.87135499999999,42.766779],[-73.87181699999999,42.767032],[-73.871993,42.767134],[-73.872389,42.767381],[-73.872597,42.767533],[-73.872614,42.767544]]],"type":"Polygon"}
}