{
  "id": "361031479024",
  "type": "Feature",
  "properties": {
    "area_land":1062932,
    "area_water":0,
    "geoid":"361031479024",
    "name":"Block Group 4",
    "state":"ny"
},
  "bbox": [
    -73.054822,
    40.737079,
    -73.041908,
    40.749109
],
  "geometry": {"coordinates":[[[-73.054788,40.737283],[-73.054412,40.739471],[-73.054216,40.740612],[-73.054074,40.741441],[-73.053884,40.742531],[-73.053346,40.745622],[-73.05332799999999,40.745788],[-73.052587,40.74593],[-73.050811,40.746255],[-73.049414,40.746526],[-73.04781800000001,40.746826],[-73.0476,40.746872],[-73.047247,40.746935],[-73.046711,40.747064],[-73.04540799999999,40.747523],[-73.044883,40.747724],[-73.042312,40.748984],[-73.042108,40.749085],[-73.042052,40.749109],[-73.042052,40.749066],[-73.04206000000001,40.748327],[-73.04207599999999,40.747305],[-73.04207700000001,40.747159],[-73.042079,40.747057],[-73.04208199999999,40.746882],[-73.04196399999999,40.743585],[-73.041961,40.743512],[-73.041954,40.743314],[-73.04194099999999,40.740353],[-73.04194,40.7402],[-73.041938,40.73973],[-73.041917,40.739272],[-73.04190800000001,40.739092],[-73.04200400000001,40.737909],[-73.043409,40.737413],[-73.04392900000001,40.73722],[-73.04418,40.737144],[-73.04434999999999,40.737112],[-73.04469899999999,40.73708],[-73.04495900000001,40.737079],[-73.045727,40.737096],[-73.04598799999999,40.737091],[-73.046595,40.737235],[-73.04796399999999,40.737586],[-73.049553,40.738096],[-73.04985600000001,40.738157],[-73.05010799999999,40.738195],[-73.050454,40.738232],[-73.05074999999999,40.738238],[-73.050901,40.738211],[-73.051732,40.737987],[-73.05235999999999,40.737819],[-73.052893,40.737669],[-73.054822,40.737149],[-73.054788,40.737283]]],"type":"Polygon"}
}