{
  "id": "360050141002",
  "type": "Feature",
  "properties": {
    "area_land":47192,
    "area_water":0,
    "geoid":"360050141002",
    "name":"Block Group 2",
    "state":"ny"
},
  "bbox": [
    -73.91131,
    40.822181,
    -73.907741,
    40.824849
],
  "geometry": {"coordinates":[[[-73.91131,40.824849],[-73.91057000000001,40.824648],[-73.91010900000001,40.824525],[-73.908709,40.824067],[-73.907741,40.823815],[-73.908418,40.822181],[-73.909413,40.822418],[-73.909497,40.822438],[-73.909851,40.822553],[-73.91070000000001,40.822324],[-73.910578,40.822563],[-73.91051899999999,40.822798],[-73.910494,40.823208],[-73.91059,40.823864],[-73.91084499999999,40.824213],[-73.91131,40.824849]]],"type":"Polygon"}
}