{
  "id": "360430105021",
  "type": "Feature",
  "properties": {
    "area_land":35565814,
    "area_water":216663,
    "geoid":"360430105021",
    "name":"Block Group 1",
    "state":"ny"
},
  "bbox": [
    -75.076826,
    42.94514,
    -74.902297,
    43.008007
],
  "geometry": {"coordinates":[[[-75.076826,42.986495],[-75.07212800000001,42.993423],[-75.06401200000001,42.991964],[-75.063407,42.991933],[-75.06052,42.991387],[-75.055447,42.990496],[-75.054367,42.989617],[-75.054131,42.989576],[-75.053836,42.989525],[-75.05376800000001,42.989513],[-75.047436,42.988359],[-75.04687199999999,42.988363],[-75.03649799999999,42.988533],[-75.02528100000001,42.988729],[-75.022965,42.987905],[-75.023118,42.988104],[-75.02319,42.988197],[-75.023588,42.988626],[-75.023762,42.988846],[-75.023844,42.988996],[-75.02389100000001,42.989168],[-75.023988,42.990508],[-75.023966,42.990928],[-75.0239,42.991489],[-75.02380599999999,42.992046],[-75.023734,42.992318],[-75.02362599999999,42.992606],[-75.02328199999999,42.993376],[-75.023241,42.993591],[-75.023245,42.993789],[-75.023296,42.994217],[-75.023293,42.994325],[-75.02325399999999,42.994582],[-75.023099,42.995043],[-75.022882,42.995667],[-75.022701,42.996145],[-75.022445,42.996952],[-75.022323,42.997413],[-75.022234,42.997807],[-75.022161,42.998193],[-75.022111,42.998636],[-75.02211800000001,42.998879],[-75.022158,42.999033],[-75.022211,42.99915],[-75.02243900000001,42.999482],[-75.022549,42.999595],[-75.02302299999999,43.0],[-75.02327,43.000232],[-75.02362100000001,43.000563],[-75.023965,43.00094],[-75.024193,43.001255],[-75.02428500000001,43.001409],[-75.02431799999999,43.001515],[-75.024332,43.001697],[-75.024287,43.001916],[-75.02417699999999,43.002084],[-75.024083,43.002177],[-75.023973,43.002248],[-75.023438,43.00251],[-75.023202,43.002661],[-75.022558,43.003123],[-75.022279,43.003286],[-75.02188099999999,43.003504],[-75.02156600000001,43.003697],[-75.02143700000001,43.003808],[-75.02113,43.00413],[-75.02089700000001,43.004417],[-75.02076,43.00462],[-75.020629,43.004858],[-75.02051899999999,43.005023],[-75.020377,43.005182],[-75.02009099999999,43.005407],[-75.019564,43.005725],[-75.019121,43.006085],[-75.018934,43.006256],[-75.018837,43.006366],[-75.018753,43.006481],[-75.018478,43.00693],[-75.018427,43.007052],[-75.01836299999999,43.007407],[-75.018303,43.007771],[-75.018292,43.007834],[-75.018265,43.007942],[-75.018243,43.008007],[-75.01817,43.007979],[-75.016516,43.007012],[-75.016019,43.006722],[-75.01571,43.006542],[-75.015698,43.006535],[-75.01579700000001,43.006191],[-75.015867,43.005912],[-75.01584800000001,43.005787],[-75.01588,43.005689],[-75.01598199999999,43.00529],[-75.01396699999999,43.005312],[-75.012823,43.004767],[-75.00958,43.003222],[-75.009575,43.003189],[-75.009491,43.003022],[-75.00944800000001,43.00287],[-75.00943599999999,43.002825],[-75.009393,43.002756],[-75.009086,43.002588],[-75.00881800000001,43.002497],[-75.008439,43.002308],[-75.00808600000001,43.002115],[-75.007931,43.001998],[-75.00785500000001,43.001919],[-75.007763,43.00182],[-75.00774199999999,43.001775],[-75.007381,43.001579],[-75.00702800000001,43.000768],[-75.006973,43.000656],[-75.00692100000001,43.000552],[-75.006851,43.00041],[-75.006495,42.999728],[-75.005715,42.998216],[-75.00556,42.997987],[-75.005402,42.997824],[-75.005133,42.997611],[-75.00474699999999,42.997306],[-75.004538,42.997109],[-75.00437599999999,42.996905],[-75.00425,42.996691],[-75.004161,42.996459],[-75.00405499999999,42.996065],[-75.00398199999999,42.995746],[-75.003882,42.995203],[-75.00380699999999,42.994913],[-75.003738,42.994778],[-75.00363400000001,42.994638],[-75.00350400000001,42.994499],[-75.003117,42.994126],[-75.002707,42.993792],[-75.002278,42.993442],[-75.00214699999999,42.99334],[-75.001931,42.993135],[-75.001856,42.993035],[-75.001738,42.992841],[-75.00137100000001,42.992113],[-75.00117,42.991827],[-75.000828,42.991432],[-74.99999800000001,42.990721],[-74.99964300000001,42.990379],[-74.999365,42.99014],[-74.99879900000001,42.989705],[-74.99829699999999,42.989343],[-74.998062,42.989193],[-74.99773500000001,42.989002],[-74.997373,42.988813],[-74.996646,42.98847],[-74.996376,42.988357],[-74.996111,42.988276],[-74.995504,42.988117],[-74.995003,42.987935],[-74.993695,42.987414],[-74.993409,42.987274],[-74.993112,42.987093],[-74.99243,42.986646],[-74.992171,42.986497],[-74.991213,42.986048],[-74.990967,42.985894],[-74.990871,42.985829],[-74.990613,42.985594],[-74.990347,42.985263],[-74.99028800000001,42.985189],[-74.99024900000001,42.985137],[-74.99022600000001,42.985107],[-74.990162,42.985023],[-74.990039,42.984862],[-74.989915,42.984719],[-74.98969700000001,42.984515],[-74.989577,42.984423],[-74.989406,42.984324],[-74.988991,42.984127],[-74.98856499999999,42.983974],[-74.988066,42.983779],[-74.987736,42.983619],[-74.98761399999999,42.983544],[-74.987458,42.983425],[-74.9873,42.983288],[-74.986756,42.982673],[-74.98656,42.982471],[-74.98629699999999,42.982257],[-74.986097,42.982134],[-74.985905,42.982028],[-74.985857,42.982001],[-74.985767,42.981952],[-74.98503599999999,42.981553],[-74.984826,42.981409],[-74.98458599999999,42.981202],[-74.984415,42.981005],[-74.984272,42.980766],[-74.984235,42.980699],[-74.984193,42.980624],[-74.984165,42.980569],[-74.984003,42.980248],[-74.98398,42.980203],[-74.983795,42.979889],[-74.983728,42.9798],[-74.98347699999999,42.979546],[-74.98333,42.979431],[-74.98321300000001,42.979354],[-74.982775,42.979126],[-74.98191,42.978774],[-74.981415,42.978557],[-74.981342,42.978652],[-74.98134899999999,42.978619],[-74.981041,42.978388],[-74.979168,42.977513],[-74.978843,42.977327],[-74.978679,42.977214],[-74.976767,42.97571],[-74.976558,42.975559],[-74.97621700000001,42.97536],[-74.97607600000001,42.975295],[-74.97578300000001,42.975184],[-74.97537,42.975075],[-74.97499000000001,42.975014],[-74.97393099999999,42.974886],[-74.973095,42.974785],[-74.972695,42.974704],[-74.97245100000001,42.974621],[-74.97199500000001,42.974408],[-74.97185899999999,42.97432],[-74.971485,42.974043],[-74.97123499999999,42.973822],[-74.97117299999999,42.973767],[-74.971119,42.97372],[-74.970287,42.972984],[-74.97005,42.97281],[-74.969871,42.972699],[-74.96974,42.972627],[-74.969511,42.972538],[-74.96930500000001,42.972476],[-74.96926499999999,42.972464],[-74.968976,42.972401],[-74.96852699999999,42.972329],[-74.968431,42.972314],[-74.968289,42.972291],[-74.96807800000001,42.972257],[-74.96776699999999,42.972193],[-74.967356,42.972066],[-74.966886,42.971882],[-74.966317,42.97164],[-74.96612399999999,42.971543],[-74.96551700000001,42.971185],[-74.965475,42.971221],[-74.964642,42.970893],[-74.964579,42.970842],[-74.964324,42.970788],[-74.96402999999999,42.970737],[-74.963283,42.970618],[-74.962699,42.970515],[-74.962386,42.970449],[-74.96205500000001,42.970349],[-74.961499,42.970112],[-74.961394,42.970067],[-74.960725,42.969783],[-74.96027599999999,42.969607],[-74.960053,42.969546],[-74.959643,42.969476],[-74.959425,42.969466],[-74.95931899999999,42.969461],[-74.959238,42.969462],[-74.958885,42.969465],[-74.958359,42.96956],[-74.958187,42.96961],[-74.957892,42.969714],[-74.957615,42.969836],[-74.956999,42.970087],[-74.956352,42.970365],[-74.95578500000001,42.970587],[-74.955568,42.970656],[-74.955163,42.970761],[-74.954808,42.970823],[-74.954339,42.970872],[-74.95408500000001,42.970884],[-74.953695,42.970889],[-74.95322299999999,42.970883],[-74.952071,42.970843],[-74.951463,42.970812],[-74.949591,42.97063],[-74.947565,42.970469],[-74.94712699999999,42.970419],[-74.946718,42.97034],[-74.945745,42.97009],[-74.945088,42.969937],[-74.944754,42.969908],[-74.94447599999999,42.969901],[-74.944203,42.969908],[-74.943433,42.969976],[-74.94306899999999,42.970018],[-74.94268599999999,42.97005],[-74.942188,42.970086],[-74.94180900000001,42.970123],[-74.94104299999999,42.970159],[-74.94023,42.970195],[-74.937102,42.970299],[-74.93694000000001,42.970287],[-74.93634400000001,42.970126],[-74.933834,42.969432],[-74.933565,42.969338],[-74.93353,42.969326],[-74.933094,42.969143],[-74.932445,42.968791],[-74.931161,42.968124],[-74.92976,42.96744],[-74.929445,42.967284],[-74.929294,42.967212],[-74.928664,42.966904],[-74.92828799999999,42.966732],[-74.928055,42.966671],[-74.927201,42.966564],[-74.92674700000001,42.96649],[-74.92624600000001,42.96638],[-74.925862,42.966262],[-74.925597,42.966158],[-74.92538999999999,42.966042],[-74.92524299999999,42.965928],[-74.92499599999999,42.965668],[-74.92455,42.965137],[-74.92388800000001,42.964347],[-74.92369600000001,42.96415],[-74.92353300000001,42.96403],[-74.923292,42.963907],[-74.92310000000001,42.963851],[-74.922856,42.963826],[-74.922004,42.963807],[-74.921262,42.963783],[-74.92066,42.963709],[-74.91891099999999,42.963451],[-74.917185,42.963189],[-74.916016,42.962998],[-74.915092,42.962814],[-74.91441500000001,42.962645],[-74.91396,42.962508],[-74.912032,42.961842],[-74.911734,42.961755],[-74.911509,42.961723],[-74.91128,42.961724],[-74.91104900000001,42.961755],[-74.91079999999999,42.961825],[-74.91009200000001,42.962086],[-74.909746,42.962198],[-74.909536,42.962253],[-74.909252,42.962279],[-74.90862199999999,42.962246],[-74.906948,42.962103],[-74.90642699999999,42.962045],[-74.906048,42.96197],[-74.90561599999999,42.961849],[-74.905243,42.95995],[-74.90477300000001,42.960285],[-74.90473799999999,42.959734],[-74.904724,42.959366],[-74.90468199999999,42.959045],[-74.904661,42.958784],[-74.90464299999999,42.957943],[-74.90462599999999,42.957661],[-74.90443999999999,42.956053],[-74.904392,42.955894],[-74.904381,42.955861],[-74.904314,42.955743],[-74.903863,42.953139],[-74.903474,42.951156],[-74.903415,42.950917],[-74.902939,42.948368],[-74.90275699999999,42.947489],[-74.902297,42.94514],[-74.91098100000001,42.945862],[-74.918199,42.946522],[-74.91837700000001,42.946537],[-74.922133,42.946864],[-74.923518,42.946977],[-74.932743,42.947739],[-74.953129,42.949417],[-74.95956,42.949801],[-74.961444,42.95002],[-74.964727,42.950421],[-74.966763,42.950572],[-74.96776800000001,42.950609],[-74.96818,42.950639],[-74.970533,42.950749],[-74.97372900000001,42.950915],[-74.975582,42.950966],[-74.981408,42.951103],[-74.992,42.951686],[-74.99251099999999,42.951708],[-74.995507,42.953053],[-74.995672,42.953126],[-74.99731199999999,42.953858],[-74.9996,42.95457],[-75.014149,42.960583],[-75.014539,42.960739],[-75.014698,42.960778],[-75.015719,42.961203],[-75.017349,42.961864],[-75.018412,42.962308],[-75.019586,42.962774],[-75.020731,42.963268],[-75.021522,42.963584],[-75.022612,42.964043],[-75.023184,42.964254],[-75.02356,42.964357],[-75.023832,42.964409],[-75.02419999999999,42.964448],[-75.03554099999999,42.969314],[-75.036748,42.969814],[-75.049419,42.975063],[-75.05068,42.975591],[-75.071091,42.984049],[-75.076429,42.986347],[-75.076525,42.986412],[-75.076826,42.986495]]],"type":"Polygon"}
}