{
  "id": "360593011011",
  "type": "Feature",
  "properties": {
    "area_land":308650,
    "area_water":0,
    "geoid":"360593011011",
    "name":"Block Group 1",
    "state":"ny"
},
  "bbox": [
    -73.72191,
    40.83928,
    -73.709188,
    40.84732
],
  "geometry": {"coordinates":[[[-73.72165,40.844526],[-73.720755,40.844602],[-73.720456,40.844641],[-73.72035200000001,40.844673],[-73.719776,40.844588],[-73.71957399999999,40.844437],[-73.718677,40.844484],[-73.717883,40.845114],[-73.717043,40.845457],[-73.71621,40.845883],[-73.715377,40.846277],[-73.714984,40.846451],[-73.715056,40.846725],[-73.71455,40.846707],[-73.714105,40.846766],[-73.714119,40.846866],[-73.713581,40.847099],[-73.712974,40.847309],[-73.71280299999999,40.847157],[-73.712226,40.84732],[-73.712322,40.847262],[-73.712391,40.847209],[-73.71245,40.84714],[-73.71248300000001,40.847074],[-73.712502,40.847007],[-73.712498,40.846957],[-73.712469,40.846861],[-73.71240400000001,40.846797],[-73.710803,40.845365],[-73.709188,40.843906],[-73.710233,40.843785],[-73.710308,40.843777],[-73.711207,40.843675],[-73.712101,40.843573],[-73.71299399999999,40.843471],[-73.713887,40.843369],[-73.714781,40.843268],[-73.715675,40.843166],[-73.716568,40.843062],[-73.717465,40.842958],[-73.718355,40.842856],[-73.719249,40.842753],[-73.720141,40.842652],[-73.719767,40.840733],[-73.719697,40.840419],[-73.720276,40.840347],[-73.720794,40.840285],[-73.72098,40.840245],[-73.720962,40.840155],[-73.720856,40.839627],[-73.720795,40.839323],[-73.720978,40.83928],[-73.72101499999999,40.839614],[-73.72110499999999,40.840427],[-73.72190999999999,40.844505],[-73.72165,40.844526]]],"type":"Polygon"}
}