{
  "id": "360470525002",
  "type": "Feature",
  "properties": {
    "area_land":25272,
    "area_water":0,
    "geoid":"360470525002",
    "name":"Block Group 2",
    "state":"ny"
},
  "bbox": [
    -73.962743,
    40.707524,
    -73.960825,
    40.709352
],
  "geometry": {"coordinates":[[[-73.96257300000001,40.708535],[-73.962414,40.709352],[-73.960825,40.709169],[-73.960984,40.708357],[-73.961144,40.707524],[-73.96186,40.707595],[-73.962131,40.707623],[-73.962743,40.707685],[-73.96257300000001,40.708535]]],"type":"Polygon"}
}