{
  "id": "360830414002",
  "type": "Feature",
  "properties": {
    "area_land":3018284,
    "area_water":113000,
    "geoid":"360830414002",
    "name":"Block Group 2",
    "state":"ny"
},
  "bbox": [
    -73.676727,
    42.752782,
    -73.649259,
    42.791663
],
  "geometry": {"coordinates":[[[-73.676484,42.753284],[-73.675803,42.754879],[-73.67538399999999,42.755861],[-73.67416900000001,42.757886],[-73.673753,42.758444],[-73.67310000000001,42.759355],[-73.671486,42.762455],[-73.671126,42.763716],[-73.670462,42.766077],[-73.670501,42.766365],[-73.67067299999999,42.767622],[-73.669121,42.771143],[-73.668361,42.772836],[-73.668362,42.776361],[-73.66835,42.776467],[-73.668333,42.776572],[-73.668312,42.776686],[-73.66736899999999,42.778736],[-73.66669,42.780239],[-73.666408,42.780743],[-73.666242,42.780999],[-73.666043,42.781317],[-73.665841,42.7816],[-73.66569,42.781775],[-73.665499,42.782041],[-73.66521,42.782365],[-73.664812,42.782795],[-73.664107,42.783453],[-73.66372,42.783836],[-73.662803,42.784618],[-73.661795,42.785502],[-73.661254,42.785974],[-73.66041199999999,42.787097],[-73.660374,42.787164],[-73.65997299999999,42.78746],[-73.65995100000001,42.787514],[-73.659869,42.787672],[-73.659561,42.787982],[-73.659058,42.789894],[-73.659165,42.791663],[-73.65657299999999,42.791085],[-73.65446900000001,42.790592],[-73.652119,42.786516],[-73.650043,42.784463],[-73.649744,42.784153],[-73.649259,42.783777],[-73.649435,42.781791],[-73.649461,42.781568],[-73.65255999999999,42.780577],[-73.65235300000001,42.780176],[-73.653852,42.779671],[-73.654055,42.779974],[-73.656665,42.779309],[-73.65786,42.778882],[-73.657957,42.778601],[-73.660555,42.771008],[-73.660837,42.770141],[-73.663166,42.762879],[-73.663344,42.760807],[-73.66343000000001,42.760598],[-73.663509,42.760496],[-73.66354699999999,42.760436],[-73.66388600000001,42.760049],[-73.664247,42.759734],[-73.665976,42.758574],[-73.666875,42.757947],[-73.668165,42.757074],[-73.668526,42.756835],[-73.668813,42.756619],[-73.668898,42.756538],[-73.668965,42.756458],[-73.669011,42.756384],[-73.66911399999999,42.756175],[-73.669472,42.755235],[-73.669568,42.755029],[-73.669691,42.754766],[-73.67018,42.753801],[-73.670367,42.753387],[-73.670434,42.753212],[-73.67059,42.752782],[-73.67625099999999,42.75289],[-73.676727,42.7529],[-73.676484,42.753284]]],"type":"Polygon"}
}