{
  "id": "360593030002",
  "type": "Feature",
  "properties": {
    "area_land":367456,
    "area_water":0,
    "geoid":"360593030002",
    "name":"Block Group 2",
    "state":"ny"
},
  "bbox": [
    -73.685384,
    40.73233,
    -73.675366,
    40.739029
],
  "geometry": {"coordinates":[[[-73.685384,40.738191],[-73.68452499999999,40.73841],[-73.683666,40.738603],[-73.68284300000001,40.738788],[-73.682149,40.738989],[-73.682011,40.739029],[-73.68178399999999,40.738356],[-73.68154199999999,40.737694],[-73.68129999999999,40.737034],[-73.68105799999999,40.736372],[-73.67877300000001,40.736851],[-73.676453,40.73734],[-73.67617,40.736687],[-73.676259,40.735955],[-73.67609400000001,40.735271],[-73.675938,40.734777],[-73.675366,40.733364],[-73.675673,40.733284],[-73.676135,40.733231],[-73.677021,40.733099],[-73.677469,40.733002],[-73.677902,40.732952],[-73.678808,40.732853],[-73.679294,40.732799],[-73.679698,40.732655],[-73.681061,40.73233],[-73.681091,40.732476],[-73.68207,40.7324],[-73.682406,40.73234],[-73.682653,40.733117],[-73.683256,40.733004],[-73.68355,40.733714],[-73.68381599999999,40.734364],[-73.683854,40.734458],[-73.684085,40.735022],[-73.68434999999999,40.735679],[-73.684546,40.736161],[-73.684618,40.736334],[-73.68488600000001,40.73699],[-73.68524600000001,40.737865],[-73.685384,40.738191]]],"type":"Polygon"}
}