{
  "id": "360610138006",
  "type": "Feature",
  "properties": {
    "area_land":18433,
    "area_water":0,
    "geoid":"360610138006",
    "name":"Block Group 6",
    "state":"ny"
},
  "bbox": [
    -73.953166,
    40.774927,
    -73.950339,
    40.776561
],
  "geometry": {"coordinates":[[[-73.95270499999999,40.776561],[-73.95223300000001,40.776362],[-73.95094400000001,40.775818],[-73.95086499999999,40.775785],[-73.950339,40.775564],[-73.95079800000001,40.774927],[-73.95142800000001,40.775192],[-73.952614,40.775691],[-73.953166,40.775923],[-73.95270499999999,40.776561]]],"type":"Polygon"}
}