{
  "id": "360470481003",
  "type": "Feature",
  "properties": {
    "area_land":64972,
    "area_water":0,
    "geoid":"360470481003",
    "name":"Block Group 3",
    "state":"ny"
},
  "bbox": [
    -73.942066,
    40.712666,
    -73.937294,
    40.714729
],
  "geometry": {"coordinates":[[[-73.942066,40.714729],[-73.94121800000001,40.714707],[-73.938755,40.714593],[-73.93729399999999,40.714537],[-73.93734600000001,40.713816],[-73.937383,40.713166],[-73.938649,40.713223],[-73.938784,40.713191],[-73.940128,40.712864],[-73.941041,40.712666],[-73.941385,40.713347],[-73.94171299999999,40.714007],[-73.942066,40.714729]]],"type":"Polygon"}
}