{
  "id": "361219703001",
  "type": "Feature",
  "properties": {
    "area_land":36013468,
    "area_water":230766,
    "geoid":"361219703001",
    "name":"Block Group 1",
    "state":"ny"
},
  "bbox": [
    -78.439103,
    42.835043,
    -78.307107,
    42.869864
],
  "geometry": {"coordinates":[[[-78.439103,42.836913],[-78.439076,42.838079],[-78.439064,42.83831],[-78.439025,42.839127],[-78.43901099999999,42.839345],[-78.43897200000001,42.839664],[-78.438956,42.839803],[-78.438997,42.841283],[-78.438999,42.841342],[-78.43898299999999,42.841823],[-78.43893799999999,42.843254],[-78.438901,42.844455],[-78.43886999999999,42.846379],[-78.438833,42.847548],[-78.43881,42.848279],[-78.438812,42.848552],[-78.43877500000001,42.848814],[-78.438737,42.848902],[-78.438686,42.848947],[-78.438637,42.848979],[-78.43851600000001,42.849019],[-78.43845399999999,42.849031],[-78.438174,42.849051],[-78.437151,42.849062],[-78.435157,42.849086],[-78.43441,42.849104],[-78.434288,42.849141],[-78.43416000000001,42.84924],[-78.434099,42.849334],[-78.434017,42.849609],[-78.433729,42.850799],[-78.43357899999999,42.851424],[-78.43338,42.852312],[-78.43317399999999,42.853232],[-78.433167,42.853265],[-78.433077,42.853693],[-78.43298299999999,42.853964],[-78.432688,42.854662],[-78.432598,42.854952],[-78.43257800000001,42.855127],[-78.432564,42.85596],[-78.43255000000001,42.856903],[-78.43253,42.857565],[-78.432513,42.858454],[-78.432481,42.860141],[-78.432418,42.862437],[-78.432396,42.86311],[-78.43235900000001,42.864293],[-78.43233600000001,42.864662],[-78.43232500000001,42.86531],[-78.432293,42.867256],[-78.432283,42.867886],[-78.432283,42.867905],[-78.42823,42.867962],[-78.410015,42.868124],[-78.406584,42.868177],[-78.402613,42.868236],[-78.39839499999999,42.868329],[-78.39664399999999,42.868335],[-78.396417,42.868343],[-78.396151,42.868352],[-78.39293600000001,42.86841],[-78.38995799999999,42.868439],[-78.387891,42.868488],[-78.38623800000001,42.868551],[-78.38614699999999,42.868548],[-78.37896499999999,42.868653],[-78.37734,42.868672],[-78.376977,42.868678],[-78.376603,42.868683],[-78.374741,42.868709],[-78.370553,42.868786],[-78.365145,42.868883],[-78.365071,42.868884],[-78.363625,42.86891],[-78.357079,42.869028],[-78.35467,42.869072],[-78.351964,42.86912],[-78.35177899999999,42.869123],[-78.33637400000001,42.869402],[-78.322036,42.86966],[-78.314526,42.869762],[-78.307512,42.869864],[-78.30747,42.869862],[-78.307312,42.869853],[-78.307315,42.869736],[-78.30731,42.869517],[-78.30729100000001,42.868509],[-78.30728499999999,42.868173],[-78.30727400000001,42.867701],[-78.307243,42.866285],[-78.307233,42.865813],[-78.30721800000001,42.865129],[-78.307188,42.863655],[-78.307187,42.863583],[-78.30718899999999,42.863078],[-78.307192,42.862395],[-78.307175,42.86044],[-78.307124,42.854576],[-78.307107,42.852622],[-78.307119,42.852614],[-78.30715600000001,42.852594],[-78.307169,42.852587],[-78.307506,42.85238],[-78.308046,42.85203],[-78.308385,42.851792],[-78.30956399999999,42.850966],[-78.311087,42.849812],[-78.31188299999999,42.849189],[-78.31250300000001,42.848706],[-78.313035,42.848303],[-78.313119,42.84824],[-78.313382,42.848063],[-78.31443400000001,42.847357],[-78.314474,42.847331],[-78.31479400000001,42.847137],[-78.314841,42.847108],[-78.314983,42.847022],[-78.315031,42.846994],[-78.316126,42.846368],[-78.31728699999999,42.845706],[-78.319425,42.844512],[-78.320527,42.843898],[-78.320868,42.843705],[-78.321895,42.843129],[-78.322237,42.842937],[-78.32281,42.84265],[-78.32357500000001,42.842296],[-78.323652,42.842261],[-78.324777,42.841757],[-78.327927,42.840296],[-78.32799900000001,42.840263],[-78.329354,42.839645],[-78.329937,42.839373],[-78.331688,42.83856],[-78.332272,42.838289],[-78.33243899999999,42.838211],[-78.333106,42.837905],[-78.333648,42.837658],[-78.33500100000001,42.837057],[-78.335267,42.836955],[-78.33563700000001,42.836822],[-78.33608,42.836664],[-78.33650799999999,42.836529],[-78.336703,42.836474],[-78.33724100000001,42.836365],[-78.337839,42.836307],[-78.33817500000001,42.836307],[-78.33927799999999,42.836274],[-78.33957599999999,42.836268],[-78.341336,42.836238],[-78.343411,42.836214],[-78.344092,42.836206],[-78.345291,42.836193],[-78.34837899999999,42.836167],[-78.34884700000001,42.83616],[-78.349898,42.836145],[-78.351938,42.836131],[-78.352825,42.836118],[-78.354187,42.836115],[-78.354574,42.83611],[-78.357415,42.836074],[-78.358501,42.836074],[-78.361729,42.836041],[-78.36248500000001,42.836036],[-78.363034,42.836034],[-78.36496,42.83603],[-78.365122,42.836032],[-78.365836,42.836021],[-78.36646399999999,42.836024],[-78.36894599999999,42.836036],[-78.370075,42.836025],[-78.370493,42.836029],[-78.370735,42.836032],[-78.371836,42.836024],[-78.372528,42.836023],[-78.37445700000001,42.836021],[-78.374605,42.836019],[-78.375298,42.836014],[-78.375911,42.83601],[-78.377751,42.835998],[-78.378365,42.835995],[-78.37858300000001,42.835993],[-78.378975,42.835992],[-78.37924,42.83599],[-78.37940399999999,42.835989],[-78.379459,42.835988],[-78.38128500000001,42.835968],[-78.382982,42.835951],[-78.38373,42.835938],[-78.38472,42.835933],[-78.386763,42.835906],[-78.387618,42.835895],[-78.38858999999999,42.835877],[-78.388965,42.835876],[-78.38939499999999,42.835876],[-78.389737,42.8359],[-78.390086,42.835942],[-78.39014400000001,42.835949],[-78.39038499999999,42.835989],[-78.390457,42.836002],[-78.391792,42.83624],[-78.39444399999999,42.836714],[-78.39480500000001,42.836767],[-78.39555900000001,42.836844],[-78.39581,42.836861],[-78.39716300000001,42.836956],[-78.397295,42.836965],[-78.39769099999999,42.836995],[-78.397823,42.837005],[-78.397924,42.837012],[-78.398206,42.837032],[-78.39823,42.837032],[-78.398332,42.837032],[-78.39849100000001,42.837028],[-78.39863200000001,42.837026],[-78.39886199999999,42.837],[-78.398966,42.836981],[-78.399124,42.836954],[-78.399371,42.836907],[-78.40016199999999,42.836709],[-78.400818,42.836534],[-78.402908,42.835978],[-78.403464,42.835849],[-78.40398500000001,42.835745],[-78.404741,42.835621],[-78.405484,42.835528],[-78.405942,42.835491],[-78.40625300000001,42.835467],[-78.407031,42.835437],[-78.407687,42.83543],[-78.408964,42.835416],[-78.409526,42.83541],[-78.410797,42.835407],[-78.412796,42.835385],[-78.414074,42.835372],[-78.41553,42.835358],[-78.41760499999999,42.835339],[-78.419898,42.835313],[-78.421081,42.8353],[-78.42135500000001,42.835298],[-78.421965,42.835292],[-78.42379699999999,42.835277],[-78.424408,42.835272],[-78.426157,42.835254],[-78.431405,42.835204],[-78.431619,42.835202],[-78.433155,42.835168],[-78.434343,42.835152],[-78.435419,42.835139],[-78.43691200000001,42.835091],[-78.4375,42.835086],[-78.43790799999999,42.835074],[-78.438603,42.835056],[-78.439097,42.835043],[-78.439099,42.83586],[-78.439103,42.836913]]],"type":"Polygon"}
}