{
  "id": "360810077001",
  "type": "Feature",
  "properties": {
    "area_land":126674,
    "area_water":0,
    "geoid":"360810077001",
    "name":"Block Group 1",
    "state":"ny"
},
  "bbox": [
    -73.934935,
    40.764491,
    -73.928556,
    40.768818
],
  "geometry": {"coordinates":[[[-73.934229,40.767855],[-73.93344500000001,40.768818],[-73.93213,40.768299],[-73.932024,40.768257],[-73.931933,40.768218],[-73.929856,40.767327],[-73.928556,40.766714],[-73.92915000000001,40.765983],[-73.929647,40.765375],[-73.93036499999999,40.764491],[-73.931692,40.765224],[-73.93225200000001,40.765534],[-73.933627,40.766292],[-73.934935,40.767013],[-73.934229,40.767855]]],"type":"Polygon"}
}