{
  "id": "361031591052",
  "type": "Feature",
  "properties": {
    "area_land":1262025,
    "area_water":0,
    "geoid":"361031591052",
    "name":"Block Group 2",
    "state":"ny"
},
  "bbox": [
    -72.99328,
    40.784179,
    -72.972764,
    40.796337
],
  "geometry": {"coordinates":[[[-72.99328,40.795169],[-72.992417,40.795227],[-72.99179599999999,40.795258],[-72.991174,40.795288],[-72.989828,40.795374],[-72.988483,40.795461],[-72.985116,40.795668],[-72.983621,40.795768],[-72.981829,40.795874],[-72.97978999999999,40.795981],[-72.97685300000001,40.796157],[-72.975877,40.796233],[-72.974929,40.796284],[-72.97395400000001,40.796337],[-72.973883,40.795659],[-72.973702,40.793959],[-72.97345799999999,40.791625],[-72.973416,40.791267],[-72.973375,40.790908],[-72.97311500000001,40.788437],[-72.97287300000001,40.786501],[-72.972813,40.785888],[-72.972764,40.785495],[-72.97445,40.785112],[-72.976854,40.784557],[-72.978577,40.784179],[-72.978656,40.785188],[-72.978736,40.786334],[-72.97890700000001,40.78633],[-72.9791,40.786347],[-72.979224,40.786386],[-72.979485,40.78654],[-72.980919,40.787421],[-72.98226699999999,40.788213],[-72.983029,40.78862],[-72.98324700000001,40.788654],[-72.98354500000001,40.788653],[-72.983964,40.789126],[-72.985513,40.790027],[-72.985964,40.790339],[-72.98645999999999,40.790808],[-72.987657,40.791744],[-72.988832,40.792449],[-72.989656,40.792914],[-72.99092899999999,40.793643],[-72.991007,40.793715],[-72.99135699999999,40.794128],[-72.992127,40.794502],[-72.99268499999999,40.794902],[-72.99328,40.795169]]],"type":"Polygon"}
}