{
  "id": "360470203002",
  "type": "Feature",
  "properties": {
    "area_land":68015,
    "area_water":0,
    "geoid":"360470203002",
    "name":"Block Group 2",
    "state":"ny"
},
  "bbox": [
    -73.968227,
    40.678818,
    -73.964454,
    40.681754
],
  "geometry": {"coordinates":[[[-73.96795400000001,40.680189],[-73.96767800000001,40.680955],[-73.967477,40.681754],[-73.96653999999999,40.681558],[-73.96548799999999,40.681339],[-73.964454,40.681125],[-73.96478999999999,40.680353],[-73.965067,40.679586],[-73.965341,40.678818],[-73.968227,40.679422],[-73.96795400000001,40.680189]]],"type":"Polygon"}
}