{
  "id": "360850231002",
  "type": "Feature",
  "properties": {
    "area_land":167655,
    "area_water":0,
    "geoid":"360850231002",
    "name":"Block Group 2",
    "state":"ny"
},
  "bbox": [
    -74.160388,
    40.630186,
    -74.155036,
    40.63412
],
  "geometry": {"coordinates":[[[-74.160388,40.631595],[-74.160342,40.632998],[-74.16031099999999,40.633788],[-74.159329,40.633857],[-74.158107,40.633939],[-74.157033,40.633922],[-74.15611699999999,40.63412],[-74.155036,40.634084],[-74.155067,40.633757],[-74.155215,40.632079],[-74.155281,40.631302],[-74.156451,40.631368],[-74.156508,40.630306],[-74.15802600000001,40.630256],[-74.159313,40.630211],[-74.16038,40.630186],[-74.160381,40.63047],[-74.160388,40.631595]]],"type":"Polygon"}
}