{
  "id": "360050434003",
  "type": "Feature",
  "properties": {
    "area_land":40126,
    "area_water":0,
    "geoid":"360050434003",
    "name":"Block Group 3",
    "state":"ny"
},
  "bbox": [
    -73.85616,
    40.895073,
    -73.852435,
    40.897252
],
  "geometry": {"coordinates":[[[-73.85616,40.895597],[-73.855249,40.897252],[-73.854347,40.896963],[-73.85351,40.896696],[-73.852435,40.89625],[-73.85256699999999,40.895973],[-73.852788,40.895563],[-73.85396,40.895936],[-73.854435,40.895073],[-73.855267,40.895341],[-73.85616,40.895597]]],"type":"Polygon"}
}