{
  "id": "360150011003",
  "type": "Feature",
  "properties": {
    "area_land":287363,
    "area_water":0,
    "geoid":"360150011003",
    "name":"Block Group 3",
    "state":"ny"
},
  "bbox": [
    -76.814025,
    42.070574,
    -76.804221,
    42.076574
],
  "geometry": {"coordinates":[[[-76.813979,42.07107],[-76.813872,42.071405],[-76.81367400000001,42.071909],[-76.813529,42.072347],[-76.81298,42.073858],[-76.812674,42.07469],[-76.811858,42.074926],[-76.810652,42.075308],[-76.80963800000001,42.075609],[-76.809569,42.075632],[-76.808745,42.075868],[-76.808463,42.075937],[-76.807776,42.076147],[-76.806265,42.076574],[-76.805899,42.075804],[-76.805678,42.075315],[-76.805396,42.074766],[-76.804945,42.074892],[-76.804221,42.075052],[-76.80472399999999,42.07361],[-76.8049,42.073149],[-76.805121,42.072611],[-76.80672300000001,42.072702],[-76.80839400000001,42.072199],[-76.810073,42.071691],[-76.813849,42.070574],[-76.814025,42.070982],[-76.813979,42.07107]]],"type":"Polygon"}
}