{
  "id": "360470084003",
  "type": "Feature",
  "properties": {
    "area_land":93251,
    "area_water":0,
    "geoid":"360470084003",
    "name":"Block Group 3",
    "state":"ny"
},
  "bbox": [
    -74.007977,
    40.652633,
    -74.002677,
    40.657072
],
  "geometry": {"coordinates":[[[-74.007614,40.654111],[-74.007361,40.654326],[-74.006839,40.65485],[-74.006231,40.6554],[-74.005652,40.655963],[-74.005081,40.656531],[-74.004465,40.657072],[-74.00267700000001,40.65599],[-74.003259,40.655429],[-74.00384099999999,40.654862],[-74.004419,40.654309],[-74.005003,40.653757],[-74.005596,40.653183],[-74.006174,40.652633],[-74.007977,40.653727],[-74.007614,40.654111]]],"type":"Polygon"}
}