{
  "id": "360810381003",
  "type": "Feature",
  "properties": {
    "area_land":126848,
    "area_water":0,
    "geoid":"360810381003",
    "name":"Block Group 3",
    "state":"ny"
},
  "bbox": [
    -73.858805,
    40.754067,
    -73.853126,
    40.75834
],
  "geometry": {"coordinates":[[[-73.857928,40.756685],[-73.857055,40.756868],[-73.85603999999999,40.757072],[-73.85504899999999,40.757182],[-73.855608,40.758305],[-73.85540399999999,40.75834],[-73.85530199999999,40.758293],[-73.855054,40.75833],[-73.85490900000001,40.758336],[-73.854766,40.758328],[-73.854629,40.758307],[-73.854496,40.758279],[-73.854208,40.757867],[-73.85382,40.757186],[-73.85378300000001,40.757112],[-73.85371600000001,40.756974],[-73.85365400000001,40.756835],[-73.853594,40.756695],[-73.853538,40.756555],[-73.85339399999999,40.756137],[-73.853351,40.756013],[-73.85318700000001,40.755398],[-73.853126,40.755109],[-73.853238,40.755096],[-73.853831,40.754958],[-73.854786,40.754708],[-73.855799,40.75441],[-73.85666399999999,40.754238],[-73.85715500000001,40.754144],[-73.857542,40.754067],[-73.858805,40.756503],[-73.857928,40.756685]]],"type":"Polygon"}
}