{
  "id": "361170218001",
  "type": "Feature",
  "properties": {
    "area_land":2656495,
    "area_water":82790,
    "geoid":"361170218001",
    "name":"Block Group 1",
    "state":"ny"
},
  "bbox": [
    -76.872936,
    43.072987,
    -76.85537,
    43.094925
],
  "geometry": {"coordinates":[[[-76.872936,43.078172],[-76.872882,43.078668],[-76.87284200000001,43.078842],[-76.872815,43.078965],[-76.87275699999999,43.079163],[-76.872719,43.079268],[-76.87267199999999,43.079395],[-76.87261100000001,43.079579],[-76.87252100000001,43.079772],[-76.87246399999999,43.079895],[-76.872393,43.080012],[-76.87224399999999,43.080264],[-76.87217699999999,43.08036],[-76.872101,43.080474],[-76.872073,43.080511],[-76.87200300000001,43.080602],[-76.871988,43.080621],[-76.87196,43.080659],[-76.871933,43.080693],[-76.871854,43.080798],[-76.87182799999999,43.080833],[-76.871816,43.080848],[-76.871801,43.080869],[-76.871782,43.080893],[-76.871771,43.080908],[-76.871696,43.081004],[-76.871545,43.081202],[-76.871472,43.081294],[-76.871398,43.081391],[-76.871206,43.081635],[-76.87054999999999,43.082474],[-76.87039900000001,43.082667],[-76.87038800000001,43.082682],[-76.870375,43.082702],[-76.870356,43.082728],[-76.870346,43.082744],[-76.870064,43.083195],[-76.869812,43.083637],[-76.86963799999999,43.083868],[-76.869473,43.084192],[-76.868983,43.085051],[-76.868855,43.085275],[-76.86847,43.08595],[-76.868343,43.086175],[-76.868143,43.086523],[-76.867788,43.087143],[-76.867536,43.087564],[-76.86733099999999,43.08791],[-76.867204,43.088125],[-76.86685900000001,43.088711],[-76.866828,43.088773],[-76.86674499999999,43.088948],[-76.866727,43.089001],[-76.866711,43.089201],[-76.86671200000001,43.0893],[-76.866741,43.089535],[-76.86694,43.091134],[-76.867007,43.091667],[-76.867024,43.091812],[-76.867075,43.092249],[-76.867092,43.092395],[-76.86715100000001,43.092887],[-76.867329,43.094363],[-76.867389,43.094855],[-76.86709500000001,43.094869],[-76.866213,43.094911],[-76.86591900000001,43.094925],[-76.861627,43.094822],[-76.856058,43.094881],[-76.855946,43.087145],[-76.85594,43.087043],[-76.855921,43.086667],[-76.855847,43.085235],[-76.855823,43.084758],[-76.855807,43.084444],[-76.85575900000001,43.083504],[-76.855743,43.083191],[-76.85571,43.082557],[-76.85561300000001,43.080655],[-76.855581,43.080021],[-76.855525,43.0783],[-76.85536999999999,43.073507],[-76.855738,43.073497],[-76.85746,43.073455],[-76.857668,43.073464],[-76.858295,43.073494],[-76.858504,43.073504],[-76.858491,43.073492],[-76.85847,43.073472],[-76.858453,43.073456],[-76.858441,43.073444],[-76.85846600000001,43.073445],[-76.858543,43.073449],[-76.858569,43.073451],[-76.858751,43.073443],[-76.859297,43.073419],[-76.85948,43.073412],[-76.859798,43.073401],[-76.860495,43.073377],[-76.860753,43.073368],[-76.86107199999999,43.073358],[-76.86112199999999,43.073356],[-76.861272,43.07335],[-76.861323,43.073349],[-76.861887,43.073325],[-76.86358199999999,43.073252],[-76.864147,43.073229],[-76.865044,43.073203],[-76.867738,43.073124],[-76.868636,43.073099],[-76.86926,43.073076],[-76.871134,43.073009],[-76.871759,43.072987],[-76.87184600000001,43.073124],[-76.87204,43.073427],[-76.87215500000001,43.073631],[-76.87219899999999,43.073724],[-76.872275,43.073886],[-76.87249,43.074482],[-76.872585,43.074826],[-76.872665,43.075301],[-76.87276,43.076224],[-76.872848,43.07708],[-76.872893,43.077521],[-76.872925,43.077822],[-76.872936,43.078172]]],"type":"Polygon"}
}