{
  "id": "360790105001",
  "type": "Feature",
  "properties": {
    "area_land":13340988,
    "area_water":445099,
    "geoid":"360790105001",
    "name":"Block Group 1",
    "state":"ny"
},
  "bbox": [
    -73.715337,
    41.477103,
    -73.647635,
    41.518293
],
  "geometry": {"coordinates":[[[-73.71533700000001,41.510049],[-73.708167,41.510742],[-73.70703,41.510852],[-73.69266399999999,41.512246],[-73.69183200000001,41.512355],[-73.691819,41.512357],[-73.691802,41.512359],[-73.69123399999999,41.512433],[-73.690038,41.512589],[-73.68983,41.512607],[-73.68871,41.512701],[-73.68606800000001,41.513003],[-73.68581399999999,41.513038],[-73.68531900000001,41.513108],[-73.685165,41.513129],[-73.685153,41.513131],[-73.685141,41.513133],[-73.68482400000001,41.513178],[-73.684355,41.513239],[-73.683849,41.513306],[-73.683701,41.513326],[-73.68331499999999,41.513377],[-73.68325299999999,41.513385],[-73.681501,41.51362],[-73.677364,41.514162],[-73.67711799999999,41.514188],[-73.676075,41.514298],[-73.675893,41.514317],[-73.674789,41.514445],[-73.67328500000001,41.514701],[-73.672757,41.514749],[-73.67216500000001,41.514837],[-73.671741,41.5149],[-73.67163499999999,41.514916],[-73.671252,41.514969],[-73.67040299999999,41.515086],[-73.670193,41.515115],[-73.670153,41.51512],[-73.65624800000001,41.516982],[-73.653091,41.517405],[-73.64763499999999,41.518293],[-73.648105,41.508672],[-73.648135,41.508054],[-73.64809,41.507776],[-73.649747,41.488979],[-73.64986399999999,41.486873],[-73.64987600000001,41.486754],[-73.650475,41.47876],[-73.650599,41.477103],[-73.650712,41.477244],[-73.650881,41.477426],[-73.650908,41.477467],[-73.651262,41.478009],[-73.651499,41.478394],[-73.651866,41.478912],[-73.652592,41.480012],[-73.65298799999999,41.480595],[-73.653502,41.481371],[-73.65413100000001,41.482321],[-73.654545,41.482884],[-73.654977,41.483399],[-73.65520100000001,41.483649],[-73.655776,41.484214],[-73.65637,41.484717],[-73.656706,41.484973],[-73.657662,41.485658],[-73.66090800000001,41.487926],[-73.661654,41.488461],[-73.662329,41.489009],[-73.662786,41.48944],[-73.663371,41.490056],[-73.663606,41.490331],[-73.664036,41.490904],[-73.66435199999999,41.491374],[-73.664456,41.49155],[-73.666478,41.495193],[-73.666747,41.495686],[-73.666984,41.496091],[-73.66727400000001,41.496519],[-73.667717,41.497116],[-73.66794899999999,41.496783],[-73.668167,41.496484],[-73.668318,41.496258],[-73.668482,41.496006],[-73.668711,41.495609],[-73.668762,41.495454],[-73.66884899999999,41.494998],[-73.668893,41.49487],[-73.669017,41.494682],[-73.670382,41.493006],[-73.670534,41.492762],[-73.670829,41.49222],[-73.67169800000001,41.490815],[-73.671798,41.490633],[-73.672214,41.489945],[-73.672477,41.489562],[-73.67280100000001,41.489183],[-73.672828,41.489112],[-73.672825,41.488983],[-73.672759,41.488795],[-73.67272699999999,41.488573],[-73.672633,41.488248],[-73.67263199999999,41.488134],[-73.672679,41.487951],[-73.67276200000001,41.487768],[-73.672783,41.487631],[-73.672743,41.487322],[-73.672759,41.487197],[-73.67279499999999,41.487099],[-73.67289700000001,41.486906],[-73.67312800000001,41.486613],[-73.673423,41.48633],[-73.673541,41.486241],[-73.67382499999999,41.486051],[-73.673939,41.485953],[-73.674199,41.485677],[-73.67467000000001,41.485327],[-73.67486700000001,41.485159],[-73.67510900000001,41.484978],[-73.675465,41.484776],[-73.675557,41.484703],[-73.67582400000001,41.484332],[-73.67590800000001,41.484267],[-73.67636299999999,41.48541],[-73.67687599999999,41.486649],[-73.677044,41.486986],[-73.677226,41.487309],[-73.677542,41.487782],[-73.678192,41.48865],[-73.678366,41.488882],[-73.678511,41.489072],[-73.678766,41.489407],[-73.67895900000001,41.489659],[-73.679261,41.490078],[-73.679388,41.490283],[-73.679456,41.490409],[-73.67964499999999,41.490756],[-73.67988699999999,41.49136],[-73.68006,41.491896],[-73.680215,41.492406],[-73.680363,41.492853],[-73.68040000000001,41.492943],[-73.680538,41.492906],[-73.680744,41.492895],[-73.680961,41.49291],[-73.68124899999999,41.492979],[-73.681574,41.493123],[-73.68167800000001,41.493184],[-73.681843,41.493312],[-73.682013,41.493485],[-73.68212699999999,41.493642],[-73.682203,41.493772],[-73.68253799999999,41.494377],[-73.682818,41.494809],[-73.68301700000001,41.495088],[-73.68320900000001,41.495399],[-73.68335,41.495692],[-73.683476,41.495906],[-73.683564,41.496004],[-73.68367499999999,41.496085],[-73.683796,41.496147],[-73.683965,41.496215],[-73.684096,41.496249],[-73.684288,41.496286],[-73.68439499999999,41.496293],[-73.684513,41.496291],[-73.684698,41.496271],[-73.68473899999999,41.49626],[-73.684901,41.496218],[-73.685425,41.496025],[-73.68578599999999,41.495923],[-73.686052,41.495862],[-73.68631000000001,41.495827],[-73.687166,41.495778],[-73.687314,41.495757],[-73.68754300000001,41.495679],[-73.687707,41.495576],[-73.688169,41.495176],[-73.68835,41.495062],[-73.68847100000001,41.495012],[-73.68865,41.494966],[-73.689044,41.494897],[-73.6893,41.494829],[-73.689414,41.494783],[-73.69167400000001,41.493684],[-73.691957,41.493583],[-73.69202,41.49357],[-73.69234299999999,41.493502],[-73.694202,41.493262],[-73.694485,41.493245],[-73.694744,41.493275],[-73.695025,41.493145],[-73.695092,41.493114],[-73.695391,41.492951],[-73.695476,41.49286],[-73.69555,41.492701],[-73.69556300000001,41.492585],[-73.695521,41.492308],[-73.695505,41.491921],[-73.69552,41.491613],[-73.695562,41.491324],[-73.696001,41.491291],[-73.696555,41.491224],[-73.697236,41.491061],[-73.697462,41.491011],[-73.69769100000001,41.490987],[-73.697785,41.490993],[-73.698024,41.491012],[-73.698325,41.491016],[-73.698407,41.491003],[-73.699057,41.49082],[-73.699158,41.490804],[-73.699365,41.490792],[-73.69958699999999,41.490821],[-73.699729,41.490858],[-73.699806,41.490888],[-73.69993599999999,41.49094],[-73.70003199999999,41.491001],[-73.700169,41.491143],[-73.70034800000001,41.491313],[-73.700419,41.491349],[-73.70075199999999,41.491436],[-73.700855,41.4915],[-73.700964,41.491607],[-73.701108,41.491842],[-73.701159,41.491963],[-73.701167,41.491981],[-73.70118100000001,41.492466],[-73.701221,41.492608],[-73.701325,41.492809],[-73.701627,41.493205],[-73.70181700000001,41.493377],[-73.701971,41.493458],[-73.702113,41.493497],[-73.70314,41.493692],[-73.703701,41.493827],[-73.703879,41.493845],[-73.704037,41.493842],[-73.70447799999999,41.493744],[-73.705139,41.49355],[-73.7054,41.493447],[-73.705865,41.493201],[-73.70614399999999,41.493073],[-73.706441,41.492976],[-73.706683,41.492947],[-73.706931,41.492953],[-73.70705100000001,41.492974],[-73.707094,41.492985],[-73.70753499999999,41.493162],[-73.70805900000001,41.493418],[-73.708485,41.493662],[-73.70889699999999,41.493944],[-73.709388,41.494246],[-73.70908300000001,41.494439],[-73.70893599999999,41.494542],[-73.708787,41.494678],[-73.70868400000001,41.494803],[-73.708575,41.495],[-73.70852499999999,41.495174],[-73.708516,41.495311],[-73.70853700000001,41.495706],[-73.70874000000001,41.496152],[-73.70890900000001,41.496401],[-73.70930199999999,41.496632],[-73.709428,41.49672],[-73.709817,41.496989],[-73.70989899999999,41.497059],[-73.70999,41.497194],[-73.710128,41.497757],[-73.71020300000001,41.497901],[-73.710283,41.497979],[-73.71055800000001,41.498149],[-73.710846,41.498297],[-73.711083,41.498384],[-73.711512,41.498494],[-73.711596,41.498511],[-73.712002,41.498648],[-73.712317,41.49872],[-73.713031,41.498799],[-73.71317000000001,41.498829],[-73.713275,41.498889],[-73.71332099999999,41.49896],[-73.713368,41.499115],[-73.713382,41.499202],[-73.713486,41.499876],[-73.713549,41.499962],[-73.713566,41.49998],[-73.713819,41.500162],[-73.71387300000001,41.500241],[-73.71388899999999,41.500307],[-73.71389000000001,41.500662],[-73.713978,41.501089],[-73.713992,41.50126],[-73.713942,41.501606],[-73.713948,41.501882],[-73.713987,41.502066],[-73.714202,41.50253],[-73.71437899999999,41.502935],[-73.714398,41.503128],[-73.714376,41.503291],[-73.714365,41.503326],[-73.714303,41.503513],[-73.714251,41.503619],[-73.714136,41.503851],[-73.714073,41.50402],[-73.71399099999999,41.504351],[-73.713977,41.504492],[-73.714015,41.504729],[-73.7141,41.504984],[-73.714178,41.50511],[-73.714315,41.505266],[-73.714426,41.505391],[-73.71451500000001,41.505502],[-73.71457599999999,41.505613],[-73.714663,41.505929],[-73.714673,41.506023],[-73.714589,41.5065],[-73.714584,41.506681],[-73.714619,41.506945],[-73.71463,41.507009],[-73.714894,41.507884],[-73.714941,41.508347],[-73.714979,41.508597],[-73.71500399999999,41.508767],[-73.715256,41.509742],[-73.71533700000001,41.510049]]],"type":"Polygon"}
}