{
  "id": "360550152001",
  "type": "Feature",
  "properties": {
    "area_land":12245290,
    "area_water":0,
    "geoid":"360550152001",
    "name":"Block Group 1",
    "state":"ny"
},
  "bbox": [
    -77.927704,
    43.225385,
    -77.876702,
    43.262784
],
  "geometry": {"coordinates":[[[-77.92770400000001,43.233128],[-77.925819,43.235768],[-77.924245,43.238031],[-77.924212,43.238078],[-77.92277,43.240114],[-77.922505,43.240553],[-77.922363,43.240838],[-77.922342,43.240882],[-77.922247,43.241183],[-77.922186,43.241456],[-77.922128,43.241836],[-77.922105,43.242171],[-77.92202899999999,43.244573],[-77.921989,43.246413],[-77.921971,43.247273],[-77.92194000000001,43.248675],[-77.92173200000001,43.256539],[-77.921631,43.259289],[-77.921623,43.260006],[-77.92159100000001,43.262784],[-77.916623,43.262773],[-77.91461,43.262768],[-77.89426,43.262617],[-77.87670199999999,43.262486],[-77.87723099999999,43.261066],[-77.87755199999999,43.260203],[-77.87811600000001,43.25876],[-77.879834,43.254086],[-77.881001,43.250833],[-77.883303,43.244447],[-77.885102,43.239443],[-77.886205,43.236294],[-77.886441,43.2357],[-77.88691900000001,43.234364],[-77.88735800000001,43.233082],[-77.888744,43.229255],[-77.889017,43.228478],[-77.889752,43.226393],[-77.89013199999999,43.225385],[-77.89076,43.225429],[-77.891392,43.225492],[-77.891808,43.225558],[-77.89184899999999,43.225565],[-77.892714,43.225736],[-77.893286,43.225865],[-77.89344699999999,43.225903],[-77.89377899999999,43.225991],[-77.894598,43.226218],[-77.894976,43.226334],[-77.899705,43.227691],[-77.90161999999999,43.228233],[-77.902676,43.228494],[-77.90346700000001,43.228694],[-77.903924,43.228783],[-77.904388,43.228848],[-77.905205,43.228927],[-77.906098,43.228993],[-77.90778899999999,43.22914],[-77.908816,43.229244],[-77.909646,43.229333],[-77.910639,43.229458],[-77.91264099999999,43.229804],[-77.916788,43.230552],[-77.917266,43.230644],[-77.92090899999999,43.231345],[-77.922359,43.231621],[-77.923051,43.231767],[-77.923343,43.231848],[-77.92580100000001,43.232558],[-77.926779,43.232854],[-77.92719,43.232978],[-77.92770400000001,43.233128]]],"type":"Polygon"}
}