{
  "id": "361130710001",
  "type": "Feature",
  "properties": {
    "area_land":44620403,
    "area_water":1208657,
    "geoid":"361130710001",
    "name":"Block Group 1",
    "state":"ny"
},
  "bbox": [
    -73.883308,
    43.304871,
    -73.765927,
    43.40814
],
  "geometry": {"coordinates":[[[-73.88329899999999,43.397988],[-73.882689,43.39806],[-73.882414,43.398084],[-73.87462499999999,43.398823],[-73.85473,43.400602],[-73.81964000000001,43.403894],[-73.819107,43.403936],[-73.818337,43.403992],[-73.81741,43.404089],[-73.81412400000001,43.404375],[-73.806059,43.405082],[-73.771113,43.40814],[-73.77012499999999,43.402883],[-73.76962,43.400141],[-73.767437,43.388333],[-73.766762,43.384621],[-73.766627,43.383825],[-73.766282,43.381981],[-73.76602800000001,43.380596],[-73.765927,43.380098],[-73.766009,43.38008],[-73.76624700000001,43.380031],[-73.766643,43.379962],[-73.767076,43.379899],[-73.76772800000001,43.379833],[-73.768615,43.379788],[-73.768997,43.379763],[-73.770101,43.379655],[-73.772097,43.379386],[-73.773015,43.379301],[-73.773633,43.379262],[-73.77467799999999,43.379253],[-73.777367,43.379304],[-73.77808400000001,43.379307],[-73.778318,43.379296],[-73.778695,43.379252],[-73.779051,43.379181],[-73.7795,43.379039],[-73.779766,43.378929],[-73.780039,43.378787],[-73.780325,43.378607],[-73.780748,43.378289],[-73.781327,43.377828],[-73.781757,43.377429],[-73.78227200000001,43.376897],[-73.782618,43.376498],[-73.782873,43.376146],[-73.783039,43.375854],[-73.78317800000001,43.37551],[-73.78324000000001,43.375298],[-73.783306,43.374861],[-73.783293,43.373852],[-73.783314,43.373532],[-73.783379,43.373208],[-73.783387,43.37316],[-73.783468,43.372889],[-73.78361200000001,43.372561],[-73.78374599999999,43.372334],[-73.78395,43.372052],[-73.78411199999999,43.371863],[-73.78434,43.371646],[-73.784408,43.371589],[-73.784526,43.371493],[-73.784695,43.371366],[-73.78475400000001,43.371321],[-73.784955,43.371186],[-73.78546299999999,43.370911],[-73.785577,43.370849],[-73.785678,43.3708],[-73.785928,43.370679],[-73.786558,43.370331],[-73.787375,43.369867],[-73.787744,43.369643],[-73.788067,43.369439],[-73.788337,43.369287],[-73.78858200000001,43.36917],[-73.78888499999999,43.369044],[-73.78912,43.368972],[-73.789457,43.368897],[-73.789811,43.368842],[-73.790116,43.36882],[-73.790333,43.36882],[-73.790578,43.368833],[-73.79100099999999,43.368895],[-73.79143000000001,43.368987],[-73.79206600000001,43.369106],[-73.792421,43.369144],[-73.79297,43.369136],[-73.793301,43.369099],[-73.793629,43.369033],[-73.793768,43.36899],[-73.794095,43.368888],[-73.79430499999999,43.368804],[-73.794557,43.368674],[-73.79489100000001,43.368454],[-73.795444,43.368049],[-73.795839,43.367763],[-73.796054,43.367594],[-73.79736699999999,43.36661],[-73.7976,43.366464],[-73.79789700000001,43.366309],[-73.79819500000001,43.366189],[-73.798489,43.366094],[-73.79886399999999,43.365997],[-73.798877,43.365995],[-73.799194,43.365942],[-73.799532,43.36591],[-73.799893,43.365901],[-73.800213,43.365911],[-73.80081800000001,43.365918],[-73.801115,43.365921],[-73.80208399999999,43.365939],[-73.806354,43.365991],[-73.807975,43.366008],[-73.808549,43.365982],[-73.809201,43.365911],[-73.809601,43.365845],[-73.80983500000001,43.365798],[-73.81043200000001,43.365659],[-73.810845,43.36554],[-73.81123100000001,43.365408],[-73.812179,43.365097],[-73.8125,43.365006],[-73.81299300000001,43.36488],[-73.813693,43.364722],[-73.81416400000001,43.36463],[-73.814865,43.364521],[-73.81666300000001,43.364276],[-73.817097,43.364221],[-73.81847999999999,43.364035],[-73.821547,43.363631],[-73.823213,43.363437],[-73.823761,43.363341],[-73.824134,43.363247],[-73.824619,43.363081],[-73.82503,43.362907],[-73.82537499999999,43.362719],[-73.825728,43.362489],[-73.82609100000001,43.3622],[-73.826247,43.362044],[-73.82653000000001,43.361706],[-73.82694600000001,43.361156],[-73.827043,43.361027],[-73.827389,43.360573],[-73.827928,43.359843],[-73.828233,43.359403],[-73.82881,43.358589],[-73.829025,43.358212],[-73.829311,43.357606],[-73.829351,43.357534],[-73.829579,43.357139],[-73.829624,43.35706],[-73.82982,43.356807],[-73.829972,43.356604],[-73.830285,43.356308],[-73.83068299999999,43.355974],[-73.83120599999999,43.355548],[-73.831684,43.355152],[-73.832095,43.354828],[-73.83250099999999,43.35451],[-73.83278900000001,43.354258],[-73.833094,43.353956],[-73.833319,43.353704],[-73.83347000000001,43.353503],[-73.8335,43.353459],[-73.833595,43.353317],[-73.833688,43.35318],[-73.83391,43.352739],[-73.834018,43.352479],[-73.834329,43.351673],[-73.834481,43.351288],[-73.83486000000001,43.350335],[-73.834996,43.349993],[-73.835171,43.349479],[-73.835201,43.349394],[-73.835229,43.349315],[-73.83537800000001,43.348897],[-73.83549600000001,43.348491],[-73.83574400000001,43.347581],[-73.835858,43.347153],[-73.83588,43.347067],[-73.83608,43.346278],[-73.836118,43.346125],[-73.836294,43.345456],[-73.836392,43.345074],[-73.83648599999999,43.344709],[-73.83657700000001,43.344357],[-73.836584,43.34433],[-73.836724,43.343847],[-73.836764,43.343709],[-73.837084,43.342617],[-73.83725800000001,43.342019],[-73.837396,43.341532],[-73.837586,43.340862],[-73.838098,43.339058],[-73.838193,43.338725],[-73.838291,43.338369],[-73.838356,43.338132],[-73.83854599999999,43.337476],[-73.838774,43.336636],[-73.838869,43.336289],[-73.83891300000001,43.336128],[-73.839089,43.335417],[-73.83919299999999,43.334974],[-73.83953700000001,43.333369],[-73.839691,43.33259],[-73.839787,43.33211],[-73.83983000000001,43.331836],[-73.839865,43.331616],[-73.8399,43.331204],[-73.839924,43.330939],[-73.839921,43.330287],[-73.839877,43.329782],[-73.839837,43.329325],[-73.83982399999999,43.329207],[-73.83977,43.328739],[-73.83973899999999,43.328474],[-73.839705,43.32804],[-73.839584,43.327077],[-73.83945,43.325878],[-73.83930599999999,43.324673],[-73.83925499999999,43.324438],[-73.83918,43.324227],[-73.839105,43.32404],[-73.839045,43.323892],[-73.83892299999999,43.323602],[-73.83877200000001,43.323241],[-73.838708,43.323089],[-73.838419,43.322426],[-73.838403,43.322381],[-73.838224,43.321867],[-73.838159,43.321535],[-73.838123,43.321172],[-73.83809100000001,43.319914],[-73.838078,43.319352],[-73.83808999999999,43.31899],[-73.838093,43.318903],[-73.83816400000001,43.318493],[-73.838453,43.317363],[-73.83853000000001,43.316979],[-73.83853999999999,43.316883],[-73.83853499999999,43.31659],[-73.838494,43.316257],[-73.838363,43.315821],[-73.838255,43.315584],[-73.838083,43.315307],[-73.83790500000001,43.315067],[-73.837509,43.314664],[-73.837277,43.314486],[-73.83677,43.314167],[-73.836077,43.313832],[-73.835849,43.313694],[-73.835533,43.313477],[-73.835256,43.313229],[-73.835126,43.313092],[-73.83494899999999,43.312871],[-73.834875,43.312762],[-73.834841,43.312705],[-73.834717,43.312498],[-73.834631,43.312306],[-73.83444299999999,43.31178],[-73.83429099999999,43.311352],[-73.83386400000001,43.310178],[-73.833428,43.308943],[-73.83322699999999,43.308374],[-73.833119,43.308001],[-73.83302399999999,43.307543],[-73.832978,43.307183],[-73.832971,43.307115],[-73.832967,43.307074],[-73.83295,43.305876],[-73.832943,43.305386],[-73.83294100000001,43.304873],[-73.83328899999999,43.304871],[-73.833466,43.304871],[-73.834036,43.305006],[-73.834205,43.305086],[-73.834384,43.305171],[-73.834732,43.305335],[-73.83546200000001,43.305677],[-73.836918,43.306611],[-73.838132,43.308534],[-73.838234,43.308972],[-73.838443,43.309862],[-73.83883400000001,43.310702],[-73.838908,43.310861],[-73.83891199999999,43.31087],[-73.838925,43.310899],[-73.838938,43.310926],[-73.839016,43.311094],[-73.83969999999999,43.312332],[-73.84036399999999,43.313153],[-73.840718,43.313404],[-73.840783,43.31345],[-73.840805,43.313466],[-73.840919,43.313547],[-73.841148,43.313709],[-73.84168699999999,43.314055],[-73.84217200000001,43.314377],[-73.842426,43.314739],[-73.842354,43.315764],[-73.842423,43.316927],[-73.84263,43.317588],[-73.84269399999999,43.317792],[-73.84276699999999,43.318],[-73.842893,43.318358],[-73.84319000000001,43.318852],[-73.84748,43.322255],[-73.848354,43.323033],[-73.849363,43.323917],[-73.84960100000001,43.324126],[-73.850759,43.324392],[-73.851884,43.324633],[-73.852799,43.324737],[-73.854009,43.324976],[-73.854904,43.325315],[-73.855654,43.325749],[-73.856341,43.326241],[-73.85683299999999,43.326641],[-73.858647,43.328115],[-73.85897900000001,43.329024],[-73.858991,43.33032],[-73.85808900000001,43.332211],[-73.856877,43.333564],[-73.854783,43.334546],[-73.854309,43.33482],[-73.85340600000001,43.33651],[-73.853286,43.33775],[-73.854203,43.339246],[-73.85917000000001,43.342962],[-73.863331,43.345214],[-73.86403799999999,43.345496],[-73.86462299999999,43.346678],[-73.86465800000001,43.34758],[-73.864527,43.349463],[-73.864321,43.351837],[-73.86447800000001,43.352686],[-73.864754,43.354178],[-73.865692,43.355216],[-73.867503,43.35627],[-73.869567,43.357251],[-73.870715,43.357894],[-73.87224999999999,43.358972],[-73.873355,43.359744],[-73.874567,43.361059],[-73.874725,43.361212],[-73.874889,43.361486],[-73.875139,43.361921],[-73.875224,43.362404],[-73.87532,43.362831],[-73.875371,43.363402],[-73.875434,43.363884],[-73.875365,43.364455],[-73.875372,43.365122],[-73.875159,43.365725],[-73.87494700000001,43.36619],[-73.874703,43.366592],[-73.874567,43.366832],[-73.873288,43.367936],[-73.872175,43.369216],[-73.871559,43.370584],[-73.87124,43.371501],[-73.870977,43.372523],[-73.87119800000001,43.373352],[-73.871475,43.374253],[-73.87194700000001,43.375069],[-73.872122,43.375348],[-73.872317,43.375712],[-73.872643,43.376343],[-73.87279599999999,43.376618],[-73.872828,43.376715],[-73.872871,43.376828],[-73.872912,43.377191],[-73.87296499999999,43.377417],[-73.87299299999999,43.378006],[-73.87302200000001,43.378458],[-73.873019,43.37882],[-73.87302800000001,43.378966],[-73.872992,43.379304],[-73.87303199999999,43.379748],[-73.873085,43.380039],[-73.873147,43.380426],[-73.873288,43.380782],[-73.873418,43.381024],[-73.873504,43.381299],[-73.873774,43.382018],[-73.873891,43.382478],[-73.874021,43.382858],[-73.87407399999999,43.383052],[-73.874138,43.383327],[-73.87419199999999,43.38348],[-73.87445099999999,43.384135],[-73.874567,43.384495],[-73.874726,43.384631],[-73.874937,43.384735],[-73.875291,43.384934],[-73.875857,43.385293],[-73.876023,43.385405],[-73.876335,43.385709],[-73.876701,43.386038],[-73.87712500000001,43.386398],[-73.877392,43.386646],[-73.87755900000001,43.386846],[-73.877805,43.387191],[-73.87804,43.387641],[-73.878142,43.387938],[-73.87823299999999,43.388203],[-73.878269,43.388452],[-73.87830599999999,43.388887],[-73.87839,43.389594],[-73.878473,43.39019],[-73.87851999999999,43.390552],[-73.87858900000001,43.390793],[-73.87866699999999,43.390929],[-73.878812,43.391105],[-73.87899,43.391298],[-73.87918999999999,43.39145],[-73.879335,43.391586],[-73.87965800000001,43.391954],[-73.879903,43.392251],[-73.88007,43.392403],[-73.88022599999999,43.392555],[-73.880481,43.392755],[-73.88065899999999,43.392931],[-73.880737,43.392995],[-73.880849,43.393172],[-73.88114,43.393597],[-73.881711,43.394503],[-73.882113,43.395081],[-73.882741,43.396236],[-73.88298899999999,43.396726],[-73.883157,43.397015],[-73.883214,43.397264],[-73.883295,43.397586],[-73.883308,43.397795],[-73.88329899999999,43.397988]]],"type":"Polygon"}
}