{
  "id": "360050415001",
  "type": "Feature",
  "properties": {
    "area_land":25619,
    "area_water":0,
    "geoid":"360050415001",
    "name":"Block Group 1",
    "state":"ny"
},
  "bbox": [
    -73.884965,
    40.868705,
    -73.881976,
    40.871227
],
  "geometry": {"coordinates":[[[-73.88496499999999,40.869538],[-73.883258,40.870593],[-73.88222,40.871227],[-73.88197599999999,40.870387],[-73.882819,40.869871],[-73.884709,40.868705],[-73.88488099999999,40.869097],[-73.88496499999999,40.869538]]],"type":"Polygon"}
}