{
  "id": "360150006003",
  "type": "Feature",
  "properties": {
    "area_land":276670,
    "area_water":37259,
    "geoid":"360150006003",
    "name":"Block Group 3",
    "state":"ny"
},
  "bbox": [
    -76.819015,
    42.083344,
    -76.810211,
    42.091085
],
  "geometry": {"coordinates":[[[-76.818465,42.090288],[-76.817481,42.09057],[-76.81571099999999,42.091085],[-76.815017,42.0898],[-76.814605,42.088964],[-76.814649,42.08895],[-76.814162,42.08811],[-76.811904,42.08877],[-76.81174900000001,42.088478],[-76.811454,42.087919],[-76.81095000000001,42.086943],[-76.810761,42.086629],[-76.810256,42.086167],[-76.810241,42.086139],[-76.810211,42.086117],[-76.81023399999999,42.086062],[-76.810315,42.08598],[-76.810801,42.085546],[-76.810884,42.085443],[-76.81105100000001,42.085239],[-76.81113999999999,42.085074],[-76.81130899999999,42.084893],[-76.811471,42.084701],[-76.81178800000001,42.08446],[-76.811921,42.084377],[-76.812031,42.084322],[-76.81244,42.084197],[-76.81338,42.084004],[-76.81374099999999,42.0839],[-76.81400600000001,42.083812],[-76.81441100000001,42.083636],[-76.814544,42.083587],[-76.814802,42.083521],[-76.814949,42.083548],[-76.815336,42.083344],[-76.815398,42.08346],[-76.81562,42.083937],[-76.815729,42.084138],[-76.81636,42.085298],[-76.816924,42.086317],[-76.81738199999999,42.087164],[-76.817863,42.08803],[-76.81810900000001,42.088479],[-76.818313,42.08885],[-76.81901499999999,42.090128],[-76.818465,42.090288]]],"type":"Polygon"}
}