{
  "id": "360734012002",
  "type": "Feature",
  "properties": {
    "area_land":33226750,
    "area_water":671868,
    "geoid":"360734012002",
    "name":"Block Group 2",
    "state":"ny"
},
  "bbox": [
    -78.310548,
    43.30609,
    -78.245872,
    43.37344
],
  "geometry": {"coordinates":[[[-78.310483,43.308412],[-78.31043,43.310253],[-78.310272,43.31483],[-78.310266,43.315004],[-78.310198,43.317202],[-78.31016200000001,43.318395],[-78.310126,43.319656],[-78.310075,43.321977],[-78.31004900000001,43.323172],[-78.310024,43.324069],[-78.309949,43.326759],[-78.30992500000001,43.327657],[-78.309924,43.327686],[-78.309922,43.327775],[-78.309922,43.327805],[-78.309918,43.327989],[-78.309814,43.331827],[-78.309702,43.336445],[-78.30967200000001,43.338456],[-78.309541,43.343691],[-78.30950900000001,43.345409],[-78.309471,43.347349],[-78.309415,43.349847],[-78.309404,43.350973],[-78.309371,43.352241],[-78.309209,43.360885],[-78.30913700000001,43.363767],[-78.309105,43.365679],[-78.30907500000001,43.366615],[-78.309059,43.366994],[-78.309056,43.367169],[-78.30903000000001,43.368834],[-78.309022,43.36939],[-78.30901799999999,43.369515],[-78.30900800000001,43.369892],[-78.309005,43.370018],[-78.308995,43.370252],[-78.308971,43.37089],[-78.308977,43.370955],[-78.309,43.371189],[-78.30903000000001,43.37138],[-78.309039,43.371521],[-78.30904,43.371532],[-78.30904,43.372024],[-78.309027,43.372526],[-78.30901900000001,43.372861],[-78.30901799999999,43.372879],[-78.309016,43.372935],[-78.309016,43.372954],[-78.309028,43.373049],[-78.309067,43.373337],[-78.30907999999999,43.373433],[-78.30883900000001,43.373436],[-78.308543,43.37344],[-78.308301,43.373404],[-78.308128,43.373358],[-78.307892,43.373316],[-78.30764600000001,43.373272],[-78.307389,43.373191],[-78.307231,43.37313],[-78.307197,43.373106],[-78.307115,43.37305],[-78.306726,43.372631],[-78.306645,43.372579],[-78.306287,43.372487],[-78.30602500000001,43.372354],[-78.30587199999999,43.37231],[-78.305747,43.372297],[-78.30528200000001,43.372214],[-78.305119,43.372185],[-78.304575,43.372038],[-78.304166,43.371927],[-78.30408799999999,43.371908],[-78.30261900000001,43.371557],[-78.30240000000001,43.371505],[-78.302127,43.371457],[-78.301699,43.371383],[-78.30140299999999,43.37134],[-78.300639,43.371275],[-78.299995,43.371271],[-78.299024,43.371368],[-78.297691,43.371436],[-78.29440700000001,43.371291],[-78.293739,43.371332],[-78.292597,43.371299],[-78.292367,43.371328],[-78.292113,43.371384],[-78.291764,43.371515],[-78.291562,43.371597],[-78.29132799999999,43.371666],[-78.291211,43.371678],[-78.29000499999999,43.37167],[-78.28948099999999,43.371698],[-78.2885,43.371831],[-78.28783900000001,43.371887],[-78.286569,43.371875],[-78.285723,43.371933],[-78.284736,43.372],[-78.284583,43.371996],[-78.284361,43.371975],[-78.284131,43.371964],[-78.28360000000001,43.371939],[-78.282931,43.371927],[-78.28219199999999,43.371899],[-78.281668,43.371836],[-78.28147,43.371795],[-78.280822,43.371662],[-78.27939000000001,43.371436],[-78.278526,43.371356],[-78.276685,43.371251],[-78.276008,43.371299],[-78.275356,43.371404],[-78.274744,43.371464],[-78.273606,43.371497],[-78.273516,43.371512],[-78.273444,43.371525],[-78.27335600000001,43.371553],[-78.273295,43.371589],[-78.27321499999999,43.371621],[-78.273122,43.371633],[-78.27278200000001,43.371613],[-78.272617,43.371621],[-78.271388,43.371871],[-78.270914,43.372006],[-78.270893,43.372012],[-78.27059,43.372086],[-78.270458,43.372119],[-78.270033,43.372248],[-78.26964099999999,43.372399],[-78.26958999999999,43.372419],[-78.269504,43.37244],[-78.269429,43.372443],[-78.269351,43.37244],[-78.26931500000001,43.372432],[-78.269194,43.372407],[-78.269037,43.372389],[-78.268987,43.372384],[-78.26889199999999,43.372377],[-78.268818,43.372365],[-78.268756,43.372341],[-78.268727,43.372317],[-78.26866099999999,43.372284],[-78.26857800000001,43.37226],[-78.26845,43.372242],[-78.26827299999999,43.372206],[-78.26806999999999,43.372191],[-78.268023,43.372184],[-78.26794200000001,43.372173],[-78.26788000000001,43.372176],[-78.26785,43.372199],[-78.26780599999999,43.372342],[-78.267777,43.372551],[-78.267741,43.372607],[-78.26768,43.372644],[-78.26763699999999,43.372644],[-78.267602,43.372644],[-78.266963,43.372658],[-78.266463,43.37262],[-78.26607300000001,43.372592],[-78.26594799999999,43.372534],[-78.265576,43.37236],[-78.265452,43.372303],[-78.26533499999999,43.372237],[-78.265299,43.372216],[-78.265238,43.372197],[-78.265173,43.372177],[-78.26493600000001,43.372141],[-78.264534,43.372056],[-78.26430000000001,43.372007],[-78.264348,43.371879],[-78.264493,43.371498],[-78.26454200000001,43.371371],[-78.26456899999999,43.371302],[-78.264652,43.371098],[-78.26467700000001,43.371039],[-78.264679,43.37103],[-78.264686,43.370999],[-78.26470999999999,43.370909],[-78.26472,43.370881],[-78.26472699999999,43.370765],[-78.264731,43.370417],[-78.26473300000001,43.370301],[-78.26473900000001,43.370032],[-78.264759,43.369225],[-78.26476599999999,43.368957],[-78.26476700000001,43.368918],[-78.26478,43.368555],[-78.264825,43.36735],[-78.264841,43.366949],[-78.264843,43.366829],[-78.26485099999999,43.366473],[-78.264854,43.366354],[-78.264855,43.366302],[-78.264921,43.364075],[-78.26494,43.361904],[-78.264984,43.361686],[-78.26503099999999,43.361558],[-78.26541899999999,43.360713],[-78.265119,43.360713],[-78.264584,43.360713],[-78.264089,43.360715],[-78.26175499999999,43.360706],[-78.258826,43.360677],[-78.254684,43.360629],[-78.25468600000001,43.360199],[-78.254729,43.358531],[-78.254735,43.358341],[-78.25476999999999,43.357591],[-78.254863,43.35476],[-78.25496800000001,43.352242],[-78.25505699999999,43.350147],[-78.255066,43.350044],[-78.255072,43.349978],[-78.255109,43.349752],[-78.25511400000001,43.349739],[-78.25515900000001,43.349647],[-78.254392,43.349643],[-78.254121,43.349635],[-78.252442,43.349624],[-78.25233900000001,43.349624],[-78.252053,43.349604],[-78.251908,43.349567],[-78.25171899999999,43.349485],[-78.25156699999999,43.349387],[-78.25145000000001,43.349297],[-78.251324,43.349164],[-78.251036,43.34886],[-78.25014400000001,43.347847],[-78.250097,43.347794],[-78.249945,43.347623],[-78.249489,43.347113],[-78.24933799999999,43.346943],[-78.249233,43.346826],[-78.248678,43.346205],[-78.24669900000001,43.343992],[-78.246174,43.343404],[-78.24605,43.343246],[-78.246002,43.343185],[-78.24591700000001,43.343033],[-78.245886,43.342921],[-78.24587699999999,43.342855],[-78.24587200000001,43.342279],[-78.245942,43.339257],[-78.24594999999999,43.33892],[-78.245977,43.338587],[-78.246028,43.338254],[-78.24609599999999,43.337988],[-78.246144,43.337665],[-78.246167,43.336586],[-78.246162,43.336147],[-78.246162,43.336118],[-78.246216,43.32979],[-78.246233,43.327884],[-78.246235,43.327788],[-78.246244,43.327672],[-78.246245,43.327479],[-78.246247,43.32698],[-78.24625,43.326596],[-78.24625899999999,43.325445],[-78.24627599999999,43.324905],[-78.246292,43.324451],[-78.24632,43.324307],[-78.246359,43.324226],[-78.24646300000001,43.324094],[-78.246673,43.323958],[-78.246899,43.32385],[-78.247246,43.323728],[-78.248142,43.323437],[-78.24974400000001,43.322939],[-78.24990699999999,43.322904],[-78.250192,43.322859],[-78.25032899999999,43.322848],[-78.250682,43.322838],[-78.251482,43.322835],[-78.251479,43.322603],[-78.251458,43.321161],[-78.251454,43.320944],[-78.25143,43.320581],[-78.251412,43.320415],[-78.251403,43.320334],[-78.251378,43.320093],[-78.25136999999999,43.320013],[-78.251367,43.319919],[-78.251358,43.319637],[-78.251355,43.319543],[-78.251328,43.31818],[-78.251318,43.317102],[-78.251313,43.316493],[-78.251313,43.31641],[-78.251302,43.315639],[-78.2513,43.315457],[-78.251299,43.31541],[-78.25129699999999,43.315363],[-78.251295,43.315287],[-78.251287,43.315084],[-78.251284,43.314991],[-78.25128100000001,43.314928],[-78.25127500000001,43.314739],[-78.251273,43.314677],[-78.251242,43.312567],[-78.25122399999999,43.312104],[-78.251096,43.30609],[-78.254255,43.306098],[-78.263735,43.306123],[-78.26689500000001,43.306132],[-78.267101,43.306132],[-78.26772,43.306133],[-78.267927,43.306134],[-78.270607,43.306139],[-78.27865,43.306154],[-78.28133099999999,43.306159],[-78.28144399999999,43.30616],[-78.283069,43.306158],[-78.288285,43.306152],[-78.290024,43.306151],[-78.290216,43.30615],[-78.290792,43.30615],[-78.29098500000001,43.30615],[-78.291299,43.30615],[-78.292242,43.30615],[-78.292557,43.30615],[-78.29259399999999,43.306149],[-78.292705,43.306148],[-78.292743,43.306148],[-78.29356799999999,43.306154],[-78.29604500000001,43.306175],[-78.296871,43.306183],[-78.296915,43.306183],[-78.297048,43.306184],[-78.297093,43.306185],[-78.299784,43.30619],[-78.307857,43.306208],[-78.310548,43.306215],[-78.310483,43.308412]]],"type":"Polygon"}
}