{
  "id": "360150112003",
  "type": "Feature",
  "properties": {
    "area_land":34181799,
    "area_water":232630,
    "geoid":"360150112003",
    "name":"Block Group 3",
    "state":"ny"
},
  "bbox": [
    -76.901558,
    42.001573,
    -76.787677,
    42.05678
],
  "geometry": {"coordinates":[[[-76.901363,42.001802],[-76.898639,42.004789],[-76.89590800000001,42.007887],[-76.895194,42.008814],[-76.89495700000001,42.009319],[-76.894869,42.00964],[-76.894813,42.009953],[-76.894789,42.010402],[-76.894842,42.01118],[-76.894898,42.011659],[-76.895054,42.013411],[-76.895084,42.013676],[-76.895101,42.013979],[-76.895128,42.014243],[-76.89514200000001,42.015223],[-76.89512499999999,42.015513],[-76.895065,42.015865],[-76.89484400000001,42.01731],[-76.894554,42.018259],[-76.894077,42.019695],[-76.893242,42.02116],[-76.891779,42.023387],[-76.890717,42.025416],[-76.890502,42.025755],[-76.890247,42.026156],[-76.889957,42.026614],[-76.889674,42.027059],[-76.88790400000001,42.028738],[-76.88607399999999,42.030476],[-76.88573,42.030802],[-76.885203,42.031113],[-76.884799,42.031351],[-76.884471,42.031641],[-76.883945,42.03198],[-76.883602,42.032215],[-76.883095,42.032554],[-76.882598,42.032853],[-76.88153699999999,42.033334],[-76.88058700000001,42.033702],[-76.879859,42.033883],[-76.879045,42.034105],[-76.878598,42.034172],[-76.87789600000001,42.034241],[-76.87878000000001,42.033682],[-76.87887499999999,42.03348],[-76.87887499999999,42.033408],[-76.87885,42.033415],[-76.878681,42.033448],[-76.87848200000001,42.033448],[-76.87826099999999,42.033454],[-76.87795199999999,42.033514],[-76.87764300000001,42.033563],[-76.877341,42.033557],[-76.87698,42.03353],[-76.876948,42.033531],[-76.87675900000001,42.033535],[-76.87637599999999,42.033529],[-76.876082,42.033518],[-76.875692,42.033469],[-76.87536,42.033436],[-76.87501399999999,42.033391],[-76.874679,42.033334],[-76.873471,42.033115],[-76.87182900000001,42.032704],[-76.871269,42.032556],[-76.870548,42.032354],[-76.869907,42.0322],[-76.86929600000001,42.032058],[-76.868802,42.031987],[-76.86829400000001,42.031921],[-76.86795600000001,42.031927],[-76.867654,42.031921],[-76.86747,42.031911],[-76.867278,42.031927],[-76.867057,42.031988],[-76.866726,42.032191],[-76.86651999999999,42.032328],[-76.866432,42.032378],[-76.866347,42.032277],[-76.86626800000001,42.032183],[-76.866196,42.032219],[-76.86568800000001,42.032416],[-76.864503,42.032757],[-76.863848,42.032922],[-76.863208,42.03306],[-76.86250099999999,42.033142],[-76.862008,42.03322],[-76.86119100000001,42.033335],[-76.860918,42.033418],[-76.86056499999999,42.033549],[-76.860204,42.033676],[-76.85985100000001,42.033868],[-76.85944600000001,42.034066],[-76.85901200000001,42.034362],[-76.85862899999999,42.03467],[-76.858394,42.034912],[-76.85815100000001,42.035142],[-76.857636,42.035752],[-76.857415,42.035988],[-76.857187,42.036191],[-76.856908,42.036509],[-76.856702,42.036614],[-76.85626000000001,42.036899],[-76.855671,42.037366],[-76.855377,42.037679],[-76.85509,42.03797],[-76.85467800000001,42.038404],[-76.854377,42.038739],[-76.85388399999999,42.039332],[-76.853773,42.03948],[-76.853633,42.039634],[-76.85356,42.0397],[-76.853464,42.039755],[-76.853184,42.039859],[-76.852912,42.039991],[-76.852706,42.040084],[-76.852603,42.040139],[-76.85250000000001,42.040227],[-76.85240400000001,42.040375],[-76.852345,42.04054],[-76.852323,42.040661],[-76.852272,42.040952],[-76.852191,42.04116],[-76.852118,42.041287],[-76.852007,42.041408],[-76.851889,42.041512],[-76.85173500000001,42.041698],[-76.851647,42.041858],[-76.851603,42.042072],[-76.851456,42.042676],[-76.851353,42.042978],[-76.85114,42.04351],[-76.851007,42.043801],[-76.85086,42.043993],[-76.85067600000001,42.044196],[-76.850426,42.044432],[-76.84998400000001,42.0448],[-76.84899799999999,42.04541],[-76.84868899999999,42.045531],[-76.84835,42.045635],[-76.84807000000001,42.045778],[-76.847864,42.045888],[-76.84768699999999,42.046025],[-76.847555,42.046108],[-76.847459,42.046162],[-76.84737800000001,42.046217],[-76.846878,42.046316],[-76.84661199999999,42.046338],[-76.846215,42.046426],[-76.84577299999999,42.046679],[-76.84556000000001,42.046789],[-76.845331,42.046822],[-76.84493399999999,42.046816],[-76.84441099999999,42.046789],[-76.84405700000001,42.046795],[-76.843593,42.046811],[-76.84324700000001,42.046844],[-76.842968,42.046883],[-76.842393,42.046993],[-76.841944,42.047064],[-76.841561,42.047118],[-76.84142900000001,42.047136],[-76.840965,42.04718],[-76.840648,42.047202],[-76.840324,42.047207],[-76.840221,42.047218],[-76.839941,42.047273],[-76.839676,42.047334],[-76.839367,42.047564],[-76.838984,42.047724],[-76.838461,42.047905],[-76.838351,42.047949],[-76.838093,42.048108],[-76.837924,42.048218],[-76.837762,42.0483],[-76.837519,42.048388],[-76.837136,42.048476],[-76.836583,42.048592],[-76.836304,42.048647],[-76.835641,42.048883],[-76.83521399999999,42.049047],[-76.834566,42.049256],[-76.833969,42.049383],[-76.83284999999999,42.049558],[-76.832268,42.04963],[-76.831731,42.049679],[-76.83117799999999,42.049778],[-76.830619,42.049855],[-76.829875,42.049993],[-76.829404,42.050075],[-76.82888800000001,42.05019],[-76.828152,42.050399],[-76.827364,42.050646],[-76.82675999999999,42.050816],[-76.82608999999999,42.050992],[-76.82547099999999,42.05119],[-76.82504400000001,42.051305],[-76.82458699999999,42.051459],[-76.824168,42.05158],[-76.82362999999999,42.051805],[-76.82231899999999,42.052387],[-76.821517,42.052749],[-76.82093500000001,42.053029],[-76.82067000000001,42.053175],[-76.820508,42.053418],[-76.81908799999999,42.05408],[-76.81894800000001,42.054145],[-76.817052,42.055247],[-76.81561600000001,42.055944],[-76.814784,42.056257],[-76.81334,42.056624],[-76.811956,42.05678],[-76.810582,42.05672],[-76.810372,42.056761],[-76.80979000000001,42.05671],[-76.809236,42.056736],[-76.80841599999999,42.056649],[-76.806802,42.056735],[-76.806718,42.056722],[-76.806421,42.056678],[-76.806211,42.056719],[-76.805257,42.056576],[-76.804761,42.056574],[-76.803855,42.056438],[-76.80374,42.056493],[-76.80324400000001,42.056492],[-76.8019,42.056326],[-76.801596,42.055988],[-76.80123500000001,42.055906],[-76.801129,42.055881],[-76.800957,42.055965],[-76.800451,42.055998],[-76.800279,42.056063],[-76.800468,42.055893],[-76.801025,42.055293],[-76.801722,42.054899],[-76.802178,42.054943],[-76.802853,42.055396],[-76.80251199999999,42.054706],[-76.802764,42.053237],[-76.803552,42.052868],[-76.80525,42.052929],[-76.80586,42.052632],[-76.806892,42.052741],[-76.80693599999999,42.052836],[-76.806961,42.052889],[-76.80710999999999,42.052907],[-76.80811,42.053144],[-76.80847300000001,42.053251],[-76.80867000000001,42.053303],[-76.80879899999999,42.053328],[-76.809253,42.053241],[-76.809544,42.053066],[-76.810147,42.05277],[-76.810491,42.052699],[-76.810894,42.052687],[-76.811762,42.052723],[-76.81276099999999,42.052858],[-76.81304799999999,42.052869],[-76.813847,42.052762],[-76.814404,42.052811],[-76.814705,42.052819],[-76.815017,42.052757],[-76.815259,42.052758],[-76.815376,42.05279],[-76.815483,42.053038],[-76.81558,42.053121],[-76.81574000000001,42.053182],[-76.81599300000001,42.05318],[-76.816287,42.053129],[-76.816609,42.052977],[-76.817063,42.052748],[-76.81753399999999,42.052318],[-76.817857,42.051911],[-76.81801900000001,42.051662],[-76.818094,42.051434],[-76.818113,42.051246],[-76.818206,42.05112],[-76.818389,42.05105],[-76.818763,42.050968],[-76.81970200000001,42.050875],[-76.819951,42.05084],[-76.820426,42.050773],[-76.820646,42.050702],[-76.820784,42.050658],[-76.821292,42.050488],[-76.82151500000001,42.050339],[-76.821527,42.050271],[-76.821532,42.050214],[-76.82157100000001,42.049732],[-76.82158099999999,42.049246],[-76.82156500000001,42.04889],[-76.82155,42.048672],[-76.82146400000001,42.047964],[-76.821365,42.047476],[-76.82102399999999,42.046138],[-76.820973,42.045803],[-76.82082200000001,42.045193],[-76.820752,42.042502],[-76.820672,42.04176],[-76.82051300000001,42.041143],[-76.82037099999999,42.040628],[-76.818888,42.038072],[-76.818737,42.038039],[-76.818534,42.038058],[-76.816711,42.036569],[-76.81185000000001,42.038027],[-76.81124800000001,42.038179],[-76.81090399999999,42.038355],[-76.810706,42.038477],[-76.80897400000001,42.040102],[-76.80815800000001,42.040975],[-76.807433,42.041856],[-76.807112,42.042181],[-76.80676,42.042339],[-76.806662,42.042383],[-76.806258,42.042486],[-76.805785,42.042532],[-76.805235,42.042555],[-76.804579,42.042654],[-76.804536,42.042662],[-76.79891000000001,42.043768],[-76.798621,42.04381],[-76.798338,42.043791],[-76.798216,42.043775],[-76.796087,42.043302],[-76.79575199999999,42.043218],[-76.79553799999999,42.043081],[-76.795393,42.042963],[-76.79511100000001,42.042612],[-76.79395100000001,42.041124],[-76.79373,42.040823],[-76.793188,42.040411],[-76.791944,42.039434],[-76.79112000000001,42.038854],[-76.790571,42.038393],[-76.790449,42.038278],[-76.79036499999999,42.038152],[-76.79027000000001,42.037967],[-76.80118400000001,42.034987],[-76.79910599999999,42.03106],[-76.798244,42.029409],[-76.79723199999999,42.02747],[-76.799705,42.02621],[-76.79973,42.026196],[-76.80082899999999,42.025633],[-76.8009,42.025596],[-76.80097499999999,42.025558],[-76.80126300000001,42.025411],[-76.80168999999999,42.02518],[-76.80656500000001,42.02277],[-76.802358,42.017954],[-76.79746299999999,42.012602],[-76.797365,42.012476],[-76.791014,42.005519],[-76.787677,42.001573],[-76.78787699999999,42.001573],[-76.810333,42.001653],[-76.812789,42.001662],[-76.815061,42.001671],[-76.81506299999999,42.001695],[-76.81513099999999,42.001798],[-76.815185,42.001867],[-76.815383,42.001897],[-76.820573,42.001914],[-76.821258,42.001916],[-76.821575,42.001924],[-76.82313499999999,42.001966],[-76.823758,42.00197],[-76.824206,42.001973],[-76.825789,42.001984],[-76.827186,42.001993],[-76.82778399999999,42.001997],[-76.82874700000001,42.00199],[-76.829521,42.001985],[-76.829819,42.001951],[-76.830147,42.001935],[-76.83046,42.001955],[-76.83052000000001,42.001967],[-76.83055899999999,42.001974],[-76.830572,42.001975],[-76.830978,42.002012],[-76.833985,42.002],[-76.83504000000001,42.002118],[-76.835076,42.002122],[-76.835182,42.002134],[-76.835266,42.002134],[-76.835351,42.002133],[-76.868498,42.001872],[-76.868985,42.001872],[-76.87038699999999,42.001796],[-76.87078,42.001773],[-76.90155799999999,42.001576],[-76.901363,42.001802]]],"type":"Polygon"}
}