{
  "id": "360610168002",
  "type": "Feature",
  "properties": {
    "area_land":98460,
    "area_water":0,
    "geoid":"360610168002",
    "name":"Block Group 2",
    "state":"ny"
},
  "bbox": [
    -73.954817,
    40.787858,
    -73.949766,
    40.791722
],
  "geometry": {"coordinates":[[[-73.954564,40.789551],[-73.953889,40.790471],[-73.95343800000001,40.791085],[-73.952984,40.791722],[-73.952438,40.791494],[-73.95137099999999,40.791049],[-73.949766,40.790372],[-73.95024100000001,40.789744],[-73.95071299999999,40.789109],[-73.951177,40.788498],[-73.951609,40.787858],[-73.952797,40.788359],[-73.95321,40.788533],[-73.95413499999999,40.78892],[-73.95481700000001,40.789205],[-73.954564,40.789551]]],"type":"Polygon"}
}