{
  "id": "360470022002",
  "type": "Feature",
  "properties": {
    "area_land":86065,
    "area_water":0,
    "geoid":"360470022002",
    "name":"Block Group 2",
    "state":"ny"
},
  "bbox": [
    -74.022769,
    40.641981,
    -74.017926,
    40.645733
],
  "geometry": {"coordinates":[[[-74.022166,40.644051],[-74.021598,40.644598],[-74.021002,40.645173],[-74.02041800000001,40.645733],[-74.018297,40.644454],[-74.018199,40.644402],[-74.018124,40.644355],[-74.017989,40.644271],[-74.017926,40.644233],[-74.01841899999999,40.643761],[-74.01901100000001,40.643165],[-74.01958,40.642595],[-74.020212,40.641981],[-74.020336,40.642055],[-74.02043999999999,40.642117],[-74.020512,40.642161],[-74.020664,40.642243],[-74.022769,40.643469],[-74.022166,40.644051]]],"type":"Polygon"}
}