{
  "id": "360595172003",
  "type": "Feature",
  "properties": {
    "area_land":856413,
    "area_water":0,
    "geoid":"360595172003",
    "name":"Block Group 3",
    "state":"ny"
},
  "bbox": [
    -73.635811,
    40.846082,
    -73.619204,
    40.861048
],
  "geometry": {"coordinates":[[[-73.635811,40.84685],[-73.635794,40.847253],[-73.63578800000001,40.847297],[-73.63578099999999,40.847601],[-73.635706,40.847935],[-73.635688,40.847996],[-73.63548900000001,40.84888],[-73.635463,40.849022],[-73.635453,40.849184],[-73.635443,40.849252],[-73.635384,40.850404],[-73.635209,40.850421],[-73.634846,40.850466],[-73.63419399999999,40.850547],[-73.63275400000001,40.850732],[-73.631668,40.850866],[-73.631187,40.850927],[-73.630895,40.850951],[-73.63085100000001,40.850945],[-73.630836,40.850959],[-73.63067100000001,40.85099],[-73.629835,40.85109],[-73.629357,40.851144],[-73.628894,40.851207],[-73.628857,40.851222],[-73.62878499999999,40.851219],[-73.62851999999999,40.851253],[-73.627985,40.85132],[-73.626549,40.851501],[-73.62566,40.851609],[-73.625387,40.851629],[-73.625407,40.852154],[-73.625288,40.854178],[-73.625198,40.85492],[-73.624861,40.855571],[-73.624512,40.856131],[-73.62408600000001,40.856522],[-73.623767,40.856733],[-73.62361300000001,40.856835],[-73.62341499999999,40.858207],[-73.62340399999999,40.858542],[-73.62341600000001,40.858792],[-73.62347800000001,40.859213],[-73.623558,40.859529],[-73.62362,40.859695],[-73.623684,40.859878],[-73.623738,40.860013],[-73.623887,40.860298],[-73.624009,40.86053],[-73.623983,40.860535],[-73.62286,40.86096],[-73.62259899999999,40.861048],[-73.622422,40.86082],[-73.62208800000001,40.860542],[-73.62167100000001,40.86023],[-73.62150099999999,40.86011],[-73.62139999999999,40.860026],[-73.62136,40.859993],[-73.621106,40.859782],[-73.620974,40.859659],[-73.620919,40.859608],[-73.620797,40.859479],[-73.620642,40.8593],[-73.620487,40.859089],[-73.62036999999999,40.858778],[-73.620306,40.858585],[-73.62012900000001,40.858052],[-73.61997599999999,40.857635],[-73.619924,40.857461],[-73.61989,40.857382],[-73.619855,40.857228],[-73.619715,40.856426],[-73.619698,40.856275],[-73.619669,40.856015],[-73.619609,40.855349],[-73.619559,40.854684],[-73.61954,40.854533],[-73.61952100000001,40.854356],[-73.619319,40.853252],[-73.619272,40.852992],[-73.619204,40.852619],[-73.620116,40.851905],[-73.620212,40.851834],[-73.621539,40.850855],[-73.622671,40.850299],[-73.624571,40.848806],[-73.625472,40.848099],[-73.626772,40.847499],[-73.631394,40.846428],[-73.635706,40.846082],[-73.635763,40.846218],[-73.635805,40.846515],[-73.635811,40.84685]]],"type":"Polygon"}
}