{
  "id": "360010018022",
  "type": "Feature",
  "properties": {
    "area_land":990582,
    "area_water":0,
    "geoid":"360010018022",
    "name":"Block Group 2",
    "state":"ny"
},
  "bbox": [
    -73.829654,
    42.659274,
    -73.812798,
    42.672246
],
  "geometry": {"coordinates":[[[-73.829654,42.660627],[-73.82964800000001,42.660682],[-73.829539,42.660702],[-73.829551,42.660747],[-73.82880900000001,42.661255],[-73.82829,42.66162],[-73.82808,42.661765],[-73.827364,42.662258],[-73.82736300000001,42.662386],[-73.82726,42.662458],[-73.827218,42.662472],[-73.82709,42.662472],[-73.826956,42.66245],[-73.82683900000001,42.66245],[-73.826745,42.662491],[-73.82669,42.662588],[-73.826638,42.662969],[-73.826638,42.663062],[-73.82667600000001,42.663218],[-73.826795,42.663403],[-73.82679899999999,42.663434],[-73.82677099999999,42.663482],[-73.826719,42.66351],[-73.826629,42.663538],[-73.826412,42.663548],[-73.82626999999999,42.6636],[-73.826215,42.663635],[-73.826194,42.663669],[-73.826194,42.663714],[-73.826232,42.663766],[-73.826317,42.663816],[-73.826364,42.663828],[-73.826373,42.663851],[-73.826367,42.663879],[-73.826346,42.663891],[-73.82626999999999,42.663877],[-73.826215,42.66386],[-73.82615199999999,42.66387],[-73.8261,42.663991],[-73.826066,42.664036],[-73.826014,42.664081],[-73.825799,42.664188],[-73.825761,42.664244],[-73.825761,42.664365],[-73.825723,42.66442],[-73.82566799999999,42.664448],[-73.825295,42.664484],[-73.825018,42.664536],[-73.824973,42.664557],[-73.824932,42.664612],[-73.824873,42.664851],[-73.824845,42.664924],[-73.824804,42.664982],[-73.824783,42.664998],[-73.824769,42.66501],[-73.824676,42.665041],[-73.82464400000001,42.665069],[-73.824631,42.665107],[-73.824634,42.665145],[-73.82476800000001,42.665288],[-73.824786,42.665328],[-73.82478999999999,42.66537],[-73.82471,42.665503],[-73.824687,42.665511],[-73.824642,42.665514],[-73.824597,42.665494],[-73.824566,42.66546],[-73.82447000000001,42.66543],[-73.824325,42.665431],[-73.82428400000001,42.665467],[-73.82428400000001,42.665477],[-73.82428400000001,42.665568],[-73.824299,42.665719],[-73.82432,42.665755],[-73.824375,42.665799],[-73.82449699999999,42.665799],[-73.82459299999999,42.665804],[-73.824618,42.665829],[-73.824628,42.665895],[-73.824583,42.666001],[-73.824562,42.666097],[-73.824567,42.666188],[-73.82459299999999,42.666219],[-73.82469399999999,42.666264],[-73.824749,42.666325],[-73.82476,42.666576],[-73.82478500000001,42.666632],[-73.82483499999999,42.666688],[-73.824905,42.666733],[-73.825001,42.666834],[-73.825022,42.666966],[-73.82501600000001,42.667097],[-73.82494699999999,42.667232],[-73.824926,42.667308],[-73.824926,42.667475],[-73.82494699999999,42.667551],[-73.82498200000001,42.667591],[-73.82503699999999,42.667607],[-73.825087,42.667601],[-73.825138,42.667561],[-73.825183,42.667541],[-73.82523399999999,42.667536],[-73.825284,42.667546],[-73.825411,42.667637],[-73.82565700000001,42.667898],[-73.825733,42.66805],[-73.82575799999999,42.668297],[-73.82580299999999,42.668353],[-73.82585899999999,42.668373],[-73.825903,42.668368],[-73.82594899999999,42.668343],[-73.82599999999999,42.668292],[-73.82603,42.668237],[-73.826075,42.668191],[-73.826131,42.668161],[-73.82620199999999,42.668161],[-73.826252,42.668171],[-73.826283,42.668191],[-73.82633800000001,42.668282],[-73.826374,42.668301],[-73.82643400000001,42.668311],[-73.82649499999999,42.668301],[-73.826556,42.668276],[-73.82668099999999,42.668281],[-73.826747,42.668311],[-73.826899,42.668478],[-73.826959,42.668559],[-73.825885,42.669383],[-73.825328,42.669869],[-73.82464,42.6704],[-73.824324,42.670662],[-73.823791,42.671105],[-73.82360300000001,42.671222],[-73.823449,42.67128],[-73.823284,42.671326],[-73.822765,42.67144],[-73.82223500000001,42.671568],[-73.82122099999999,42.67181],[-73.820762,42.671905],[-73.820329,42.671997],[-73.81998299999999,42.672075],[-73.819171,42.672246],[-73.819079,42.672184],[-73.819029,42.672126],[-73.819008,42.672064],[-73.81896500000001,42.67197],[-73.818909,42.671886],[-73.818703,42.671724],[-73.818575,42.671646],[-73.817868,42.67117],[-73.817267,42.670794],[-73.817061,42.670643],[-73.816941,42.670507],[-73.81687700000001,42.670408],[-73.816599,42.669865],[-73.816552,42.669813],[-73.816457,42.669714],[-73.816354,42.669635],[-73.815625,42.669203],[-73.81477,42.668713],[-73.814492,42.668553],[-73.813902,42.668197],[-73.813745,42.668115],[-73.813241,42.667819],[-73.812952,42.667641],[-73.81285699999999,42.667588],[-73.812798,42.667551],[-73.812969,42.667429],[-73.81321699999999,42.667238],[-73.813636,42.666895],[-73.81510900000001,42.665765],[-73.815343,42.665599],[-73.815409,42.665549],[-73.815755,42.665291],[-73.81718100000001,42.664204],[-73.81767600000001,42.663809],[-73.81833899999999,42.663236],[-73.81851,42.663087],[-73.81941,42.662237],[-73.819761,42.661925],[-73.820391,42.661339],[-73.820832,42.660936],[-73.821336,42.660458],[-73.821449,42.660349],[-73.821367,42.660348],[-73.82142899999999,42.660298],[-73.82148100000001,42.660266],[-73.821534,42.660266],[-73.821692,42.660268],[-73.821776,42.660269],[-73.822086,42.660276],[-73.82310099999999,42.660162],[-73.82323,42.660091],[-73.82344500000001,42.659957],[-73.823697,42.659759],[-73.824061,42.659487],[-73.82472199999999,42.6593],[-73.82517,42.659274],[-73.825495,42.659332],[-73.825782,42.659455],[-73.826038,42.659566],[-73.82628200000001,42.659608],[-73.82725499999999,42.65948],[-73.828135,42.659365],[-73.82817900000001,42.659475],[-73.82828499999999,42.659638],[-73.828323,42.659723],[-73.828366,42.659783],[-73.828405,42.659808],[-73.828592,42.65985],[-73.82864499999999,42.659874],[-73.828785,42.660029],[-73.828846,42.660051],[-73.8289,42.660061],[-73.82902,42.660065],[-73.82917399999999,42.660047],[-73.829217,42.66005],[-73.829246,42.660068],[-73.82926999999999,42.660139],[-73.829256,42.660188],[-73.829249,42.660284],[-73.829249,42.660366],[-73.829319,42.660466],[-73.82940600000001,42.660486],[-73.829497,42.660449],[-73.82958000000001,42.660449],[-73.82964200000001,42.660466],[-73.829654,42.66054],[-73.829654,42.660627]]],"type":"Polygon"}
}