{
  "id": "360810548001",
  "type": "Feature",
  "properties": {
    "area_land":132706,
    "area_water":0,
    "geoid":"360810548001",
    "name":"Block Group 1",
    "state":"ny"
},
  "bbox": [
    -73.755771,
    40.720262,
    -73.749579,
    40.725144
],
  "geometry": {"coordinates":[[[-73.75503399999999,40.724118],[-73.754969,40.72416],[-73.754087,40.724695],[-73.753354,40.725144],[-73.751912,40.723947],[-73.749579,40.722014],[-73.750259,40.72159],[-73.751092,40.721007],[-73.751814,40.720498],[-73.752334,40.720262],[-73.753227,40.721284],[-73.75433099999999,40.722309],[-73.75491100000001,40.722842],[-73.755771,40.72364],[-73.75503399999999,40.724118]]],"type":"Polygon"}
}