{
  "id": "360271406021",
  "type": "Feature",
  "properties": {
    "area_land":1338519,
    "area_water":0,
    "geoid":"360271406021",
    "name":"Block Group 1",
    "state":"ny"
},
  "bbox": [
    -73.938923,
    41.638545,
    -73.919472,
    41.651357
],
  "geometry": {"coordinates":[[[-73.938316,41.649302],[-73.93792000000001,41.649579],[-73.937856,41.649647],[-73.937504,41.64976],[-73.93734000000001,41.649821],[-73.93642699999999,41.650104],[-73.936061,41.650252],[-73.935059,41.650708],[-73.934879,41.65078],[-73.93454699999999,41.650879],[-73.934102,41.650937],[-73.932948,41.650975],[-73.93259399999999,41.650997],[-73.932479,41.651008],[-73.931748,41.65106],[-73.931194,41.651109],[-73.930325,41.651186],[-73.92958,41.651241],[-73.929039,41.65131],[-73.92856,41.651357],[-73.928094,41.650899],[-73.927987,41.65077],[-73.92792799999999,41.650696],[-73.927651,41.650403],[-73.92679099999999,41.649357],[-73.926384,41.648805],[-73.92521600000001,41.647387],[-73.925003,41.647148],[-73.924406,41.646454],[-73.923993,41.645989],[-73.923569,41.645523],[-73.923316,41.645287],[-73.92259300000001,41.64457],[-73.922045,41.644065],[-73.920727,41.642759],[-73.92053900000001,41.642553],[-73.92027299999999,41.642181],[-73.919983,41.641643],[-73.919895,41.641413],[-73.919832,41.641187],[-73.919788,41.640975],[-73.9196,41.639743],[-73.919568,41.639587],[-73.919472,41.63912],[-73.92146,41.638553],[-73.92153399999999,41.638545],[-73.921594,41.638558],[-73.92193,41.638687],[-73.922366,41.638814],[-73.92276699999999,41.638915],[-73.923331,41.63907],[-73.92375,41.639168],[-73.923832,41.639042],[-73.923979,41.638892],[-73.924148,41.638772],[-73.924432,41.638633],[-73.92464099999999,41.638985],[-73.924705,41.639069],[-73.92477,41.639124],[-73.92492799999999,41.639217],[-73.92509099999999,41.639273],[-73.925393,41.639347],[-73.927077,41.639803],[-73.928135,41.640105],[-73.92832900000001,41.64016],[-73.928752,41.640295],[-73.929197,41.640466],[-73.92949,41.640614],[-73.929824,41.640759],[-73.92997,41.640811],[-73.93010599999999,41.640844],[-73.930632,41.6409],[-73.931084,41.640905],[-73.931693,41.640961],[-73.931861,41.641031],[-73.93275,41.641472],[-73.93338799999999,41.641829],[-73.933521,41.64192],[-73.93359100000001,41.641989],[-73.93364,41.642059],[-73.933654,41.642122],[-73.933657,41.642332],[-73.93481,41.642357],[-73.934985,41.642364],[-73.935198,41.64234],[-73.93589799999999,41.642212],[-73.936368,41.642462],[-73.93842600000001,41.644088],[-73.938176,41.644389],[-73.938107,41.644448],[-73.938067,41.644461],[-73.938052,41.644529],[-73.937994,41.644627],[-73.937465,41.645253],[-73.93720999999999,41.645547],[-73.936836,41.646015],[-73.93678300000001,41.646082],[-73.936554,41.646418],[-73.936243,41.646928],[-73.93597800000001,41.64748],[-73.935911,41.647594],[-73.938923,41.64882],[-73.938316,41.649302]]],"type":"Polygon"}
}