{
  "id": "360650258001",
  "type": "Feature",
  "properties": {
    "area_land":61757812,
    "area_water":29948,
    "geoid":"360650258001",
    "name":"Block Group 1",
    "state":"ny"
},
  "bbox": [
    -75.313994,
    42.869372,
    -75.201444,
    42.940574
],
  "geometry": {"coordinates":[[[-75.31399399999999,42.935406],[-75.303048,42.935667],[-75.301433,42.935736],[-75.29985000000001,42.935804],[-75.29464900000001,42.936027],[-75.28475299999999,42.936452],[-75.276894,42.93679],[-75.27368800000001,42.936928],[-75.26956,42.937105],[-75.26424299999999,42.937334],[-75.257784,42.937611],[-75.251439,42.937874],[-75.24960799999999,42.937963],[-75.247361,42.938118],[-75.24704300000001,42.93816],[-75.24657500000001,42.938183],[-75.24087900000001,42.938549],[-75.238325,42.938714],[-75.237055,42.938796],[-75.23575700000001,42.938871],[-75.233908,42.938979],[-75.231757,42.939098],[-75.22897399999999,42.939267],[-75.221452,42.939724],[-75.219387,42.939832],[-75.207362,42.940574],[-75.207066,42.937407],[-75.20706,42.937334],[-75.20649,42.931426],[-75.20648,42.931318],[-75.205716,42.923388],[-75.20508700000001,42.916866],[-75.205083,42.916818],[-75.204638,42.911943],[-75.20462499999999,42.911785],[-75.204508,42.910594],[-75.204176,42.907236],[-75.204166,42.907137],[-75.20339199999999,42.899263],[-75.202675,42.891669],[-75.202656,42.891417],[-75.20228899999999,42.887505],[-75.202005,42.885232],[-75.20186699999999,42.884126],[-75.20178799999999,42.883493],[-75.20156,42.88161],[-75.201444,42.880664],[-75.201812,42.88064],[-75.20311100000001,42.880554],[-75.203301,42.880542],[-75.207262,42.880282],[-75.211545,42.880011],[-75.211586,42.880009],[-75.21205500000001,42.879985],[-75.212158,42.879973],[-75.213403,42.879896],[-75.222803,42.879271],[-75.22890700000001,42.878861],[-75.22923400000001,42.878839],[-75.231036,42.878719],[-75.232499,42.878612],[-75.232663,42.8786],[-75.241872,42.877932],[-75.242137,42.877913],[-75.242745,42.877869],[-75.24267,42.877763],[-75.242591,42.877706],[-75.242484,42.877626],[-75.242413,42.877535],[-75.242378,42.877438],[-75.242395,42.877347],[-75.242431,42.877282],[-75.242502,42.877243],[-75.242582,42.877243],[-75.242662,42.877204],[-75.242732,42.877152],[-75.242857,42.877041],[-75.24314099999999,42.876931],[-75.243424,42.876866],[-75.243495,42.876781],[-75.243522,42.876638],[-75.243584,42.876476],[-75.243611,42.87632],[-75.24369900000001,42.876229],[-75.243815,42.876131],[-75.243832,42.876073],[-75.24380600000001,42.875988],[-75.243824,42.875936],[-75.24393000000001,42.875845],[-75.24405400000001,42.875626],[-75.24421,42.875433],[-75.24430700000001,42.875332],[-75.244421,42.875244],[-75.244445,42.8752],[-75.244457,42.875147],[-75.244421,42.875085],[-75.244343,42.875041],[-75.244258,42.875037],[-75.244162,42.875068],[-75.244108,42.875072],[-75.24406,42.875045],[-75.24405400000001,42.874984],[-75.24412,42.874918],[-75.244156,42.874869],[-75.24415,42.874799],[-75.244186,42.87475],[-75.24424,42.87471],[-75.244331,42.874653],[-75.244415,42.874636],[-75.244445,42.874605],[-75.24447499999999,42.874547],[-75.244523,42.874508],[-75.244601,42.874486],[-75.244722,42.874468],[-75.244812,42.874442],[-75.244884,42.874406],[-75.244968,42.874345],[-75.245143,42.874239],[-75.245227,42.874151],[-75.245311,42.874054],[-75.245414,42.873992],[-75.245582,42.873917],[-75.245853,42.873846],[-75.24605699999999,42.873745],[-75.24612999999999,42.873688],[-75.246154,42.873626],[-75.24616,42.873538],[-75.246118,42.873414],[-75.246087,42.873345],[-75.24588799999999,42.873217],[-75.24581000000001,42.873097],[-75.245822,42.873031],[-75.245864,42.872987],[-75.245949,42.872965],[-75.246087,42.872899],[-75.24630399999999,42.872753],[-75.246442,42.872745],[-75.246526,42.872767],[-75.246629,42.872815],[-75.246743,42.872877],[-75.24683899999999,42.872899],[-75.24691799999999,42.872899],[-75.247164,42.872846],[-75.24728500000001,42.872811],[-75.247303,42.872771],[-75.247255,42.872652],[-75.247158,42.872537],[-75.247176,42.872445],[-75.24723,42.872383],[-75.247321,42.872348],[-75.24745299999999,42.872392],[-75.247531,42.872396],[-75.24760999999999,42.872365],[-75.24773,42.872286],[-75.24790400000001,42.872268],[-75.24815700000001,42.872281],[-75.248223,42.872264],[-75.24826,42.87222],[-75.248278,42.872154],[-75.248254,42.871977],[-75.24830799999999,42.871823],[-75.248284,42.871765],[-75.248211,42.87173],[-75.24808,42.871684],[-75.248006,42.87165],[-75.247963,42.871604],[-75.247991,42.871604],[-75.249342,42.871658],[-75.24960799999999,42.871669],[-75.25032899999999,42.871616],[-75.250389,42.871612],[-75.25850699999999,42.871308],[-75.25897000000001,42.871291],[-75.26395599999999,42.871106],[-75.26463,42.871082],[-75.267673,42.870968],[-75.27051899999999,42.870856],[-75.276466,42.870624],[-75.283162,42.870334],[-75.286502,42.87019],[-75.287792,42.870134],[-75.28799600000001,42.870126],[-75.290721,42.870009],[-75.291318,42.869983],[-75.29146,42.869977],[-75.29479000000001,42.869894],[-75.294938,42.86989],[-75.304428,42.869604],[-75.304492,42.869593],[-75.30452699999999,42.869587],[-75.304553,42.869584],[-75.304829,42.869556],[-75.30508399999999,42.869535],[-75.305435,42.869517],[-75.30695,42.869456],[-75.307104,42.869441],[-75.30785400000001,42.869378],[-75.30798299999999,42.869372],[-75.308317,42.87507],[-75.308341,42.875328],[-75.308408,42.876077],[-75.308942,42.881722],[-75.30912600000001,42.883681],[-75.310858,42.902098],[-75.31093199999999,42.902657],[-75.311036,42.903966],[-75.311463,42.908518],[-75.311559,42.908653],[-75.311769,42.909183],[-75.31177,42.911763],[-75.31265,42.921117],[-75.312805,42.922706],[-75.31399399999999,42.935406]]],"type":"Polygon"}
}