{
  "id": "360610073002",
  "type": "Feature",
  "properties": {
    "area_land":12009,
    "area_water":0,
    "geoid":"360610073002",
    "name":"Block Group 2",
    "state":"ny"
},
  "bbox": [
    -74.006407,
    40.733054,
    -74.004277,
    40.73401
],
  "geometry": {"coordinates":[[[-74.006294,40.733742],[-74.004561,40.73401],[-74.004277,40.733391],[-74.005866,40.733147],[-74.006407,40.733054],[-74.006294,40.733742]]],"type":"Polygon"}
}