{
  "id": "361190042002",
  "type": "Feature",
  "properties": {
    "area_land":287523,
    "area_water":0,
    "geoid":"361190042002",
    "name":"Block Group 2",
    "state":"ny"
},
  "bbox": [
    -73.831181,
    40.919828,
    -73.821194,
    40.925975
],
  "geometry": {"coordinates":[[[-73.831181,40.92559],[-73.831174,40.925726],[-73.831174,40.925786],[-73.831176,40.925975],[-73.83083499999999,40.925969],[-73.83040800000001,40.925955],[-73.83017100000001,40.925932],[-73.82943899999999,40.925846],[-73.82889400000001,40.925713],[-73.828576,40.925625],[-73.828385,40.925561],[-73.82810600000001,40.925467],[-73.827935,40.925411],[-73.82736300000001,40.925175],[-73.826842,40.924917],[-73.826697,40.924847],[-73.826587,40.924794],[-73.82640600000001,40.924731],[-73.82585899999999,40.924462],[-73.823998,40.923616],[-73.823728,40.923516],[-73.823024,40.923321],[-73.822665,40.923241],[-73.82119400000001,40.92292],[-73.82122200000001,40.922726],[-73.821237,40.922627],[-73.82125600000001,40.9225],[-73.821457,40.921847],[-73.82166700000001,40.921168],[-73.821848,40.920522],[-73.82203699999999,40.919828],[-73.823229,40.92],[-73.823352,40.920017],[-73.824674,40.920198],[-73.824851,40.920222],[-73.82486400000001,40.920596],[-73.825682,40.92087],[-73.826588,40.921175],[-73.827505,40.921478],[-73.827681,40.921534],[-73.82843800000001,40.921775],[-73.829379,40.922076],[-73.828982,40.922761],[-73.82862299999999,40.923401],[-73.82942,40.923667],[-73.83000800000001,40.923843],[-73.830213,40.923921],[-73.83030599999999,40.923956],[-73.83042399999999,40.923997],[-73.830704,40.924065],[-73.830958,40.924094],[-73.83115599999999,40.924101],[-73.831175,40.925145],[-73.831181,40.92559]]],"type":"Polygon"}
}