{
  "id": "360810373001",
  "type": "Feature",
  "properties": {
    "area_land":86997,
    "area_water":0,
    "geoid":"360810373001",
    "name":"Block Group 1",
    "state":"ny"
},
  "bbox": [
    -73.864335,
    40.757759,
    -73.860522,
    40.762648
],
  "geometry": {"coordinates":[[[-73.864187,40.761178],[-73.863496,40.761558],[-73.86317,40.761738],[-73.86277,40.761964],[-73.86244600000001,40.762144],[-73.86204499999999,40.762371],[-73.861563,40.762648],[-73.86139300000001,40.762387],[-73.861197,40.762136],[-73.860986,40.761891],[-73.860761,40.761654],[-73.860522,40.761426],[-73.86112799999999,40.760775],[-73.86138800000001,40.760496],[-73.861617,40.760553],[-73.861386,40.759963],[-73.86099900000001,40.757825],[-73.861906,40.757795],[-73.862807,40.757759],[-73.863175,40.759778],[-73.863392,40.760978],[-73.864335,40.761143],[-73.864187,40.761178]]],"type":"Polygon"}
}