{
  "id": "360594069001",
  "type": "Feature",
  "properties": {
    "area_land":218208,
    "area_water":0,
    "geoid":"360594069001",
    "name":"Block Group 1",
    "state":"ny"
},
  "bbox": [
    -73.614182,
    40.715291,
    -73.607042,
    40.721374
],
  "geometry": {"coordinates":[[[-73.61414600000001,40.720814],[-73.613635,40.721251],[-73.612542,40.721346],[-73.611794,40.721374],[-73.611817,40.721129],[-73.61093200000001,40.720915],[-73.609891,40.720655],[-73.60955199999999,40.720601],[-73.609414,40.720487],[-73.609267,40.720397],[-73.60897,40.720296],[-73.609095,40.720783],[-73.608834,40.720733],[-73.608722,40.720171],[-73.608537,40.720203],[-73.60844400000001,40.720231],[-73.60783600000001,40.718713],[-73.60798,40.718666],[-73.608124,40.718614],[-73.607412,40.716985],[-73.60704200000001,40.71608],[-73.607564,40.715627],[-73.607575,40.715705],[-73.60775099999999,40.716162],[-73.608491,40.718085],[-73.609239,40.717915],[-73.609487,40.717851],[-73.610018,40.717718],[-73.610518,40.717586],[-73.610215,40.716922],[-73.61018300000001,40.716833],[-73.61130199999999,40.716254],[-73.61146100000001,40.716172],[-73.611822,40.716004],[-73.61192,40.715932],[-73.612836,40.715456],[-73.61315399999999,40.715291],[-73.61277200000001,40.716094],[-73.61268699999999,40.716261],[-73.612634,40.716384],[-73.612804,40.716808],[-73.61306999999999,40.717462],[-73.613339,40.718119],[-73.613606,40.718773],[-73.613874,40.71943],[-73.61407199999999,40.719916],[-73.614126,40.720023],[-73.614182,40.720063],[-73.61414600000001,40.720814]]],"type":"Polygon"}
}