{
  "id": "361119541004",
  "type": "Feature",
  "properties": {
    "area_land":11610438,
    "area_water":290782,
    "geoid":"361119541004",
    "name":"Block Group 4",
    "state":"ny"
},
  "bbox": [
    -74.076541,
    41.58061,
    -74.029712,
    41.623668
],
  "geometry": {"coordinates":[[[-74.07654100000001,41.617427],[-74.07595499999999,41.617493],[-74.075948,41.617618],[-74.075919,41.617975],[-74.075836,41.618339],[-74.07567299999999,41.618798],[-74.07552,41.619178],[-74.07510499999999,41.620152],[-74.07495299999999,41.620448],[-74.074707,41.6208],[-74.074336,41.62129],[-74.07412600000001,41.621602],[-74.073993,41.621823],[-74.07379400000001,41.622149],[-74.073695,41.622269],[-74.07358499999999,41.622383],[-74.07321,41.622675],[-74.072957,41.622581],[-74.07262900000001,41.622488],[-74.07209400000001,41.622353],[-74.07155299999999,41.622227],[-74.071156,41.622147],[-74.069632,41.621917],[-74.068703,41.621825],[-74.068573,41.621819],[-74.068382,41.621816],[-74.068293,41.621821],[-74.068021,41.621835],[-74.067801,41.621875],[-74.067114,41.622065],[-74.065954,41.622416],[-74.065181,41.622598],[-74.065124,41.622611],[-74.06444399999999,41.622759],[-74.06352699999999,41.622931],[-74.06330800000001,41.622962],[-74.062952,41.622997],[-74.062516,41.622998],[-74.062026,41.622987],[-74.06171500000001,41.622965],[-74.060787,41.622904],[-74.060416,41.622848],[-74.060391,41.62285],[-74.059766,41.622754],[-74.059544,41.622732],[-74.05931200000001,41.622747],[-74.059166,41.622782],[-74.05898500000001,41.622854],[-74.05846099999999,41.623133],[-74.05820199999999,41.623254],[-74.057884,41.62337],[-74.05759999999999,41.623443],[-74.05737000000001,41.623478],[-74.05694,41.623498],[-74.05665,41.623483],[-74.056417,41.623436],[-74.056145,41.623324],[-74.055875,41.623158],[-74.05556799999999,41.622956],[-74.05505599999999,41.622672],[-74.054652,41.622482],[-74.054495,41.622445],[-74.054301,41.622432],[-74.054107,41.622452],[-74.05392399999999,41.622501],[-74.053715,41.62258],[-74.05353100000001,41.622674],[-74.053372,41.622791],[-74.05319900000001,41.622934],[-74.052936,41.623167],[-74.052796,41.623263],[-74.052707,41.623312],[-74.05258499999999,41.623379],[-74.05223700000001,41.623525],[-74.052092,41.623567],[-74.05183,41.623615],[-74.051559,41.623652],[-74.05132399999999,41.623666],[-74.051149,41.623668],[-74.050995,41.623654],[-74.050809,41.62361],[-74.050635,41.623547],[-74.05055400000001,41.623517],[-74.050456,41.623468],[-74.050139,41.623305],[-74.049876,41.623169],[-74.049122,41.622755],[-74.048849,41.62265],[-74.048513,41.622566],[-74.048334,41.62253],[-74.048248,41.622521],[-74.048073,41.622518],[-74.047257,41.622586],[-74.04688400000001,41.622625],[-74.046767,41.62264],[-74.046363,41.622695],[-74.046172,41.622702],[-74.045968,41.622683],[-74.045759,41.622635],[-74.045582,41.622574],[-74.045497,41.622536],[-74.045401,41.622479],[-74.04522900000001,41.622325],[-74.045007,41.622057],[-74.04463699999999,41.621564],[-74.043482,41.619927],[-74.043328,41.619742],[-74.043198,41.619627],[-74.042998,41.619507],[-74.042421,41.61925],[-74.041704,41.618873],[-74.04098500000001,41.618528],[-74.04073099999999,41.618392],[-74.040492,41.618208],[-74.04033800000001,41.61807],[-74.03979,41.61753],[-74.03959999999999,41.617375],[-74.03943200000001,41.617272],[-74.039069,41.617057],[-74.038731,41.616866],[-74.038507,41.616695],[-74.038265,41.616432],[-74.03806899999999,41.616268],[-74.037876,41.616116],[-74.037521,41.615819],[-74.037066,41.615524],[-74.036497,41.615123],[-74.03639099999999,41.615077],[-74.036249,41.615038],[-74.035819,41.614968],[-74.03568799999999,41.614964],[-74.03551,41.614984],[-74.0354,41.615014],[-74.03524299999999,41.615095],[-74.034981,41.615281],[-74.03487199999999,41.615371],[-74.03471999999999,41.61553],[-74.034665,41.615615],[-74.034629,41.615697],[-74.03455099999999,41.616089],[-74.034482,41.616195],[-74.034429,41.616244],[-74.03438300000001,41.616266],[-74.034021,41.61628],[-74.033924,41.61626],[-74.03388200000001,41.61623],[-74.033857,41.616186],[-74.03384699999999,41.616072],[-74.033871,41.61591],[-74.033951,41.615597],[-74.03403299999999,41.615032],[-74.03403,41.614845],[-74.034001,41.614755],[-74.03397,41.614706],[-74.03376400000001,41.614552],[-74.033664,41.614498],[-74.03362799999999,41.614479],[-74.033461,41.614404],[-74.033339,41.614337],[-74.033278,41.614288],[-74.033225,41.614216],[-74.033129,41.613982],[-74.03309400000001,41.613948],[-74.033053,41.613934],[-74.03297999999999,41.613942],[-74.032906,41.61399],[-74.03274999999999,41.614212],[-74.03241800000001,41.614488],[-74.03232,41.614609],[-74.032145,41.614932],[-74.03208100000001,41.615142],[-74.031969,41.615439],[-74.031879,41.615626],[-74.031779,41.6158],[-74.031689,41.615912],[-74.031594,41.616001],[-74.031482,41.616082],[-74.03138300000001,41.616134],[-74.031279,41.616167],[-74.03089300000001,41.616209],[-74.03058299999999,41.616228],[-74.030517,41.616254],[-74.030462,41.616306],[-74.030417,41.616416],[-74.03037999999999,41.616819],[-74.03034100000001,41.616933],[-74.030277,41.61706],[-74.030218,41.617122],[-74.030097,41.617161],[-74.030008,41.617161],[-74.02989599999999,41.617136],[-74.029794,41.617096],[-74.029742,41.617071],[-74.029712,41.617041],[-74.031533,41.60852],[-74.033665,41.598453],[-74.036056,41.587303],[-74.03613300000001,41.586942],[-74.03712,41.582108],[-74.037125,41.582044],[-74.03860400000001,41.581907],[-74.04132799999999,41.581655],[-74.041892,41.581603],[-74.042145,41.581579],[-74.04224499999999,41.581576],[-74.04225700000001,41.581569],[-74.049295,41.580997],[-74.049364,41.580991],[-74.050082,41.580928],[-74.050724,41.580871],[-74.05293500000001,41.580676],[-74.053308,41.580643],[-74.053625,41.580615],[-74.053648,41.580613],[-74.053685,41.58061],[-74.053752,41.580641],[-74.053791,41.580658],[-74.05394200000001,41.580724],[-74.05386900000001,41.582588],[-74.053804,41.584257],[-74.053804,41.584301],[-74.053804,41.584879],[-74.053804,41.586065],[-74.05460600000001,41.58714],[-74.05513000000001,41.587842],[-74.05514700000001,41.587865],[-74.055742,41.588636],[-74.05577700000001,41.588685],[-74.05579299999999,41.588707],[-74.05586099999999,41.588803],[-74.057536,41.59116],[-74.05762900000001,41.591291],[-74.057742,41.59145],[-74.057828,41.591571],[-74.057934,41.59172],[-74.058013,41.591831],[-74.05803,41.591855],[-74.058769,41.592895],[-74.059067,41.593314],[-74.05955400000001,41.594],[-74.060228,41.594948],[-74.060671,41.595572],[-74.060896,41.595888],[-74.06145100000001,41.596669],[-74.063017,41.598872],[-74.068083,41.606001],[-74.069193,41.605596],[-74.070553,41.605171],[-74.074405,41.603658],[-74.074432,41.603649],[-74.074459,41.603757],[-74.07486,41.605119],[-74.074963,41.605574],[-74.075012,41.606085],[-74.07502100000001,41.606334],[-74.075039,41.606829],[-74.07508199999999,41.608198],[-74.075143,41.61012],[-74.075165,41.610528],[-74.075249,41.610994],[-74.07554,41.612106],[-74.07562900000001,41.61272],[-74.075805,41.615435],[-74.07583700000001,41.615948],[-74.075857,41.61609],[-74.075896,41.616323],[-74.07599399999999,41.616615],[-74.076064,41.616764],[-74.07614700000001,41.616909],[-74.076303,41.617137],[-74.07654100000001,41.617427]]],"type":"Polygon"}
}