{
  "id": "360130351003",
  "type": "Feature",
  "properties": {
    "area_land":3450155,
    "area_water":0,
    "geoid":"360130351003",
    "name":"Block Group 3",
    "state":"ny"
},
  "bbox": [
    -79.172456,
    42.512655,
    -79.15281,
    42.544255
],
  "geometry": {"coordinates":[[[-79.172456,42.512655],[-79.17232199999999,42.512896],[-79.171879,42.513571],[-79.171695,42.513808],[-79.171466,42.514036],[-79.17127000000001,42.514202],[-79.170621,42.514663],[-79.17048200000001,42.514787],[-79.170376,42.514926],[-79.17033499999999,42.515087],[-79.170339,42.515162],[-79.17035799999999,42.515233],[-79.170598,42.515582],[-79.17084199999999,42.51586],[-79.17097,42.515958],[-79.171319,42.516104],[-79.171575,42.516187],[-79.171691,42.516247],[-79.171815,42.516355],[-79.17189,42.516479],[-79.17192799999999,42.516603],[-79.17192799999999,42.516704],[-79.171916,42.516779],[-79.171736,42.517136],[-79.171255,42.517961],[-79.17121299999999,42.51807],[-79.171188,42.518314],[-79.17119099999999,42.518461],[-79.171206,42.518562],[-79.17130400000001,42.518708],[-79.17151800000001,42.518948],[-79.171575,42.519027],[-79.171661,42.519264],[-79.17169800000001,42.519432],[-79.17169800000001,42.519556],[-79.17167999999999,42.519635],[-79.17164200000001,42.519695],[-79.17147300000001,42.519823],[-79.171334,42.519905],[-79.17112400000001,42.519988],[-79.17093199999999,42.520025],[-79.17033499999999,42.520085],[-79.169764,42.52028],[-79.168367,42.52078],[-79.166253,42.521568],[-79.165013,42.522055],[-79.164878,42.5221],[-79.164784,42.522172],[-79.16473499999999,42.52225],[-79.164619,42.522509],[-79.164518,42.5229],[-79.164495,42.523057],[-79.164525,42.523785],[-79.164649,42.524187],[-79.164799,42.524476],[-79.165077,42.524892],[-79.165408,42.525583],[-79.16546,42.525669],[-79.16552799999999,42.525725],[-79.16561,42.525751],[-79.165761,42.525759],[-79.16587,42.525755],[-79.166118,42.525684],[-79.166568,42.525376],[-79.166662,42.52532],[-79.166737,42.525294],[-79.16685,42.525279],[-79.167304,42.525252],[-79.169021,42.525241],[-79.170095,42.525395],[-79.170181,42.525429],[-79.170298,42.525526],[-79.170346,42.525598],[-79.170418,42.525767],[-79.170444,42.525894],[-79.170436,42.526179],[-79.17042499999999,42.526232],[-79.170373,42.526299],[-79.169663,42.526862],[-79.16912600000001,42.527313],[-79.169043,42.527365],[-79.168807,42.527466],[-79.16876499999999,42.527493],[-79.168728,42.527534],[-79.168679,42.527639],[-79.16866400000001,42.52771],[-79.168671,42.527782],[-79.168713,42.52786],[-79.169287,42.528461],[-79.16968199999999,42.528776],[-79.16986199999999,42.528844],[-79.16999300000001,42.528907],[-79.170117,42.529009],[-79.170654,42.529571],[-79.17086500000001,42.529812],[-79.17104500000001,42.529981],[-79.17107900000001,42.530086],[-79.171075,42.530206],[-79.17105599999999,42.530292],[-79.17100000000001,42.530382],[-79.170902,42.53048],[-79.17079,42.530573],[-79.169922,42.53114],[-79.169847,42.531219],[-79.169802,42.531298],[-79.169783,42.53144],[-79.16977900000001,42.531534],[-79.169758,42.531598],[-79.169708,42.531665],[-79.16943000000001,42.531909],[-79.169374,42.532041],[-79.16936200000001,42.532251],[-79.169377,42.532318],[-79.16940700000001,42.532375],[-79.169453,42.532423],[-79.169535,42.532465],[-79.16968900000001,42.532498],[-79.169873,42.532513],[-79.17014399999999,42.532502],[-79.170838,42.532412],[-79.171353,42.532363],[-79.171458,42.532367],[-79.171514,42.53239],[-79.17155200000001,42.532438],[-79.17157400000001,42.532532],[-79.171627,42.533129],[-79.17163499999999,42.533527],[-79.171623,42.53368],[-79.171601,42.533755],[-79.171567,42.533815],[-79.171503,42.533875],[-79.171244,42.534059],[-79.171145,42.53412],[-79.1711,42.534148],[-79.170185,42.534712],[-79.170132,42.534765],[-79.170114,42.534802],[-79.170114,42.534851],[-79.170162,42.53496],[-79.170241,42.535084],[-79.170298,42.5352],[-79.17037999999999,42.535523],[-79.17039200000001,42.535951],[-79.17036899999999,42.536037],[-79.170316,42.536127],[-79.17010999999999,42.53627],[-79.170042,42.536292],[-79.169911,42.536315],[-79.169678,42.536326],[-79.169254,42.53639],[-79.169051,42.536412],[-79.168758,42.536412],[-79.16794299999999,42.536363],[-79.167838,42.536382],[-79.167759,42.536412],[-79.167672,42.536498],[-79.167586,42.536694],[-79.167571,42.536825],[-79.167575,42.537065],[-79.167609,42.537155],[-79.167661,42.537249],[-79.16792,42.537572],[-79.16811199999999,42.537782],[-79.16824699999999,42.537876],[-79.168469,42.537993],[-79.16859599999999,42.538044],[-79.16893399999999,42.538146],[-79.16913599999999,42.538229],[-79.16896199999999,42.538528],[-79.168927,42.538601],[-79.168798,42.538901],[-79.16868599999999,42.53916],[-79.168453,42.539758],[-79.168009,42.540862],[-79.16748200000001,42.542248],[-79.167385,42.542506],[-79.166859,42.543764],[-79.166663,42.544255],[-79.16503400000001,42.543918],[-79.164737,42.543855],[-79.164742,42.543643],[-79.16477999999999,42.543523],[-79.165002,42.543271],[-79.165032,42.543215],[-79.16503899999999,42.543158],[-79.16502800000001,42.543057],[-79.16499,42.542948],[-79.164947,42.542863],[-79.16488099999999,42.542731],[-79.16480199999999,42.542599],[-79.164739,42.542524],[-79.16465599999999,42.542453],[-79.164581,42.542419],[-79.16447599999999,42.5424],[-79.16435199999999,42.542389],[-79.163991,42.542419],[-79.163713,42.542517],[-79.163206,42.54281],[-79.16288,42.543012],[-79.16278200000001,42.543035],[-79.16263499999999,42.543038],[-79.162023,42.54302],[-79.161839,42.542997],[-79.161644,42.54296],[-79.16154299999999,42.54293],[-79.161464,42.542888],[-79.161351,42.542757],[-79.161272,42.542577],[-79.16116700000001,42.542187],[-79.161159,42.541995],[-79.16117800000001,42.541815],[-79.16122300000001,42.541699],[-79.16130200000001,42.541631],[-79.161422,42.541601],[-79.161528,42.541556],[-79.16158799999999,42.541507],[-79.161629,42.541425],[-79.161693,42.541252],[-79.1617,42.54105],[-79.161655,42.540757],[-79.16156100000001,42.540445],[-79.161449,42.540232],[-79.161366,42.540153],[-79.161261,42.540085],[-79.16115600000001,42.540048],[-79.161013,42.540029],[-79.16088499999999,42.540029],[-79.160754,42.540044],[-79.16063699999999,42.540104],[-79.160389,42.540208],[-79.159631,42.540528],[-79.15902199999999,42.540719],[-79.158827,42.540764],[-79.158647,42.540768],[-79.158354,42.540749],[-79.157697,42.540626],[-79.15746,42.540603],[-79.156966,42.540616],[-79.156893,42.540618],[-79.15655099999999,42.540554],[-79.15586399999999,42.540337],[-79.15557099999999,42.540217],[-79.155424,42.540142],[-79.155334,42.540067],[-79.15526699999999,42.539991],[-79.15512,42.53977],[-79.155053,42.539628],[-79.155,42.539417],[-79.155,42.539327],[-79.155023,42.53926],[-79.15506000000001,42.539215],[-79.155124,42.539162],[-79.15656199999999,42.538626],[-79.157325,42.538382],[-79.157366,42.538355],[-79.15738899999999,42.538322],[-79.157377,42.538232],[-79.15728,42.538138],[-79.157242,42.538082],[-79.15722,42.537999],[-79.157178,42.537661],[-79.15713,42.537098],[-79.157084,42.537008],[-79.156761,42.536521],[-79.156649,42.53637],[-79.156521,42.536235],[-79.15637099999999,42.536104],[-79.156284,42.53601],[-79.156239,42.535931],[-79.15611199999999,42.535624],[-79.15606699999999,42.535579],[-79.15600999999999,42.535552],[-79.15589,42.535545],[-79.155781,42.535582],[-79.155642,42.535654],[-79.15555999999999,42.535676],[-79.15548099999999,42.535657],[-79.15539800000001,42.535609],[-79.155357,42.535556],[-79.155338,42.535477],[-79.155338,42.535406],[-79.155394,42.535275],[-79.155417,42.535185],[-79.155421,42.535102],[-79.15540900000001,42.534997],[-79.155361,42.534896],[-79.15526300000001,42.534757],[-79.155244,42.534637],[-79.155259,42.534554],[-79.155511,42.534081],[-79.155563,42.533924],[-79.15555999999999,42.532877],[-79.155582,42.532772],[-79.15595,42.532085],[-79.15650599999999,42.531211],[-79.156581,42.531125],[-79.156656,42.531057],[-79.157697,42.530258],[-79.15813199999999,42.529837],[-79.15822199999999,42.529717],[-79.158579,42.529181],[-79.158602,42.529125],[-79.158602,42.529064],[-79.158575,42.528974],[-79.158508,42.528866],[-79.15822199999999,42.52858],[-79.15810999999999,42.528524],[-79.15797499999999,42.528483],[-79.15778299999999,42.528442],[-79.157618,42.52843],[-79.157366,42.528442],[-79.15612299999999,42.52858],[-79.15598,42.52858],[-79.155841,42.528554],[-79.155665,42.528483],[-79.155548,42.528408],[-79.15548099999999,42.52834],[-79.15536400000001,42.528149],[-79.15526699999999,42.527916],[-79.155248,42.527837],[-79.155248,42.527755],[-79.15528500000001,42.527567],[-79.155368,42.527413],[-79.15602199999999,42.526738],[-79.15608899999999,42.526693],[-79.15621299999999,42.526648],[-79.15672000000001,42.526434],[-79.15676499999999,42.52637],[-79.15678800000001,42.526306],[-79.156795,42.52622],[-79.156769,42.526115],[-79.156705,42.526029],[-79.155496,42.525027],[-79.155428,42.524944],[-79.155135,42.524486],[-79.155098,42.524359],[-79.15509400000001,42.52428],[-79.15512,42.524186],[-79.155169,42.52413],[-79.155522,42.523867],[-79.15603299999999,42.523425],[-79.156082,42.523353],[-79.156104,42.523259],[-79.156108,42.523151],[-79.156007,42.522693],[-79.155804,42.522336],[-79.155766,42.522224],[-79.15572899999999,42.522044],[-79.15560499999999,42.520798],[-79.155552,42.520652],[-79.155496,42.52055],[-79.155383,42.520411],[-79.15414,42.519184],[-79.15341100000001,42.518546],[-79.15307,42.518272],[-79.152991,42.518179],[-79.15292700000001,42.518059],[-79.15281,42.517884],[-79.152895,42.51784],[-79.15307900000001,42.517748],[-79.15327000000001,42.517659],[-79.153919,42.517356],[-79.157776,42.515414],[-79.158626,42.515012],[-79.15924699999999,42.514729],[-79.160431,42.514273],[-79.161002,42.514076],[-79.161716,42.51385],[-79.162414,42.513645],[-79.163498,42.513384],[-79.16410399999999,42.513271],[-79.16482600000001,42.513148],[-79.165733,42.513022],[-79.166104,42.512983],[-79.166472,42.512943],[-79.167016,42.512899],[-79.16948499999999,42.512742],[-79.17108899999999,42.512673],[-79.171705,42.512669],[-79.172095,42.512667],[-79.172211,42.512666],[-79.172355,42.512657],[-79.172456,42.512655]]],"type":"Polygon"}
}