{
  "id": "360670038001",
  "type": "Feature",
  "properties": {
    "area_land":419636,
    "area_water":0,
    "geoid":"360670038001",
    "name":"Block Group 1",
    "state":"ny"
},
  "bbox": [
    -76.188247,
    43.035291,
    -76.171283,
    43.042958
],
  "geometry": {"coordinates":[[[-76.188247,43.035951],[-76.188193,43.03622],[-76.18812,43.036426],[-76.187729,43.036394],[-76.1875,43.036395],[-76.18732900000001,43.036413],[-76.18720399999999,43.036433],[-76.18683299999999,43.036529],[-76.18660300000001,43.036627],[-76.18616400000001,43.036805],[-76.183716,43.037894],[-76.182936,43.038145],[-76.182767,43.038187],[-76.182196,43.038266],[-76.18104,43.038425],[-76.179856,43.038585],[-76.179372,43.03865],[-76.178641,43.03875],[-76.17751800000001,43.038906],[-76.177232,43.038944],[-76.175684,43.039157],[-76.17525000000001,43.039217],[-76.17477599999999,43.039321],[-76.174494,43.03941],[-76.17395500000001,43.039614],[-76.17386,43.039658],[-76.173937,43.039699],[-76.174325,43.040023],[-76.17455699999999,43.040249],[-76.174626,43.040355],[-76.17462999999999,43.040377],[-76.174637,43.040412],[-76.174632,43.040557],[-76.174612,43.040621],[-76.174532,43.040756],[-76.17435399999999,43.04093],[-76.1742,43.041115],[-76.174109,43.041266],[-76.17398900000001,43.041555],[-76.173931,43.041795],[-76.17394,43.042143],[-76.17397699999999,43.042295],[-76.174054,43.04241],[-76.174263,43.042646],[-76.174077,43.042714],[-76.174024,43.042762],[-76.174008,43.042846],[-76.17402300000001,43.042958],[-76.172573,43.042858],[-76.171283,43.042829],[-76.17164099999999,43.041908],[-76.17181600000001,43.041465],[-76.17200099999999,43.040999],[-76.17202899999999,43.040929],[-76.17239600000001,43.040012],[-76.172748,43.039108],[-76.173109,43.038171],[-76.173187,43.037971],[-76.17347599999999,43.03724],[-76.17369600000001,43.036677],[-76.17395999999999,43.036014],[-76.173985,43.035952],[-76.17539600000001,43.03588],[-76.177027,43.035804],[-76.17723700000001,43.035794],[-76.17843000000001,43.035733],[-76.179632,43.035681],[-76.180784,43.035624],[-76.18082800000001,43.03565],[-76.18809,43.035291],[-76.18823,43.035672],[-76.18824499999999,43.035748],[-76.188247,43.035951]]],"type":"Polygon"}
}