{
  "id": "360810085002",
  "type": "Feature",
  "properties": {
    "area_land":126114,
    "area_water":0,
    "geoid":"360810085002",
    "name":"Block Group 2",
    "state":"ny"
},
  "bbox": [
    -73.945814,
    40.755234,
    -73.9391,
    40.759308
],
  "geometry": {"coordinates":[[[-73.945814,40.757799],[-73.94416699999999,40.759308],[-73.943296,40.758984],[-73.94245600000001,40.758683],[-73.94166199999999,40.758398],[-73.940862,40.758111],[-73.940022,40.757809],[-73.9391,40.757494],[-73.94004,40.756487],[-73.941239,40.755234],[-73.94204999999999,40.755649],[-73.94282200000001,40.756059],[-73.943547,40.756441],[-73.94435,40.756875],[-73.94506699999999,40.75733],[-73.945814,40.757799]]],"type":"Polygon"}
}