{
  "id": "360290130021",
  "type": "Feature",
  "properties": {
    "area_land":2885039,
    "area_water":0,
    "geoid":"360290130021",
    "name":"Block Group 1",
    "state":"ny"
},
  "bbox": [
    -78.864398,
    42.74976,
    -78.836516,
    42.771232
],
  "geometry": {"coordinates":[[[-78.86439799999999,42.76495],[-78.855076,42.771232],[-78.85468299999999,42.771049],[-78.853926,42.770697],[-78.85328800000001,42.770285],[-78.85184599999999,42.769441],[-78.852245,42.768997],[-78.852149,42.768543],[-78.85153699999999,42.768517],[-78.850216,42.768455],[-78.850013,42.76806],[-78.849395,42.767784],[-78.849543,42.767445],[-78.84928600000001,42.767292],[-78.84857,42.766822],[-78.848018,42.766352],[-78.847869,42.765993],[-78.847909,42.765991],[-78.847874,42.765959],[-78.84784000000001,42.765928],[-78.846974,42.766148],[-78.846739,42.766767],[-78.84670800000001,42.76677],[-78.846406,42.76658],[-78.84639799999999,42.76621],[-78.846396,42.765798],[-78.845325,42.765343],[-78.84482800000001,42.765357],[-78.84414200000001,42.765436],[-78.843256,42.76503],[-78.842325,42.765012],[-78.84152899999999,42.7647],[-78.840942,42.764598],[-78.84026,42.764585],[-78.839866,42.764303],[-78.839365,42.764382],[-78.83896,42.764446],[-78.83875,42.764259],[-78.83869799999999,42.763961],[-78.83884500000001,42.7633],[-78.83942399999999,42.762971],[-78.840175,42.762547],[-78.840389,42.762034],[-78.840412,42.76198],[-78.84106800000001,42.761878],[-78.841076,42.761649],[-78.840435,42.76134],[-78.83962699999999,42.760478],[-78.838461,42.760067],[-78.837855,42.759644],[-78.837738,42.759436],[-78.836928,42.75862],[-78.836516,42.758482],[-78.837402,42.758149],[-78.83987,42.757226],[-78.843025,42.755625],[-78.84312799999999,42.755573],[-78.843909,42.755174],[-78.844697,42.754771],[-78.847435,42.753385],[-78.85069,42.751755],[-78.85097,42.751609],[-78.85151,42.751335],[-78.85175,42.75121],[-78.853059,42.750549],[-78.853836,42.750154],[-78.854614,42.74976],[-78.85582700000001,42.751328],[-78.85585,42.751358],[-78.85772900000001,42.753841],[-78.858644,42.755007],[-78.860085,42.756869],[-78.86041899999999,42.757338],[-78.86064399999999,42.757679],[-78.860904,42.758095],[-78.860955,42.758181],[-78.860974,42.758213],[-78.86100500000001,42.758266],[-78.861169,42.75855],[-78.86143199999999,42.759055],[-78.86176,42.759762],[-78.862639,42.761689],[-78.863224,42.76288],[-78.86368,42.76376],[-78.86384,42.764051],[-78.864169,42.764582],[-78.86439799999999,42.76495]]],"type":"Polygon"}
}