{
  "id": "360470494003",
  "type": "Feature",
  "properties": {
    "area_land":46125,
    "area_water":0,
    "geoid":"360470494003",
    "name":"Block Group 3",
    "state":"ny"
},
  "bbox": [
    -73.976396,
    40.640659,
    -73.973941,
    40.643274
],
  "geometry": {"coordinates":[[[-73.97639599999999,40.643051],[-73.97546699999999,40.643152],[-73.97437499999999,40.643274],[-73.973941,40.640882],[-73.975015,40.640762],[-73.975944,40.640659],[-73.97639599999999,40.643051]]],"type":"Polygon"}
}