{
  "id": "360470076001",
  "type": "Feature",
  "properties": {
    "area_land":53594,
    "area_water":0,
    "geoid":"360470076001",
    "name":"Block Group 1",
    "state":"ny"
},
  "bbox": [
    -74.016086,
    40.642866,
    -74.011484,
    40.646418
],
  "geometry": {"coordinates":[[[-74.016086,40.645882],[-74.015533,40.646418],[-74.013741,40.645349],[-74.011484,40.643986],[-74.012066,40.643425],[-74.012649,40.642866],[-74.01490699999999,40.644229],[-74.014324,40.64479],[-74.01592100000001,40.645779],[-74.016086,40.645882]]],"type":"Polygon"}
}