{
  "id": "360930212003",
  "type": "Feature",
  "properties": {
    "area_land":377860,
    "area_water":0,
    "geoid":"360930212003",
    "name":"Block Group 3",
    "state":"ny"
},
  "bbox": [
    -73.983245,
    42.79431,
    -73.972394,
    42.802572
],
  "geometry": {"coordinates":[[[-73.983093,42.801626],[-73.983001,42.80159],[-73.982344,42.801734],[-73.98082599999999,42.80235],[-73.980559,42.802437],[-73.980227,42.802515],[-73.980107,42.802529],[-73.979868,42.802572],[-73.97973500000001,42.802562],[-73.978767,42.802368],[-73.977559,42.802081],[-73.976269,42.801776],[-73.97504600000001,42.80146],[-73.97384099999999,42.801152],[-73.97258600000001,42.800843],[-73.973392,42.799109],[-73.97397100000001,42.797774],[-73.972667,42.79581],[-73.97239399999999,42.794879],[-73.97283299999999,42.794685],[-73.97316600000001,42.794559],[-73.973681,42.794361],[-73.973783,42.79431],[-73.97632299999999,42.796443],[-73.97935200000001,42.798532],[-73.983245,42.801687],[-73.983093,42.801626]]],"type":"Polygon"}
}