{
  "id": "360130307002",
  "type": "Feature",
  "properties": {
    "area_land":194712,
    "area_water":0,
    "geoid":"360130307002",
    "name":"Block Group 2",
    "state":"ny"
},
  "bbox": [
    -79.237183,
    42.086155,
    -79.231487,
    42.091862
],
  "geometry": {"coordinates":[[[-79.237183,42.091862],[-79.23677600000001,42.091811],[-79.236284,42.091719],[-79.235748,42.091547],[-79.23536,42.091369],[-79.23533,42.091396],[-79.235185,42.091527],[-79.23509799999999,42.091638],[-79.23465400000001,42.091598],[-79.234039,42.091545],[-79.233885,42.091561],[-79.233071,42.091695],[-79.232821,42.090491],[-79.23272299999999,42.089809],[-79.232719,42.089638],[-79.232731,42.089571],[-79.232769,42.089517],[-79.23278999999999,42.089501],[-79.23269000000001,42.089305],[-79.232542,42.088881],[-79.232401,42.088277],[-79.232249,42.08776],[-79.23206,42.087325],[-79.23196900000001,42.087116],[-79.231841,42.086884],[-79.231601,42.086467],[-79.231487,42.086262],[-79.231533,42.086261],[-79.231593,42.086261],[-79.23227300000001,42.086257],[-79.233088,42.086241],[-79.233772,42.086231],[-79.23455199999999,42.086231],[-79.234628,42.086209],[-79.23468099999999,42.086182],[-79.234782,42.086155],[-79.235936,42.086162],[-79.23710699999999,42.086167],[-79.237121,42.087944],[-79.23664100000001,42.087923],[-79.235899,42.087915],[-79.235894,42.089221],[-79.23591999999999,42.090264],[-79.235736,42.090271],[-79.235955,42.090651],[-79.23615599999999,42.090895],[-79.23652,42.091262],[-79.23713499999999,42.091822],[-79.237183,42.091862]]],"type":"Polygon"}
}