{
  "id": "360150006002",
  "type": "Feature",
  "properties": {
    "area_land":432664,
    "area_water":0,
    "geoid":"360150006002",
    "name":"Block Group 2",
    "state":"ny"
},
  "bbox": [
    -76.822479,
    42.08811,
    -76.808295,
    42.097414
],
  "geometry": {"coordinates":[[[-76.822479,42.096415],[-76.82135700000001,42.09675],[-76.82028099999999,42.097067],[-76.819129,42.097414],[-76.818656,42.096476],[-76.818152,42.095541],[-76.817634,42.094618],[-76.817412,42.094164],[-76.81710699999999,42.093611],[-76.816802,42.093065],[-76.81656599999999,42.092615],[-76.81655000000001,42.092566],[-76.816253,42.092073],[-76.814009,42.092726],[-76.81217100000001,42.093264],[-76.812468,42.093809],[-76.81270499999999,42.094278],[-76.811583,42.094599],[-76.81088099999999,42.094816],[-76.810041,42.095074],[-76.80944599999999,42.095237],[-76.808814,42.094168],[-76.808295,42.093195],[-76.808892,42.093025],[-76.80914199999999,42.092955],[-76.809821,42.092764],[-76.81166,42.092222],[-76.810973,42.090956],[-76.812781,42.090441],[-76.812354,42.089632],[-76.811904,42.08877],[-76.814162,42.08811],[-76.814649,42.08895],[-76.814605,42.088964],[-76.815017,42.0898],[-76.81571099999999,42.091085],[-76.817481,42.09057],[-76.818465,42.090288],[-76.81901499999999,42.090128],[-76.81955600000001,42.091116],[-76.819839,42.091608],[-76.820106,42.092112],[-76.820403,42.092646],[-76.820708,42.093214],[-76.82125000000001,42.094206],[-76.82146400000001,42.094591],[-76.821761,42.095137],[-76.822479,42.096415]]],"type":"Polygon"}
}