{
  "id": "360650217013",
  "type": "Feature",
  "properties": {
    "area_land":503551,
    "area_water":0,
    "geoid":"360650217013",
    "name":"Block Group 3",
    "state":"ny"
},
  "bbox": [
    -75.28543,
    43.064471,
    -75.271573,
    43.076063
],
  "geometry": {"coordinates":[[[-75.285219,43.074614],[-75.284848,43.074794],[-75.283683,43.075362],[-75.283269,43.075566],[-75.283083,43.075657],[-75.282262,43.076063],[-75.27996400000001,43.074299],[-75.279687,43.074087],[-75.278719,43.073357],[-75.27847199999999,43.073173],[-75.27828,43.073028],[-75.278131,43.072915],[-75.278076,43.072881],[-75.277781,43.07271],[-75.27682299999999,43.072191],[-75.27633899999999,43.071931],[-75.274263,43.070833],[-75.27264,43.069971],[-75.27220199999999,43.069744],[-75.27170099999999,43.069487],[-75.271573,43.069414],[-75.27161099999999,43.069368],[-75.27161,43.066879],[-75.271698,43.065037],[-75.271709,43.064963],[-75.271906,43.064471],[-75.272583,43.064569],[-75.27511199999999,43.064848],[-75.27511699999999,43.064871],[-75.27516799999999,43.065115],[-75.27529199999999,43.065403],[-75.27544399999999,43.066261],[-75.275486,43.0667],[-75.275486,43.067079],[-75.275445,43.067214],[-75.27534,43.067487],[-75.27530299999999,43.067614],[-75.27529199999999,43.067771],[-75.275307,43.068044],[-75.27533200000001,43.068161],[-75.27542,43.068329],[-75.275723,43.068842],[-75.275992,43.069247],[-75.27613100000001,43.069341],[-75.27631700000001,43.06941],[-75.276517,43.069461],[-75.27678400000001,43.069502],[-75.277108,43.069534],[-75.27783700000001,43.069625],[-75.27800000000001,43.069681],[-75.278395,43.069815],[-75.278632,43.069913],[-75.278865,43.070073],[-75.279044,43.070135],[-75.279179,43.070146],[-75.279562,43.070124],[-75.27975499999999,43.070128],[-75.280192,43.070179],[-75.280557,43.070267],[-75.281053,43.07042],[-75.281476,43.070605],[-75.28190600000001,43.070817],[-75.28218699999999,43.070995],[-75.282391,43.071086],[-75.283091,43.071294],[-75.283208,43.071349],[-75.283368,43.071578],[-75.283492,43.071698],[-75.283762,43.071931],[-75.283933,43.072132],[-75.284057,43.072339],[-75.284301,43.072693],[-75.284462,43.072977],[-75.284502,43.073086],[-75.284637,43.073563],[-75.28474300000001,43.073826],[-75.28491,43.074033],[-75.28543000000001,43.074511],[-75.285219,43.074614]]],"type":"Polygon"}
}