{
  "id": "360050039003",
  "type": "Feature",
  "properties": {
    "area_land":36604,
    "area_water":0,
    "geoid":"360050039003",
    "name":"Block Group 3",
    "state":"ny"
},
  "bbox": [
    -73.927121,
    40.81005,
    -73.923726,
    40.812384
],
  "geometry": {"coordinates":[[[-73.92644300000001,40.811507],[-73.92555299999999,40.811941],[-73.924683,40.812384],[-73.923726,40.811979],[-73.92419099999999,40.81135],[-73.924648,40.810728],[-73.92514199999999,40.81005],[-73.92614,40.810503],[-73.926321,40.810586],[-73.927121,40.810949],[-73.92644300000001,40.811507]]],"type":"Polygon"}
}