{
  "id": "360810922001",
  "type": "Feature",
  "properties": {
    "area_land":183235,
    "area_water":0,
    "geoid":"360810922001",
    "name":"Block Group 1",
    "state":"ny"
},
  "bbox": [
    -73.863379,
    40.574212,
    -73.854849,
    40.579257
],
  "geometry": {"coordinates":[[[-73.86337899999999,40.575309],[-73.862739,40.575842],[-73.86286800000001,40.576024],[-73.862883,40.57606],[-73.86283,40.576088],[-73.859089,40.578074],[-73.858653,40.578331],[-73.85683899999999,40.579257],[-73.856763,40.579177],[-73.855937,40.577763],[-73.854849,40.575878],[-73.855673,40.575602],[-73.85649600000001,40.575325],[-73.857321,40.575048],[-73.85814499999999,40.574771],[-73.85896700000001,40.574497],[-73.859815,40.574212],[-73.860862,40.57608],[-73.861683,40.575797],[-73.86250800000001,40.575519],[-73.862933,40.575378],[-73.86337899999999,40.575309]]],"type":"Polygon"}
}