{
  "id": "360290108031",
  "type": "Feature",
  "properties": {
    "area_land":1087141,
    "area_water":0,
    "geoid":"360290108031",
    "name":"Block Group 1",
    "state":"ny"
},
  "bbox": [
    -78.754321,
    42.906859,
    -78.730037,
    42.914225
],
  "geometry": {"coordinates":[[[-78.754321,42.907091],[-78.75431399999999,42.907806],[-78.7543,42.90922],[-78.754285,42.910554],[-78.754273,42.911483],[-78.754251,42.913424],[-78.754248,42.913712],[-78.753759,42.913759],[-78.75041,42.91396],[-78.749748,42.914004],[-78.748481,42.914061],[-78.74689499999999,42.91412],[-78.746674,42.914134],[-78.745963,42.914181],[-78.74515700000001,42.914225],[-78.744411,42.914203],[-78.74377699999999,42.914148],[-78.742456,42.913957],[-78.742396,42.913946],[-78.740889,42.913677],[-78.739412,42.913425],[-78.73809900000001,42.913178],[-78.73692,42.912948],[-78.736644,42.912915],[-78.73617400000001,42.912888],[-78.735249,42.912932],[-78.73424900000001,42.913025],[-78.733496,42.913195],[-78.73334800000001,42.913236],[-78.733024,42.912803],[-78.732963,42.912721],[-78.731565,42.911225],[-78.730037,42.909644],[-78.730895,42.909652],[-78.731134,42.90965],[-78.731373,42.909643],[-78.731611,42.90963],[-78.732167,42.909587],[-78.732484,42.909556],[-78.73515500000001,42.909247],[-78.736124,42.909131],[-78.736294,42.90911],[-78.73905499999999,42.908789],[-78.74190900000001,42.908462],[-78.744698,42.908172],[-78.74695699999999,42.907893],[-78.751665,42.907356],[-78.753517,42.907139],[-78.754245,42.907096],[-78.754217,42.906859],[-78.75432000000001,42.907046],[-78.754321,42.907091]]],"type":"Polygon"}
}