{
  "id": "360593025021",
  "type": "Feature",
  "properties": {
    "area_land":8519862,
    "area_water":0,
    "geoid":"360593025021",
    "name":"Block Group 1",
    "state":"ny"
},
  "bbox": [
    -73.625781,
    40.756605,
    -73.568826,
    40.783546
],
  "geometry": {"coordinates":[[[-73.62577899999999,40.772176],[-73.62576,40.772693],[-73.62572900000001,40.773154],[-73.62566099999999,40.77371],[-73.625615,40.774087],[-73.625511,40.774668],[-73.625297,40.775667],[-73.62522199999999,40.776018],[-73.625136,40.7765],[-73.62513,40.776852],[-73.625158,40.777077],[-73.62518300000001,40.777198],[-73.625254,40.777434],[-73.625428,40.77783],[-73.625514,40.777984],[-73.62557099999999,40.778066],[-73.624916,40.777999],[-73.624831,40.777991],[-73.624116,40.778045],[-73.62402,40.778506],[-73.623723,40.779872],[-73.62346700000001,40.781107],[-73.62418599999999,40.781097],[-73.62426600000001,40.781701],[-73.62326899999999,40.782059],[-73.623076,40.782946],[-73.623017,40.783215],[-73.62288599999999,40.78321],[-73.622114,40.783177],[-73.621235,40.783188],[-73.620729,40.783224],[-73.619051,40.783483],[-73.618399,40.783537],[-73.617936,40.783546],[-73.617597,40.783545],[-73.617301,40.783534],[-73.616659,40.783485],[-73.616409,40.78343],[-73.615889,40.783362],[-73.615442,40.783278],[-73.614951,40.783155],[-73.614332,40.782959],[-73.61384200000001,40.782771],[-73.613568,40.782649],[-73.61306399999999,40.7824],[-73.610602,40.781088],[-73.609695,40.780618],[-73.60950699999999,40.780535],[-73.60893799999999,40.780317],[-73.60846600000001,40.780156],[-73.607799,40.779986],[-73.60732299999999,40.779894],[-73.606753,40.779807],[-73.606414,40.779773],[-73.60606,40.77975],[-73.605771,40.77974],[-73.605403,40.779742],[-73.60502,40.779743],[-73.60451399999999,40.779777],[-73.603922,40.77985],[-73.60343,40.779925],[-73.60249,40.780111],[-73.601579,40.780327],[-73.601015,40.780484],[-73.600407,40.780672],[-73.599857,40.780856],[-73.59784500000001,40.781599],[-73.596716,40.781993],[-73.5955,40.782392],[-73.594545,40.782674],[-73.593547,40.782945],[-73.592477,40.783205],[-73.591826,40.783331],[-73.591117,40.783431],[-73.590583,40.783475],[-73.59012,40.783498],[-73.5894,40.783498],[-73.589196,40.783482],[-73.587931,40.783353],[-73.587159,40.783225],[-73.586136,40.782923],[-73.58510099999999,40.782515],[-73.58416699999999,40.782011],[-73.582984,40.781364],[-73.582787,40.781208],[-73.58107800000001,40.780249],[-73.57998000000001,40.779755],[-73.57883099999999,40.779366],[-73.577997,40.779141],[-73.57710400000001,40.778976],[-73.57625899999999,40.778856],[-73.574449,40.778888],[-73.573556,40.77901],[-73.572441,40.779169],[-73.57190799999999,40.779277],[-73.571433,40.779045],[-73.568826,40.777324],[-73.571162,40.776111],[-73.570116,40.775335],[-73.569804,40.775273],[-73.569633,40.775172],[-73.57214399999999,40.773864],[-73.572889,40.773493],[-73.57337699999999,40.773216],[-73.573926,40.772925],[-73.575846,40.771882],[-73.57649499999999,40.77153],[-73.57662999999999,40.77146],[-73.577068,40.771233],[-73.57805399999999,40.770738],[-73.579404,40.770124],[-73.580709,40.769516],[-73.58171900000001,40.769065],[-73.583191,40.768419],[-73.583549,40.768308],[-73.584329,40.768056],[-73.58483099999999,40.767931],[-73.58550700000001,40.767785],[-73.58620000000001,40.767644],[-73.587059,40.767459],[-73.587914,40.767276],[-73.588241,40.767206],[-73.58890700000001,40.767065],[-73.58974000000001,40.766886],[-73.591122,40.766589],[-73.592057,40.766385],[-73.592581,40.766233],[-73.593075,40.766082],[-73.594566,40.765566],[-73.594897,40.765451],[-73.595364,40.765301],[-73.595872,40.765113],[-73.596864,40.764769],[-73.597177,40.764659],[-73.597509,40.764543],[-73.59782800000001,40.764431],[-73.598766,40.764104],[-73.60058600000001,40.763477],[-73.601291,40.763279],[-73.601856,40.763143],[-73.602423,40.763038],[-73.603398,40.762869],[-73.603897,40.762782],[-73.605496,40.762515],[-73.606887,40.762259],[-73.608459,40.76188],[-73.609707,40.761563],[-73.610005,40.761487],[-73.61066700000001,40.761315],[-73.61165,40.761013],[-73.611954,40.760921],[-73.61292299999999,40.760598],[-73.613257,40.760479],[-73.613868,40.760221],[-73.614602,40.759912],[-73.615173,40.759654],[-73.615309,40.759594],[-73.61637,40.759084],[-73.617071,40.758744],[-73.617861,40.758256],[-73.618509,40.75792],[-73.61963799999999,40.757302],[-73.619698,40.757403],[-73.619882,40.757321],[-73.620609,40.756942],[-73.62095600000001,40.756766],[-73.62127,40.756605],[-73.62187299999999,40.757114],[-73.622801,40.757992],[-73.62297,40.758251],[-73.62301100000001,40.758312],[-73.623158,40.75856],[-73.623165,40.758598],[-73.623254,40.758749],[-73.62375900000001,40.759911],[-73.623794,40.759992],[-73.624624,40.761893],[-73.624633,40.761913],[-73.62481099999999,40.762364],[-73.62496400000001,40.762825],[-73.62514,40.76354],[-73.625259,40.764221],[-73.625321,40.764726],[-73.625378,40.765484],[-73.62562200000001,40.769042],[-73.625649,40.769382],[-73.62570100000001,40.769821],[-73.625764,40.770831],[-73.625781,40.772041],[-73.62577899999999,40.772176]]],"type":"Polygon"}
}