{
  "id": "361031587042",
  "type": "Feature",
  "properties": {
    "area_land":1135993,
    "area_water":0,
    "geoid":"361031587042",
    "name":"Block Group 2",
    "state":"ny"
},
  "bbox": [
    -73.023545,
    40.860275,
    -72.998718,
    40.869698
],
  "geometry": {"coordinates":[[[-73.023545,40.86779],[-73.023117,40.867827],[-73.022813,40.867827],[-73.021753,40.867992],[-73.02134100000001,40.868049],[-73.021202,40.868085],[-73.02063699999999,40.868232],[-73.02026499999999,40.868355],[-73.01970799999999,40.868511],[-73.019448,40.868579],[-73.01889199999999,40.86867],[-73.018849,40.868675],[-73.018601,40.868705],[-73.01758700000001,40.868692],[-73.016746,40.868705],[-73.01592100000001,40.868691],[-73.015061,40.868653],[-73.014759,40.868652],[-73.01413100000001,40.868664],[-73.01333700000001,40.868674],[-73.01268899999999,40.868702],[-73.012422,40.86871],[-73.011771,40.868727],[-73.01094999999999,40.86875],[-73.009804,40.868811],[-73.009277,40.868831],[-73.00834,40.868853],[-73.007676,40.868866],[-73.0067,40.868834],[-73.006294,40.868802],[-73.00548499999999,40.868739],[-73.004268,40.868662],[-73.003106,40.868542],[-73.002304,40.868484],[-73.001885,40.868548],[-73.001175,40.86877],[-73.000696,40.869029],[-73.000337,40.869299],[-72.999754,40.869698],[-72.999741,40.86954],[-72.999588,40.868663],[-72.999565,40.868503],[-72.99952,40.868004],[-72.99949700000001,40.867743],[-72.999464,40.867455],[-72.999442,40.867261],[-72.999208,40.86555],[-72.999,40.863514],[-72.99898,40.86331],[-72.99896099999999,40.863105],[-72.99893299999999,40.862845],[-72.998856,40.862205],[-72.99885500000001,40.86216],[-72.998817,40.861473],[-72.998803,40.86129],[-72.998726,40.860396],[-72.998718,40.860275],[-72.99970999999999,40.860996],[-73.000381,40.861389],[-73.001526,40.86201],[-73.002404,40.862511],[-73.00262499999999,40.86264],[-73.003792,40.863266],[-73.004469,40.863609],[-73.004929,40.863842],[-73.005741,40.864362],[-73.005864,40.864437],[-73.006192,40.864661],[-73.00688,40.865125],[-73.007206,40.865296],[-73.00733700000001,40.865356],[-73.007549,40.865438],[-73.007696,40.865479],[-73.007845,40.865504],[-73.007957,40.865514],[-73.00807500000001,40.865523],[-73.00836200000001,40.865502],[-73.008577,40.865465],[-73.008968,40.865349],[-73.00927900000001,40.865268],[-73.009681,40.865134],[-73.010228,40.864964],[-73.01074800000001,40.864789],[-73.011127,40.864669],[-73.011325,40.864608],[-73.011554,40.864539],[-73.011634,40.864515],[-73.01185,40.864493],[-73.012674,40.864338],[-73.01298800000001,40.864284],[-73.013245,40.864241],[-73.013665,40.864174],[-73.01410799999999,40.864051],[-73.014764,40.86383],[-73.015343,40.86364],[-73.015839,40.86346],[-73.016488,40.863373],[-73.016999,40.863318],[-73.01745699999999,40.863257],[-73.017742,40.863227],[-73.018106,40.86319],[-73.01818900000001,40.863181],[-73.019426,40.862979],[-73.019876,40.862918],[-73.021036,40.862732],[-73.021233,40.862697],[-73.021844,40.862605],[-73.022065,40.863167],[-73.022407,40.863913],[-73.022683,40.864448],[-73.023072,40.865063],[-73.023385,40.865856],[-73.023492,40.866581],[-73.023545,40.86779]]],"type":"Polygon"}
}