{
  "id": "360290164004",
  "type": "Feature",
  "properties": {
    "area_land":657483,
    "area_water":0,
    "geoid":"360290164004",
    "name":"Block Group 4",
    "state":"ny"
},
  "bbox": [
    -78.870544,
    42.873261,
    -78.855141,
    42.881583
],
  "geometry": {"coordinates":[[[-78.87052,42.876876],[-78.87050000000001,42.876937],[-78.870305,42.877551],[-78.87012900000001,42.878102],[-78.86989699999999,42.878807],[-78.86986899999999,42.878893],[-78.86967,42.879504],[-78.869494,42.880047],[-78.869467,42.880129],[-78.869364,42.880763],[-78.869394,42.880768],[-78.869263,42.881178],[-78.86914299999999,42.881551],[-78.86913199999999,42.881583],[-78.868949,42.881552],[-78.86853600000001,42.88148],[-78.868426,42.881461],[-78.867974,42.881383],[-78.867705,42.881336],[-78.86707199999999,42.881226],[-78.866974,42.881209],[-78.8663,42.881092],[-78.866224,42.881079],[-78.86476399999999,42.880826],[-78.863754,42.880651],[-78.859933,42.879974],[-78.85753,42.879549],[-78.85598400000001,42.879273],[-78.855512,42.879193],[-78.855358,42.879161],[-78.855254,42.879106],[-78.855141,42.878983],[-78.855248,42.878943],[-78.855417,42.87887],[-78.85562400000001,42.87874],[-78.855722,42.878652],[-78.8558,42.878561],[-78.855895,42.878403],[-78.85592800000001,42.878329],[-78.85609599999999,42.877799],[-78.85629299999999,42.877179],[-78.85664800000001,42.876082],[-78.856746,42.875781],[-78.856881,42.875353],[-78.857157,42.874481],[-78.857353,42.873863],[-78.857461,42.873522],[-78.857495,42.873416],[-78.857544,42.873261],[-78.85785799999999,42.873319],[-78.85906300000001,42.873289],[-78.85982199999999,42.87386],[-78.859898,42.873903],[-78.860259,42.874108],[-78.860613,42.874309],[-78.861214,42.874681],[-78.861761,42.87497],[-78.86244499999999,42.875244],[-78.862796,42.875358],[-78.86293999999999,42.875404],[-78.863325,42.875486],[-78.863845,42.875618],[-78.86618300000001,42.876053],[-78.866795,42.876151],[-78.86726299999999,42.876239],[-78.867868,42.876333],[-78.86814800000001,42.876379],[-78.87006700000001,42.876703],[-78.870544,42.876802],[-78.87052,42.876876]]],"type":"Polygon"}
}