{
  "id": "360610228003",
  "type": "Feature",
  "properties": {
    "area_land":46811,
    "area_water":0,
    "geoid":"360610228003",
    "name":"Block Group 3",
    "state":"ny"
},
  "bbox": [
    -73.947034,
    40.814634,
    -73.94321,
    40.817175
],
  "geometry": {"coordinates":[[[-73.946546,40.816502],[-73.946055,40.817175],[-73.94320999999999,40.815976],[-73.943699,40.815306],[-73.944193,40.814634],[-73.947034,40.81583],[-73.946546,40.816502]]],"type":"Polygon"}
}