{
  "id": "360593034001",
  "type": "Feature",
  "properties": {
    "area_land":999991,
    "area_water":0,
    "geoid":"360593034001",
    "name":"Block Group 1",
    "state":"ny"
},
  "bbox": [
    -73.640759,
    40.757785,
    -73.626339,
    40.767411
],
  "geometry": {"coordinates":[[[-73.640759,40.766495],[-73.63655,40.766984],[-73.630692,40.767411],[-73.628573,40.766103],[-73.626339,40.761598],[-73.62660099999999,40.759635],[-73.62679,40.759617],[-73.627773,40.759502],[-73.62825599999999,40.759437],[-73.62876900000001,40.759376],[-73.629487,40.759271],[-73.629659,40.759251],[-73.630578,40.75912],[-73.63145400000001,40.758995],[-73.631579,40.758974],[-73.63188700000001,40.758906],[-73.63254999999999,40.758782],[-73.633695,40.758569],[-73.63461599999999,40.758399],[-73.634873,40.758325],[-73.635304,40.758288],[-73.636436,40.758287],[-73.636771,40.758259],[-73.637129,40.758217],[-73.637563,40.758139],[-73.637693,40.758104],[-73.638272,40.758008],[-73.638383,40.75799],[-73.63910199999999,40.757861],[-73.639332,40.757824],[-73.63959699999999,40.757785],[-73.63967700000001,40.758716],[-73.639707,40.75906],[-73.639735,40.759446],[-73.639763,40.759703],[-73.639819,40.760389],[-73.639931,40.76129],[-73.639987,40.761666],[-73.64004300000001,40.762105],[-73.640141,40.762781],[-73.640225,40.763425],[-73.640337,40.764111],[-73.640488,40.765137],[-73.640567,40.765536],[-73.640598,40.765689],[-73.640759,40.766495]]],"type":"Polygon"}
}