{
  "id": "360730407002",
  "type": "Feature",
  "properties": {
    "area_land":2441135,
    "area_water":16667,
    "geoid":"360730407002",
    "name":"Block Group 2",
    "state":"ny"
},
  "bbox": [
    -78.25314,
    43.245937,
    -78.193203,
    43.260884
],
  "geometry": {"coordinates":[[[-78.253135,43.251739],[-78.25066099999999,43.252624],[-78.24969,43.253057],[-78.249306,43.253214],[-78.248716,43.253386],[-78.248153,43.253524],[-78.247649,43.253626],[-78.247103,43.25371],[-78.245968,43.253878],[-78.244174,43.25409],[-78.242698,43.254264],[-78.241867,43.254383],[-78.239361,43.254745],[-78.234948,43.255266],[-78.23263900000001,43.255539],[-78.231487,43.255706],[-78.23077000000001,43.255783],[-78.23034699999999,43.25583],[-78.227667,43.256154],[-78.22712,43.256198],[-78.226737,43.256216],[-78.226236,43.256205],[-78.22591199999999,43.256172],[-78.225392,43.256085],[-78.225154,43.256033],[-78.224925,43.255983],[-78.224407,43.255826],[-78.223992,43.255662],[-78.223523,43.255462],[-78.223392,43.255384],[-78.222983,43.255141],[-78.22258600000001,43.254861],[-78.22256899999999,43.254846],[-78.22202799999999,43.254362],[-78.22106700000001,43.253528],[-78.220337,43.252914],[-78.219584,43.252281],[-78.21940499999999,43.252142],[-78.218868,43.251727],[-78.218733,43.251623],[-78.218689,43.251591],[-78.218182,43.251218],[-78.21796000000001,43.251071],[-78.217934,43.251054],[-78.21722800000001,43.250653],[-78.215926,43.250001],[-78.215586,43.249819],[-78.214797,43.249398],[-78.21462200000001,43.249303],[-78.21448100000001,43.249227],[-78.21409199999999,43.249036],[-78.213915,43.24895],[-78.213604,43.248789],[-78.213244,43.248604],[-78.21265099999999,43.248352],[-78.212614,43.248336],[-78.21231899999999,43.248246],[-78.21162,43.248032],[-78.211495,43.247994],[-78.210748,43.24782],[-78.20993199999999,43.24766],[-78.209474,43.247605],[-78.209339,43.24759],[-78.208821,43.24756],[-78.208746,43.247556],[-78.20866599999999,43.247551],[-78.208426,43.247536],[-78.20834600000001,43.247532],[-78.208225,43.247837],[-78.20813,43.247938],[-78.208035,43.247999],[-78.207995,43.248026],[-78.20783400000001,43.24808],[-78.20763100000001,43.248161],[-78.207544,43.248221],[-78.20749600000001,43.248376],[-78.207463,43.248834],[-78.20745700000001,43.249406],[-78.20745599999999,43.249595],[-78.20741599999999,43.249797],[-78.207329,43.24996],[-78.207127,43.250341],[-78.20702199999999,43.250541],[-78.20686499999999,43.25077],[-78.20663500000001,43.251156],[-78.20647700000001,43.25146],[-78.206407,43.251597],[-78.206293,43.25176],[-78.206247,43.251825],[-78.206119,43.252009],[-78.205669,43.252526],[-78.205647,43.252581],[-78.205662,43.252745],[-78.205764,43.252967],[-78.205837,43.253087],[-78.205851,43.253182],[-78.205811,43.253395],[-78.205791,43.253506],[-78.20578399999999,43.253645],[-78.20575100000001,43.253758],[-78.20571700000001,43.253822],[-78.20571099999999,43.253834],[-78.205704,43.253918],[-78.205715,43.254013],[-78.20582,43.254209],[-78.205935,43.254388],[-78.205961,43.254457],[-78.205961,43.254533],[-78.205928,43.25465],[-78.20593100000001,43.254701],[-78.205946,43.254734],[-78.20600399999999,43.254796],[-78.206012,43.254821],[-78.205997,43.254847],[-78.205848,43.254952],[-78.20581799999999,43.254993],[-78.205811,43.255043],[-78.20581799999999,43.255113],[-78.205884,43.255266],[-78.205933,43.255346],[-78.206046,43.255437],[-78.206075,43.255481],[-78.206079,43.255528],[-78.206065,43.25559],[-78.20602100000001,43.255656],[-78.20594199999999,43.255707],[-78.20581799999999,43.255743],[-78.205676,43.25575],[-78.20537400000001,43.255801],[-78.205319,43.255849],[-78.205217,43.256038],[-78.205155,43.256093],[-78.20489999999999,43.256173],[-78.20484500000001,43.256198],[-78.204798,43.256249],[-78.204746,43.256329],[-78.20466999999999,43.256493],[-78.204601,43.256574],[-78.20452,43.256635],[-78.204429,43.256683],[-78.20396100000001,43.256839],[-78.203582,43.25689],[-78.203563,43.256893],[-78.20327899999999,43.256952],[-78.202697,43.257098],[-78.20252499999999,43.257169],[-78.201965,43.257442],[-78.20190599999999,43.257502],[-78.201886,43.257544],[-78.201883,43.257566],[-78.20189999999999,43.25759],[-78.201928,43.257615],[-78.202079,43.257805],[-78.20209800000001,43.25786],[-78.20208700000001,43.2579],[-78.202039,43.257929],[-78.201307,43.258064],[-78.20103899999999,43.258096],[-78.20096599999999,43.258125],[-78.20090399999999,43.258166],[-78.200802,43.258264],[-78.200714,43.258304],[-78.20060100000001,43.258322],[-78.200486,43.258318],[-78.19999,43.258304],[-78.199586,43.258311],[-78.199292,43.25838],[-78.199168,43.258435],[-78.19907000000001,43.258508],[-78.198669,43.25888],[-78.198195,43.259473],[-78.198103,43.259554],[-78.197959,43.259656],[-78.197799,43.259736],[-78.19719000000001,43.259907],[-78.196738,43.259998],[-78.196603,43.259994],[-78.196476,43.259965],[-78.19637299999999,43.259911],[-78.196297,43.259852],[-78.19613099999999,43.259768],[-78.195927,43.25971],[-78.19569,43.259677],[-78.195537,43.259674],[-78.195446,43.259696],[-78.195358,43.259743],[-78.195307,43.259801],[-78.195274,43.25987],[-78.195267,43.260056],[-78.195241,43.260158],[-78.19515800000001,43.260247],[-78.195148,43.26026],[-78.195035,43.260326],[-78.194919,43.260359],[-78.194554,43.260359],[-78.194434,43.260395],[-78.194335,43.260461],[-78.194047,43.260683],[-78.19394200000001,43.260723],[-78.193821,43.260745],[-78.19348599999999,43.260759],[-78.19338399999999,43.260788],[-78.193203,43.260884],[-78.193207,43.260715],[-78.19322099999999,43.260211],[-78.19322699999999,43.260045],[-78.19325499999999,43.259271],[-78.193303,43.258034],[-78.19333899999999,43.257189],[-78.19334499999999,43.256981],[-78.19334499999999,43.256951],[-78.193348,43.256854],[-78.193378,43.256178],[-78.19338,43.256138],[-78.193381,43.256102],[-78.193392,43.255876],[-78.19339600000001,43.255801],[-78.193399,43.25575],[-78.1934,43.255722],[-78.19341,43.255488],[-78.193414,43.25541],[-78.193428,43.255075],[-78.193445,43.254679],[-78.193451,43.254525],[-78.19346299999999,43.25416],[-78.193465,43.254073],[-78.193477,43.253739],[-78.193485,43.253532],[-78.19349,43.253433],[-78.19353099999999,43.252517],[-78.193545,43.252212],[-78.193546,43.252164],[-78.19355299999999,43.252023],[-78.193555,43.251976],[-78.193557,43.251914],[-78.193577,43.251238],[-78.193631,43.249962],[-78.193618,43.249853],[-78.193634,43.249848],[-78.193668,43.249102],[-78.193692,43.248432],[-78.19369399999999,43.248315],[-78.193707,43.247971],[-78.19371099999999,43.247856],[-78.19371599999999,43.24753],[-78.193742,43.246556],[-78.19374999999999,43.246232],[-78.193921,43.246247],[-78.19401999999999,43.246246],[-78.194424,43.246243],[-78.194841,43.246229],[-78.195115,43.246221],[-78.196527,43.246201],[-78.197952,43.246168],[-78.198138,43.246162],[-78.1987,43.246151],[-78.198887,43.246147],[-78.199308,43.246137],[-78.20057300000001,43.246111],[-78.20099500000001,43.246102],[-78.201229,43.246097],[-78.20127100000001,43.246096],[-78.2021,43.246084],[-78.202377,43.246081],[-78.20253099999999,43.246078],[-78.20299799999999,43.246072],[-78.203154,43.246071],[-78.203394,43.246064],[-78.204115,43.246045],[-78.204356,43.246039],[-78.204652,43.246031],[-78.205544,43.246008],[-78.20584100000001,43.246001],[-78.205865,43.246],[-78.20594,43.245998],[-78.20596500000001,43.245998],[-78.206039,43.245996],[-78.206265,43.245991],[-78.20634,43.24599],[-78.206363,43.245989],[-78.206434,43.245987],[-78.206458,43.245987],[-78.20683699999999,43.245979],[-78.206855,43.245978],[-78.208049,43.245953],[-78.208448,43.245945],[-78.208513,43.245943],[-78.208709,43.245938],[-78.208775,43.245937],[-78.20877400000001,43.245967],[-78.20877400000001,43.246061],[-78.20877400000001,43.246092],[-78.208831,43.246117],[-78.208849,43.246126],[-78.209002,43.246195],[-78.20905999999999,43.246221],[-78.209086,43.246233],[-78.21003399999999,43.24666],[-78.210111,43.246696],[-78.21199799999999,43.247591],[-78.21220700000001,43.247698],[-78.21322499999999,43.248211],[-78.21425600000001,43.248732],[-78.214302,43.248756],[-78.21444,43.248829],[-78.21448599999999,43.248854],[-78.214598,43.248914],[-78.214804,43.249024],[-78.214935,43.249094],[-78.215048,43.249154],[-78.21538700000001,43.249331],[-78.216404,43.249866],[-78.21674299999999,43.250046],[-78.217704,43.250552],[-78.217905,43.250658],[-78.218408,43.250892],[-78.218808,43.251041],[-78.219206,43.251154],[-78.219641,43.251259],[-78.220241,43.251374],[-78.220816,43.251442],[-78.220932,43.251457],[-78.22117299999999,43.251473],[-78.221532,43.251492],[-78.221901,43.251501],[-78.222217,43.251501],[-78.22316600000001,43.251501],[-78.223483,43.251502],[-78.22691399999999,43.251496],[-78.22712900000001,43.251496],[-78.23296000000001,43.251509],[-78.2362,43.251528],[-78.237303,43.251527],[-78.238068,43.251534],[-78.240549,43.251558],[-78.241715,43.251555],[-78.24332,43.251551],[-78.243785,43.251551],[-78.247924,43.251594],[-78.248137,43.251593],[-78.24891599999999,43.251591],[-78.249698,43.251604],[-78.249743,43.251604],[-78.251152,43.25162],[-78.252679,43.251616],[-78.25314,43.251607],[-78.253135,43.251739]]],"type":"Polygon"}
}