{
  "id": "360470520003",
  "type": "Feature",
  "properties": {
    "area_land":26859,
    "area_water":0,
    "geoid":"360470520003",
    "name":"Block Group 3",
    "state":"ny"
},
  "bbox": [
    -73.965382,
    40.633249,
    -73.963946,
    40.636688
],
  "geometry": {"coordinates":[[[-73.96538200000001,40.636279],[-73.964957,40.636479],[-73.964513,40.636688],[-73.96449699999999,40.636606],[-73.964263,40.635358],[-73.964215,40.6351],[-73.964187,40.634954],[-73.96394600000001,40.633662],[-73.964805,40.633249],[-73.965082,40.634683],[-73.96538200000001,40.636279]]],"type":"Polygon"}
}