{
  "id": "361119537003",
  "type": "Feature",
  "properties": {
    "area_land":13308450,
    "area_water":184527,
    "geoid":"361119537003",
    "name":"Block Group 3",
    "state":"ny"
},
  "bbox": [
    -74.014251,
    41.692364,
    -73.975695,
    41.745208
],
  "geometry": {"coordinates":[[[-74.01424,41.699781],[-74.014116,41.700412],[-74.014019,41.700736],[-74.013706,41.701465],[-74.01361,41.701814],[-74.01348299999999,41.702429],[-74.013316,41.703109],[-74.013199,41.703835],[-74.01312,41.704166],[-74.012936,41.704698],[-74.012885,41.704892],[-74.012854,41.705031],[-74.01279700000001,41.705757],[-74.012792,41.705977],[-74.012799,41.706527],[-74.012817,41.706977],[-74.01291999999999,41.708206],[-74.012916,41.708382],[-74.012913,41.708495],[-74.01290299999999,41.708561],[-74.012771,41.709208],[-74.012584,41.710066],[-74.01246999999999,41.710532],[-74.012382,41.710954],[-74.012355,41.711154],[-74.01234599999999,41.712127],[-74.01232899999999,41.71239],[-74.012316,41.712494],[-74.012264,41.712683],[-74.012181,41.712903],[-74.011668,41.713789],[-74.011438,41.71422],[-74.01124299999999,41.714625],[-74.011116,41.714987],[-74.010982,41.715491],[-74.01090600000001,41.715861],[-74.01084,41.716184],[-74.010687,41.717092],[-74.010656,41.71741],[-74.010604,41.718988],[-74.010593,41.719366],[-74.010599,41.719576],[-74.010569,41.719981],[-74.010486,41.720274],[-74.010369,41.720535],[-74.010346,41.720572],[-74.01021900000001,41.720783],[-74.01014600000001,41.720931],[-74.01005499999999,41.721131],[-74.01002,41.721232],[-74.009939,41.721502],[-74.009922,41.721587],[-74.009894,41.721722],[-74.009839,41.722058],[-74.00979700000001,41.7222],[-74.00978000000001,41.722257],[-74.009643,41.722643],[-74.00963400000001,41.722717],[-74.00963299999999,41.722737],[-74.009657,41.722964],[-74.00972400000001,41.72318],[-74.009996,41.723813],[-74.01027000000001,41.724403],[-74.01046599999999,41.724766],[-74.010682,41.725162],[-74.010727,41.725272],[-74.010792,41.725472],[-74.010807,41.725633],[-74.0108,41.725748],[-74.010713,41.726037],[-74.01055700000001,41.726385],[-74.010364,41.726705],[-74.01010100000001,41.727069],[-74.00979700000001,41.727554],[-74.009782,41.727578],[-74.00942499999999,41.728115],[-74.00928500000001,41.728294],[-74.00869299999999,41.728956],[-74.00848499999999,41.729137],[-74.008134,41.729381],[-74.00776399999999,41.729588],[-74.00739900000001,41.729749],[-74.00680699999999,41.729978],[-74.006709,41.730028],[-74.006529,41.730143],[-74.00636,41.730276],[-74.005938,41.730691],[-74.00578400000001,41.730858],[-74.00541200000001,41.731314],[-74.00501800000001,41.73182],[-74.004895,41.73202],[-74.00485,41.732143],[-74.00484299999999,41.732341],[-74.004912,41.732932],[-74.004935,41.7333],[-74.004898,41.733514],[-74.004845,41.733635],[-74.00478099999999,41.733737],[-74.004598,41.733977],[-74.004514,41.734086],[-74.004369,41.734311],[-74.004261,41.734519],[-74.004133,41.734774],[-74.00408899999999,41.734968],[-74.004105,41.735078],[-74.004148,41.735176],[-74.00424,41.73525],[-74.005774,41.736469],[-74.006113,41.736745],[-74.00628,41.736887],[-74.00658199999999,41.737123],[-74.00681299999999,41.737221],[-74.007086,41.737278],[-74.007243,41.737291],[-74.00727999999999,41.737338],[-74.007875,41.737482],[-74.008146,41.737589],[-74.00850800000001,41.737803],[-74.008633,41.737864],[-74.008774,41.737916],[-74.008927,41.737941],[-74.00921700000001,41.737982],[-74.009367,41.738015],[-74.00982,41.738139],[-74.010023,41.738213],[-74.01011800000001,41.738258],[-74.010192,41.738306],[-74.010283,41.738405],[-74.010424,41.7386],[-74.010638,41.738961],[-74.008196,41.739414],[-74.006446,41.739779],[-74.005427,41.740006],[-74.003872,41.740368],[-74.00223099999999,41.740783],[-74.001119,41.741082],[-73.999548,41.741501],[-73.99819100000001,41.741868],[-73.997955,41.741927],[-73.99299600000001,41.743259],[-73.991505,41.743656],[-73.98995600000001,41.744056],[-73.988417,41.744477],[-73.987942,41.744604],[-73.986778,41.744896],[-73.986063,41.745031],[-73.985523,41.745109],[-73.985024,41.745157],[-73.984391,41.745203],[-73.98354399999999,41.745208],[-73.983324,41.7452],[-73.98264500000001,41.74516],[-73.981927,41.745077],[-73.981578,41.745028],[-73.98145599999999,41.745005],[-73.980411,41.743816],[-73.980209,41.743572],[-73.97927300000001,41.742288],[-73.97852399999999,41.741094],[-73.978151,41.740644],[-73.977457,41.737401],[-73.977419,41.737223],[-73.97704400000001,41.73548],[-73.977024,41.735392],[-73.976895,41.734573],[-73.97690299999999,41.733162],[-73.976935,41.731279],[-73.97623400000001,41.730021],[-73.975695,41.729057],[-73.97660399999999,41.725191],[-73.97691399999999,41.723678],[-73.977941,41.722034],[-73.979066,41.72048],[-73.979159,41.720279],[-73.979202,41.720175],[-73.979632,41.719135],[-73.980383,41.7176],[-73.980656,41.717042],[-73.982822,41.704961],[-73.98286299999999,41.704685],[-73.98350000000001,41.699512],[-73.982873,41.698404],[-73.982894,41.69821],[-73.982961,41.697755],[-73.983037,41.697586],[-73.983132,41.697454],[-73.98325699999999,41.697339],[-73.983425,41.697234],[-73.98378700000001,41.69706],[-73.984154,41.696902],[-73.98430999999999,41.696816],[-73.984488,41.696664],[-73.984644,41.696458],[-73.984774,41.696238],[-73.98493499999999,41.695896],[-73.984996,41.695729],[-73.985129,41.695189],[-73.985187,41.695004],[-73.985246,41.694873],[-73.98531800000001,41.694777],[-73.985412,41.694701],[-73.985466,41.694663],[-73.985609,41.694596],[-73.986468,41.694358],[-73.98657900000001,41.694316],[-73.987377,41.693953],[-73.987774,41.693806],[-73.987938,41.693772],[-73.988106,41.693755],[-73.988266,41.693769],[-73.988445,41.693809],[-73.98874000000001,41.693919],[-73.98889800000001,41.693998],[-73.990008,41.694606],[-73.991046,41.695193],[-73.991637,41.695524],[-73.991711,41.695565],[-73.99198800000001,41.695698],[-73.99221900000001,41.695778],[-73.99272499999999,41.695927],[-73.99309700000001,41.696021],[-73.993285,41.69605],[-73.993477,41.69607],[-73.993664,41.696059],[-73.99373,41.69605],[-73.99385599999999,41.696013],[-73.99405899999999,41.69593],[-73.994876,41.695507],[-73.995919,41.694968],[-73.99733500000001,41.694222],[-73.99751000000001,41.694114],[-73.997676,41.693992],[-73.997793,41.693888],[-73.997962,41.693711],[-73.99833599999999,41.693264],[-73.998507,41.693092],[-73.99864700000001,41.692991],[-73.998987,41.692812],[-73.99926499999999,41.692648],[-73.99948500000001,41.692459],[-73.99958599999999,41.692364],[-73.999657,41.692394],[-74.012226,41.698171],[-74.01245,41.697161],[-74.01261700000001,41.696402],[-74.01276300000001,41.695753],[-74.01365699999999,41.69714],[-74.01370199999999,41.697167],[-74.013757,41.697243],[-74.013977,41.697529],[-74.01398399999999,41.697969],[-74.01397900000001,41.698513],[-74.01402899999999,41.699],[-74.013756,41.698874],[-74.013822,41.698969],[-74.014126,41.699315],[-74.01420400000001,41.699437],[-74.014251,41.699565],[-74.01424,41.699781]]],"type":"Polygon"}
}