{
  "id": "360810838003",
  "type": "Feature",
  "properties": {
    "area_land":133035,
    "area_water":0,
    "geoid":"360810838003",
    "name":"Block Group 3",
    "state":"ny"
},
  "bbox": [
    -73.824216,
    40.668733,
    -73.81845,
    40.672858
],
  "geometry": {"coordinates":[[[-73.82364800000001,40.671044],[-73.823083,40.672858],[-73.82217,40.672693],[-73.821257,40.672529],[-73.82031000000001,40.672356],[-73.819357,40.672187],[-73.819118,40.672155],[-73.81845,40.672032],[-73.819019,40.670208],[-73.819929,40.670372],[-73.820567,40.670485],[-73.820876,40.670543],[-73.82147999999999,40.668733],[-73.822391,40.668897],[-73.823303,40.669062],[-73.82421600000001,40.669227],[-73.82364800000001,40.671044]]],"type":"Polygon"}
}