{
  "id": "360550056002",
  "type": "Feature",
  "properties": {
    "area_land":189938,
    "area_water":0,
    "geoid":"360550056002",
    "name":"Block Group 2",
    "state":"ny"
},
  "bbox": [
    -77.58254,
    43.166437,
    -77.577366,
    43.173566
],
  "geometry": {"coordinates":[[[-77.58253999999999,43.170946],[-77.582263,43.170952],[-77.582093,43.170956],[-77.58205100000001,43.173181],[-77.58205100000001,43.173406],[-77.581619,43.173418],[-77.58099799999999,43.173436],[-77.577366,43.173566],[-77.577817,43.172727],[-77.578084,43.172227],[-77.578709,43.171037],[-77.57925899999999,43.170038],[-77.579564,43.169496],[-77.580015,43.168677],[-77.580117,43.168493],[-77.580808,43.167249],[-77.580861,43.167134],[-77.58100399999999,43.166868],[-77.58122,43.166467],[-77.582318,43.166437],[-77.582356,43.167211],[-77.58242199999999,43.168433],[-77.58243,43.168617],[-77.582443,43.168896],[-77.58253999999999,43.170946]]],"type":"Polygon"}
}