{
  "id": "360811159001",
  "type": "Feature",
  "properties": {
    "area_land":135243,
    "area_water":0,
    "geoid":"360811159001",
    "name":"Block Group 1",
    "state":"ny"
},
  "bbox": [
    -73.824669,
    40.768169,
    -73.817293,
    40.771478
],
  "geometry": {"coordinates":[[[-73.824669,40.770407],[-73.82189700000001,40.77082],[-73.81975799999999,40.771131],[-73.818726,40.771281],[-73.818336,40.771332],[-73.81729300000001,40.771478],[-73.817317,40.770289],[-73.818271,40.770166],[-73.819215,40.770026],[-73.819205,40.768869],[-73.82032,40.768714],[-73.821405,40.768559],[-73.822278,40.768436],[-73.823092,40.768321],[-73.824212,40.768169],[-73.824443,40.769286],[-73.824669,40.770407]]],"type":"Polygon"}
}