{
  "id": "361019603001",
  "type": "Feature",
  "properties": {
    "area_land":95425188,
    "area_water":0,
    "geoid":"361019603001",
    "name":"Block Group 1",
    "state":"ny"
},
  "bbox": [
    -77.544722,
    42.428456,
    -77.38794,
    42.576871
],
  "geometry": {"coordinates":[[[-77.544681,42.446919],[-77.544662,42.449888],[-77.544639,42.454435],[-77.54460400000001,42.467083],[-77.544399,42.472841],[-77.544438,42.474374],[-77.544309,42.485886],[-77.54430600000001,42.486587],[-77.54254400000001,42.486592],[-77.542428,42.493183],[-77.542312,42.499919],[-77.542146,42.505435],[-77.541996,42.509985],[-77.54177900000001,42.515824],[-77.541455,42.515824],[-77.54124899999999,42.515798],[-77.540943,42.515747],[-77.54076999999999,42.515705],[-77.54060800000001,42.515647],[-77.540458,42.515578],[-77.53912,42.514753],[-77.538749,42.514566],[-77.538375,42.514393],[-77.538009,42.514255],[-77.537825,42.514202],[-77.537656,42.514507],[-77.537491,42.514787],[-77.53731000000001,42.51503],[-77.537173,42.51516],[-77.53715,42.515178],[-77.537059,42.515252],[-77.53680799999999,42.515421],[-77.536771,42.515437],[-77.536405,42.5156],[-77.536238,42.515652],[-77.53606000000001,42.515689],[-77.535732,42.515727],[-77.535505,42.515735],[-77.535155,42.515732],[-77.535025,42.515737],[-77.53476000000001,42.515732],[-77.53276,42.515691],[-77.53222,42.515697],[-77.53184899999999,42.51571],[-77.53166299999999,42.515737],[-77.531565,42.515776],[-77.531452,42.515865],[-77.531099,42.51578],[-77.530872,42.515739],[-77.530637,42.515707],[-77.530171,42.51567],[-77.529644,42.515655],[-77.52513399999999,42.515621],[-77.52437999999999,42.515628],[-77.523633,42.515623],[-77.52225300000001,42.515622],[-77.52069,42.5157],[-77.52008499999999,42.515705],[-77.519757,42.515686],[-77.51942,42.515633],[-77.519274,42.515609],[-77.518885,42.515533],[-77.518565,42.515462],[-77.517867,42.515279],[-77.51770399999999,42.515225],[-77.517055,42.51498],[-77.516577,42.514768],[-77.51651,42.514731],[-77.516119,42.514513],[-77.515807,42.514306],[-77.515692,42.514212],[-77.515517,42.514071],[-77.515261,42.51383],[-77.515232,42.513802],[-77.514827,42.513276],[-77.512613,42.509918],[-77.51252599999999,42.509788],[-77.511706,42.508553],[-77.511301,42.507976],[-77.510932,42.507426],[-77.508045,42.503206],[-77.507778,42.502854],[-77.507519,42.502603],[-77.507279,42.502432],[-77.507125,42.50234],[-77.506874,42.502218],[-77.506388,42.502048],[-77.505613,42.501867],[-77.505771,42.50147],[-77.50658900000001,42.499563],[-77.506682,42.499399],[-77.506792,42.499233],[-77.506989,42.498975],[-77.50708899999999,42.49886],[-77.50710599999999,42.498841],[-77.507304,42.498651],[-77.507513,42.498482],[-77.5073,42.498266],[-77.50719100000001,42.498114],[-77.50711699999999,42.497956],[-77.507076,42.497777],[-77.507076,42.497613],[-77.507132,42.497385],[-77.507722,42.495833],[-77.507778,42.495654],[-77.50780399999999,42.495411],[-77.507797,42.49521],[-77.50768100000001,42.494474],[-77.507588,42.49406],[-77.50746100000001,42.493579],[-77.50727999999999,42.492973],[-77.507205,42.492764],[-77.50708899999999,42.492547],[-77.506861,42.49223],[-77.50668,42.492019],[-77.506523,42.491814],[-77.506202,42.491366],[-77.50591300000001,42.491032],[-77.50545700000001,42.490622],[-77.505315,42.490484],[-77.505115,42.490251],[-77.50420200000001,42.488797],[-77.504023,42.488487],[-77.503861,42.488239],[-77.503603,42.487978],[-77.503185,42.487605],[-77.503136,42.487562],[-77.501508,42.486012],[-77.50116,42.485724],[-77.50091399999999,42.485534],[-77.499369,42.484465],[-77.499212,42.484327],[-77.499126,42.484189],[-77.49907,42.484025],[-77.499014,42.483674],[-77.498938,42.483258],[-77.498852,42.482605],[-77.498718,42.481737],[-77.49864100000001,42.481518],[-77.496205,42.481483],[-77.495589,42.481479],[-77.494648,42.481457],[-77.492643,42.481408],[-77.49154,42.481392],[-77.491331,42.481389],[-77.490065,42.481367],[-77.489609,42.481356],[-77.489208,42.481347],[-77.488518,42.481361],[-77.487168,42.481422],[-77.48617299999999,42.481506],[-77.485979,42.481528],[-77.485482,42.481622],[-77.485152,42.481698],[-77.484595,42.481862],[-77.484472,42.481907],[-77.484267,42.481999],[-77.484089,42.482095],[-77.483903,42.482211],[-77.483594,42.482428],[-77.484095,42.482883],[-77.48452,42.483274],[-77.48526699999999,42.483936],[-77.485502,42.48418],[-77.486135,42.484938],[-77.486547,42.485447],[-77.486608,42.485525],[-77.48710800000001,42.48616],[-77.487488,42.486575],[-77.487983,42.487032],[-77.488547,42.487489],[-77.48875700000001,42.487639],[-77.490285,42.488836],[-77.490723,42.489179],[-77.490949,42.489367],[-77.49096299999999,42.489379],[-77.491165,42.489551],[-77.49323800000001,42.491452],[-77.493528,42.491731],[-77.493554,42.491756],[-77.493641,42.491847],[-77.493797,42.492011],[-77.493871,42.492099],[-77.49400799999999,42.492264],[-77.494131,42.492451],[-77.49419899999999,42.492554],[-77.49434100000001,42.492803],[-77.494418,42.492967],[-77.494528,42.493288],[-77.494626,42.493729],[-77.494659,42.494154],[-77.49472,42.496297],[-77.494726,42.496498],[-77.494726,42.496871],[-77.494714,42.497189],[-77.49469499999999,42.497333],[-77.49462800000001,42.497599],[-77.49459899999999,42.497674],[-77.49438000000001,42.49823],[-77.49397500000001,42.499226],[-77.49376599999999,42.499738],[-77.49346,42.500454],[-77.493161,42.501188],[-77.493028,42.501582],[-77.49277600000001,42.502456],[-77.492705,42.502706],[-77.49248900000001,42.503478],[-77.492339,42.503971],[-77.492296,42.504128],[-77.492192,42.50451],[-77.49209399999999,42.504765],[-77.49191500000001,42.505084],[-77.49168299999999,42.505412],[-77.491649,42.505449],[-77.49138000000001,42.505729],[-77.49125100000001,42.505838],[-77.491006,42.506024],[-77.490838,42.506143],[-77.490516,42.506325],[-77.490184,42.506471],[-77.48990000000001,42.506588],[-77.489744,42.50664],[-77.489187,42.5068],[-77.48807100000001,42.507089],[-77.48600500000001,42.50763],[-77.485542,42.507794],[-77.485136,42.507954],[-77.48477099999999,42.508114],[-77.483985,42.508498],[-77.48321,42.508872],[-77.482433,42.509223],[-77.481632,42.509626],[-77.480915,42.510025],[-77.480197,42.510439],[-77.47874899999999,42.511322],[-77.478042,42.511789],[-77.477767,42.511982],[-77.477019,42.512583],[-77.476837,42.512738],[-77.476438,42.513112],[-77.475863,42.513689],[-77.475606,42.513984],[-77.475568,42.514027],[-77.475537,42.514066],[-77.475092,42.514624],[-77.474751,42.515102],[-77.47445399999999,42.515587],[-77.473378,42.517553],[-77.472612,42.519102],[-77.470754,42.522799],[-77.470248,42.523822],[-77.469902,42.524522],[-77.468765,42.526796],[-77.468687,42.52696],[-77.468525,42.527302],[-77.467783,42.528728],[-77.46603,42.532012],[-77.465385,42.533212],[-77.463311,42.537104],[-77.463241,42.537234],[-77.46254999999999,42.538542],[-77.46229700000001,42.539111],[-77.46203,42.539794],[-77.461828,42.540403],[-77.46163900000001,42.54101],[-77.46136799999999,42.541962],[-77.46087799999999,42.543597],[-77.459745,42.547353],[-77.45956700000001,42.547993],[-77.45948300000001,42.548453],[-77.459446,42.548871],[-77.45945399999999,42.54939],[-77.459513,42.54987],[-77.459633,42.550409],[-77.459766,42.550784],[-77.45994,42.551185],[-77.460172,42.551609],[-77.461656,42.553958],[-77.462333,42.555027],[-77.463554,42.557086],[-77.463703,42.557375],[-77.46378799999999,42.557672],[-77.46393399999999,42.558268],[-77.464018,42.558625],[-77.464151,42.559135],[-77.464296,42.559691],[-77.464562,42.560706],[-77.464634,42.561008],[-77.464663,42.56119],[-77.464653,42.561309],[-77.464614,42.56151],[-77.46438999999999,42.562206],[-77.46407499999999,42.563139],[-77.464045,42.563231],[-77.463762,42.564105],[-77.463639,42.564388],[-77.463515,42.564595],[-77.463263,42.564932],[-77.46316299999999,42.565042],[-77.462715,42.565451],[-77.461033,42.566933],[-77.460258,42.5676],[-77.458657,42.569001],[-77.458501,42.56914],[-77.45842,42.569211],[-77.457336,42.570152],[-77.45686600000001,42.570527],[-77.454548,42.57204],[-77.453275,42.572861],[-77.45192,42.573737],[-77.451579,42.573937],[-77.451363,42.57405],[-77.451117,42.574162],[-77.450379,42.57444],[-77.44964,42.574711],[-77.449274,42.574878],[-77.448303,42.575356],[-77.44730300000001,42.575872],[-77.446774,42.576155],[-77.44639100000001,42.576405],[-77.445871,42.576789],[-77.44584999999999,42.576805],[-77.445786,42.576854],[-77.44576600000001,42.576871],[-77.445566,42.576853],[-77.445249,42.576849],[-77.443696,42.576834],[-77.443179,42.576829],[-77.442882,42.57683],[-77.441991,42.576833],[-77.441918,42.576834],[-77.44180799999999,42.576844],[-77.441697,42.576866],[-77.441675,42.576843],[-77.441609,42.576776],[-77.441588,42.576754],[-77.44049800000001,42.576747],[-77.437889,42.57673],[-77.42679200000001,42.57666],[-77.42309299999999,42.576637],[-77.423162,42.572758],[-77.423204,42.570398],[-77.42318400000001,42.56958],[-77.423226,42.56916],[-77.423205,42.568351],[-77.423371,42.561082],[-77.423373,42.560968],[-77.423383,42.560474],[-77.423435,42.557544],[-77.423436,42.556581],[-77.42344300000001,42.552901],[-77.422282,42.552881],[-77.41759,42.552824],[-77.410494,42.552743],[-77.39713999999999,42.552566],[-77.397141,42.55204],[-77.397148,42.550405],[-77.397178,42.5493],[-77.39725799999999,42.542729],[-77.397402,42.53091],[-77.393073,42.530759],[-77.389304,42.530578],[-77.389613,42.522624],[-77.389635,42.52229],[-77.38794,42.519536],[-77.38804,42.519525],[-77.388177,42.519483],[-77.388265,42.519437],[-77.38832499999999,42.519356],[-77.388374,42.519261],[-77.388469,42.518934],[-77.388525,42.518618],[-77.388599,42.518369],[-77.388644,42.518309],[-77.389286,42.517167],[-77.389388,42.516804],[-77.389613,42.516351],[-77.389673,42.516291],[-77.389754,42.516256],[-77.389831,42.516196],[-77.38995799999999,42.51601],[-77.39,42.515898],[-77.390018,42.515782],[-77.390035,42.515372],[-77.390081,42.515309],[-77.390165,42.515242],[-77.390254,42.515189],[-77.390299,42.515151],[-77.390399,42.51478],[-77.39046399999999,42.514536],[-77.39056600000001,42.514342],[-77.39065100000001,42.514247],[-77.39071800000001,42.514188],[-77.390809,42.514142],[-77.39093200000001,42.514121],[-77.391023,42.514096],[-77.39107300000001,42.514054],[-77.391278,42.513673],[-77.391412,42.513546],[-77.391971,42.513198],[-77.39206900000001,42.513121],[-77.392252,42.512859],[-77.392734,42.512016],[-77.39288500000001,42.511868],[-77.392934,42.511784],[-77.393001,42.511583],[-77.39313199999999,42.511325],[-77.39317800000001,42.51129],[-77.393276,42.511262],[-77.39337500000001,42.511209],[-77.39342000000001,42.511149],[-77.393449,42.511086],[-77.393449,42.511019],[-77.39342000000001,42.510872],[-77.393438,42.510759],[-77.39348699999999,42.510703],[-77.393557,42.51059],[-77.393547,42.510492],[-77.393512,42.510439],[-77.39340300000001,42.510344],[-77.393198,42.510198],[-77.39300799999999,42.510009],[-77.39297999999999,42.509963],[-77.39298700000001,42.50991],[-77.393012,42.509851],[-77.393012,42.509812],[-77.392994,42.509791],[-77.392871,42.509815],[-77.392808,42.509812],[-77.39267100000001,42.509749],[-77.39259300000001,42.509745],[-77.392516,42.509763],[-77.392453,42.509763],[-77.392375,42.509742],[-77.39230499999999,42.509689],[-77.392284,42.509643],[-77.39223800000001,42.509204],[-77.392207,42.509151],[-77.39206900000001,42.509018],[-77.392059,42.508972],[-77.39206900000001,42.508926],[-77.392115,42.508898],[-77.392836,42.508687],[-77.392892,42.508659],[-77.39294099999999,42.50861],[-77.392945,42.508564],[-77.39291299999999,42.508506],[-77.392724,42.508323],[-77.39269899999999,42.508285],[-77.392706,42.508211],[-77.39272699999999,42.508148],[-77.39275499999999,42.508102],[-77.392822,42.508053],[-77.393061,42.50793],[-77.393244,42.507817],[-77.393311,42.507754],[-77.393715,42.507297],[-77.394204,42.506851],[-77.394299,42.506714],[-77.39451800000001,42.506286],[-77.39462399999999,42.506156],[-77.39493299999999,42.50603],[-77.395141,42.505963],[-77.39541800000001,42.505784],[-77.395535,42.505742],[-77.395686,42.505706],[-77.39601999999999,42.505713],[-77.396238,42.505728],[-77.396428,42.505752],[-77.396625,42.505763],[-77.39675099999999,42.505759],[-77.396846,42.505717],[-77.397193,42.505406],[-77.397274,42.505343],[-77.397344,42.505304],[-77.397425,42.505283],[-77.39747800000001,42.505286],[-77.39758999999999,42.505343],[-77.39763600000001,42.505343],[-77.397696,42.505311],[-77.39778,42.50509],[-77.397837,42.504984],[-77.397924,42.504886],[-77.398072,42.504773],[-77.398185,42.504657],[-77.39829400000001,42.504555],[-77.398364,42.504541],[-77.398561,42.504555],[-77.39863800000001,42.504548],[-77.398684,42.504506],[-77.39870500000001,42.504457],[-77.39868800000001,42.504411],[-77.39859199999999,42.504285],[-77.398571,42.504225],[-77.398578,42.504172],[-77.398624,42.504067],[-77.398646,42.503791],[-77.398667,42.503742],[-77.39870500000001,42.5037],[-77.398726,42.503636],[-77.398726,42.503541],[-77.39870500000001,42.503401],[-77.398726,42.503359],[-77.399208,42.503035],[-77.39942600000001,42.502926],[-77.399665,42.502849],[-77.399901,42.502803],[-77.399996,42.502768],[-77.400194,42.502626],[-77.400391,42.502468],[-77.40047199999999,42.502415],[-77.40055599999999,42.502398],[-77.400679,42.502398],[-77.400813,42.502415],[-77.400943,42.502458],[-77.401098,42.502475],[-77.401256,42.502447],[-77.401358,42.502408],[-77.401414,42.502356],[-77.401428,42.502313],[-77.40140700000001,42.502275],[-77.40133400000001,42.502247],[-77.401151,42.502215],[-77.40107999999999,42.502176],[-77.401042,42.502131],[-77.401042,42.502085],[-77.40107999999999,42.502029],[-77.401151,42.50199],[-77.401281,42.501944],[-77.401527,42.501881],[-77.401629,42.501832],[-77.40167099999999,42.501772],[-77.401706,42.501684],[-77.401752,42.501604],[-77.401819,42.501544],[-77.401921,42.501498],[-77.40220600000001,42.5014],[-77.40225100000001,42.501368],[-77.402255,42.501333],[-77.40223400000001,42.501287],[-77.401994,42.501117],[-77.40192399999999,42.501054],[-77.401843,42.500906],[-77.401822,42.500825],[-77.401832,42.50059],[-77.40185700000001,42.500534],[-77.40191,42.500477],[-77.40195199999999,42.500453],[-77.40197000000001,42.500414],[-77.40197000000001,42.500383],[-77.40186799999999,42.500267],[-77.40186,42.500221],[-77.40191,42.500107],[-77.401906,42.500068],[-77.40188499999999,42.500032],[-77.40145699999999,42.499761],[-77.40154099999999,42.499498],[-77.412531,42.486789],[-77.412965,42.48627],[-77.416048,42.486293],[-77.422184,42.486363],[-77.422257,42.486386],[-77.42537799999999,42.486388],[-77.427792,42.486452],[-77.430797,42.486488],[-77.431715,42.486499],[-77.434865,42.486532],[-77.43498099999999,42.486533],[-77.43881500000001,42.486574],[-77.450261,42.486675],[-77.456579,42.486771],[-77.46027100000001,42.48681],[-77.460257,42.482654],[-77.460235,42.47643],[-77.46393,42.476401],[-77.463841,42.467594],[-77.463877,42.467331],[-77.47189299999999,42.467443],[-77.473204,42.467441],[-77.474447,42.467399],[-77.474433,42.463189],[-77.474385,42.461511],[-77.47439300000001,42.457877],[-77.478325,42.457918],[-77.479687,42.457933],[-77.47973,42.457933],[-77.480155,42.457939],[-77.48067,42.457929],[-77.480666,42.456687],[-77.480666,42.456616],[-77.480667,42.456173],[-77.480666,42.455281],[-77.480664,42.454079],[-77.480664,42.453856],[-77.48065800000001,42.449268],[-77.491753,42.449563],[-77.49791500000001,42.449727],[-77.49970500000001,42.449786],[-77.50259,42.449828],[-77.502621,42.449777],[-77.505321,42.449838],[-77.505702,42.449838],[-77.50539999999999,42.444598],[-77.505386,42.444351],[-77.505574,42.444078],[-77.50560299999999,42.444007],[-77.505613,42.443926],[-77.505606,42.443819],[-77.50558100000001,42.443692],[-77.505578,42.443589],[-77.505585,42.443532],[-77.505645,42.443437],[-77.505713,42.443256],[-77.50572699999999,42.443175],[-77.505713,42.443065],[-77.505638,42.442814],[-77.505613,42.442732],[-77.50564900000001,42.442608],[-77.50571600000001,42.442491],[-77.505709,42.442075],[-77.506713,42.442078],[-77.506801,42.442079],[-77.514184,42.442178],[-77.51423,42.438667],[-77.514246,42.437368],[-77.514352,42.429336],[-77.514363,42.428456],[-77.525648,42.428601],[-77.534237,42.428644],[-77.544031,42.42886],[-77.543831,42.434022],[-77.543639,42.440813],[-77.543595,42.442743],[-77.54472199999999,42.44276],[-77.544681,42.446919]]],"type":"Polygon"}
}