{
  "id": "360610060001",
  "type": "Feature",
  "properties": {
    "area_land":50207,
    "area_water":0,
    "geoid":"360610060001",
    "name":"Block Group 1",
    "state":"ny"
},
  "bbox": [
    -73.978909,
    40.73231,
    -73.973646,
    40.736791
],
  "geometry": {"coordinates":[[[-73.978498,40.736791],[-73.978233,40.736676],[-73.976364,40.735868],[-73.975891,40.735673],[-73.975223,40.735398],[-73.97514,40.735392],[-73.975111,40.73539],[-73.97496,40.735369],[-73.97482599999999,40.735382],[-73.974749,40.735425],[-73.974672,40.735398],[-73.974433,40.735315],[-73.974183,40.734275],[-73.97403,40.733694],[-73.97395299999999,40.733382],[-73.973894,40.733344],[-73.973828,40.7333],[-73.973795,40.733278],[-73.97375099999999,40.733261],[-73.973692,40.733241],[-73.973646,40.733161],[-73.973653,40.733125],[-73.973697,40.733088],[-73.973769,40.733078],[-73.97387999999999,40.733093],[-73.973805,40.732803],[-73.97365000000001,40.73231],[-73.97379599999999,40.732325],[-73.97407699999999,40.73247],[-73.974243,40.732536],[-73.974256,40.732587],[-73.97463999999999,40.734132],[-73.97467,40.734253],[-73.974772,40.734221],[-73.97481999999999,40.734217],[-73.974872,40.734208],[-73.975138,40.734176],[-73.975245,40.7342],[-73.975556,40.734425],[-73.975616,40.734514],[-73.97573199999999,40.734687],[-73.976094,40.735059],[-73.976249,40.735145],[-73.976376,40.73517],[-73.976721,40.735057],[-73.977057,40.734885],[-73.977199,40.734908],[-73.977317,40.734989],[-73.977484,40.735169],[-73.977718,40.735422],[-73.97819200000001,40.735962],[-73.97848999999999,40.736005],[-73.978909,40.736164],[-73.978498,40.736791]]],"type":"Polygon"}
}