{
  "id": "360010135083",
  "type": "Feature",
  "properties": {
    "area_land":11510573,
    "area_water":1126425,
    "geoid":"360010135083",
    "name":"Block Group 3",
    "state":"ny"
},
  "bbox": [
    -73.824895,
    42.743475,
    -73.753201,
    42.792177
],
  "geometry": {"coordinates":[[[-73.82484599999999,42.773087],[-73.824516,42.773237],[-73.81930800000001,42.773855],[-73.816529,42.774188],[-73.816424,42.774201],[-73.813281,42.774576],[-73.81194600000001,42.774736],[-73.811626,42.774774],[-73.809603,42.775016],[-73.80955899999999,42.775784],[-73.809517,42.776509],[-73.80950300000001,42.776703],[-73.809489,42.776897],[-73.809484,42.776981],[-73.809479,42.777064],[-73.809462,42.777344],[-73.80944100000001,42.777685],[-73.809369,42.778869],[-73.799464,42.778878],[-73.79939899999999,42.778903],[-73.799297,42.778944],[-73.797965,42.779477],[-73.793565,42.782577],[-73.79056300000001,42.785942],[-73.79026500000001,42.786277],[-73.787065,42.789677],[-73.782464,42.791777],[-73.77996400000001,42.792177],[-73.77736400000001,42.791777],[-73.769564,42.786277],[-73.768764,42.785877],[-73.767764,42.785977],[-73.76666400000001,42.786077],[-73.764865,42.787277],[-73.763465,42.788576],[-73.76149599999999,42.791579],[-73.761433,42.791675],[-73.76137,42.791771],[-73.760739,42.791165],[-73.760547,42.790981],[-73.759283,42.789734],[-73.758702,42.789001],[-73.758365,42.78842],[-73.758264,42.78822],[-73.75801800000001,42.7877],[-73.75788300000001,42.78724],[-73.757794,42.786785],[-73.75778099999999,42.786666],[-73.757778,42.786285],[-73.75778200000001,42.785978],[-73.757794,42.78566],[-73.75787099999999,42.785116],[-73.757957,42.784772],[-73.75807500000001,42.78435],[-73.75817499999999,42.784043],[-73.758627,42.782475],[-73.758871,42.781589],[-73.759321,42.779976],[-73.759624,42.778796],[-73.759928,42.777546],[-73.760126,42.776595],[-73.760166,42.776401],[-73.759564,42.776502],[-73.758377,42.776625],[-73.75689199999999,42.776732],[-73.75530999999999,42.776819],[-73.75487200000001,42.775652],[-73.75462400000001,42.774823],[-73.75452300000001,42.77425],[-73.754366,42.773581],[-73.754279,42.773316],[-73.75420200000001,42.773131],[-73.75393200000001,42.772665],[-73.753742,42.772399],[-73.753618,42.77226],[-73.753501,42.772155],[-73.75326,42.771991],[-73.753201,42.771958],[-73.753435,42.771172],[-73.753534,42.770685],[-73.753708,42.769558],[-73.753764,42.769225],[-73.753867,42.768538],[-73.75393699999999,42.768225],[-73.75408899999999,42.76765],[-73.75415,42.767489],[-73.75433,42.767059],[-73.754352,42.766992],[-73.754352,42.766958],[-73.754785,42.765706],[-73.755073,42.764888],[-73.75524900000001,42.764424],[-73.75583399999999,42.76275],[-73.75586,42.762663],[-73.756091,42.762061],[-73.756226,42.761677],[-73.756478,42.76086],[-73.756561,42.760635],[-73.756591,42.760555],[-73.75664999999999,42.76041],[-73.756681,42.760316],[-73.75676300000001,42.760034],[-73.756812,42.759885],[-73.75690299999999,42.759638],[-73.75703799999999,42.759292],[-73.757199,42.758836],[-73.75736000000001,42.758364],[-73.757448,42.758219],[-73.75767399999999,42.757554],[-73.75815299999999,42.756312],[-73.758799,42.754641],[-73.75946999999999,42.752779],[-73.759574,42.75244],[-73.759563,42.752318],[-73.759591,42.752174],[-73.759682,42.751825],[-73.75985300000001,42.75124],[-73.760099,42.750455],[-73.760364,42.749551],[-73.760541,42.748986],[-73.76062,42.748643],[-73.76062,42.748552],[-73.760578,42.748272],[-73.760553,42.748203],[-73.76054600000001,42.748086],[-73.76057,42.747987],[-73.760604,42.747923],[-73.760704,42.747855],[-73.76080899999999,42.747821],[-73.760846,42.747811],[-73.760895,42.747729],[-73.76097300000001,42.74756],[-73.76106799999999,42.747258],[-73.761185,42.74682],[-73.761228,42.746641],[-73.761465,42.745535],[-73.761605,42.744657],[-73.761695,42.744463],[-73.76173900000001,42.743576],[-73.761819,42.743475],[-73.761912,42.743574],[-73.76189100000001,42.743828],[-73.76187,42.744458],[-73.761903,42.744507],[-73.761923,42.744571],[-73.76193600000001,42.744694],[-73.761663,42.746242],[-73.76151299999999,42.746881],[-73.761308,42.747556],[-73.76129,42.747653],[-73.76131599999999,42.747953],[-73.761354,42.748033],[-73.76136200000001,42.748086],[-73.761556,42.748436],[-73.761601,42.748502],[-73.761674,42.74858],[-73.762202,42.748939],[-73.762455,42.749093],[-73.763156,42.749554],[-73.76364,42.74988],[-73.76388,42.75004],[-73.764476,42.750444],[-73.765401,42.751079],[-73.76645000000001,42.751782],[-73.76658500000001,42.751863],[-73.766622,42.751885],[-73.76668600000001,42.751924],[-73.766801,42.751787],[-73.766842,42.751717],[-73.766993,42.751753],[-73.767152,42.751829],[-73.76766499999999,42.752089],[-73.76730999999999,42.752283],[-73.767488,42.752385],[-73.767689,42.752489],[-73.768096,42.752699],[-73.76825599999999,42.752765],[-73.768709,42.752974],[-73.768855,42.753035],[-73.768953,42.753081],[-73.76906099999999,42.753132],[-73.769192,42.7532],[-73.76978,42.753448],[-73.770064,42.753586],[-73.770123,42.753377],[-73.77112700000001,42.754069],[-73.771737,42.754344],[-73.772645,42.754755],[-73.772628,42.754782],[-73.77262399999999,42.7548],[-73.772637,42.754842],[-73.772657,42.754875],[-73.77269800000001,42.754922],[-73.77284,42.755066],[-73.77331599999999,42.75552],[-73.773617,42.755773],[-73.774182,42.756294],[-73.774404,42.756531],[-73.77460600000001,42.756796],[-73.774923,42.757256],[-73.775029,42.757409],[-73.77506200000001,42.757457],[-73.775318,42.757828],[-73.77544899999999,42.758041],[-73.77558399999999,42.758292],[-73.775807,42.758757],[-73.776911,42.76075],[-73.777328,42.761491],[-73.778068,42.762817],[-73.778291,42.763224],[-73.77842200000001,42.763428],[-73.778629,42.763711],[-73.77892199999999,42.764105],[-73.77920899999999,42.764421],[-73.779657,42.76482],[-73.780036,42.765116],[-73.78019,42.765234],[-73.780424,42.765472],[-73.780554,42.765638],[-73.780643,42.76584],[-73.780911,42.767189],[-73.78099,42.767471],[-73.78109600000001,42.767738],[-73.781149,42.76783],[-73.78128,42.768033],[-73.78090400000001,42.76815],[-73.780765,42.768189],[-73.780646,42.768208],[-73.780321,42.768225],[-73.78017199999999,42.768217],[-73.779611,42.768439],[-73.77727899999999,42.769277],[-73.776512,42.769539],[-73.776437,42.769587],[-73.776397,42.769619],[-73.776358,42.769675],[-73.776323,42.769764],[-73.77629899999999,42.769868],[-73.77630000000001,42.769918],[-73.776307,42.769945],[-73.776329,42.770033],[-73.77663200000001,42.77068],[-73.776642,42.770759],[-73.776623,42.770866],[-73.776478,42.77125],[-73.77643,42.77136],[-73.776388,42.771426],[-73.776336,42.771488],[-73.776251,42.771546],[-73.77611,42.771616],[-73.776129,42.771681],[-73.776162,42.771719],[-73.776218,42.771761],[-73.776308,42.771788],[-73.776703,42.771816],[-73.777084,42.771816],[-73.777248,42.771802],[-73.777422,42.771761],[-73.778617,42.771371],[-73.779528,42.771073],[-73.780805,42.773117],[-73.781983,42.7727],[-73.78134,42.771626],[-73.780923,42.771005],[-73.780917,42.770898],[-73.78095,42.770815],[-73.78098300000001,42.770777],[-73.781069,42.770709],[-73.781879,42.770345],[-73.782594,42.77141],[-73.783008,42.772003],[-73.78330699999999,42.772456],[-73.784582,42.772155],[-73.784612,42.77225],[-73.78467000000001,42.772459],[-73.784682,42.772639],[-73.784677,42.772728],[-73.785524,42.772805],[-73.786303,42.772866],[-73.787935,42.773022],[-73.788127,42.771839],[-73.78855,42.771811],[-73.78862700000001,42.771782],[-73.78866499999999,42.771754],[-73.788696,42.77172],[-73.78871100000001,42.771687],[-73.78883399999999,42.77088],[-73.788864,42.770582],[-73.78948099999999,42.77057],[-73.789608,42.770581],[-73.789739,42.770604],[-73.78984800000001,42.770647],[-73.78989199999999,42.770681],[-73.79000499999999,42.770867],[-73.79098,42.771005],[-73.79098399999999,42.770945],[-73.79086599999999,42.770779],[-73.790424,42.770128],[-73.789839,42.769815],[-73.789759,42.769754],[-73.789672,42.769588],[-73.789675,42.769423],[-73.789726,42.76914],[-73.789675,42.768901],[-73.789688,42.768699],[-73.789834,42.768643],[-73.790035,42.768618],[-73.790239,42.768607],[-73.79034,42.76849],[-73.79034799999999,42.768361],[-73.79039400000001,42.768183],[-73.790511,42.768146],[-73.79074900000001,42.768158],[-73.790708,42.767999],[-73.790599,42.767852],[-73.79039,42.767588],[-73.790198,42.767416],[-73.78998900000001,42.767238],[-73.78982999999999,42.767133],[-73.789592,42.767086],[-73.789413,42.767012],[-73.789312,42.766966],[-73.78921800000001,42.766898],[-73.78891400000001,42.766726],[-73.788805,42.766652],[-73.78866499999999,42.766544],[-73.788855,42.766368],[-73.788928,42.766299],[-73.789061,42.766178],[-73.789283,42.766012],[-73.78943099999999,42.765925],[-73.789519,42.765885],[-73.789686,42.765826],[-73.79023599999999,42.765649],[-73.790801,42.765476],[-73.791202,42.765331],[-73.79142299999999,42.765221],[-73.792215,42.764803],[-73.792529,42.764619],[-73.79408100000001,42.763807],[-73.794972,42.763284],[-73.795321,42.763066],[-73.79547700000001,42.762985],[-73.795576,42.762956],[-73.795823,42.762911],[-73.796148,42.762902],[-73.796291,42.762863],[-73.796339,42.762836],[-73.796384,42.762798],[-73.79644,42.76272],[-73.796459,42.762684],[-73.796492,42.762639],[-73.796554,42.76266],[-73.797234,42.762832],[-73.797591,42.762923],[-73.798023,42.763026],[-73.798621,42.76314],[-73.80074999999999,42.763559],[-73.802734,42.763943],[-73.802983,42.764],[-73.804603,42.764326],[-73.80490399999999,42.764387],[-73.805561,42.764526],[-73.80650799999999,42.764717],[-73.807666,42.764922],[-73.80800000000001,42.764985],[-73.808385,42.765055],[-73.80953,42.765262],[-73.81057699999999,42.765445],[-73.81216499999999,42.765735],[-73.812966,42.76595],[-73.813402,42.766102],[-73.813832,42.76627],[-73.81497899999999,42.766855],[-73.81639800000001,42.76763],[-73.81718100000001,42.768066],[-73.81771500000001,42.768356],[-73.818611,42.76886],[-73.81914399999999,42.769207],[-73.819169,42.769219],[-73.819425,42.769394],[-73.820909,42.770403],[-73.822147,42.77124],[-73.822547,42.771497],[-73.824895,42.772995],[-73.82484599999999,42.773087]]],"type":"Polygon"}
}