{
  "id": "360470385002",
  "type": "Feature",
  "properties": {
    "area_land":43470,
    "area_water":0,
    "geoid":"360470385002",
    "name":"Block Group 2",
    "state":"ny"
},
  "bbox": [
    -73.930035,
    40.6871,
    -73.923689,
    40.688541
],
  "geometry": {"coordinates":[[[-73.930035,40.687833],[-73.92711300000001,40.688167],[-73.923834,40.688541],[-73.923689,40.687811],[-73.926967,40.687438],[-73.92988800000001,40.6871],[-73.930035,40.687833]]],"type":"Polygon"}
}