{
  "id": "360811483000",
  "type": "Feature",
  "properties": {
    "area_land":0,
    "area_water":1013009,
    "geoid":"360811483000",
    "name":"Block Group 0",
    "state":"ny"
},
  "bbox": [
    -73.760295,
    40.766076,
    -73.750337,
    40.788703
],
  "geometry": {"coordinates":[[[-73.760142,40.780674],[-73.758799,40.784299],[-73.756187,40.788703],[-73.750817,40.782887],[-73.75045799999999,40.78261],[-73.750337,40.782512],[-73.750772,40.782643],[-73.750902,40.782616],[-73.75113399999999,40.782602],[-73.751424,40.782478],[-73.751645,40.782397],[-73.751845,40.782334],[-73.752014,40.782206],[-73.752225,40.782056],[-73.752348,40.781913],[-73.75246,40.781781],[-73.752748,40.781518],[-73.75299800000001,40.781289],[-73.75300799999999,40.780866],[-73.75353,40.780234],[-73.75389300000001,40.779795],[-73.754026,40.779604],[-73.75413,40.779384],[-73.754131,40.779177],[-73.75411200000001,40.779025],[-73.754122,40.778972],[-73.754248,40.778673],[-73.754282,40.778559],[-73.754302,40.778406],[-73.754373,40.778263],[-73.754442,40.778125],[-73.75448799999999,40.778051],[-73.75455700000001,40.777981],[-73.754485,40.777904],[-73.754558,40.777777],[-73.75464100000001,40.77771],[-73.75471,40.777672],[-73.754786,40.777648],[-73.754812,40.777636],[-73.755422,40.777654],[-73.75542,40.777701],[-73.755517,40.777704],[-73.755518,40.777584],[-73.755424,40.777584],[-73.75541800000001,40.777636],[-73.75481499999999,40.777613],[-73.754836,40.777467],[-73.754891,40.77719],[-73.754896,40.777156],[-73.754921,40.777127],[-73.75496200000001,40.77709],[-73.754982,40.777044],[-73.754929,40.77702],[-73.75488199999999,40.776986],[-73.754856,40.776945],[-73.754858,40.776896],[-73.754896,40.77683],[-73.75493899999999,40.776765],[-73.754975,40.776698],[-73.75502299999999,40.776638],[-73.755066,40.776601],[-73.755107,40.776588],[-73.755177,40.776544],[-73.75518599999999,40.776498],[-73.755173,40.776457],[-73.755137,40.776407],[-73.75509700000001,40.776377],[-73.755011,40.776313],[-73.75493,40.776247],[-73.754887,40.776189],[-73.754857,40.776139],[-73.75485399999999,40.776111],[-73.75483800000001,40.776061],[-73.75482,40.775991],[-73.754801,40.775938],[-73.754801,40.775899],[-73.754752,40.775878],[-73.75470900000001,40.775855],[-73.75466,40.775836],[-73.75458,40.775719],[-73.754546,40.775684],[-73.75448299999999,40.775629],[-73.75442200000001,40.775549],[-73.754333,40.77542],[-73.75424099999999,40.775267],[-73.754274,40.775184],[-73.75418999999999,40.77513],[-73.754144,40.775045],[-73.754121,40.774917],[-73.754104,40.77471],[-73.75402099999999,40.774511],[-73.754006,40.774469],[-73.75398,40.774397],[-73.753956,40.774306],[-73.75391399999999,40.774272],[-73.75383600000001,40.774224],[-73.75380800000001,40.774146],[-73.753753,40.774056],[-73.75368,40.773973],[-73.75364,40.773867],[-73.75362199999999,40.773822],[-73.753562,40.773665],[-73.753478,40.77349],[-73.75339200000001,40.773272],[-73.753367,40.773208],[-73.753388,40.77307],[-73.75341,40.772959],[-73.753452,40.772863],[-73.753506,40.77277],[-73.75357,40.772695],[-73.75364,40.772632],[-73.753722,40.77257],[-73.753809,40.772504],[-73.753878,40.772455],[-73.75392600000001,40.772419],[-73.753975,40.772383],[-73.75403300000001,40.772338],[-73.754199,40.772202],[-73.754296,40.77213],[-73.754381,40.772041],[-73.754706,40.771871],[-73.75485500000001,40.771798],[-73.755011,40.771738],[-73.755059,40.771719],[-73.755081,40.771836],[-73.75511400000001,40.771831],[-73.755083,40.771713],[-73.755256,40.771657],[-73.755427,40.771651],[-73.755504,40.771598],[-73.755573,40.771529],[-73.755561,40.771449],[-73.75550200000001,40.771283],[-73.755422,40.771187],[-73.755415,40.771149],[-73.755342,40.771022],[-73.755397,40.771005],[-73.755402,40.771017],[-73.75553499999999,40.770986],[-73.75551299999999,40.770945],[-73.75539999999999,40.77097],[-73.755404,40.770982],[-73.75533,40.770991],[-73.755207,40.770675],[-73.754901,40.770081],[-73.75487200000001,40.770028],[-73.754813,40.769961],[-73.75478099999999,40.769924],[-73.754755,40.769882],[-73.754727,40.769803],[-73.75472000000001,40.769783],[-73.754706,40.769742],[-73.754696,40.769709],[-73.75469,40.769677],[-73.754684,40.769627],[-73.754683,40.76956],[-73.754694,40.769505],[-73.754699,40.769451],[-73.754699,40.769431],[-73.75469699999999,40.769407],[-73.75468600000001,40.769323],[-73.754682,40.769303],[-73.754676,40.769262],[-73.754682,40.769212],[-73.75469699999999,40.769165],[-73.754721,40.769079],[-73.75473,40.769039],[-73.754733,40.769002],[-73.75473100000001,40.768988],[-73.75471400000001,40.768952],[-73.754711,40.768936],[-73.754713,40.768841],[-73.75471400000001,40.768795],[-73.7547,40.768783],[-73.75467,40.768773],[-73.754603,40.768775],[-73.754486,40.768783],[-73.754442,40.768783],[-73.754395,40.768758],[-73.754401,40.76873],[-73.75443799999999,40.76869],[-73.75450499999999,40.768655],[-73.754617,40.768651],[-73.75470199999999,40.768621],[-73.75474,40.768584],[-73.754768,40.768533],[-73.754775,40.768507],[-73.754805,40.768443],[-73.754851,40.768413],[-73.75485500000001,40.768368],[-73.754828,40.768319],[-73.754851,40.768248],[-73.754863,40.76818],[-73.75488199999999,40.768093],[-73.754904,40.768047],[-73.75495600000001,40.767991],[-73.75499600000001,40.767848],[-73.755076,40.767664],[-73.755072,40.767533],[-73.75499499999999,40.767429],[-73.75497300000001,40.767354],[-73.754918,40.767248],[-73.754875,40.767162],[-73.75481000000001,40.76709],[-73.754696,40.766997],[-73.754638,40.76693],[-73.754593,40.766864],[-73.754542,40.76678],[-73.754508,40.76672],[-73.754435,40.766589],[-73.75437599999999,40.766485],[-73.75432000000001,40.766413],[-73.754282,40.766384],[-73.754227,40.766361],[-73.75417,40.76632],[-73.754132,40.766279],[-73.754104,40.766217],[-73.754087,40.766153],[-73.754047,40.766076],[-73.757988,40.768397],[-73.75916700000001,40.771887],[-73.75958300000001,40.774001],[-73.760295,40.776921],[-73.760142,40.780674]]],"type":"Polygon"}
}