{
  "id": "360610255003",
  "type": "Feature",
  "properties": {
    "area_land":23816,
    "area_water":0,
    "geoid":"360610255003",
    "name":"Block Group 3",
    "state":"ny"
},
  "bbox": [
    -73.94261,
    40.844049,
    -73.940518,
    40.846231
],
  "geometry": {"coordinates":[[[-73.94261,40.846231],[-73.940518,40.845369],[-73.94079499999999,40.844686],[-73.940854,40.84452],[-73.940933,40.844357],[-73.941029,40.8442],[-73.941142,40.844049],[-73.942459,40.844601],[-73.94229199999999,40.845087],[-73.942339,40.845333],[-73.94261,40.846231]]],"type":"Polygon"}
}