{
  "id": "360610191004",
  "type": "Feature",
  "properties": {
    "area_land":21316,
    "area_water":0,
    "geoid":"360610191004",
    "name":"Block Group 4",
    "state":"ny"
},
  "bbox": [
    -73.970423,
    40.798476,
    -73.968207,
    40.80033
],
  "geometry": {"coordinates":[[[-73.969964,40.799702],[-73.969505,40.80033],[-73.96820700000001,40.799786],[-73.968557,40.799109],[-73.96900100000001,40.798476],[-73.970423,40.799071],[-73.969964,40.799702]]],"type":"Polygon"}
}