{
  "id": "360290133001",
  "type": "Feature",
  "properties": {
    "area_land":868907,
    "area_water":0,
    "geoid":"360290133001",
    "name":"Block Group 1",
    "state":"ny"
},
  "bbox": [
    -78.82158,
    42.714424,
    -78.812825,
    42.732013
],
  "geometry": {"coordinates":[[[-78.82158,42.727486],[-78.82106899999999,42.727792],[-78.819413,42.728786],[-78.819051,42.728977],[-78.81541300000001,42.730756],[-78.813729,42.731577],[-78.812825,42.732013],[-78.812861,42.730536],[-78.81287399999999,42.729964],[-78.81288499999999,42.729483],[-78.812905,42.728633],[-78.812912,42.728294],[-78.812922,42.727803],[-78.812941,42.726988],[-78.812957,42.72659],[-78.812966,42.726177],[-78.813017,42.724051],[-78.813075,42.721706],[-78.813106,42.720171],[-78.813126,42.719169],[-78.81312699999999,42.719099],[-78.813147,42.718487],[-78.81317199999999,42.717231],[-78.813177,42.717041],[-78.81318400000001,42.716638],[-78.813193,42.716003],[-78.813233,42.714424],[-78.814145,42.714658],[-78.81488400000001,42.714836],[-78.81497899999999,42.714858],[-78.81684199999999,42.715009],[-78.81726999999999,42.715044],[-78.817722,42.715082],[-78.820446,42.715311],[-78.820864,42.715332],[-78.82081100000001,42.717025],[-78.820787,42.717819],[-78.819969,42.7178],[-78.81990500000001,42.719774],[-78.819872,42.720819],[-78.819833,42.721832],[-78.81745600000001,42.721788],[-78.817432,42.722766],[-78.817414,42.723769],[-78.817379,42.72504],[-78.817359,42.726005],[-78.817347,42.726252],[-78.81733,42.727076],[-78.81884599999999,42.727107],[-78.82122200000001,42.727152],[-78.82158,42.727486]]],"type":"Polygon"}
}