{
  "id": "360610121005",
  "type": "Feature",
  "properties": {
    "area_land":21994,
    "area_water":0,
    "geoid":"360610121005",
    "name":"Block Group 5",
    "state":"ny"
},
  "bbox": [
    -73.99123,
    40.759164,
    -73.987927,
    40.760988
],
  "geometry": {"coordinates":[[[-73.990764,40.760988],[-73.98871800000001,40.760125],[-73.987927,40.759791],[-73.98839099999999,40.759164],[-73.989254,40.759525],[-73.990357,40.759988],[-73.99123,40.760354],[-73.990764,40.760988]]],"type":"Polygon"}
}