{
  "id": "360850114011",
  "type": "Feature",
  "properties": {
    "area_land":160072,
    "area_water":0,
    "geoid":"360850114011",
    "name":"Block Group 1",
    "state":"ny"
},
  "bbox": [
    -74.098796,
    40.583044,
    -74.092616,
    40.588488
],
  "geometry": {"coordinates":[[[-74.098094,40.58685],[-74.09747900000001,40.587298],[-74.097931,40.587516],[-74.098506,40.587808],[-74.097584,40.588488],[-74.097193,40.588284],[-74.09701099999999,40.58819],[-74.096802,40.588096],[-74.09656099999999,40.587971],[-74.095071,40.587203],[-74.09416400000001,40.586735],[-74.09261600000001,40.58594],[-74.093407,40.58524],[-74.094025,40.584748],[-74.094711,40.584203],[-74.095438,40.583624],[-74.096169,40.583044],[-74.09702,40.583559],[-74.097801,40.584026],[-74.098485,40.584455],[-74.09721999999999,40.585497],[-74.098001,40.585916],[-74.09879599999999,40.586301],[-74.098094,40.58685]]],"type":"Polygon"}
}