{
  "id": "360610241005",
  "type": "Feature",
  "properties": {
    "area_land":21670,
    "area_water":0,
    "geoid":"360610241005",
    "name":"Block Group 5",
    "state":"ny"
},
  "bbox": [
    -73.944879,
    40.832865,
    -73.941577,
    40.834681
],
  "geometry": {"coordinates":[[[-73.94442600000001,40.834681],[-73.941577,40.833487],[-73.942032,40.832865],[-73.944879,40.834059],[-73.94442600000001,40.834681]]],"type":"Polygon"}
}