{
  "id": "360810677001",
  "type": "Feature",
  "properties": {
    "area_land":91295,
    "area_water":0,
    "geoid":"360810677001",
    "name":"Block Group 1",
    "state":"ny"
},
  "bbox": [
    -73.872711,
    40.717831,
    -73.867969,
    40.721638
],
  "geometry": {"coordinates":[[[-73.872711,40.718654],[-73.87209,40.71894],[-73.871296,40.719308],[-73.87178400000001,40.719917],[-73.872272,40.720526],[-73.871472,40.720899],[-73.87066799999999,40.721268],[-73.86986899999999,40.721638],[-73.86888999999999,40.720421],[-73.867969,40.719268],[-73.868779,40.718904],[-73.869586,40.718545],[-73.870531,40.718161],[-73.87143,40.717992],[-73.872392,40.717831],[-73.872711,40.718654]]],"type":"Polygon"}
}