{
  "id": "360270502032",
  "type": "Feature",
  "properties": {
    "area_land":5954498,
    "area_water":37585,
    "geoid":"360270502032",
    "name":"Block Group 2",
    "state":"ny"
},
  "bbox": [
    -73.82862,
    41.544736,
    -73.794783,
    41.582996
],
  "geometry": {"coordinates":[[[-73.82860599999999,41.545491],[-73.828566,41.545798],[-73.82841999999999,41.546317],[-73.82816099999999,41.547072],[-73.828104,41.547304],[-73.828051,41.54764],[-73.82803199999999,41.548264],[-73.828047,41.548863],[-73.827966,41.549933],[-73.82794699999999,41.550193],[-73.827894,41.55049],[-73.82772300000001,41.551149],[-73.827581,41.551534],[-73.82749800000001,41.551671],[-73.827382,41.551816],[-73.826926,41.552317],[-73.826706,41.552592],[-73.826325,41.552948],[-73.82615199999999,41.553082],[-73.825869,41.55334],[-73.82568999999999,41.553563],[-73.825469,41.553904],[-73.825181,41.554444],[-73.824951,41.554811],[-73.824786,41.555121],[-73.824353,41.555819],[-73.823947,41.556557],[-73.823666,41.557037],[-73.823499,41.557266],[-73.822987,41.557798],[-73.82265,41.558137],[-73.822502,41.558303],[-73.82228499999999,41.55851],[-73.82182,41.558984],[-73.821634,41.559187],[-73.82131,41.559573],[-73.820899,41.560172],[-73.820768,41.560476],[-73.820701,41.560807],[-73.820696,41.56098],[-73.820696,41.561135],[-73.820744,41.561555],[-73.820853,41.561864],[-73.82102500000001,41.562188],[-73.821639,41.563148],[-73.822129,41.563915],[-73.82235900000001,41.564268],[-73.822823,41.565004],[-73.82288699999999,41.565184],[-73.822908,41.565289],[-73.822908,41.565421],[-73.82289299999999,41.565585],[-73.82278599999999,41.566234],[-73.822728,41.566458],[-73.82269100000001,41.56656],[-73.822219,41.567316],[-73.821956,41.567762],[-73.821729,41.56825],[-73.821622,41.568563],[-73.821603,41.568685],[-73.82154,41.569226],[-73.821488,41.569934],[-73.821502,41.570036],[-73.821527,41.570116],[-73.821654,41.5704],[-73.82176200000001,41.570614],[-73.821838,41.570884],[-73.821878,41.571209],[-73.821855,41.57147],[-73.82181199999999,41.571648],[-73.821707,41.571912],[-73.821562,41.572208],[-73.820931,41.573503],[-73.820757,41.57386],[-73.820618,41.57418],[-73.82056,41.574448],[-73.820543,41.574548],[-73.82050599999999,41.574811],[-73.820482,41.575253],[-73.82048,41.575398],[-73.820514,41.575457],[-73.82058499999999,41.575533],[-73.820694,41.575612],[-73.820767,41.575648],[-73.82100199999999,41.575658],[-73.820385,41.576093],[-73.81896500000001,41.577031],[-73.81656,41.578637],[-73.816157,41.578925],[-73.813743,41.580522],[-73.813401,41.580751],[-73.81249800000001,41.581384],[-73.81232199999999,41.581519],[-73.8116,41.581993],[-73.810923,41.582422],[-73.810187,41.582836],[-73.80994200000001,41.582986],[-73.809926,41.582996],[-73.809911,41.582976],[-73.80968,41.582789],[-73.809405,41.582578],[-73.808533,41.581882],[-73.80805599999999,41.581492],[-73.80765,41.581154],[-73.80782000000001,41.581024],[-73.808706,41.580238],[-73.808519,41.579999],[-73.808454,41.579897],[-73.80838300000001,41.57974],[-73.808224,41.579123],[-73.808167,41.578887],[-73.808093,41.578499],[-73.808052,41.578305],[-73.808032,41.578192],[-73.80789300000001,41.577652],[-73.807773,41.577362],[-73.807626,41.577083],[-73.807531,41.576902],[-73.807445,41.576652],[-73.807412,41.576494],[-73.807372,41.576351],[-73.807304,41.576007],[-73.80727400000001,41.575826],[-73.807255,41.575676],[-73.80723999999999,41.575541],[-73.80723399999999,41.575391],[-73.807231,41.575247],[-73.80724600000001,41.575066],[-73.807265,41.574873],[-73.807295,41.574689],[-73.807311,41.574542],[-73.80733499999999,41.574389],[-73.807372,41.574205],[-73.807412,41.573938],[-73.807452,41.573715],[-73.80747,41.573531],[-73.807479,41.57343],[-73.807468,41.573247],[-73.807461,41.573044],[-73.80741500000001,41.572836],[-73.8074,41.572785],[-73.807326,41.572534],[-73.807214,41.572274],[-73.807091,41.572081],[-73.80678,41.571627],[-73.806575,41.571324],[-73.80639499999999,41.571074],[-73.806217,41.570831],[-73.80595099999999,41.570546],[-73.805847,41.570451],[-73.805525,41.570194],[-73.805183,41.569989],[-73.804844,41.569832],[-73.804742,41.569794],[-73.80363,41.569379],[-73.80345199999999,41.569303],[-73.803023,41.569121],[-73.802879,41.569058],[-73.80251699999999,41.56887],[-73.801901,41.568512],[-73.80156100000001,41.568305],[-73.8013,41.568131],[-73.800956,41.567913],[-73.800839,41.56784],[-73.800543,41.567664],[-73.800039,41.567409],[-73.79957899999999,41.567211],[-73.798991,41.566938],[-73.79858,41.566711],[-73.79833600000001,41.566556],[-73.798075,41.566361],[-73.797764,41.566084],[-73.79767699999999,41.565999],[-73.79754699999999,41.565851],[-73.797476,41.565763],[-73.79740099999999,41.565671],[-73.79732799999999,41.565567],[-73.79724,41.565442],[-73.79715899999999,41.565307],[-73.797076,41.565143],[-73.796982,41.564945],[-73.796925,41.564805],[-73.796836,41.564456],[-73.79677599999999,41.564161],[-73.796778,41.564128],[-73.79674,41.56394],[-73.796706,41.563693],[-73.796678,41.563514],[-73.796644,41.563344],[-73.796618,41.563243],[-73.796584,41.563095],[-73.796542,41.56297],[-73.796498,41.562824],[-73.796443,41.562702],[-73.79636000000001,41.56254],[-73.796306,41.562444],[-73.796125,41.562175],[-73.79592599999999,41.561903],[-73.795725,41.561582],[-73.795613,41.561403],[-73.795501,41.561189],[-73.795421,41.560994],[-73.795356,41.560815],[-73.795288,41.560617],[-73.795199,41.560325],[-73.795067,41.559935],[-73.79503,41.559784],[-73.794978,41.559596],[-73.79493100000001,41.559414],[-73.79489700000001,41.559295],[-73.794866,41.559138],[-73.794827,41.558987],[-73.79480100000001,41.558862],[-73.794783,41.55873],[-73.794783,41.558553],[-73.79481699999999,41.55839],[-73.794872,41.558218],[-73.79506000000001,41.557915],[-73.795252,41.557644],[-73.795401,41.557405],[-73.795543,41.557108],[-73.795678,41.556787],[-73.79574,41.556588],[-73.795843,41.556096],[-73.795866,41.55595],[-73.795883,41.555832],[-73.79589300000001,41.555569],[-73.795907,41.555184],[-73.795906,41.555135],[-73.795908,41.555031],[-73.795912,41.5548],[-73.79591600000001,41.554598],[-73.79591600000001,41.554398],[-73.795906,41.554253],[-73.79585899999999,41.554022],[-73.795778,41.553715],[-73.795675,41.553439],[-73.796029,41.553308],[-73.79613000000001,41.553272],[-73.796451,41.553152],[-73.79679899999999,41.553025],[-73.79709099999999,41.552932],[-73.79736,41.552885],[-73.7976,41.552852],[-73.797882,41.552831],[-73.798075,41.552837],[-73.798224,41.552843],[-73.79834,41.552854],[-73.798462,41.55287],[-73.798573,41.55289],[-73.79868399999999,41.552914],[-73.79877500000001,41.552939],[-73.798886,41.55297],[-73.799002,41.553005],[-73.799156,41.553061],[-73.800269,41.553507],[-73.80057600000001,41.553637],[-73.80068,41.553677],[-73.800838,41.553743],[-73.800979,41.553807],[-73.80112800000001,41.553866],[-73.801348,41.553952],[-73.801563,41.554037],[-73.801784,41.554126],[-73.802004,41.554211],[-73.802153,41.554275],[-73.802283,41.554329],[-73.802425,41.554384],[-73.802549,41.554426],[-73.802674,41.554469],[-73.802781,41.554503],[-73.802904,41.554535],[-73.803038,41.554573],[-73.803213,41.55462],[-73.80337299999999,41.554652],[-73.80359199999999,41.554699],[-73.803769,41.554733],[-73.803939,41.554754],[-73.804118,41.554776],[-73.804305,41.554797],[-73.80460600000001,41.55482],[-73.804827,41.554823],[-73.80513999999999,41.554827],[-73.805387,41.55482],[-73.805666,41.554797],[-73.80588299999999,41.554778],[-73.80610900000001,41.554744],[-73.80630499999999,41.554716],[-73.806505,41.554678],[-73.80667099999999,41.554646],[-73.80686900000001,41.554597],[-73.807078,41.554537],[-73.807473,41.554414],[-73.807523,41.554399],[-73.807627,41.554358],[-73.807734,41.554318],[-73.807834,41.554277],[-73.807991,41.554211],[-73.808145,41.554137],[-73.808266,41.554079],[-73.808421,41.553996],[-73.80857,41.553913],[-73.808685,41.553843],[-73.808932,41.55368],[-73.809155,41.553527],[-73.809409,41.553329],[-73.809989,41.552902],[-73.810666,41.552364],[-73.811466,41.551678],[-73.81177099999999,41.551454],[-73.812941,41.5506],[-73.814674,41.549367],[-73.815242,41.548959],[-73.815523,41.548768],[-73.815969,41.548498],[-73.816507,41.548223],[-73.81769799999999,41.547699],[-73.818681,41.547289],[-73.81916699999999,41.547085],[-73.819653,41.546913],[-73.820588,41.546695],[-73.82127800000001,41.546609],[-73.821941,41.546531],[-73.822307,41.54649],[-73.82282600000001,41.546414],[-73.823245,41.54633],[-73.82379299999999,41.546197],[-73.825092,41.545813],[-73.826384,41.545413],[-73.82677099999999,41.545292],[-73.828593,41.544736],[-73.82862,41.545239],[-73.82860599999999,41.545491]]],"type":"Polygon"}
}