{
  "id": "360550129002",
  "type": "Feature",
  "properties": {
    "area_land":827626,
    "area_water":0,
    "geoid":"360550129002",
    "name":"Block Group 2",
    "state":"ny"
},
  "bbox": [
    -77.579604,
    43.115758,
    -77.561669,
    43.126452
],
  "geometry": {"coordinates":[[[-77.57960199999999,43.116112],[-77.579589,43.116203],[-77.57955699999999,43.116299],[-77.579471,43.116464],[-77.57887700000001,43.117535],[-77.57878599999999,43.117718],[-77.578754,43.117799],[-77.578738,43.117888],[-77.57873600000001,43.118014],[-77.578711,43.118134],[-77.578675,43.118223],[-77.57843099999999,43.118665],[-77.57837600000001,43.118785],[-77.578355,43.118874],[-77.578354,43.11896],[-77.57836399999999,43.11905],[-77.57848799999999,43.119626],[-77.578502,43.11973],[-77.578504,43.119819],[-77.578495,43.119903],[-77.57847,43.120022],[-77.578446,43.120103],[-77.578407,43.120187],[-77.578352,43.120251],[-77.57828600000001,43.1203],[-77.578214,43.120336],[-77.57813299999999,43.120357],[-77.57805999999999,43.120368],[-77.57781300000001,43.120378],[-77.575875,43.120431],[-77.574313,43.120477],[-77.574264,43.119509],[-77.57023,43.119631],[-77.57011900000001,43.11963],[-77.569979,43.119618],[-77.569828,43.119595],[-77.569684,43.119561],[-77.56948800000001,43.119499],[-77.56886900000001,43.12064],[-77.56805300000001,43.122145],[-77.566776,43.124501],[-77.566613,43.124802],[-77.565712,43.126398],[-77.56463100000001,43.126452],[-77.563192,43.125178],[-77.562783,43.124816],[-77.561727,43.123863],[-77.56166899999999,43.12381],[-77.56319499999999,43.121891],[-77.563298,43.121754],[-77.563334,43.121677],[-77.563348,43.121582],[-77.563301,43.120874],[-77.563247,43.119774],[-77.563187,43.118633],[-77.563113,43.117498],[-77.563042,43.116235],[-77.564993,43.116165],[-77.566363,43.116125],[-77.56748899999999,43.116095],[-77.568618,43.116058],[-77.57137400000001,43.115957],[-77.574868,43.115886],[-77.579578,43.115758],[-77.579604,43.116024],[-77.57960199999999,43.116112]]],"type":"Polygon"}
}