{
  "id": "360610018007",
  "type": "Feature",
  "properties": {
    "area_land":17675,
    "area_water":0,
    "geoid":"360610018007",
    "name":"Block Group 7",
    "state":"ny"
},
  "bbox": [
    -73.992621,
    40.718348,
    -73.990436,
    40.719832
],
  "geometry": {"coordinates":[[[-73.992195,40.719679],[-73.992118,40.719832],[-73.991243,40.719562],[-73.990436,40.719318],[-73.990529,40.71916],[-73.99097399999999,40.718348],[-73.991747,40.718583],[-73.992621,40.718851],[-73.992195,40.719679]]],"type":"Polygon"}
}