{
  "id": "360670018001",
  "type": "Feature",
  "properties": {
    "area_land":175029,
    "area_water":0,
    "geoid":"360670018001",
    "name":"Block Group 1",
    "state":"ny"
},
  "bbox": [
    -76.114104,
    43.065995,
    -76.106129,
    43.068841
],
  "geometry": {"coordinates":[[[-76.114104,43.068474],[-76.113394,43.068508],[-76.112729,43.06854],[-76.11201,43.068575],[-76.111403,43.068603],[-76.11127999999999,43.068609],[-76.110516,43.068641],[-76.110057,43.068666],[-76.108825,43.068728],[-76.10845500000001,43.068741],[-76.107462,43.068786],[-76.10666399999999,43.068825],[-76.10637699999999,43.068841],[-76.10636,43.0688],[-76.106223,43.067502],[-76.106129,43.066369],[-76.107364,43.066298],[-76.10858399999999,43.066231],[-76.109842,43.066182],[-76.111074,43.066125],[-76.111197,43.066119],[-76.11251,43.066055],[-76.113883,43.065995],[-76.114104,43.068474]]],"type":"Polygon"}
}