{
  "id": "360510311002",
  "type": "Feature",
  "properties": {
    "area_land":35329840,
    "area_water":2037125,
    "geoid":"360510311002",
    "name":"Block Group 2",
    "state":"ny"
},
  "bbox": [
    -77.718062,
    42.67227,
    -77.649709,
    42.763662
],
  "geometry": {"coordinates":[[[-77.718028,42.67397],[-77.71792600000001,42.678397],[-77.71789200000001,42.679874],[-77.71788599999999,42.679991],[-77.71787,42.680342],[-77.717866,42.68046],[-77.717855,42.68085],[-77.71782399999999,42.682023],[-77.717814,42.682414],[-77.717725,42.685828],[-77.717457,42.696071],[-77.71736900000001,42.699486],[-77.717501,42.707096],[-77.717451,42.708551],[-77.717375,42.710503],[-77.717416,42.713639],[-77.717382,42.715234],[-77.717339,42.720875],[-77.717339,42.722221],[-77.71734499999999,42.722927],[-77.71735200000001,42.723639],[-77.717082,42.723587],[-77.717005,42.723545],[-77.716915,42.723466],[-77.716818,42.723312],[-77.716717,42.7286],[-77.716606,42.751969],[-77.716437,42.763623],[-77.715389,42.763614],[-77.713544,42.763599],[-77.713082,42.763602],[-77.71231400000001,42.763608],[-77.71225200000001,42.76361],[-77.71206599999999,42.763617],[-77.712005,42.76362],[-77.710812,42.763629],[-77.710555,42.76363],[-77.70829000000001,42.763647],[-77.708125,42.763648],[-77.70648,42.763662],[-77.706205,42.763655],[-77.704756,42.763624],[-77.70470899999999,42.76362],[-77.703447,42.763623],[-77.703368,42.763624],[-77.702291,42.763592],[-77.701624,42.763598],[-77.699523,42.763588],[-77.698525,42.763584],[-77.698215,42.763585],[-77.69764499999999,42.763587],[-77.695936,42.763592],[-77.695367,42.763595],[-77.69359900000001,42.763583],[-77.693545,42.763583],[-77.692475,42.763549],[-77.69143699999999,42.763554],[-77.690378,42.763546],[-77.69033399999999,42.763546],[-77.688298,42.763545],[-77.68695,42.763545],[-77.686531,42.763554],[-77.684479,42.763555],[-77.68194800000001,42.763557],[-77.67850799999999,42.763595],[-77.678324,42.763594],[-77.67627299999999,42.763587],[-77.67523199999999,42.763592],[-77.67210900000001,42.763607],[-77.671069,42.763613],[-77.668888,42.763629],[-77.668453,42.763626],[-77.66456700000001,42.763604],[-77.660605,42.763603],[-77.660304,42.763603],[-77.65799,42.763585],[-77.656333,42.763578],[-77.655337,42.763575],[-77.651365,42.763524],[-77.649709,42.763504],[-77.649855,42.763167],[-77.650012,42.762808],[-77.65021299999999,42.762405],[-77.65035,42.762188],[-77.650363,42.762168],[-77.65047300000001,42.762022],[-77.65058000000001,42.761903],[-77.650592,42.761889],[-77.650858,42.76162],[-77.650964,42.761514],[-77.65172200000001,42.7608],[-77.652012,42.760528],[-77.652503,42.760108],[-77.65334900000001,42.759389],[-77.65398399999999,42.758856],[-77.65448000000001,42.758442],[-77.654619,42.758325],[-77.655036,42.757975],[-77.655176,42.757859],[-77.655254,42.757793],[-77.655489,42.757596],[-77.655568,42.757531],[-77.656227,42.756988],[-77.65650599999999,42.756739],[-77.65736099999999,42.755968],[-77.660297,42.753325],[-77.66063200000001,42.752981],[-77.661973,42.751398],[-77.662372,42.750907],[-77.66269800000001,42.750508],[-77.663179,42.749935],[-77.663605,42.749403],[-77.663751,42.749175],[-77.663808,42.749022],[-77.663884,42.748555],[-77.66390699999999,42.74826],[-77.663923,42.74787],[-77.663911,42.747649],[-77.66384499999999,42.746357],[-77.663865,42.74587],[-77.663932,42.745478],[-77.664019,42.745118],[-77.664081,42.744952],[-77.66423500000001,42.744633],[-77.664489,42.744223],[-77.664783,42.74381],[-77.66482499999999,42.743752],[-77.665645,42.742641],[-77.66602,42.742114],[-77.666656,42.741223],[-77.66716700000001,42.740548],[-77.66719399999999,42.740514],[-77.6675,42.740057],[-77.667528,42.740011],[-77.667551,42.739975],[-77.667575,42.739937],[-77.667591,42.739911],[-77.66776,42.739627],[-77.6678,42.739561],[-77.66814599999999,42.738851],[-77.668302,42.738494],[-77.66833099999999,42.73841],[-77.668481,42.737988],[-77.66856799999999,42.737726],[-77.668598,42.73764],[-77.668662,42.73739],[-77.668762,42.736921],[-77.66882099999999,42.736652],[-77.66904599999999,42.735591],[-77.669253,42.734901],[-77.669301,42.734746],[-77.67019999999999,42.732296],[-77.670372,42.731861],[-77.670489,42.731626],[-77.670681,42.731244],[-77.671395,42.729945],[-77.67145600000001,42.729836],[-77.671837,42.729183],[-77.672151,42.728648],[-77.672321,42.728397],[-77.672417,42.728213],[-77.672585,42.727811],[-77.672612,42.727749],[-77.672804,42.727149],[-77.672871,42.727],[-77.673361,42.726114],[-77.673389,42.726066],[-77.673715,42.725512],[-77.67379099999999,42.725381],[-77.67398799999999,42.725047],[-77.674024,42.724991],[-77.674108,42.724865],[-77.674235,42.72467],[-77.674616,42.724089],[-77.674744,42.723895],[-77.674961,42.723546],[-77.67505800000001,42.723343],[-77.675179,42.722981],[-77.675445,42.721996],[-77.67547,42.721905],[-77.675512,42.721747],[-77.67557600000001,42.721512],[-77.675639,42.721276],[-77.67568199999999,42.72112],[-77.675718,42.720989],[-77.675721,42.720977],[-77.675738,42.720915],[-77.675817,42.720546],[-77.675849,42.720402],[-77.6759,42.720074],[-77.67594800000001,42.719769],[-77.676034,42.719088],[-77.67605,42.718968],[-77.676067,42.718758],[-77.676061,42.71846],[-77.67603099999999,42.718282],[-77.675985,42.718095],[-77.675939,42.717908],[-77.675596,42.716945],[-77.675583,42.716906],[-77.675527,42.716747],[-77.675364,42.716287],[-77.675331,42.716192],[-77.675167,42.715727],[-77.675121,42.715556],[-77.67512000000001,42.71532],[-77.675117,42.714613],[-77.675116,42.714378],[-77.675062,42.712314],[-77.675066,42.712053],[-77.675072,42.711958],[-77.675094,42.711674],[-77.675141,42.711293],[-77.675543,42.708477],[-77.67585699999999,42.705833],[-77.675968,42.705016],[-77.676024,42.704762],[-77.676129,42.704292],[-77.676265,42.703548],[-77.676402,42.702374],[-77.676424,42.702171],[-77.676492,42.701564],[-77.67651499999999,42.701362],[-77.676586,42.700799],[-77.676654,42.700445],[-77.676852,42.69943],[-77.676913,42.698827],[-77.67690399999999,42.697685],[-77.676897,42.696758],[-77.67688800000001,42.696249],[-77.67688800000001,42.696228],[-77.676895,42.694722],[-77.67689799999999,42.694213],[-77.676901,42.69402],[-77.676912,42.693442],[-77.67691600000001,42.69325],[-77.67693300000001,42.692762],[-77.676958,42.692529],[-77.677032,42.692162],[-77.67712899999999,42.691821],[-77.677621,42.690613],[-77.67789,42.689942],[-77.67800200000001,42.689666],[-77.678679,42.687924],[-77.67894200000001,42.687251],[-77.679373,42.686154],[-77.679503,42.68584],[-77.679672,42.685437],[-77.679757,42.685274],[-77.68013999999999,42.684711],[-77.68029,42.684534],[-77.681478,42.683185],[-77.68186900000001,42.682676],[-77.68219499999999,42.682193],[-77.68226199999999,42.682096],[-77.682632,42.681454],[-77.68292,42.680861],[-77.682973,42.680748],[-77.68313499999999,42.680413],[-77.683189,42.680301],[-77.68353500000001,42.679596],[-77.683606,42.679454],[-77.68422200000001,42.678378],[-77.68434499999999,42.678122],[-77.684489,42.677727],[-77.68454199999999,42.67748],[-77.684709,42.676713],[-77.68487500000001,42.675918],[-77.684892,42.675828],[-77.685361,42.673484],[-77.68539800000001,42.673167],[-77.68550399999999,42.67227],[-77.68675399999999,42.672293],[-77.68741300000001,42.672306],[-77.689599,42.672305],[-77.69050799999999,42.672311],[-77.691318,42.672318],[-77.691759,42.672329],[-77.692881,42.672337],[-77.694382,42.67235],[-77.696101,42.672335],[-77.696247,42.672336],[-77.696957,42.672343],[-77.69736899999999,42.672357],[-77.697621,42.672358],[-77.69796700000001,42.67236],[-77.698024,42.672357],[-77.69895099999999,42.672355],[-77.701227,42.672353],[-77.70182200000001,42.672356],[-77.702151,42.672358],[-77.702468,42.672361],[-77.703048,42.672356],[-77.70437200000001,42.67237],[-77.70834499999999,42.672413],[-77.70967,42.672428],[-77.71044000000001,42.672436],[-77.71275,42.672462],[-77.713521,42.672471],[-77.71376600000001,42.672473],[-77.71450400000001,42.672482],[-77.71475,42.672485],[-77.715412,42.672486],[-77.717399,42.672492],[-77.718062,42.672494],[-77.718028,42.67397]]],"type":"Polygon"}
}