{
  "id": "360610010010",
  "type": "Feature",
  "properties": {
    "area_land":0,
    "area_water":244297,
    "geoid":"360610010010",
    "name":"Block Group 0",
    "state":"ny"
},
  "bbox": [
    -73.975933,
    40.707332,
    -73.968861,
    40.714582
],
  "geometry": {"coordinates":[[[-73.97534,40.714313],[-73.97530500000001,40.714396],[-73.975298,40.714412],[-73.975286,40.714442],[-73.975233,40.714568],[-73.975227,40.714582],[-73.968861,40.71265],[-73.968895,40.71262],[-73.96894500000001,40.712575],[-73.968993,40.712533],[-73.969021,40.712508],[-73.96905,40.712482],[-73.969072,40.712385],[-73.969128,40.712144],[-73.969612,40.71016],[-73.96994100000001,40.70931],[-73.969888,40.70877],[-73.96984500000001,40.707988],[-73.969613,40.707634],[-73.970141,40.707407],[-73.970236,40.707367],[-73.97031800000001,40.707332],[-73.970573,40.707555],[-73.972309,40.709071],[-73.97278900000001,40.709378],[-73.975933,40.712907],[-73.97534,40.714313]]],"type":"Polygon"}
}