{
  "id": "360811247003",
  "type": "Feature",
  "properties": {
    "area_land":167658,
    "area_water":0,
    "geoid":"360811247003",
    "name":"Block Group 3",
    "state":"ny"
},
  "bbox": [
    -73.800015,
    40.723235,
    -73.791745,
    40.727141
],
  "geometry": {"coordinates":[[[-73.800015,40.726287],[-73.79912299999999,40.726385],[-73.798231,40.726483],[-73.79734000000001,40.726582],[-73.796447,40.726681],[-73.795519,40.726783],[-73.79459,40.726886],[-73.793662,40.726989],[-73.7923,40.727141],[-73.792045,40.726551],[-73.79174500000001,40.725776],[-73.793335,40.725284],[-73.794224,40.724982],[-73.79511599999999,40.724676],[-73.795883,40.724415],[-73.796752,40.724117],[-73.79760899999999,40.723825],[-73.798472,40.72353],[-73.79933200000001,40.723235],[-73.799716,40.724717],[-73.800015,40.726287]]],"type":"Polygon"}
}