{
  "id": "360470340002",
  "type": "Feature",
  "properties": {
    "area_land":47648,
    "area_water":0,
    "geoid":"360470340002",
    "name":"Block Group 2",
    "state":"ny"
},
  "bbox": [
    -73.994904,
    40.57152,
    -73.991387,
    40.57343
],
  "geometry": {"coordinates":[[[-73.99490400000001,40.572873],[-73.99382799999999,40.573013],[-73.992773,40.573198],[-73.991743,40.57343],[-73.991387,40.571656],[-73.992475,40.571561],[-73.993577,40.571617],[-73.994726,40.57152],[-73.99490400000001,40.572873]]],"type":"Polygon"}
}