{
  "id": "360050052001",
  "type": "Feature",
  "properties": {
    "area_land":158791,
    "area_water":0,
    "geoid":"360050052001",
    "name":"Block Group 1",
    "state":"ny"
},
  "bbox": [
    -73.884568,
    40.82297,
    -73.87993,
    40.828356
],
  "geometry": {"coordinates":[[[-73.884531,40.825647],[-73.883832,40.828271],[-73.88295100000001,40.828304],[-73.881981,40.828356],[-73.88135200000001,40.825656],[-73.880427,40.82578],[-73.87993,40.823641],[-73.881787,40.823402],[-73.882577,40.823277],[-73.882761,40.823248],[-73.884411,40.82297],[-73.884568,40.824928],[-73.884531,40.825647]]],"type":"Polygon"}
}