{
  "id": "360470868002",
  "type": "Feature",
  "properties": {
    "area_land":56732,
    "area_water":0,
    "geoid":"360470868002",
    "name":"Block Group 2",
    "state":"ny"
},
  "bbox": [
    -73.931772,
    40.653742,
    -73.927694,
    40.655516
],
  "geometry": {"coordinates":[[[-73.931772,40.655273],[-73.930768,40.655336],[-73.929762,40.655398],[-73.928827,40.655456],[-73.92785600000001,40.655516],[-73.927694,40.653985],[-73.928662,40.653923],[-73.92959399999999,40.653862],[-73.930604,40.653805],[-73.931608,40.653742],[-73.931772,40.655273]]],"type":"Polygon"}
}