{
  "id": "360450605001",
  "type": "Feature",
  "properties": {
    "area_land":132210347,
    "area_water":5186658,
    "geoid":"360450605001",
    "name":"Block Group 1",
    "state":"ny"
},
  "bbox": [
    -76.065673,
    44.000972,
    -75.877695,
    44.198836
],
  "geometry": {"coordinates":[[[-76.065673,44.138531],[-76.06545,44.138541],[-76.063804,44.138487],[-76.06329599999999,44.138472],[-76.061289,44.138417],[-76.058965,44.138337],[-76.05671100000001,44.138242],[-76.05586,44.138218],[-76.053471,44.138194],[-76.050279,44.138222],[-76.049892,44.138248],[-76.049671,44.138298],[-76.049058,44.138486],[-76.043981,44.140256],[-76.042742,44.140669],[-76.04167700000001,44.14105],[-76.038751,44.142047],[-76.038031,44.142295],[-76.033562,44.143738],[-76.032926,44.143942],[-76.031205,44.144528],[-76.02849000000001,44.145471],[-76.027215,44.145898],[-76.02430200000001,44.146873],[-76.02318699999999,44.147261],[-76.018783,44.148751],[-76.017658,44.149163],[-76.01689399999999,44.149424],[-76.01500299999999,44.150114],[-76.01089399999999,44.151588],[-76.01003799999999,44.151903],[-76.00984800000001,44.151963],[-76.00936799999999,44.152109],[-76.00880600000001,44.152257],[-76.00742700000001,44.152571],[-76.006733,44.152721],[-76.006012,44.152884],[-76.004865,44.15312],[-76.00433700000001,44.153194],[-76.003428,44.153256],[-76.002973,44.153261],[-76.002476,44.153284],[-76.00165200000001,44.153302],[-76.00088100000001,44.153354],[-76.000137,44.153385],[-75.999653,44.153386],[-75.999296,44.153395],[-75.999167,44.153398],[-75.999334,44.15521],[-75.999351,44.155293],[-75.999106,44.156271],[-75.99822899999999,44.156692],[-75.997015,44.15733],[-75.995638,44.157743],[-75.99532600000001,44.157831],[-75.994938,44.158017],[-75.99449199999999,44.158151],[-75.994157,44.158213],[-75.99379,44.158245],[-75.989992,44.158447],[-75.98727,44.158585],[-75.985754,44.158656],[-75.985564,44.158678],[-75.985384,44.158717],[-75.98526200000001,44.158771],[-75.985191,44.158813],[-75.98423099999999,44.159497],[-75.980034,44.16239],[-75.976854,44.164536],[-75.976406,44.164812],[-75.976224,44.164914],[-75.976112,44.164966],[-75.975601,44.165181],[-75.975638,44.165303],[-75.97565899999999,44.165433],[-75.97569,44.165921],[-75.97564,44.168489],[-75.975537,44.173009],[-75.97542199999999,44.17534],[-75.97539399999999,44.177432],[-75.975399,44.177891],[-75.97537699999999,44.178352],[-75.975317,44.178611],[-75.975227,44.178857],[-75.974822,44.17958],[-75.97265400000001,44.183269],[-75.972053,44.18429],[-75.971795,44.184725],[-75.970851,44.18632],[-75.97063199999999,44.186691],[-75.970153,44.1875],[-75.968619,44.19014],[-75.967426,44.192146],[-75.967415,44.192166],[-75.967169,44.192611],[-75.966792,44.193242],[-75.966774,44.193272],[-75.966706,44.193387],[-75.966021,44.194548],[-75.965738,44.195022],[-75.965401,44.195574],[-75.964977,44.196261],[-75.964888,44.196361],[-75.964753,44.196465],[-75.964641,44.196519],[-75.964394,44.196566],[-75.960756,44.196934],[-75.959891,44.19702],[-75.959709,44.197039],[-75.95962299999999,44.197048],[-75.95907699999999,44.197103],[-75.952778,44.197773],[-75.952048,44.197852],[-75.95168,44.197894],[-75.945076,44.198602],[-75.943134,44.198783],[-75.942539,44.198822],[-75.941768,44.198836],[-75.940485,44.198813],[-75.94030100000001,44.198802],[-75.939483,44.198745],[-75.93870800000001,44.198669],[-75.936762,44.198454],[-75.935551,44.198324],[-75.935485,44.198317],[-75.930172,44.197735],[-75.92935799999999,44.197616],[-75.928471,44.197449],[-75.927553,44.197254],[-75.926508,44.196999],[-75.925094,44.196576],[-75.923923,44.196188],[-75.92035199999999,44.195015],[-75.91857899999999,44.194397],[-75.914203,44.1929],[-75.912942,44.192469],[-75.912143,44.192214],[-75.911237,44.191962],[-75.910673,44.191829],[-75.90992199999999,44.191661],[-75.906143,44.190877],[-75.90523,44.190714],[-75.90443399999999,44.190615],[-75.903806,44.190559],[-75.90309000000001,44.190514],[-75.902205,44.190502],[-75.900924,44.190541],[-75.89946999999999,44.190663],[-75.89679700000001,44.190917],[-75.890317,44.191518],[-75.889458,44.191583],[-75.88854000000001,44.191643],[-75.887618,44.191686],[-75.88667100000001,44.191718],[-75.885587,44.191743],[-75.884005,44.191782],[-75.883957,44.191783],[-75.881333,44.191861],[-75.881288,44.191862],[-75.880517,44.191879],[-75.88047299999999,44.19188],[-75.880239,44.191885],[-75.879835,44.191893],[-75.87953899999999,44.191898],[-75.87923000000001,44.191907],[-75.879205,44.191648],[-75.879009,44.188165],[-75.87898800000001,44.18779],[-75.87886,44.185737],[-75.878658,44.183788],[-75.87843100000001,44.181593],[-75.87822199999999,44.179577],[-75.87811000000001,44.1785],[-75.878045,44.178154],[-75.87799800000001,44.177607],[-75.87796400000001,44.177209],[-75.877893,44.176393],[-75.87786199999999,44.17603],[-75.87784499999999,44.175831],[-75.877788,44.174701],[-75.87774899999999,44.173929],[-75.87771100000001,44.173194],[-75.877709,44.172789],[-75.8777,44.170833],[-75.877698,44.169587],[-75.877695,44.168117],[-75.877695,44.16777],[-75.877745,44.167744],[-75.877792,44.167693],[-75.877865,44.167645],[-75.87792,44.167627],[-75.877995,44.167625],[-75.878086,44.167625],[-75.8784,44.169805],[-75.878457,44.170201],[-75.878681,44.168837],[-75.878412,44.16764],[-75.87845,44.166178],[-75.87845299999999,44.165428],[-75.878449,44.161437],[-75.878457,44.160674],[-75.87848200000001,44.16019],[-75.878545,44.159743],[-75.87857099999999,44.159605],[-75.878606,44.159413],[-75.87871199999999,44.158949],[-75.878874,44.158451],[-75.878991,44.158122],[-75.879216,44.157593],[-75.87939299999999,44.157228],[-75.87961300000001,44.156844],[-75.87991599999999,44.156374],[-75.880411,44.155688],[-75.88248400000001,44.153109],[-75.882927,44.152547],[-75.883308,44.152088],[-75.88375000000001,44.151488],[-75.88413799999999,44.150872],[-75.884434,44.150272],[-75.88463400000001,44.149802],[-75.88477,44.149414],[-75.884917,44.148775],[-75.884992,44.148248],[-75.88501100000001,44.148018],[-75.885036,44.14732],[-75.885009,44.146889],[-75.88495399999999,44.146452],[-75.884866,44.145974],[-75.884767,44.145595],[-75.884697,44.145387],[-75.884558,44.144976],[-75.884404,44.144625],[-75.883961,44.143758],[-75.883938,44.143722],[-75.88388399999999,44.14362],[-75.883081,44.142084],[-75.882322,44.140606],[-75.88205600000001,44.139968],[-75.881935,44.139585],[-75.88185199999999,44.139269],[-75.88177399999999,44.138853],[-75.881716,44.138508],[-75.88163400000001,44.13735],[-75.881624,44.137151],[-75.881637,44.136716],[-75.881556,44.134463],[-75.881511,44.131638],[-75.88146,44.129948],[-75.881468,44.129358],[-75.88149799999999,44.128772],[-75.881604,44.127781],[-75.88171199999999,44.127139],[-75.881845,44.126551],[-75.882013,44.125944],[-75.88240999999999,44.124793],[-75.88245999999999,44.124679],[-75.882666,44.124198],[-75.88275899999999,44.123987],[-75.882924,44.123619],[-75.883087,44.123293],[-75.88362600000001,44.122311],[-75.883927,44.121833],[-75.88458,44.120885],[-75.88494300000001,44.120411],[-75.885329,44.119937],[-75.885734,44.119467],[-75.886625,44.118526],[-75.88705,44.11812],[-75.887618,44.117618],[-75.88920400000001,44.116231],[-75.89037399999999,44.115208],[-75.891508,44.114244],[-75.892036,44.113763],[-75.89370599999999,44.112325],[-75.894447,44.111631],[-75.895172,44.110911],[-75.8954,44.110667],[-75.895785,44.110224],[-75.897644,44.107912],[-75.898633,44.106667],[-75.899027,44.106197],[-75.899451,44.105727],[-75.9004,44.104779],[-75.900909,44.104301],[-75.901465,44.103827],[-75.902055,44.103357],[-75.90271199999999,44.102862],[-75.903008,44.102647],[-75.90403000000001,44.101965],[-75.906874,44.100142],[-75.9083,44.099217],[-75.90892100000001,44.098759],[-75.909284,44.098484],[-75.910082,44.097807],[-75.910591,44.097336],[-75.91104199999999,44.09687],[-75.91145899999999,44.096396],[-75.91186,44.095907],[-75.912227,44.095417],[-75.912691,44.094715],[-75.9131,44.093995],[-75.913332,44.093521],[-75.91362599999999,44.092842],[-75.91389599999999,44.092092],[-75.914029,44.091609],[-75.91418299999999,44.090948],[-75.914243,44.090657],[-75.91438100000001,44.089525],[-75.914457,44.08883],[-75.914546,44.08801],[-75.914627,44.087181],[-75.914884,44.084558],[-75.915042,44.083349],[-75.91519700000001,44.082384],[-75.915392,44.081402],[-75.915496,44.080911],[-75.915724,44.079968],[-75.9158,44.079694],[-75.91630499999999,44.077999],[-75.916785,44.076499],[-75.917231,44.075069],[-75.91730800000001,44.074818],[-75.917556,44.074013],[-75.917794,44.073242],[-75.91838,44.071341],[-75.919089,44.068974],[-75.920096,44.065687],[-75.920142,44.065524],[-75.92026,44.065044],[-75.92047700000001,44.063923],[-75.920585,44.062862],[-75.92061200000001,44.062252],[-75.92062,44.061913],[-75.92059999999999,44.061336],[-75.920523,44.060435],[-75.92045299999999,44.059901],[-75.920219,44.058759],[-75.919951,44.057822],[-75.919741,44.057201],[-75.919534,44.056695],[-75.91896800000001,44.05544],[-75.918739,44.054932],[-75.91862500000001,44.054705],[-75.918195,44.053764],[-75.91797800000001,44.05329],[-75.917706,44.052726],[-75.91709,44.051377],[-75.915408,44.047742],[-75.91532599999999,44.047565],[-75.915189,44.047268],[-75.914867,44.046548],[-75.914525,44.04565],[-75.914365,44.0452],[-75.914343,44.045119],[-75.914309,44.044994],[-75.914158,44.04444],[-75.91401399999999,44.043847],[-75.913934,44.043439],[-75.91386900000001,44.043099],[-75.91383,44.042896],[-75.913782,44.042549],[-75.913708,44.041979],[-75.91365399999999,44.041259],[-75.91362599999999,44.04065],[-75.913631,44.039945],[-75.91364299999999,44.039715],[-75.913667,44.039259],[-75.913701,44.038869],[-75.913815,44.038134],[-75.913934,44.037507],[-75.914135,44.036702],[-75.914141,44.03668],[-75.914389,44.035744],[-75.914524,44.035233],[-75.91453,44.035209],[-75.914743,44.034318],[-75.914986,44.033303],[-75.91515800000001,44.03258],[-75.915783,44.03024],[-75.916157,44.028725],[-75.916279,44.02809],[-75.91641199999999,44.027075],[-75.91645200000001,44.026545],[-75.91646900000001,44.026015],[-75.916467,44.02556],[-75.91641199999999,44.024582],[-75.916303,44.023701],[-75.916264,44.023462],[-75.916236,44.023287],[-75.91607500000001,44.022539],[-75.915853,44.021704],[-75.915646,44.021088],[-75.915519,44.020735],[-75.91534900000001,44.020311],[-75.913893,44.017013],[-75.912412,44.013572],[-75.912373,44.013486],[-75.91164499999999,44.011836],[-75.911417,44.01127],[-75.911266,44.010846],[-75.911151,44.010429],[-75.911028,44.009774],[-75.91098700000001,44.009247],[-75.910983,44.00894],[-75.91100400000001,44.008502],[-75.911061,44.008043],[-75.91113199999999,44.007699],[-75.91121200000001,44.00738],[-75.91129599999999,44.007112],[-75.911469,44.006658],[-75.911652,44.006247],[-75.91187600000001,44.005836],[-75.912059,44.005539],[-75.912398,44.005057],[-75.91270900000001,44.004673],[-75.91307999999999,44.004272],[-75.913498,44.003869],[-75.91376700000001,44.003639],[-75.914188,44.003302],[-75.91453,44.003059],[-75.914895,44.002821],[-75.91525,44.002603],[-75.915628,44.002393],[-75.91629500000001,44.002063],[-75.916687,44.001889],[-75.917452,44.001605],[-75.91808,44.001405],[-75.918719,44.001223],[-75.919498,44.001021],[-75.919686,44.000972],[-75.91971700000001,44.001022],[-75.919786,44.00113],[-75.919933,44.001387],[-75.920045,44.001593],[-75.920157,44.001785],[-75.921397,44.003906],[-75.921526,44.004207],[-75.92173,44.004562],[-75.92190100000001,44.00486],[-75.92287899999999,44.006503],[-75.92347100000001,44.007502],[-75.923649,44.007817],[-75.924053,44.008528],[-75.92439,44.009207],[-75.924547,44.009564],[-75.92624000000001,44.013513],[-75.92628000000001,44.013568],[-75.926314,44.013645],[-75.92689900000001,44.01498],[-75.927254,44.015718],[-75.928515,44.017882],[-75.929821,44.020153],[-75.92985400000001,44.020211],[-75.930322,44.021024],[-75.930336,44.021048],[-75.930922,44.022031],[-75.931423,44.022832],[-75.932762,44.024974],[-75.933498,44.026115],[-75.934343,44.027431],[-75.934657,44.027974],[-75.935058,44.028741],[-75.935457,44.029529],[-75.936255,44.031127],[-75.93656799999999,44.031666],[-75.937252,44.032769],[-75.93777300000001,44.03367],[-75.938123,44.034321],[-75.940473,44.039052],[-75.940534,44.039157],[-75.940957,44.040037],[-75.942412,44.042953],[-75.94284500000001,44.043826],[-75.943865,44.045902],[-75.944102,44.046344],[-75.944354,44.046754],[-75.945359,44.048178],[-75.945745,44.048697],[-75.946341,44.049573],[-75.948007,44.052292],[-75.948865,44.053713],[-75.9496,44.054906],[-75.950068,44.055676],[-75.95029599999999,44.056053],[-75.95049299999999,44.056375],[-75.95088699999999,44.057021],[-75.952321,44.059355],[-75.95241,44.059489],[-75.95245300000001,44.059556],[-75.95265499999999,44.059905],[-75.95273899999999,44.060049],[-75.952843,44.060294],[-75.952943,44.060616],[-75.95305999999999,44.061201],[-75.953107,44.061463],[-75.953377,44.062839],[-75.953469,44.063235],[-75.953603,44.063639],[-75.953676,44.063805],[-75.953857,44.064105],[-75.953997,44.064293],[-75.954308,44.064649],[-75.95466399999999,44.064986],[-75.95558200000001,44.065846],[-75.95888600000001,44.068956],[-75.96081100000001,44.070754],[-75.96393399999999,44.073676],[-75.96417099999999,44.073874],[-75.964679,44.074245],[-75.96487999999999,44.074377],[-75.965485,44.074721],[-75.966894,44.075417],[-75.968109,44.076032],[-75.96844299999999,44.07622],[-75.968943,44.076518],[-75.969504,44.07689],[-75.969914,44.07719],[-75.97030700000001,44.077495],[-75.970815,44.077931],[-75.971076,44.078184],[-75.971543,44.078674],[-75.971964,44.079165],[-75.972285,44.079593],[-75.972651,44.080131],[-75.974452,44.08305],[-75.97515199999999,44.084139],[-75.97534,44.084378],[-75.97537,44.084411],[-75.975443,44.084493],[-75.97582,44.084845],[-75.976219,44.085142],[-75.97653,44.085335],[-75.976743,44.085451],[-75.977211,44.085661],[-75.97763399999999,44.085815],[-75.977842,44.085878],[-75.978194,44.085966],[-75.97862600000001,44.086053],[-75.978945,44.086128],[-75.98044,44.086428],[-75.981246,44.086621],[-75.981567,44.086726],[-75.98189000000001,44.086849],[-75.982221,44.086998],[-75.982438,44.087107],[-75.982865,44.087357],[-75.984353,44.088304],[-75.98576799999999,44.089213],[-75.988636,44.091036],[-75.990076,44.091963],[-75.990135,44.092],[-75.990104,44.092003],[-75.99021399999999,44.092833],[-75.990447,44.092826],[-75.991308,44.092764],[-75.991342,44.092761],[-75.9914,44.092798],[-75.99490900000001,44.095041],[-75.995733,44.095587],[-75.99744699999999,44.096704],[-75.99799299999999,44.097031],[-75.998025,44.097048],[-75.998249,44.097164],[-75.998632,44.097345],[-76.000597,44.098185],[-76.010284,44.102262],[-76.011241,44.102667],[-76.011289,44.102687],[-76.011696,44.102861],[-76.011965,44.103],[-76.012455,44.103282],[-76.01270700000001,44.103449],[-76.016423,44.105756],[-76.02072099999999,44.108465],[-76.026179,44.111887],[-76.02798900000001,44.113021],[-76.028823,44.113554],[-76.02938399999999,44.113931],[-76.03017199999999,44.114443],[-76.03360499999999,44.116719],[-76.037813,44.119543],[-76.038512,44.120007],[-76.039883,44.120903],[-76.040665,44.121398],[-76.04169,44.122062],[-76.04491400000001,44.124131],[-76.04530200000001,44.124374],[-76.049065,44.126819],[-76.050982,44.128066],[-76.051773,44.128581],[-76.052498,44.129058],[-76.055233,44.130856],[-76.055567,44.131084],[-76.055992,44.131361],[-76.05899700000001,44.133328],[-76.059363,44.133562],[-76.06064499999999,44.134406],[-76.061303,44.13488],[-76.06178300000001,44.135246],[-76.063869,44.137001],[-76.06393,44.137052],[-76.06414100000001,44.13723],[-76.064606,44.137621],[-76.065551,44.138407],[-76.065673,44.138531]]],"type":"Polygon"}
}