{
  "id": "360470818003",
  "type": "Feature",
  "properties": {
    "area_land":34153,
    "area_water":0,
    "geoid":"360470818003",
    "name":"Block Group 3",
    "state":"ny"
},
  "bbox": [
    -73.949769,
    40.650807,
    -73.946776,
    40.652796
],
  "geometry": {"coordinates":[[[-73.949769,40.652642],[-73.948256,40.652722],[-73.946873,40.652796],[-73.946776,40.651854],[-73.94727,40.651825],[-73.947743,40.651798],[-73.948674,40.651749],[-73.94859099999999,40.650855],[-73.94957100000001,40.650807],[-73.949669,40.651698],[-73.949769,40.652642]]],"type":"Polygon"}
}