{
  "id": "360470906003",
  "type": "Feature",
  "properties": {
    "area_land":57196,
    "area_water":0,
    "geoid":"360470906003",
    "name":"Block Group 3",
    "state":"ny"
},
  "bbox": [
    -73.911336,
    40.670955,
    -73.907337,
    40.673567
],
  "geometry": {"coordinates":[[[-73.91109899999999,40.672183],[-73.910968,40.672236],[-73.90994499999999,40.672661],[-73.90976999999999,40.672733],[-73.909255,40.672948],[-73.90842000000001,40.673313],[-73.907877,40.673567],[-73.90765500000001,40.672745],[-73.907337,40.671506],[-73.90830800000001,40.671364],[-73.91106600000001,40.670955],[-73.91133600000001,40.672077],[-73.91109899999999,40.672183]]],"type":"Polygon"}
}