{
  "id": "360379501002",
  "type": "Feature",
  "properties": {
    "area_land":29819001,
    "area_water":25532,
    "geoid":"360379501002",
    "name":"Block Group 2",
    "state":"ny"
},
  "bbox": [
    -78.016214,
    43.038612,
    -77.928513,
    43.089168
],
  "geometry": {"coordinates":[[[-78.01621400000001,43.088649],[-78.01515000000001,43.08868],[-78.012236,43.088811],[-78.01127700000001,43.088864],[-78.009455,43.088954],[-78.007385,43.089046],[-78.002009,43.089162],[-78.001319,43.089168],[-78.000606,43.089159],[-77.998806,43.089077],[-77.996408,43.089011],[-77.994772,43.088998],[-77.990171,43.08906],[-77.98696,43.089079],[-77.98537,43.089099],[-77.98365099999999,43.089088],[-77.980011,43.089129],[-77.97713,43.089159],[-77.976494,43.089149],[-77.97371800000001,43.08909],[-77.972076,43.089051],[-77.967022,43.08896],[-77.96624799999999,43.088951],[-77.95906100000001,43.088934],[-77.957308,43.088932],[-77.955578,43.088918],[-77.95080799999999,43.088912],[-77.94641300000001,43.08888],[-77.946488,43.08737],[-77.94653,43.086502],[-77.946524,43.0863],[-77.94651399999999,43.086251],[-77.94649,43.086165],[-77.946167,43.085549],[-77.94608700000001,43.08542],[-77.945911,43.085092],[-77.94588899999999,43.085067],[-77.94582200000001,43.084942],[-77.946758,43.084692],[-77.95014399999999,43.08376],[-77.950524,43.083652],[-77.950631,43.083622],[-77.952905,43.082985],[-77.958455,43.08146],[-77.959408,43.081215],[-77.95959499999999,43.081157],[-77.959749,43.08108],[-77.959822,43.081011],[-77.959863,43.080939],[-77.95989299999999,43.080789],[-77.959822,43.079333],[-77.95972399999999,43.077936],[-77.956929,43.077927],[-77.951993,43.0779],[-77.95061699999999,43.0779],[-77.94999900000001,43.0779],[-77.948978,43.077903],[-77.948142,43.077912],[-77.947551,43.077917],[-77.94649800000001,43.077902],[-77.94547300000001,43.077865],[-77.94541700000001,43.077863],[-77.944761,43.07784],[-77.944727,43.077956],[-77.944343,43.078123],[-77.943816,43.078325],[-77.943699,43.078368],[-77.943246,43.078535],[-77.943172,43.078562],[-77.940772,43.079447],[-77.94003499999999,43.079722],[-77.93991699999999,43.079766],[-77.937467,43.080676],[-77.935169,43.081529],[-77.93503800000001,43.081541],[-77.934949,43.081527],[-77.933813,43.082364],[-77.933695,43.082449],[-77.932858,43.083052],[-77.930931,43.084431],[-77.930311,43.084887],[-77.93010599999999,43.085038],[-77.928534,43.086199],[-77.928513,43.086215],[-77.92900400000001,43.085206],[-77.930069,43.083033],[-77.93007900000001,43.083009],[-77.930922,43.081004],[-77.931026,43.080756],[-77.931167,43.080421],[-77.931376,43.079966],[-77.931394,43.079929],[-77.934152,43.074238],[-77.937495,43.067184],[-77.938925,43.06407],[-77.94633,43.049258],[-77.94636300000001,43.049163],[-77.946414,43.049015],[-77.946799,43.047906],[-77.946994,43.047339],[-77.94701999999999,43.047287],[-77.947284,43.046722],[-77.948233,43.045161],[-77.949853,43.045148],[-77.949943,43.045148],[-77.95177,43.045033],[-77.964663,43.045061],[-77.968735,43.045086],[-77.98495699999999,43.04521],[-77.990155,43.045272],[-77.99467,43.045336],[-77.99464500000001,43.042891],[-77.99456600000001,43.038733],[-77.996461,43.038732],[-78.004204,43.038728],[-78.01251600000001,43.038612],[-78.01410199999999,43.038622],[-78.01410199999999,43.038789],[-78.01409700000001,43.040189],[-78.01410300000001,43.04115],[-78.01412500000001,43.041559],[-78.014133,43.042337],[-78.01419,43.042748],[-78.014201,43.044751],[-78.01422700000001,43.049173],[-78.014228,43.04932],[-78.01423,43.049468],[-78.014253,43.052188],[-78.014281,43.05491],[-78.014264,43.057569],[-78.014297,43.059878],[-78.014337,43.063832],[-78.014343,43.064864],[-78.014343,43.064908],[-78.014353,43.065788],[-78.014437,43.069837],[-78.014449,43.070766],[-78.01457000000001,43.079357],[-78.01466600000001,43.079356],[-78.016051,43.079337],[-78.016204,43.087479],[-78.01621400000001,43.088649]]],"type":"Polygon"}
}