{
  "id": "360594080001",
  "type": "Feature",
  "properties": {
    "area_land":293804,
    "area_water":0,
    "geoid":"360594080001",
    "name":"Block Group 1",
    "state":"ny"
},
  "bbox": [
    -73.569159,
    40.714932,
    -73.562487,
    40.72414
],
  "geometry": {"coordinates":[[[-73.56837,40.717231],[-73.56816499999999,40.717352],[-73.56782800000001,40.717567],[-73.566457,40.718399],[-73.567037,40.718938],[-73.567609,40.719469],[-73.568181,40.72],[-73.56825000000001,40.719957],[-73.568335,40.720392],[-73.568437,40.721077],[-73.568551,40.721756],[-73.568664,40.722437],[-73.56877900000001,40.723118],[-73.568899,40.723779],[-73.568927,40.723935],[-73.568405,40.723976],[-73.56675799999999,40.72414],[-73.56656099999999,40.72401],[-73.566574,40.723922],[-73.56649,40.723596],[-73.566338,40.723352],[-73.565905,40.722701],[-73.56548100000001,40.722055],[-73.565305,40.721793],[-73.564877,40.721175],[-73.564453,40.720547],[-73.56416299999999,40.720129],[-73.564025,40.719945],[-73.563851,40.719712],[-73.562487,40.717994],[-73.563059,40.717545],[-73.56314500000001,40.717488],[-73.563771,40.716963],[-73.56381399999999,40.716927],[-73.56431600000001,40.716533],[-73.56468,40.71624],[-73.56505300000001,40.715956],[-73.565247,40.715788],[-73.56540200000001,40.715656],[-73.566033,40.715036],[-73.56609899999999,40.714975],[-73.56616099999999,40.714932],[-73.56725400000001,40.715589],[-73.569159,40.716727],[-73.56837,40.717231]]],"type":"Polygon"}
}