{
  "id": "360610126004",
  "type": "Feature",
  "properties": {
    "area_land":17179,
    "area_water":0,
    "geoid":"360610126004",
    "name":"Block Group 4",
    "state":"ny"
},
  "bbox": [
    -73.962014,
    40.766868,
    -73.959318,
    40.768437
],
  "geometry": {"coordinates":[[[-73.96155899999999,40.768437],[-73.961094,40.768241],[-73.96104,40.768219],[-73.96012500000001,40.767834],[-73.959318,40.767494],[-73.959777,40.766868],[-73.960497,40.767172],[-73.961403,40.767554],[-73.961544,40.767613],[-73.962014,40.767812],[-73.96155899999999,40.768437]]],"type":"Polygon"}
}