{
  "id": "360594141001",
  "type": "Feature",
  "properties": {
    "area_land":229035,
    "area_water":0,
    "geoid":"360594141001",
    "name":"Block Group 1",
    "state":"ny"
},
  "bbox": [
    -73.583155,
    40.665749,
    -73.574014,
    40.670371
],
  "geometry": {"coordinates":[[[-73.583155,40.667369],[-73.58261899999999,40.667444],[-73.58280000000001,40.66833],[-73.581909,40.66843],[-73.581013,40.668534],[-73.58116099999999,40.669282],[-73.581309,40.670028],[-73.58024,40.67015],[-73.579168,40.670273],[-73.57836500000001,40.670371],[-73.577805,40.669902],[-73.57745,40.669677],[-73.576453,40.669059],[-73.576402,40.669028],[-73.575704,40.668594],[-73.575042,40.668181],[-73.57492499999999,40.66811],[-73.57463799999999,40.667917],[-73.57450900000001,40.667798],[-73.57431099999999,40.667592],[-73.57401400000001,40.667287],[-73.575265,40.667043],[-73.57614,40.666875],[-73.577191,40.666672],[-73.578239,40.666469],[-73.57886499999999,40.666349],[-73.579291,40.666267],[-73.579898,40.666149],[-73.580455,40.66607],[-73.58276499999999,40.665749],[-73.58286,40.666157],[-73.582954,40.66656],[-73.583033,40.66691],[-73.583155,40.667369]]],"type":"Polygon"}
}