{
  "id": "361031102004",
  "type": "Feature",
  "properties": {
    "area_land":1694793,
    "area_water":0,
    "geoid":"361031102004",
    "name":"Block Group 4",
    "state":"ny"
},
  "bbox": [
    -73.451486,
    40.869449,
    -73.430748,
    40.884471
],
  "geometry": {"coordinates":[[[-73.451486,40.873399],[-73.451292,40.873532],[-73.45114100000001,40.873672],[-73.450976,40.873833],[-73.450653,40.87418],[-73.45038,40.874509],[-73.45030199999999,40.874589],[-73.45023399999999,40.874691],[-73.45017199999999,40.874809],[-73.45008799999999,40.875024],[-73.45004400000001,40.87522],[-73.450012,40.875476],[-73.45001999999999,40.875797],[-73.450074,40.875987],[-73.45008900000001,40.876059],[-73.45030300000001,40.87657],[-73.45057799999999,40.87728],[-73.450669,40.877498],[-73.45064499999999,40.877662],[-73.450608,40.877773],[-73.450272,40.878226],[-73.450203,40.878398],[-73.45032500000001,40.879557],[-73.45043200000001,40.880671],[-73.450424,40.881053],[-73.450288,40.881358],[-73.44957100000001,40.882437],[-73.449173,40.882907],[-73.44903600000001,40.883143],[-73.448815,40.883685],[-73.44853999999999,40.88431],[-73.448464,40.884471],[-73.44795999999999,40.884365],[-73.443617,40.884146],[-73.443405,40.884135],[-73.443192,40.884124],[-73.44288,40.884135],[-73.44255200000001,40.884127],[-73.442222,40.884101],[-73.44193300000001,40.884059],[-73.44161200000001,40.884002],[-73.441383,40.883952],[-73.441154,40.883925],[-73.44043000000001,40.883902],[-73.439865,40.883922],[-73.439224,40.883956],[-73.439117,40.883728],[-73.43879699999999,40.883319],[-73.43871300000001,40.8832],[-73.43834699999999,40.882731],[-73.438132,40.882442],[-73.43734000000001,40.881446],[-73.436723,40.880615],[-73.436497,40.880321],[-73.43641,40.879985],[-73.436226,40.879352],[-73.43615699999999,40.879104],[-73.435661,40.877506],[-73.435501,40.876975],[-73.435356,40.876456],[-73.435303,40.876231],[-73.435219,40.875904],[-73.43512,40.875603],[-73.435018,40.875373],[-73.434861,40.875159],[-73.434631,40.874911],[-73.43440200000001,40.874725],[-73.434128,40.874537],[-73.433578,40.874247],[-73.433044,40.873854],[-73.432655,40.873503],[-73.432289,40.873175],[-73.43206000000001,40.872943],[-73.43182400000001,40.872688],[-73.431641,40.872454],[-73.43137299999999,40.872051],[-73.431175,40.871647],[-73.43074799999999,40.870715],[-73.43126700000001,40.870585],[-73.43229700000001,40.870166],[-73.432558,40.870058],[-73.43309000000001,40.869839],[-73.433376,40.869722],[-73.434045,40.869449],[-73.43408599999999,40.86947],[-73.43415400000001,40.869484],[-73.43450300000001,40.869552],[-73.434772,40.869606],[-73.43481199999999,40.869632],[-73.435344,40.869765],[-73.43615699999999,40.869958],[-73.436555,40.870048],[-73.437309,40.870209],[-73.437882,40.87035],[-73.438056,40.870452],[-73.439323,40.87118],[-73.439781,40.871437],[-73.43991800000001,40.871516],[-73.44012499999999,40.871646],[-73.440387,40.871795],[-73.441277,40.872295],[-73.44142100000001,40.872354],[-73.441658,40.872451],[-73.442718,40.872824],[-73.443703,40.873218],[-73.44459500000001,40.873272],[-73.44528200000001,40.873272],[-73.44735799999999,40.873469],[-73.44766300000001,40.873469],[-73.44786999999999,40.87344],[-73.44813600000001,40.873405],[-73.448283,40.8734],[-73.448959,40.873301],[-73.449172,40.873261],[-73.449415,40.873259],[-73.44977400000001,40.873277],[-73.450444,40.873368],[-73.450925,40.873425],[-73.451221,40.873442],[-73.45132099999999,40.873432],[-73.451486,40.873399]]],"type":"Polygon"}
}