{
  "id": "360850291022",
  "type": "Feature",
  "properties": {
    "area_land":1148062,
    "area_water":0,
    "geoid":"360850291022",
    "name":"Block Group 2",
    "state":"ny"
},
  "bbox": [
    -74.205962,
    40.579927,
    -74.178239,
    40.599811
],
  "geometry": {"coordinates":[[[-74.205527,40.5815],[-74.205028,40.581724],[-74.203642,40.585317],[-74.202547,40.585484],[-74.20201,40.58571],[-74.19892900000001,40.587006],[-74.19864800000001,40.587079],[-74.19704400000001,40.58791],[-74.195716,40.588699],[-74.194008,40.58975],[-74.193568,40.590012],[-74.193298,40.590175],[-74.192939,40.590379],[-74.192626,40.59058],[-74.19232599999999,40.590746],[-74.19157300000001,40.591173],[-74.19081199999999,40.591619],[-74.190101,40.592027],[-74.189429,40.592432],[-74.188818,40.592795],[-74.188332,40.593072],[-74.188046,40.593242],[-74.18693,40.593901],[-74.18667600000001,40.594052],[-74.186503,40.594158],[-74.18535799999999,40.594804],[-74.18498099999999,40.595063],[-74.18381100000001,40.595854],[-74.18202599999999,40.59711],[-74.180132,40.598461],[-74.178239,40.599811],[-74.179541,40.596746],[-74.18207700000001,40.594249],[-74.182238,40.593663],[-74.18226900000001,40.593665],[-74.182331,40.593641],[-74.18256,40.593546],[-74.18285,40.593332],[-74.183173,40.593038],[-74.183868,40.592372],[-74.184196,40.591996],[-74.184263,40.591863],[-74.184296,40.591739],[-74.184348,40.591634],[-74.184343,40.591563],[-74.184386,40.591487],[-74.184528,40.591358],[-74.184676,40.591239],[-74.184876,40.591111],[-74.185051,40.591069],[-74.18534699999999,40.59094],[-74.18549400000001,40.590778],[-74.185794,40.590431],[-74.185965,40.590193],[-74.186098,40.589984],[-74.186222,40.589818],[-74.186243,40.589744],[-74.186245,40.589627],[-74.186212,40.589503],[-74.18614599999999,40.58938],[-74.186117,40.589303],[-74.18598900000001,40.589194],[-74.185917,40.589146],[-74.18580799999999,40.589075],[-74.18567,40.588999],[-74.185513,40.588875],[-74.185456,40.588785],[-74.18543699999999,40.58868],[-74.185446,40.588609],[-74.18549899999999,40.588509],[-74.185627,40.588319],[-74.185884,40.588112],[-74.186136,40.588029],[-74.186246,40.588029],[-74.186317,40.588063],[-74.186374,40.588101],[-74.18646,40.58812],[-74.18654100000001,40.58812],[-74.186626,40.588101],[-74.186745,40.588053],[-74.18690100000001,40.587911],[-74.187023,40.587691],[-74.187348,40.587345],[-74.18744599999999,40.587279],[-74.18782299999999,40.587026],[-74.188385,40.586757],[-74.18893199999999,40.586433],[-74.18948,40.586098],[-74.189956,40.585675],[-74.190207,40.585622],[-74.190305,40.585624],[-74.19110999999999,40.58583],[-74.191318,40.585705],[-74.192319,40.58557],[-74.19243400000001,40.585396],[-74.192544,40.585319],[-74.192716,40.5852],[-74.192888,40.58516],[-74.193325,40.585038],[-74.193601,40.585123],[-74.19418400000001,40.585069],[-74.194379,40.585008],[-74.194703,40.584849],[-74.196201,40.583961],[-74.19768500000001,40.583008],[-74.19798,40.582876],[-74.19818100000001,40.582766],[-74.198736,40.582558],[-74.199118,40.582432],[-74.199471,40.582296],[-74.19979499999999,40.582103],[-74.200076,40.581544],[-74.200076,40.581275],[-74.199996,40.580952],[-74.199967,40.580568],[-74.20009,40.580266],[-74.200169,40.580141],[-74.20042100000001,40.579955],[-74.200478,40.579927],[-74.203563,40.580434],[-74.205962,40.580047],[-74.205527,40.5815]]],"type":"Polygon"}
}