{
  "id": "360550117031",
  "type": "Feature",
  "properties": {
    "area_land":1222693,
    "area_water":0,
    "geoid":"360550117031",
    "name":"Block Group 1",
    "state":"ny"
},
  "bbox": [
    -77.432235,
    43.10832,
    -77.422546,
    43.122988
],
  "geometry": {"coordinates":[[[-77.43223500000001,43.122896],[-77.425792,43.122987],[-77.425729,43.122988],[-77.42468700000001,43.122804],[-77.422853,43.122508],[-77.422882,43.122396],[-77.422915,43.122179],[-77.422927,43.121371],[-77.422973,43.118255],[-77.423017,43.115521],[-77.423017,43.115133],[-77.422867,43.112839],[-77.42281800000001,43.112259],[-77.422698,43.110529],[-77.422617,43.109449],[-77.422546,43.10838],[-77.422646,43.108381],[-77.42717500000001,43.108345],[-77.42782699999999,43.108341],[-77.43015200000001,43.108321],[-77.432134,43.10832],[-77.432188,43.112041],[-77.432203,43.11337],[-77.432192,43.11637],[-77.43218,43.11802],[-77.432179,43.118468],[-77.432174,43.120538],[-77.43217199999999,43.122453],[-77.43217199999999,43.122685],[-77.43223500000001,43.122896]]],"type":"Polygon"}
}