{
  "id": "360870124012",
  "type": "Feature",
  "properties": {
    "area_land":203943,
    "area_water":0,
    "geoid":"360870124012",
    "name":"Block Group 2",
    "state":"ny"
},
  "bbox": [
    -74.061112,
    41.100319,
    -74.054326,
    41.106533
],
  "geometry": {"coordinates":[[[-74.061016,41.102258],[-74.06096599999999,41.102642],[-74.06091000000001,41.103084],[-74.060864,41.103431],[-74.060402,41.104002],[-74.06041,41.104099],[-74.06017199999999,41.105447],[-74.060153,41.105629],[-74.060198,41.106249],[-74.060191,41.1064],[-74.060068,41.106389],[-74.059679,41.106332],[-74.059394,41.106358],[-74.05901299999999,41.106408],[-74.058832,41.106423],[-74.057889,41.106509],[-74.057738,41.106533],[-74.05745899999999,41.104942],[-74.05720599999999,41.103488],[-74.05718899999999,41.103386],[-74.057124,41.103056],[-74.057075,41.102907],[-74.05706000000001,41.102881],[-74.057033,41.102836],[-74.056933,41.102671],[-74.056831,41.10256],[-74.056752,41.102473],[-74.056558,41.102317],[-74.05638399999999,41.102212],[-74.056265,41.10215],[-74.05596199999999,41.102041],[-74.055679,41.101975],[-74.055319,41.101886],[-74.05504000000001,41.101793],[-74.054963,41.10175],[-74.054883,41.101705],[-74.054642,41.101512],[-74.05448,41.101316],[-74.054413,41.10119],[-74.054373,41.101085],[-74.054332,41.100875],[-74.054328,41.100762],[-74.054326,41.100626],[-74.054344,41.100319],[-74.054745,41.100332],[-74.055605,41.100357],[-74.05614799999999,41.100403],[-74.056381,41.100451],[-74.05655299999999,41.100489],[-74.05658200000001,41.100616],[-74.056613,41.100704],[-74.05664400000001,41.100777],[-74.05667200000001,41.100834],[-74.05669,41.100881],[-74.056709,41.100948],[-74.056727,41.10105],[-74.056324,41.101077],[-74.056195,41.10108],[-74.056224,41.101308],[-74.056248,41.101502],[-74.056286,41.1015],[-74.056314,41.101508],[-74.05678899999999,41.101459],[-74.056782,41.101399],[-74.056772,41.101342],[-74.056952,41.101326],[-74.056899,41.10094],[-74.056879,41.100866],[-74.056849,41.100782],[-74.056809,41.100696],[-74.056763,41.100562],[-74.056757,41.100534],[-74.05702100000001,41.100592],[-74.057069,41.100603],[-74.057844,41.100777],[-74.059161,41.101061],[-74.059939,41.10123],[-74.060982,41.101489],[-74.06111199999999,41.101521],[-74.061016,41.102258]]],"type":"Polygon"}
}