{
  "id": "360290094022",
  "type": "Feature",
  "properties": {
    "area_land":967051,
    "area_water":0,
    "geoid":"360290094022",
    "name":"Block Group 2",
    "state":"ny"
},
  "bbox": [
    -78.767601,
    42.960192,
    -78.755498,
    42.974366
],
  "geometry": {"coordinates":[[[-78.767601,42.973538],[-78.766519,42.973791],[-78.765925,42.973929],[-78.765579,42.974011],[-78.765415,42.974048],[-78.764895,42.974166],[-78.764167,42.974333],[-78.763993,42.974366],[-78.763969,42.974347],[-78.76333,42.973942],[-78.76311800000001,42.973801],[-78.762254,42.973225],[-78.762128,42.973129],[-78.76192500000001,42.972953],[-78.761836,42.972862],[-78.76174399999999,42.972752],[-78.76166499999999,42.97263],[-78.761522,42.972374],[-78.761286,42.971923],[-78.760902,42.97119],[-78.76083300000001,42.971054],[-78.760288,42.969983],[-78.759891,42.969215],[-78.759868,42.969171],[-78.759801,42.969042],[-78.75963,42.96871],[-78.759615,42.96868],[-78.759579,42.968613],[-78.759348,42.96827],[-78.759344,42.968178],[-78.759231,42.968184],[-78.759056,42.968032],[-78.75828199999999,42.967358],[-78.757349,42.966535],[-78.75655,42.965823],[-78.756477,42.96574],[-78.75637999999999,42.96561],[-78.75630099999999,42.965473],[-78.756209,42.96527],[-78.756176,42.965174],[-78.756154,42.96511],[-78.756113,42.964949],[-78.75608699999999,42.964786],[-78.756089,42.964345],[-78.75608099999999,42.964095],[-78.756073,42.963808],[-78.75605899999999,42.963535],[-78.75603700000001,42.963333],[-78.75600799999999,42.963089],[-78.755865,42.96237],[-78.755664,42.961603],[-78.755498,42.961076],[-78.75621,42.960957],[-78.757341,42.960767],[-78.758388,42.960591],[-78.759319,42.960448],[-78.76003799999999,42.960332],[-78.760673,42.96023],[-78.76089899999999,42.960192],[-78.760937,42.960409],[-78.760852,42.960581],[-78.760739,42.96073],[-78.76080899999999,42.961262],[-78.760865,42.961594],[-78.760895,42.961664],[-78.760941,42.96173],[-78.761015,42.9618],[-78.761107,42.961857],[-78.761213,42.961908],[-78.76132800000001,42.961948],[-78.76148000000001,42.961981],[-78.761638,42.961996],[-78.762491,42.961978],[-78.764224,42.961944],[-78.76436200000001,42.961941],[-78.764529,42.961948],[-78.764695,42.961963],[-78.764859,42.961986],[-78.7651,42.962041],[-78.765333,42.962112],[-78.765556,42.9622],[-78.76575,42.962304],[-78.76593,42.962422],[-78.766041,42.962507],[-78.76614499999999,42.962596],[-78.76622500000001,42.962679],[-78.76633699999999,42.962822],[-78.766431,42.962972],[-78.766504,42.963128],[-78.766581,42.963346],[-78.76679,42.964078],[-78.766863,42.964312],[-78.766955,42.964666],[-78.766989,42.964875],[-78.76706299999999,42.966464],[-78.767078,42.966774],[-78.76711400000001,42.967629],[-78.767133,42.968066],[-78.76714800000001,42.968227],[-78.76723800000001,42.969166],[-78.76729,42.969879],[-78.767346,42.970567],[-78.767381,42.971001],[-78.76742299999999,42.971501],[-78.767453,42.971848],[-78.76754699999999,42.972949],[-78.767596,42.973517],[-78.767601,42.973538]]],"type":"Polygon"}
}