{
  "id": "360894923001",
  "type": "Feature",
  "properties": {
    "area_land":42246570,
    "area_water":834400,
    "geoid":"360894923001",
    "name":"Block Group 1",
    "state":"ny"
},
  "bbox": [
    -75.063391,
    44.542229,
    -74.953512,
    44.625384
],
  "geometry": {"coordinates":[[[-75.063391,44.576897],[-75.06164,44.577817],[-75.04459900000001,44.586469],[-75.044285,44.586618],[-75.04298199999999,44.587238],[-75.042204,44.587607],[-75.041696,44.587851],[-75.031775,44.592568],[-75.03107900000001,44.592891],[-75.009106,44.603352],[-75.004368,44.605607],[-74.999825,44.607712],[-74.998436,44.608362],[-74.998209,44.608469],[-74.994343,44.610322],[-74.989796,44.612524],[-74.98922399999999,44.612816],[-74.98827199999999,44.613266],[-74.987891,44.61346],[-74.983232,44.615628],[-74.979283,44.617468],[-74.97600799999999,44.619055],[-74.97474699999999,44.619668],[-74.974036,44.619993],[-74.973702,44.620145],[-74.97350299999999,44.620238],[-74.97322200000001,44.620371],[-74.972697,44.620608],[-74.97215,44.620859],[-74.971099,44.621357],[-74.965898,44.623745],[-74.964107,44.624382],[-74.96327100000001,44.625048],[-74.962602,44.625384],[-74.96261199999999,44.625059],[-74.962187,44.622582],[-74.96199300000001,44.621127],[-74.961583,44.618036],[-74.96129500000001,44.615763],[-74.961044,44.613619],[-74.96077099999999,44.611511],[-74.959874,44.602896],[-74.959194,44.597503],[-74.958074,44.588882],[-74.95802399999999,44.588535],[-74.95793,44.587823],[-74.95783299999999,44.587059],[-74.957776,44.586755],[-74.957753,44.586629],[-74.957745,44.586577],[-74.957734,44.586496],[-74.957713,44.586379],[-74.957684,44.586087],[-74.957678,44.586],[-74.957601,44.584879],[-74.95719800000001,44.582021],[-74.95711900000001,44.581432],[-74.956898,44.58033],[-74.956807,44.579252],[-74.956639,44.577751],[-74.95630800000001,44.575533],[-74.956181,44.573963],[-74.95606100000001,44.573328],[-74.95595899999999,44.572445],[-74.95587500000001,44.571759],[-74.955788,44.571046],[-74.95533399999999,44.567757],[-74.954976,44.564738],[-74.95486699999999,44.563683],[-74.954819,44.563294],[-74.954483,44.560783],[-74.954261,44.559067],[-74.95356,44.553492],[-74.953512,44.553114],[-74.95377000000001,44.553104],[-74.954741,44.553053],[-74.955338,44.553052],[-74.95558,44.553041],[-74.95656099999999,44.552921],[-74.95774,44.552804],[-74.958094,44.552784],[-74.96001699999999,44.552636],[-74.965232,44.552304],[-74.96727799999999,44.552174],[-74.968198,44.552103],[-74.968755,44.552061],[-74.96890999999999,44.552061],[-74.96956900000001,44.552095],[-74.969775,44.552097],[-74.970001,44.552084],[-74.971081,44.551961],[-74.973877,44.551687],[-74.974345,44.551665],[-74.97496700000001,44.551664],[-74.975482,44.551647],[-74.975814,44.551636],[-74.97865299999999,44.551456],[-74.979252,44.551398],[-74.98015700000001,44.551272],[-74.980643,44.551227],[-74.98080299999999,44.55123],[-74.981183,44.551263],[-74.981548,44.551318],[-74.98196900000001,44.551409],[-74.982219,44.551449],[-74.982482,44.551451],[-74.982536,44.551446],[-74.982739,44.551425],[-74.983897,44.551176],[-74.984303,44.551117],[-74.984874,44.551066],[-74.985704,44.550968],[-74.98647,44.550895],[-74.98707899999999,44.550848],[-74.987452,44.550868],[-74.98768200000001,44.550908],[-74.98858300000001,44.551206],[-74.98920699999999,44.551349],[-74.98935400000001,44.551369],[-74.989795,44.551378],[-74.989976,44.551367],[-74.990059,44.551355],[-74.99028,44.551323],[-74.990419,44.55129],[-74.990725,44.551188],[-74.991884,44.550707],[-74.992124,44.550627],[-74.992423,44.550549],[-74.992681,44.550509],[-74.993953,44.550377],[-74.994282,44.550339],[-74.994747,44.550252],[-74.995436,44.55013],[-74.99571299999999,44.550104],[-74.99708200000001,44.550066],[-74.997292,44.55005],[-74.998244,44.549953],[-74.999297,44.549884],[-74.999713,44.549882],[-74.99982,44.549893],[-75.000224,44.549994],[-75.000449,44.550074],[-75.000643,44.550165],[-75.00088700000001,44.550323],[-75.00118999999999,44.550514],[-75.00164100000001,44.55077],[-75.002025,44.550449],[-75.002464,44.550094],[-75.004149,44.548705],[-75.004389,44.548516],[-75.004743,44.548286],[-75.005459,44.547896],[-75.005605,44.547801],[-75.00572099999999,44.547712],[-75.005968,44.547462],[-75.006092,44.547273],[-75.00618799999999,44.547073],[-75.006314,44.546532],[-75.00642000000001,44.546178],[-75.006567,44.545876],[-75.00671800000001,44.545647],[-75.006956,44.545371],[-75.00712900000001,44.545229],[-75.007696,44.544814],[-75.008601,44.544196],[-75.009028,44.543946],[-75.01057,44.543091],[-75.01116500000001,44.542737],[-75.01195300000001,44.542229],[-75.01374800000001,44.543315],[-75.015126,44.544155],[-75.017493,44.545544],[-75.01866099999999,44.546238],[-75.02054200000001,44.547327],[-75.020797,44.547466],[-75.02118400000001,44.547631],[-75.021618,44.54779],[-75.024173,44.548673],[-75.024153,44.549884],[-75.024114,44.550446],[-75.023922,44.55145],[-75.023787,44.552308],[-75.023748,44.552607],[-75.023714,44.552788],[-75.02345,44.553753],[-75.023112,44.55473],[-75.02284299999999,44.555643],[-75.022761,44.55582],[-75.022623,44.556036],[-75.022559,44.556116],[-75.022657,44.556267],[-75.022792,44.556387],[-75.022858,44.556445],[-75.02309700000001,44.556617],[-75.023488,44.556909],[-75.024255,44.557531],[-75.024621,44.557754],[-75.024936,44.557987],[-75.025104,44.558124],[-75.025767,44.558661],[-75.02618200000001,44.558997],[-75.026534,44.559251],[-75.026797,44.559406],[-75.02704,44.559514],[-75.02853500000001,44.560097],[-75.028558,44.560107],[-75.029614,44.560574],[-75.031071,44.561245],[-75.031555,44.561454],[-75.03434900000001,44.562715],[-75.03467999999999,44.562852],[-75.036086,44.563478],[-75.036799,44.563784],[-75.03736499999999,44.56404],[-75.03888600000001,44.56471],[-75.040138,44.565245],[-75.04185,44.566003],[-75.043493,44.566701],[-75.04431,44.567045],[-75.04533600000001,44.567493],[-75.045952,44.56778],[-75.046809,44.568148],[-75.048272,44.568783],[-75.04897200000001,44.569081],[-75.05036699999999,44.56971],[-75.05113799999999,44.570042],[-75.05181899999999,44.570348],[-75.052496,44.570635],[-75.054579,44.571545],[-75.055099,44.571784],[-75.05540499999999,44.571948],[-75.055646,44.572114],[-75.05603000000001,44.572472],[-75.05624899999999,44.57269],[-75.057199,44.573606],[-75.057712,44.574027],[-75.05848899999999,44.574616],[-75.058848,44.574891],[-75.05916499999999,44.575086],[-75.059459,44.57523],[-75.05985099999999,44.575379],[-75.060909,44.575732],[-75.06126999999999,44.575861],[-75.061775,44.576084],[-75.0625,44.576468],[-75.062748,44.576608],[-75.06321699999999,44.576837],[-75.063391,44.576897]]],"type":"Polygon"}
}