{
  "id": "360470494001",
  "type": "Feature",
  "properties": {
    "area_land":50044,
    "area_water":0,
    "geoid":"360470494001",
    "name":"Block Group 1",
    "state":"ny"
},
  "bbox": [
    -73.974657,
    40.643274,
    -73.971648,
    40.645863
],
  "geometry": {"coordinates":[[[-73.974419,40.644915],[-73.97419600000001,40.645007],[-73.973101,40.645451],[-73.972086,40.645863],[-73.971946,40.645164],[-73.971799,40.644376],[-73.971648,40.643573],[-73.97272,40.643456],[-73.97381300000001,40.643336],[-73.974096,40.643305],[-73.97437499999999,40.643274],[-73.97465699999999,40.644806],[-73.974419,40.644915]]],"type":"Polygon"}
}