{
  "id": "360470954001",
  "type": "Feature",
  "properties": {
    "area_land":87939,
    "area_water":0,
    "geoid":"360470954001",
    "name":"Block Group 1",
    "state":"ny"
},
  "bbox": [
    -73.91893,
    40.638682,
    -73.913904,
    40.642384
],
  "geometry": {"coordinates":[[[-73.91816300000001,40.64108],[-73.917402,40.641517],[-73.91662100000001,40.641948],[-73.915925,40.642384],[-73.913904,40.640569],[-73.914609,40.640102],[-73.91532100000001,40.639637],[-73.916033,40.639172],[-73.916809,40.638682],[-73.91893,40.640585],[-73.91816300000001,40.64108]]],"type":"Polygon"}
}