{
  "id": "360290076002",
  "type": "Feature",
  "properties": {
    "area_land":515420,
    "area_water":0,
    "geoid":"360290076002",
    "name":"Block Group 2",
    "state":"ny"
},
  "bbox": [
    -78.874796,
    43.003377,
    -78.865022,
    43.010515
],
  "geometry": {"coordinates":[[[-78.874585,43.00421],[-78.874375,43.005003],[-78.874185,43.00572],[-78.873971,43.006447],[-78.873959,43.006486],[-78.873752,43.007176],[-78.873721,43.007282],[-78.87358,43.007755],[-78.87344899999999,43.008174],[-78.873217,43.008918],[-78.872899,43.009958],[-78.872822,43.010207],[-78.871368,43.010224],[-78.870305,43.010237],[-78.869197,43.010263],[-78.869164,43.010263],[-78.868977,43.010282],[-78.868414,43.010378],[-78.86802299999999,43.010489],[-78.867952,43.010515],[-78.86708299999999,43.009648],[-78.865734,43.008299],[-78.86515,43.007719],[-78.86511299999999,43.007664],[-78.865022,43.007257],[-78.865026,43.006894],[-78.86503,43.006457],[-78.865031,43.00588],[-78.865032,43.005683],[-78.865042,43.00497],[-78.865053,43.004172],[-78.865065,43.003377],[-78.86994799999999,43.003397],[-78.874796,43.003412],[-78.874585,43.00421]]],"type":"Polygon"}
}