{
  "id": "360594070004",
  "type": "Feature",
  "properties": {
    "area_land":205500,
    "area_water":0,
    "geoid":"360594070004",
    "name":"Block Group 4",
    "state":"ny"
},
  "bbox": [
    -73.629511,
    40.690941,
    -73.621986,
    40.697073
],
  "geometry": {"coordinates":[[[-73.629486,40.691607],[-73.62936999999999,40.693616],[-73.62926400000001,40.695218],[-73.628861,40.695326],[-73.62834599999999,40.695458],[-73.627551,40.695667],[-73.627432,40.695699],[-73.626397,40.695975],[-73.626122,40.696046],[-73.62564399999999,40.69617],[-73.62496899999999,40.69634],[-73.624591,40.696436],[-73.624396,40.696485],[-73.622165,40.697073],[-73.62213199999999,40.696975],[-73.622083,40.69676],[-73.62198600000001,40.696066],[-73.623306,40.695954],[-73.62344,40.695927],[-73.623581,40.695884],[-73.62379799999999,40.695783],[-73.623921,40.69569],[-73.624004,40.695614],[-73.624044,40.69557],[-73.62413100000001,40.695427],[-73.624212,40.695197],[-73.624381,40.694638],[-73.6245,40.694325],[-73.624751,40.693673],[-73.624762,40.693618],[-73.624793,40.693561],[-73.62487900000001,40.69336],[-73.62497,40.693229],[-73.625046,40.693147],[-73.62519399999999,40.693024],[-73.62522,40.692988],[-73.625255,40.692966],[-73.62532,40.692924],[-73.62575099999999,40.69277],[-73.62569499999999,40.692528],[-73.625711,40.692328],[-73.625741,40.692242],[-73.62577899999999,40.69217],[-73.62585,40.692053],[-73.626008,40.69192],[-73.626279,40.691758],[-73.62648900000001,40.691642],[-73.626633,40.691554],[-73.627092,40.691301],[-73.627303,40.691178],[-73.627369,40.691123],[-73.627416,40.691068],[-73.627482,40.690941],[-73.627521,40.690962],[-73.62755,40.690959],[-73.628609,40.691257],[-73.62951099999999,40.691511],[-73.629486,40.691607]]],"type":"Polygon"}
}