{
  "id": "360610193004",
  "type": "Feature",
  "properties": {
    "area_land":20947,
    "area_water":0,
    "geoid":"360610193004",
    "name":"Block Group 4",
    "state":"ny"
},
  "bbox": [
    -73.961917,
    40.799958,
    -73.959647,
    40.8018
],
  "geometry": {"coordinates":[[[-73.96145799999999,40.801172],[-73.961077,40.8018],[-73.96015800000001,40.801386],[-73.959647,40.801156],[-73.960065,40.800586],[-73.960527,40.799958],[-73.961917,40.800543],[-73.96145799999999,40.801172]]],"type":"Polygon"}
}