{
  "id": "360870112002",
  "type": "Feature",
  "properties": {
    "area_land":2346640,
    "area_water":30835,
    "geoid":"360870112002",
    "name":"Block Group 2",
    "state":"ny"
},
  "bbox": [
    -73.977774,
    41.078323,
    -73.959757,
    41.106563
],
  "geometry": {"coordinates":[[[-73.977771,41.079739],[-73.97775300000001,41.079816],[-73.977541,41.080311],[-73.977502,41.080434],[-73.977448,41.080711],[-73.97736,41.081323],[-73.977338,41.081466],[-73.977221,41.082215],[-73.97715100000001,41.082428],[-73.97708,41.08255],[-73.976558,41.082608],[-73.976342,41.082633],[-73.97531499999999,41.082714],[-73.974616,41.082768],[-73.97364399999999,41.082862],[-73.972967,41.082905],[-73.97273199999999,41.082923],[-73.972656,41.082952],[-73.972605,41.08299],[-73.972572,41.083034],[-73.972515,41.083152],[-73.972438,41.083578],[-73.97241699999999,41.083788],[-73.97224199999999,41.08475],[-73.972274,41.085236],[-73.972354,41.085853],[-73.972397,41.086237],[-73.972432,41.086862],[-73.97241699999999,41.087225],[-73.97237699999999,41.087614],[-73.972341,41.08785],[-73.972291,41.088046],[-73.971937,41.088998],[-73.971557,41.090081],[-73.971538,41.090189],[-73.971554,41.09035],[-73.971718,41.090916],[-73.971929,41.091694],[-73.97202299999999,41.092038],[-73.972036,41.092091],[-73.97205200000001,41.09215],[-73.972105,41.092362],[-73.972193,41.093174],[-73.972266,41.093587],[-73.972391,41.093958],[-73.97269900000001,41.094936],[-73.972729,41.09506],[-73.972937,41.095679],[-73.973202,41.096288],[-73.973535,41.097108],[-73.973564,41.097233],[-73.973597,41.097533],[-73.97364,41.098432],[-73.97364,41.098522],[-73.97358,41.098872],[-73.973454,41.099245],[-73.973353,41.099503],[-73.97311000000001,41.100195],[-73.97283400000001,41.100933],[-73.972764,41.10109],[-73.97271499999999,41.101213],[-73.972666,41.101379],[-73.972555,41.101873],[-73.97255199999999,41.101885],[-73.97251799999999,41.102077],[-73.972509,41.102186],[-73.97248,41.102355],[-73.97246199999999,41.102513],[-73.972348,41.10325],[-73.972337,41.103364],[-73.972313,41.103553],[-73.97227599999999,41.103991],[-73.972218,41.103998],[-73.971339,41.104254],[-73.97099300000001,41.104351],[-73.970721,41.104428],[-73.96917999999999,41.104911],[-73.96818399999999,41.105212],[-73.966734,41.105474],[-73.96659699999999,41.105496],[-73.96645599999999,41.105535],[-73.96635000000001,41.105577],[-73.966224,41.105644],[-73.966121,41.105715],[-73.965818,41.105975],[-73.965644,41.106143],[-73.96537600000001,41.10638],[-73.96519499999999,41.106499],[-73.965067,41.106563],[-73.965007,41.10648],[-73.964927,41.106282],[-73.96480099999999,41.105973],[-73.964968,41.105824],[-73.965069,41.105712],[-73.965155,41.105596],[-73.965321,41.105332],[-73.96544400000001,41.10508],[-73.96553299999999,41.104822],[-73.965559,41.104684],[-73.965642,41.104066],[-73.96563,41.103845],[-73.965551,41.103492],[-73.96535299999999,41.102916],[-73.965115,41.102305],[-73.96462099999999,41.100944],[-73.96459,41.100854],[-73.964563,41.10078],[-73.964466,41.100546],[-73.964268,41.100007],[-73.964196,41.099747],[-73.96414300000001,41.099497],[-73.964119,41.099256],[-73.96410400000001,41.098856],[-73.964119,41.098014],[-73.96413699999999,41.097309],[-73.964229,41.095613],[-73.964247,41.095125],[-73.964237,41.0946],[-73.964204,41.093652],[-73.96420000000001,41.093593],[-73.964197,41.093524],[-73.96417099999999,41.093024],[-73.96413699999999,41.092651],[-73.963956,41.091527],[-73.963859,41.091049],[-73.963612,41.090079],[-73.96333300000001,41.089237],[-73.962784,41.087756],[-73.96255600000001,41.087204],[-73.96234200000001,41.086746],[-73.96213,41.086298],[-73.961702,41.085456],[-73.961378,41.084849],[-73.961164,41.084507],[-73.96081,41.08398],[-73.959924,41.082731],[-73.95989299999999,41.082688],[-73.959757,41.082505],[-73.959985,41.082468],[-73.96166599999999,41.082192],[-73.961797,41.082173],[-73.963618,41.081923],[-73.963645,41.081079],[-73.96367499999999,41.080933],[-73.963701,41.080806],[-73.963753,41.080724],[-73.963831,41.080663],[-73.96393999999999,41.080624],[-73.964021,41.080611],[-73.96404800000001,41.080607],[-73.96430599999999,41.080626],[-73.964462,41.080665],[-73.96498200000001,41.080847],[-73.965103,41.080864],[-73.965216,41.080856],[-73.96532000000001,41.080812],[-73.96539799999999,41.080734],[-73.965463,41.080622],[-73.96551100000001,41.080501],[-73.965554,41.080184],[-73.96557,41.079925],[-73.96557799999999,41.079797],[-73.965684,41.079063],[-73.96574,41.07886],[-73.96577499999999,41.078795],[-73.965827,41.078743],[-73.965914,41.0787],[-73.966157,41.078641],[-73.96648,41.078569],[-73.966527,41.078559],[-73.966696,41.078503],[-73.96684399999999,41.078442],[-73.967045,41.078323],[-73.975509,41.078523],[-73.97767399999999,41.078541],[-73.977673,41.078882],[-73.977774,41.079617],[-73.977771,41.079739]]],"type":"Polygon"}
}