{
  "id": "361031594072",
  "type": "Feature",
  "properties": {
    "area_land":1166434,
    "area_water":0,
    "geoid":"361031594072",
    "name":"Block Group 2",
    "state":"ny"
},
  "bbox": [
    -72.885956,
    40.828402,
    -72.86556,
    40.836174
],
  "geometry": {"coordinates":[[[-72.88595599999999,40.836174],[-72.88542,40.836096],[-72.88526299999999,40.836078],[-72.884962,40.836042],[-72.884818,40.836052],[-72.884557,40.836032],[-72.883703,40.835991],[-72.883177,40.83596],[-72.882575,40.835934],[-72.882344,40.83593],[-72.881979,40.83586],[-72.881636,40.835808],[-72.88142999999999,40.835758],[-72.881079,40.835712],[-72.880911,40.835701],[-72.880506,40.835655],[-72.87965800000001,40.835566],[-72.87915599999999,40.835521],[-72.87791,40.835389],[-72.877385,40.835326],[-72.876158,40.835197],[-72.875653,40.835163],[-72.87508200000001,40.83509],[-72.874876,40.835056],[-72.87439500000001,40.835029],[-72.87366299999999,40.835013],[-72.873532,40.835028],[-72.87284,40.835027],[-72.87263900000001,40.835011],[-72.872332,40.834997],[-72.871442,40.834976],[-72.870874,40.834969],[-72.870025,40.834955],[-72.869795,40.834923],[-72.869122,40.834793],[-72.868573,40.834712],[-72.867727,40.83462],[-72.86737599999999,40.834587],[-72.866666,40.834525],[-72.8663,40.834488],[-72.86596400000001,40.834469],[-72.86559800000001,40.834453],[-72.865613,40.833483],[-72.865583,40.832054],[-72.86556,40.831268],[-72.86556,40.828494],[-72.867299,40.828464],[-72.869055,40.828457],[-72.870817,40.828456],[-72.872563,40.828437],[-72.87432699999999,40.828433],[-72.876088,40.82841],[-72.877833,40.828403],[-72.87958399999999,40.828402],[-72.879779,40.828409],[-72.88139200000001,40.828655],[-72.88220699999999,40.82878],[-72.882434,40.828763],[-72.883718,40.831564],[-72.883876,40.831892],[-72.88395300000001,40.832022],[-72.884963,40.83412],[-72.885706,40.835657],[-72.88595599999999,40.836174]]],"type":"Polygon"}
}