{
  "id": "361031584093",
  "type": "Feature",
  "properties": {
    "area_land":2034873,
    "area_water":0,
    "geoid":"361031584093",
    "name":"Block Group 3",
    "state":"ny"
},
  "bbox": [
    -72.899914,
    40.893745,
    -72.878887,
    40.913025
],
  "geometry": {"coordinates":[[[-72.899914,40.907802],[-72.899557,40.908042],[-72.89954899999999,40.907905],[-72.89937399999999,40.907668],[-72.899069,40.907745],[-72.898861,40.90802],[-72.89368899999999,40.907904],[-72.893056,40.907825],[-72.891133,40.90757],[-72.886876,40.906212],[-72.88641,40.906241],[-72.88626600000001,40.906291],[-72.885266,40.905856],[-72.88431199999999,40.908146],[-72.883115,40.910872],[-72.88254999999999,40.912109],[-72.882313,40.912727],[-72.882199,40.913025],[-72.88184800000001,40.913002],[-72.879654,40.912846],[-72.879313,40.912822],[-72.87888700000001,40.912792],[-72.879048,40.911859],[-72.879277,40.910701],[-72.879513,40.909931],[-72.879672,40.909487],[-72.881529,40.905094],[-72.881647,40.904831],[-72.882026,40.903933],[-72.882154,40.903661],[-72.88241600000001,40.902922],[-72.882547,40.902442],[-72.88259100000001,40.902229],[-72.882666,40.901789],[-72.882696,40.90153],[-72.882801,40.900078],[-72.88289,40.898524],[-72.88297300000001,40.897559],[-72.88306300000001,40.896957],[-72.88315900000001,40.896453],[-72.88318,40.896345],[-72.883241,40.89603],[-72.88346799999999,40.895965],[-72.88408099999999,40.89579],[-72.884709,40.895643],[-72.88529200000001,40.895521],[-72.886225,40.89536],[-72.886695,40.895307],[-72.888346,40.895136],[-72.88910799999999,40.895049],[-72.89106099999999,40.894867],[-72.891115,40.894821],[-72.89169,40.894756],[-72.891966,40.894722],[-72.892453,40.894626],[-72.892668,40.894592],[-72.893102,40.894504],[-72.893545,40.894435],[-72.89426899999999,40.89429],[-72.894735,40.894179],[-72.89549700000001,40.893954],[-72.896246,40.893745],[-72.896321,40.894019],[-72.898218,40.901405],[-72.89899200000001,40.904419],[-72.899305,40.905662],[-72.899519,40.906459],[-72.899671,40.907047],[-72.899816,40.907532],[-72.899914,40.907802]]],"type":"Polygon"}
}