{
  "id": "360470600005",
  "type": "Feature",
  "properties": {
    "area_land":69896,
    "area_water":0,
    "geoid":"360470600005",
    "name":"Block Group 5",
    "state":"ny"
},
  "bbox": [
    -73.952783,
    40.585936,
    -73.948921,
    40.588514
],
  "geometry": {"coordinates":[[[-73.952675,40.587157],[-73.95247500000001,40.587214],[-73.952276,40.587272],[-73.95233,40.58751],[-73.952454,40.588173],[-73.951493,40.588279],[-73.95053900000001,40.588383],[-73.94934499999999,40.588514],[-73.949254,40.588028],[-73.948921,40.586261],[-73.950103,40.58613],[-73.95107,40.586025],[-73.95188899999999,40.585936],[-73.952783,40.587072],[-73.952675,40.587157]]],"type":"Polygon"}
}