{
  "id": "361031580071",
  "type": "Feature",
  "properties": {
    "area_land":1429779,
    "area_water":0,
    "geoid":"361031580071",
    "name":"Block Group 1",
    "state":"ny"
},
  "bbox": [
    -73.130468,
    40.909693,
    -73.11552,
    40.92449
],
  "geometry": {"coordinates":[[[-73.130464,40.915439],[-73.13043399999999,40.91572],[-73.130425,40.91577],[-73.13037,40.915902],[-73.130258,40.916249],[-73.129869,40.917104],[-73.129389,40.918293],[-73.12919100000001,40.918604],[-73.128683,40.919366],[-73.127369,40.921054],[-73.12683199999999,40.921632],[-73.126154,40.922264],[-73.125669,40.922657],[-73.125272,40.922943],[-73.125,40.923146],[-73.12459699999999,40.923405],[-73.123886,40.923811],[-73.123372,40.924062],[-73.122874,40.924244],[-73.122556,40.924297],[-73.122226,40.92427],[-73.121955,40.92421],[-73.121369,40.923907],[-73.121005,40.924175],[-73.12092,40.924227],[-73.12062899999999,40.924341],[-73.120282,40.924428],[-73.120012,40.924469],[-73.119609,40.924481],[-73.11958,40.924482],[-73.119398,40.92449],[-73.119308,40.924201],[-73.119258,40.92408],[-73.11909900000001,40.92378],[-73.119012,40.923646],[-73.11883400000001,40.923398],[-73.118691,40.923242],[-73.11752300000001,40.922057],[-73.117311,40.921836],[-73.117012,40.921446],[-73.116799,40.921076],[-73.116348,40.920094],[-73.11582,40.918515],[-73.115664,40.917945],[-73.115528,40.916972],[-73.11552,40.916499],[-73.11553000000001,40.916098],[-73.11560299999999,40.915716],[-73.11578,40.914953],[-73.116023,40.914184],[-73.11607600000001,40.914068],[-73.11629000000001,40.914127],[-73.116485,40.914167],[-73.117034,40.914328],[-73.117378,40.914451],[-73.11764599999999,40.9146],[-73.118076,40.914785],[-73.11838299999999,40.914875],[-73.118838,40.915235],[-73.11894700000001,40.914988],[-73.119023,40.914754],[-73.11907600000001,40.914482],[-73.119101,40.914309],[-73.119111,40.914157],[-73.119105,40.914022],[-73.11907600000001,40.913851],[-73.119,40.913611],[-73.118855,40.913194],[-73.118757,40.91291],[-73.11870999999999,40.91274],[-73.118675,40.912491],[-73.118675,40.912194],[-73.118707,40.91191],[-73.118751,40.911742],[-73.118843,40.911386],[-73.11895,40.911114],[-73.119007,40.910972],[-73.119038,40.910789],[-73.11906999999999,40.910249],[-73.119108,40.910152],[-73.11917099999999,40.910035],[-73.119253,40.90995],[-73.119401,40.909834],[-73.119561,40.909757],[-73.11971699999999,40.909713],[-73.120266,40.909693],[-73.120784,40.909716],[-73.12143399999999,40.909785],[-73.121753,40.909852],[-73.12193000000001,40.90988],[-73.12281400000001,40.909877],[-73.123166,40.909811],[-73.12385500000001,40.910221],[-73.124286,40.910318],[-73.124827,40.910539],[-73.126017,40.910942],[-73.126352,40.911076],[-73.127847,40.911929],[-73.128157,40.912163],[-73.12852599999999,40.91247],[-73.128668,40.912604],[-73.12893800000001,40.912876],[-73.12927000000001,40.913179],[-73.12971,40.913594],[-73.12988300000001,40.913839],[-73.12994500000001,40.913919],[-73.130055,40.914059],[-73.13017499999999,40.914244],[-73.13026000000001,40.914428],[-73.13037199999999,40.914725],[-73.13043999999999,40.914977],[-73.13046799999999,40.915242],[-73.130464,40.915439]]],"type":"Polygon"}
}