{
  "id": "360450618002",
  "type": "Feature",
  "properties": {
    "area_land":21163028,
    "area_water":342031,
    "geoid":"360450618002",
    "name":"Block Group 2",
    "state":"ny"
},
  "bbox": [
    -76.015413,
    43.859122,
    -75.919081,
    43.940549
],
  "geometry": {"coordinates":[[[-76.015413,43.868826],[-76.01531300000001,43.869275],[-76.01527400000001,43.869268],[-76.01483399999999,43.869267],[-76.014627,43.870141],[-76.014385,43.871077],[-76.01419199999999,43.871693],[-76.014021,43.872141],[-76.013977,43.872241],[-76.013779,43.87269],[-76.01351099999999,43.873239],[-76.01326400000001,43.873687],[-76.013154,43.873894],[-76.012781,43.874524],[-76.01271199999999,43.874628],[-76.012455,43.875007],[-76.01199,43.875599],[-76.011196,43.876526],[-76.010749,43.876996],[-76.010265,43.877455],[-76.009745,43.877921],[-76.00922300000001,43.878363],[-76.005433,43.881647],[-76.002887,43.883858],[-76.001885,43.884728],[-76.00141600000001,43.885137],[-76.000523,43.885903],[-76.00021700000001,43.886168],[-75.999494,43.886811],[-75.999364,43.886926],[-75.998991,43.887251],[-75.998953,43.88723],[-75.998642,43.887054],[-75.99839799999999,43.886913],[-75.99629,43.88569],[-75.996031,43.885542],[-75.995836,43.88543],[-75.995408,43.885174],[-75.994545,43.884416],[-75.993953,43.883876],[-75.993753,43.883696],[-75.99350099999999,43.883444],[-75.99331599999999,43.883236],[-75.99327,43.883169],[-75.993094,43.882851],[-75.993003,43.882629],[-75.99312999999999,43.884081],[-75.99315199999999,43.884226],[-75.99315799999999,43.88442],[-75.993138,43.884676],[-75.993106,43.884844],[-75.993048,43.885049],[-75.99292800000001,43.885332],[-75.99275299999999,43.885599],[-75.99257299999999,43.885825],[-75.992385,43.886023],[-75.99141299999999,43.886836],[-75.99117099999999,43.887029],[-75.991,43.887152],[-75.99063200000001,43.887351],[-75.990488,43.887418],[-75.989496,43.887812],[-75.988955,43.888011],[-75.987925,43.888424],[-75.986903,43.888817],[-75.986814,43.888818],[-75.98593700000001,43.889165],[-75.985783,43.889231],[-75.985011,43.88954],[-75.983555,43.890149],[-75.983029,43.8904],[-75.98130500000001,43.891365],[-75.980977,43.891539],[-75.980414,43.89179],[-75.979945,43.891965],[-75.979221,43.89221],[-75.978121,43.892582],[-75.975759,43.89338],[-75.97512399999999,43.893626],[-75.974706,43.893812],[-75.974288,43.894014],[-75.972956,43.894669],[-75.97243,43.894927],[-75.97019299999999,43.896024],[-75.96972,43.896274],[-75.969313,43.896529],[-75.96696900000001,43.898107],[-75.96646200000001,43.898432],[-75.96593799999999,43.898745],[-75.96384,43.899922],[-75.962233,43.900817],[-75.961164,43.901386],[-75.96062999999999,43.901634],[-75.96033,43.901753],[-75.959778,43.901972],[-75.95942599999999,43.902102],[-75.95912,43.90221],[-75.957945,43.902639],[-75.95726500000001,43.902914],[-75.956897,43.903089],[-75.95639300000001,43.903366],[-75.95581199999999,43.903738],[-75.95532300000001,43.904106],[-75.951731,43.906928],[-75.94784900000001,43.909995],[-75.947177,43.910484],[-75.946788,43.910767],[-75.94547300000001,43.91167],[-75.94517399999999,43.911904],[-75.94483200000001,43.912212],[-75.943641,43.913431],[-75.94311500000001,43.913993],[-75.942798,43.914383],[-75.94265,43.914618],[-75.942481,43.914988],[-75.942379,43.915311],[-75.942296,43.915786],[-75.94202300000001,43.917871],[-75.94201099999999,43.917957],[-75.941987,43.918134],[-75.941975,43.918219],[-75.94193799999999,43.918495],[-75.941858,43.919242],[-75.94183099999999,43.919673],[-75.941851,43.920239],[-75.94193,43.921186],[-75.942049,43.922485],[-75.942063,43.922635],[-75.942069,43.923156],[-75.942038,43.923507],[-75.94194400000001,43.923892],[-75.94161200000001,43.924941],[-75.941208,43.926077],[-75.940691,43.927398],[-75.940309,43.928377],[-75.940033,43.929075],[-75.939729,43.929733],[-75.939607,43.929938],[-75.93930899999999,43.930351],[-75.93896599999999,43.930759],[-75.938756,43.930961],[-75.938571,43.931163],[-75.938303,43.931409],[-75.93809299999999,43.931584],[-75.937994,43.93167],[-75.937674,43.931891],[-75.937303,43.932117],[-75.936768,43.932388],[-75.93110799999999,43.935051],[-75.927458,43.936796],[-75.922674,43.939077],[-75.92189399999999,43.939471],[-75.921369,43.939772],[-75.920678,43.940223],[-75.920614,43.94018],[-75.920552,43.940153],[-75.92045,43.94015],[-75.92025700000001,43.940166],[-75.920143,43.940199],[-75.919989,43.940262],[-75.919406,43.940549],[-75.919346,43.940292],[-75.919302,43.939956],[-75.91910900000001,43.938623],[-75.91908100000001,43.938317],[-75.919096,43.937501],[-75.919138,43.937131],[-75.919186,43.936944],[-75.919239,43.936821],[-75.919304,43.936671],[-75.919556,43.936222],[-75.919934,43.93561],[-75.920383,43.934856],[-75.920856,43.93411],[-75.921937,43.93236],[-75.922268,43.93188],[-75.922898,43.930971],[-75.9243,43.928988],[-75.924537,43.928669],[-75.92494499999999,43.928089],[-75.92540099999999,43.927463],[-75.926346,43.926132],[-75.926811,43.925438],[-75.92706099999999,43.925083],[-75.927235,43.92489],[-75.92787800000001,43.924283],[-75.92818800000001,43.923906],[-75.928245,43.923816],[-75.928428,43.92353],[-75.92870499999999,43.923078],[-75.928714,43.92306],[-75.92890300000001,43.922649],[-75.928985,43.922445],[-75.92956100000001,43.920772],[-75.929652,43.920564],[-75.929765,43.920357],[-75.930063,43.919948],[-75.93019099999999,43.919699],[-75.93025799999999,43.919478],[-75.930364,43.918685],[-75.930468,43.917677],[-75.93058600000001,43.916629],[-75.930724,43.915249],[-75.93101900000001,43.912465],[-75.931094,43.911893],[-75.93121600000001,43.910796],[-75.931342,43.909871],[-75.931572,43.907918],[-75.93159900000001,43.907597],[-75.931888,43.904949],[-75.93194099999999,43.904574],[-75.932018,43.903791],[-75.93208199999999,43.903434],[-75.93217,43.903194],[-75.932264,43.903026],[-75.93232500000001,43.902945],[-75.932417,43.902855],[-75.93262,43.902693],[-75.933047,43.902437],[-75.93443499999999,43.901699],[-75.935288,43.901266],[-75.93603299999999,43.900874],[-75.93667600000001,43.900542],[-75.937437,43.900186],[-75.938901,43.899569],[-75.939409,43.899327],[-75.93981100000001,43.899116],[-75.94107,43.898301],[-75.942685,43.897218],[-75.94317599999999,43.896859],[-75.943507,43.896568],[-75.94361000000001,43.896457],[-75.94389700000001,43.896106],[-75.945865,43.893455],[-75.946265,43.892882],[-75.94631699999999,43.892808],[-75.946485,43.892557],[-75.946895,43.891945],[-75.948244,43.889986],[-75.948694,43.889307],[-75.94889499999999,43.888894],[-75.94906400000001,43.888404],[-75.94913,43.888131],[-75.949156,43.88783],[-75.94916499999999,43.887543],[-75.949212,43.886756],[-75.949291,43.886237],[-75.94956000000001,43.884975],[-75.949714,43.884429],[-75.95043,43.882375],[-75.951026,43.88074],[-75.951317,43.880078],[-75.95161899999999,43.879519],[-75.952157,43.878617],[-75.952685,43.877784],[-75.953157,43.877099],[-75.95343099999999,43.87674],[-75.95375300000001,43.87637],[-75.95414100000001,43.875977],[-75.954936,43.875243],[-75.955223,43.875],[-75.95552600000001,43.87476],[-75.95571,43.874627],[-75.95676400000001,43.873825],[-75.957639,43.873138],[-75.958099,43.872795],[-75.958427,43.872514],[-75.95863,43.872303],[-75.95881900000001,43.872106],[-75.960196,43.870451],[-75.96041700000001,43.870238],[-75.960649,43.87007],[-75.960987,43.869873],[-75.962176,43.86916],[-75.96345100000001,43.868428],[-75.96394100000001,43.868126],[-75.96405799999999,43.868022],[-75.964156,43.867881],[-75.964226,43.867687],[-75.964286,43.867412],[-75.964461,43.866316],[-75.964788,43.864432],[-75.964968,43.863478],[-75.965193,43.8625],[-75.965628,43.860711],[-75.965806,43.859938],[-75.966446,43.859964],[-75.967266,43.859964],[-75.971378,43.859886],[-75.97255199999999,43.859837],[-75.97273300000001,43.859827],[-75.97727500000001,43.859593],[-75.98042100000001,43.859324],[-75.98161500000001,43.859209],[-75.982178,43.859168],[-75.98306100000001,43.859149],[-75.988569,43.859122],[-75.98935899999999,43.859132],[-75.990973,43.859183],[-75.992305,43.859228],[-75.992434,43.859232],[-75.996326,43.859371],[-75.996371,43.859373],[-75.998323,43.859442],[-75.998362,43.859443],[-75.998773,43.859454],[-75.99999699999999,43.859513],[-76.00236599999999,43.85969],[-76.003345,43.859757],[-76.003929,43.859804],[-76.004552,43.859873],[-76.00506300000001,43.859976],[-76.00540100000001,43.860089],[-76.005593,43.860135],[-76.005621,43.860156],[-76.005803,43.860298],[-76.006022,43.860477],[-76.00625599999999,43.860668],[-76.00733099999999,43.861633],[-76.00781000000001,43.862079],[-76.00785500000001,43.862122],[-76.00800099999999,43.862263],[-76.008137,43.862392],[-76.008207,43.862457],[-76.008269,43.862516],[-76.00835600000001,43.862596],[-76.00841,43.862647],[-76.00904800000001,43.863245],[-76.009469,43.863616],[-76.01015599999999,43.86421],[-76.010684,43.864684],[-76.010704,43.864702],[-76.01094500000001,43.864908],[-76.013471,43.867188],[-76.01349999999999,43.867214],[-76.01374800000001,43.867436],[-76.01427700000001,43.867875],[-76.014307,43.8679],[-76.01482,43.868331],[-76.014983,43.868466],[-76.015018,43.868496],[-76.015379,43.868798],[-76.015413,43.868826]]],"type":"Polygon"}
}