{
  "id": "360050067003",
  "type": "Feature",
  "properties": {
    "area_land":24721,
    "area_water":0,
    "geoid":"360050067003",
    "name":"Block Group 3",
    "state":"ny"
},
  "bbox": [
    -73.921478,
    40.81978,
    -73.919178,
    40.822095
],
  "geometry": {"coordinates":[[[-73.92119,40.820833],[-73.920891,40.821494],[-73.920665,40.821837],[-73.920463,40.821997],[-73.920401,40.822047],[-73.92034,40.822095],[-73.91978899999999,40.821941],[-73.919178,40.82177],[-73.91938399999999,40.821118],[-73.919995,40.821287],[-73.920096,40.821315],[-73.92032399999999,40.821223],[-73.92046499999999,40.82086],[-73.920329,40.820644],[-73.919617,40.820444],[-73.919844,40.81978],[-73.920581,40.819969],[-73.92147799999999,40.8202],[-73.92119,40.820833]]],"type":"Polygon"}
}