{
  "id": "360319605984",
  "type": "Feature",
  "properties": {
    "area_land":51622340,
    "area_water":599633,
    "geoid":"360319605984",
    "name":"Block Group 4",
    "state":"ny"
},
  "bbox": [
    -73.982272,
    44.218273,
    -73.879019,
    44.336743
],
  "geometry": {"coordinates":[[[-73.98227199999999,44.278084],[-73.982219,44.278267],[-73.982135,44.278399],[-73.98201,44.278521],[-73.98185700000001,44.278622],[-73.981041,44.27904],[-73.980954,44.279089],[-73.980695,44.279239],[-73.980647,44.279268],[-73.980192,44.279554],[-73.979719,44.27911],[-73.97968,44.279073],[-73.97945900000001,44.278884],[-73.97945,44.278877],[-73.979236,44.278762],[-73.97919899999999,44.278749],[-73.979072,44.278704],[-73.978888,44.278668],[-73.978773,44.278646],[-73.97791599999999,44.278537],[-73.977716,44.278511],[-73.97751700000001,44.278489],[-73.977159,44.278458],[-73.97676800000001,44.278458],[-73.97640699999999,44.278497],[-73.976061,44.278574],[-73.975773,44.278673],[-73.97552899999999,44.27879],[-73.9755,44.278804],[-73.975247,44.278959],[-73.974777,44.279319],[-73.974474,44.27952],[-73.97411,44.279703],[-73.973432,44.280011],[-73.973101,44.280208],[-73.97282,44.280413],[-73.971625,44.281428],[-73.971339,44.281689],[-73.970669,44.282317],[-73.969677,44.283294],[-73.969115,44.283825],[-73.96870199999999,44.284163],[-73.968288,44.284461],[-73.96804,44.284624],[-73.967682,44.284861],[-73.96751,44.284964],[-73.966764,44.285426],[-73.965981,44.28591],[-73.96500899999999,44.286556],[-73.96379399999999,44.287394],[-73.962951,44.287989],[-73.960573,44.289603],[-73.960233,44.289799],[-73.959824,44.289994],[-73.959001,44.290355],[-73.957971,44.29086],[-73.95769900000001,44.29097],[-73.95728099999999,44.29111],[-73.956469,44.291331],[-73.95583499999999,44.291485],[-73.955237,44.291605],[-73.954609,44.291723],[-73.953159,44.292078],[-73.952808,44.292141],[-73.951848,44.29225],[-73.95154700000001,44.292304],[-73.95120300000001,44.292392],[-73.951054,44.29244],[-73.950819,44.292541],[-73.950722,44.292596],[-73.95064499999999,44.29264],[-73.95050999999999,44.292722],[-73.950322,44.292855],[-73.95012800000001,44.293009],[-73.949911,44.293227],[-73.94972799999999,44.29347],[-73.94915399999999,44.294428],[-73.949043,44.294582],[-73.94886200000001,44.294784],[-73.948567,44.29502],[-73.948027,44.295418],[-73.947524,44.295854],[-73.947163,44.296126],[-73.94679600000001,44.296328],[-73.94629999999999,44.296556],[-73.945994,44.296681],[-73.945769,44.296745],[-73.94557399999999,44.296781],[-73.94525,44.296807],[-73.94498900000001,44.296807],[-73.944638,44.296778],[-73.94385699999999,44.296669],[-73.943549,44.296656],[-73.943324,44.296665],[-73.94298999999999,44.296722],[-73.94279,44.296776],[-73.942595,44.296846],[-73.942391,44.296945],[-73.942143,44.297099],[-73.941926,44.297289],[-73.94177500000001,44.297477],[-73.94145899999999,44.297976],[-73.941349,44.298116],[-73.941112,44.298358],[-73.940957,44.298499],[-73.94073299999999,44.298668],[-73.940493,44.298818],[-73.940258,44.298941],[-73.93986200000001,44.299105],[-73.939032,44.299366],[-73.938576,44.299549],[-73.938202,44.29975],[-73.937753,44.300051],[-73.937253,44.300416],[-73.936696,44.300792],[-73.936423,44.300934],[-73.93627499999999,44.300999],[-73.935766,44.301164],[-73.93531900000001,44.301283],[-73.935129,44.301319],[-73.934774,44.301354],[-73.93462,44.301354],[-73.934302,44.301319],[-73.93414300000001,44.301287],[-73.933542,44.301117],[-73.932678,44.30084],[-73.931827,44.300555],[-73.93079400000001,44.300226],[-73.930435,44.300138],[-73.930052,44.300074],[-73.929807,44.30005],[-73.929563,44.300041],[-73.929328,44.300041],[-73.928772,44.300092],[-73.928327,44.300193],[-73.928141,44.300243],[-73.927819,44.300362],[-73.92763600000001,44.300442],[-73.92726399999999,44.30065],[-73.926928,44.30088],[-73.92662199999999,44.301062],[-73.92631799999999,44.301207],[-73.926011,44.301328],[-73.925338,44.301537],[-73.92393,44.301954],[-73.92323399999999,44.302184],[-73.922912,44.302304],[-73.92226100000001,44.302623],[-73.921588,44.302982],[-73.921115,44.303249],[-73.920716,44.303496],[-73.91958099999999,44.304339],[-73.919219,44.304579],[-73.91881100000001,44.304801],[-73.918052,44.305164],[-73.91768500000001,44.30535],[-73.917405,44.305535],[-73.91716,44.305757],[-73.91661999999999,44.306396],[-73.916371,44.306631],[-73.915778,44.307102],[-73.91560200000001,44.307276],[-73.91545499999999,44.307492],[-73.91538300000001,44.307662],[-73.915347,44.307794],[-73.915334,44.308026],[-73.91535,44.308246],[-73.915538,44.309521],[-73.91556300000001,44.309985],[-73.91555,44.310115],[-73.915474,44.310373],[-73.915359,44.310667],[-73.91463,44.311977],[-73.914534,44.312211],[-73.914456,44.312577],[-73.914455,44.312836],[-73.914483,44.313054],[-73.914525,44.313203],[-73.914728,44.31375],[-73.914778,44.313898],[-73.914834,44.31415],[-73.914986,44.315105],[-73.915024,44.315228],[-73.915126,44.315491],[-73.915527,44.316202],[-73.91561400000001,44.316425],[-73.91565900000001,44.316589],[-73.91570400000001,44.316916],[-73.915683,44.317136],[-73.915643,44.317353],[-73.915553,44.317667],[-73.914984,44.319368],[-73.914788,44.319851],[-73.91463899999999,44.320079],[-73.914276,44.320538],[-73.91415499999999,44.320642],[-73.91373400000001,44.32094],[-73.91349599999999,44.321133],[-73.913207,44.321396],[-73.91302399999999,44.321596],[-73.912791,44.321957],[-73.912684,44.322199],[-73.912392,44.323154],[-73.91231500000001,44.323368],[-73.912114,44.323812],[-73.910484,44.326524],[-73.910336,44.326728],[-73.91001900000001,44.32707],[-73.909847,44.327217],[-73.909581,44.327404],[-73.909446,44.327494],[-73.90887499999999,44.327837],[-73.90819500000001,44.328198],[-73.90759799999999,44.328495],[-73.90741199999999,44.328599],[-73.907132,44.328813],[-73.906997,44.328924],[-73.90633,44.329584],[-73.905883,44.330042],[-73.903761,44.332146],[-73.90325900000001,44.332629],[-73.90243700000001,44.333312],[-73.901944,44.333702],[-73.900386,44.334872],[-73.89992100000001,44.33519],[-73.899715,44.335321],[-73.899156,44.335674],[-73.89789399999999,44.33661],[-73.897696,44.336743],[-73.89669499999999,44.330682],[-73.896669,44.330558],[-73.896641,44.330328],[-73.895993,44.326058],[-73.893575,44.310964],[-73.89154499999999,44.298158],[-73.883313,44.250046],[-73.882034,44.242383],[-73.879019,44.224305],[-73.879217,44.224211],[-73.87970799999999,44.223934],[-73.88055799999999,44.223477],[-73.88105400000001,44.223225],[-73.882138,44.222549],[-73.88290499999999,44.222103],[-73.884469,44.22115],[-73.88479700000001,44.220928],[-73.885126,44.220671],[-73.885285,44.220523],[-73.885627,44.22015],[-73.88596,44.219771],[-73.88606,44.21968],[-73.886242,44.21954],[-73.88645,44.219414],[-73.88673799999999,44.219274],[-73.88767,44.218973],[-73.88802800000001,44.218855],[-73.888383,44.21874],[-73.889093,44.218534],[-73.889352,44.21848],[-73.889788,44.218407],[-73.89052700000001,44.218358],[-73.892415,44.21831],[-73.893728,44.218279],[-73.894031,44.218273],[-73.894553,44.218294],[-73.894831,44.218321],[-73.89515400000001,44.218366],[-73.89569899999999,44.21848],[-73.895943,44.218548],[-73.89625599999999,44.218653],[-73.896665,44.218826],[-73.89688200000001,44.218935],[-73.897284,44.219161],[-73.897526,44.219325],[-73.89784,44.219585],[-73.89803499999999,44.219774],[-73.898364,44.22017],[-73.898421,44.220238],[-73.89865,44.220555],[-73.898833,44.220809],[-73.899083,44.221157],[-73.899265,44.221389],[-73.899385,44.221542],[-73.899653,44.221843],[-73.89998799999999,44.222179],[-73.900486,44.222613],[-73.90099499999999,44.222972],[-73.90123199999999,44.223123],[-73.901827,44.223451],[-73.90228,44.223669],[-73.902755,44.223866],[-73.90558900000001,44.224837],[-73.906392,44.225108],[-73.90667999999999,44.225219],[-73.90706299999999,44.225389],[-73.907506,44.225649],[-73.907856,44.225873],[-73.90819,44.226126],[-73.908289,44.226212],[-73.90857,44.226496],[-73.908664,44.226609],[-73.908849,44.226833],[-73.909004,44.227078],[-73.90916,44.227358],[-73.90920300000001,44.227434],[-73.9093,44.227603],[-73.909734,44.228331],[-73.910579,44.229748],[-73.911097,44.230603],[-73.911288,44.230929],[-73.91144799999999,44.231218],[-73.911674,44.231703],[-73.91186399999999,44.232199],[-73.912043,44.232772],[-73.91211800000001,44.233069],[-73.912143,44.233166],[-73.91224,44.233709],[-73.912252,44.23384],[-73.912268,44.234014],[-73.912291,44.234261],[-73.91230299999999,44.234379],[-73.91230299999999,44.234442],[-73.912307,44.234763],[-73.912318,44.235803],[-73.912345,44.23601],[-73.912398,44.236209],[-73.912505,44.236454],[-73.912707,44.236777],[-73.91276999999999,44.236853],[-73.912975,44.237072],[-73.913219,44.237275],[-73.913471,44.237436],[-73.91376700000001,44.237587],[-73.91399199999999,44.237678],[-73.915083,44.238057],[-73.91724600000001,44.238793],[-73.920007,44.239801],[-73.923436,44.241053],[-73.92376299999999,44.241157],[-73.92407900000001,44.241243],[-73.924103,44.241249],[-73.924491,44.241337],[-73.924999,44.241425],[-73.92529500000001,44.241465],[-73.92594800000001,44.241522],[-73.92631299999999,44.241535],[-73.926569,44.24153],[-73.926925,44.241524],[-73.927441,44.241487],[-73.927999,44.241417],[-73.928123,44.241394],[-73.928532,44.241319],[-73.928906,44.241229],[-73.931825,44.240448],[-73.932249,44.240336],[-73.93247599999999,44.240286],[-73.932914,44.240216],[-73.933138,44.240202],[-73.93321899999999,44.240197],[-73.933334,44.24019],[-73.933729,44.240188],[-73.93419,44.240226],[-73.93452600000001,44.240279],[-73.93481800000001,44.240343],[-73.93522400000001,44.240467],[-73.935368,44.240511],[-73.93664699999999,44.240984],[-73.93738,44.241267],[-73.9375,44.241313],[-73.937769,44.24141],[-73.93811599999999,44.241537],[-73.93882600000001,44.241761],[-73.939314,44.241871],[-73.939795,44.241949],[-73.940264,44.241998],[-73.940837,44.24202],[-73.941323,44.242011],[-73.94373299999999,44.241878],[-73.943896,44.241869],[-73.945829,44.241752],[-73.946594,44.241718],[-73.947337,44.241665],[-73.948043,44.241637],[-73.948313,44.241634],[-73.948812,44.241656],[-73.949245,44.241699],[-73.949726,44.241787],[-73.950047,44.24186],[-73.95107899999999,44.242191],[-73.95146099999999,44.242325],[-73.952066,44.242536],[-73.95498000000001,44.243554],[-73.959616,44.245153],[-73.96010699999999,44.245332],[-73.960463,44.245461],[-73.961298,44.245831],[-73.962142,44.246255],[-73.963555,44.247062],[-73.96446,44.247572],[-73.964862,44.247824],[-73.965211,44.248086],[-73.96544799999999,44.248302],[-73.96569,44.248556],[-73.965825,44.248719],[-73.965969,44.248922],[-73.96608000000001,44.249107],[-73.96616899999999,44.249296],[-73.96629,44.249635],[-73.96637200000001,44.25],[-73.966382,44.250435],[-73.96635499999999,44.25069],[-73.96628,44.250947],[-73.966148,44.251215],[-73.966024,44.251406],[-73.965844,44.251626],[-73.965576,44.251875],[-73.965309,44.252055],[-73.964603,44.252462],[-73.964342,44.252653],[-73.96396900000001,44.253032],[-73.96246600000001,44.254615],[-73.962311,44.254805],[-73.962165,44.255023],[-73.962039,44.255283],[-73.96195299999999,44.255594],[-73.961933,44.255788],[-73.961944,44.256055],[-73.961963,44.256165],[-73.962022,44.256364],[-73.962157,44.25667],[-73.962373,44.257096],[-73.962673,44.257659],[-73.96283,44.257894],[-73.963026,44.258133],[-73.963274,44.258376],[-73.963534,44.25859],[-73.963852,44.258809],[-73.96424399999999,44.259025],[-73.96534200000001,44.259525],[-73.96648999999999,44.26005],[-73.96669799999999,44.260153],[-73.966922,44.260277],[-73.967224,44.260467],[-73.967553,44.260707],[-73.967868,44.260982],[-73.96813400000001,44.261257],[-73.96839199999999,44.261596],[-73.968568,44.261884],[-73.968658,44.262066],[-73.968981,44.262883],[-73.96909599999999,44.263172],[-73.969246,44.263579],[-73.969508,44.264273],[-73.969762,44.26486],[-73.96994100000001,44.265209],[-73.97005299999999,44.265392],[-73.97027300000001,44.265714],[-73.970668,44.266211],[-73.97096000000001,44.266524],[-73.971352,44.266879],[-73.971735,44.267184],[-73.972156,44.267478],[-73.973023,44.268015],[-73.973286,44.268171],[-73.97376,44.268446],[-73.97371,44.268635],[-73.973866,44.268508],[-73.974296,44.268748],[-73.97480299999999,44.269017],[-73.976422,44.269807],[-73.97751599999999,44.270341],[-73.97767899999999,44.270436],[-73.977802,44.270508],[-73.977966,44.270604],[-73.978211,44.270758],[-73.978871,44.27122],[-73.978915,44.271254],[-73.979006,44.271325],[-73.97918199999999,44.271469],[-73.97926099999999,44.271543],[-73.97933399999999,44.271634],[-73.979409,44.271751],[-73.979435,44.271831],[-73.97944200000001,44.271893],[-73.97945199999999,44.271977],[-73.97946,44.272042],[-73.97946,44.272063],[-73.97946,44.272137],[-73.97946,44.2722],[-73.97946,44.272319],[-73.97947000000001,44.27236],[-73.979512,44.272524],[-73.97958199999999,44.272685],[-73.979721,44.27293],[-73.980379,44.27395],[-73.98084299999999,44.274659],[-73.980947,44.274922],[-73.98117999999999,44.276091],[-73.9812,44.276306],[-73.98119199999999,44.27638],[-73.981178,44.276505],[-73.981162,44.276583],[-73.981154,44.276687],[-73.981188,44.276844],[-73.98128199999999,44.27697],[-73.981364,44.277038],[-73.981453,44.277092],[-73.981883,44.277304],[-73.98206999999999,44.277447],[-73.982128,44.277527],[-73.98218799999999,44.277686],[-73.98227199999999,44.277952],[-73.98227199999999,44.278084]]],"type":"Polygon"}
}