{
  "id": "360830524044",
  "type": "Feature",
  "properties": {
    "area_land":942773,
    "area_water":0,
    "geoid":"360830524044",
    "name":"Block Group 4",
    "state":"ny"
},
  "bbox": [
    -73.744969,
    42.611934,
    -73.731356,
    42.628959
],
  "geometry": {"coordinates":[[[-73.744969,42.615525],[-73.74488700000001,42.617025],[-73.744873,42.617176],[-73.744867,42.617281],[-73.744316,42.62081],[-73.743904,42.623271],[-73.743458,42.626214],[-73.743101,42.628513],[-73.743042,42.628959],[-73.742636,42.628281],[-73.74138000000001,42.626568],[-73.740736,42.625742],[-73.74021,42.624965],[-73.739683,42.624314],[-73.739473,42.624119],[-73.738782,42.623359],[-73.73831,42.622937],[-73.73813699999999,42.622785],[-73.737668,42.622363],[-73.73752,42.622236],[-73.73566700000001,42.620535],[-73.73551,42.6204],[-73.73523900000001,42.620167],[-73.734891,42.619844],[-73.734336,42.619359],[-73.733969,42.61904],[-73.733908,42.618991],[-73.733333,42.61845],[-73.733142,42.618288],[-73.732972,42.618145],[-73.73266700000001,42.617867],[-73.73195200000001,42.617285],[-73.73135600000001,42.616721],[-73.731461,42.61665],[-73.73256600000001,42.616011],[-73.732845,42.616239],[-73.73396700000001,42.615602],[-73.734796,42.615125],[-73.735297,42.614796],[-73.735395,42.614752],[-73.735535,42.614701],[-73.73607699999999,42.615336],[-73.736637,42.616043],[-73.73691100000001,42.616429],[-73.73698899999999,42.61656],[-73.737003,42.61666],[-73.73725,42.616314],[-73.737472,42.61584],[-73.737624,42.615508],[-73.737718,42.615227],[-73.737747,42.614777],[-73.737729,42.614379],[-73.740854,42.614441],[-73.74148099999999,42.614459],[-73.74153,42.613702],[-73.741597,42.6133],[-73.74162099999999,42.613219],[-73.741652,42.613195],[-73.741713,42.613155],[-73.74181,42.613137],[-73.742414,42.613143],[-73.74244,42.611934],[-73.743084,42.611961],[-73.74314,42.611987],[-73.74315,42.612],[-73.743174,42.612125],[-73.74311299999999,42.613164],[-73.743905,42.613186],[-73.744106,42.613204],[-73.744392,42.613254],[-73.74494300000001,42.613244],[-73.744946,42.613739],[-73.744947,42.613802],[-73.744969,42.615525]]],"type":"Polygon"}
}