{
  "id": "360471182022",
  "type": "Feature",
  "properties": {
    "area_land":61992,
    "area_water":0,
    "geoid":"360471182022",
    "name":"Block Group 2",
    "state":"ny"
},
  "bbox": [
    -73.870948,
    40.686116,
    -73.867018,
    40.690709
],
  "geometry": {"coordinates":[[[-73.870482,40.690619],[-73.87012799999999,40.690709],[-73.86945299999999,40.687878],[-73.868351,40.688151],[-73.868227,40.687616],[-73.867277,40.687745],[-73.867018,40.68683],[-73.867986,40.686594],[-73.869084,40.686322],[-73.86990900000001,40.686116],[-73.86999900000001,40.686503],[-73.87027500000001,40.687673],[-73.870948,40.690502],[-73.870482,40.690619]]],"type":"Polygon"}
}