{
  "id": "360810063004",
  "type": "Feature",
  "properties": {
    "area_land":53304,
    "area_water":0,
    "geoid":"360810063004",
    "name":"Block Group 4",
    "state":"ny"
},
  "bbox": [
    -73.919484,
    40.761695,
    -73.915791,
    40.76502
],
  "geometry": {"coordinates":[[[-73.91929500000001,40.76268],[-73.917389,40.76502],[-73.91659,40.764644],[-73.915791,40.764268],[-73.917888,40.761695],[-73.91868599999999,40.762072],[-73.918966,40.762204],[-73.919484,40.762449],[-73.91929500000001,40.76268]]],"type":"Polygon"}
}