{
  "id": "360610068003",
  "type": "Feature",
  "properties": {
    "area_land":24400,
    "area_water":0,
    "geoid":"360610068003",
    "name":"Block Group 3",
    "state":"ny"
},
  "bbox": [
    -73.987302,
    40.737546,
    -73.983632,
    40.739522
],
  "geometry": {"coordinates":[[[-73.987302,40.738903],[-73.98684900000001,40.739522],[-73.985232,40.73884],[-73.984514,40.738537],[-73.983632,40.738165],[-73.984082,40.737546],[-73.984981,40.737927],[-73.985675,40.738219],[-73.986425,40.738535],[-73.98685399999999,40.738714],[-73.987302,40.738903]]],"type":"Polygon"}
}