{
  "id": "360270701021",
  "type": "Feature",
  "properties": {
    "area_land":5180026,
    "area_water":61006,
    "geoid":"360270701021",
    "name":"Block Group 1",
    "state":"ny"
},
  "bbox": [
    -73.898364,
    41.825683,
    -73.868006,
    41.851031
],
  "geometry": {"coordinates":[[[-73.89836099999999,41.841652],[-73.89833400000001,41.842045],[-73.898251,41.842523],[-73.898197,41.842744],[-73.898141,41.842913],[-73.897853,41.843625],[-73.897616,41.844058],[-73.897294,41.84454],[-73.896918,41.844995],[-73.896624,41.845291],[-73.896201,41.845674],[-73.89528,41.846472],[-73.89490499999999,41.846832],[-73.894502,41.84728],[-73.894217,41.847613],[-73.89319500000001,41.848827],[-73.89304199999999,41.848983],[-73.89287400000001,41.849138],[-73.89245099999999,41.849492],[-73.89208499999999,41.849753],[-73.891772,41.849942],[-73.890908,41.850463],[-73.890168,41.850898],[-73.889948,41.851031],[-73.889523,41.850852],[-73.88459,41.848775],[-73.87863400000001,41.846412],[-73.871258,41.84678],[-73.871201,41.846474],[-73.870728,41.843903],[-73.868843,41.832724],[-73.86800599999999,41.82657],[-73.868441,41.826438],[-73.868467,41.82643],[-73.86852500000001,41.826399],[-73.86906999999999,41.826018],[-73.869158,41.825969],[-73.869699,41.825737],[-73.869872,41.825699],[-73.870172,41.825683],[-73.87072000000001,41.825719],[-73.870948,41.825764],[-73.87103399999999,41.825781],[-73.871201,41.825814],[-73.871493,41.825916],[-73.871712,41.825981],[-73.871959,41.825998],[-73.872518,41.826001],[-73.872552,41.826459],[-73.874143,41.826819],[-73.874692,41.82692],[-73.87485700000001,41.826935],[-73.875023,41.826943],[-73.87519899999999,41.826927],[-73.875893,41.826812],[-73.876672,41.8267],[-73.8767,41.826696],[-73.87701,41.826665],[-73.877408,41.826666],[-73.877618,41.826673],[-73.878044,41.826686],[-73.878244,41.826668],[-73.879065,41.826454],[-73.87921900000001,41.826423],[-73.87928700000001,41.82642],[-73.879516,41.826412],[-73.87978099999999,41.82642],[-73.88038299999999,41.826462],[-73.88062499999999,41.826467],[-73.88101899999999,41.826437],[-73.88167799999999,41.826283],[-73.88196000000001,41.826254],[-73.88217899999999,41.826245],[-73.882688,41.82625],[-73.883092,41.826254],[-73.883396,41.826287],[-73.883548,41.826316],[-73.88437,41.826601],[-73.884691,41.826827],[-73.885147,41.82723],[-73.885789,41.827844],[-73.88598,41.827959],[-73.886064,41.827986],[-73.886196,41.828004],[-73.88642299999999,41.828022],[-73.887045,41.827986],[-73.887201,41.827995],[-73.88742499999999,41.828027],[-73.887771,41.828107],[-73.887927,41.828151],[-73.888047,41.828195],[-73.888164,41.828236],[-73.888381,41.828355],[-73.888475,41.828438],[-73.888515,41.828503],[-73.888491,41.828729],[-73.888486,41.82878],[-73.888469,41.828872],[-73.888464,41.828901],[-73.888464,41.828998],[-73.888508,41.82917],[-73.88855100000001,41.829248],[-73.88871399999999,41.829386],[-73.888953,41.829523],[-73.88915900000001,41.829588],[-73.889658,41.829725],[-73.88982799999999,41.829746],[-73.889994,41.829749],[-73.89010500000001,41.82973],[-73.890192,41.829709],[-73.89048099999999,41.829628],[-73.891066,41.829426],[-73.89122500000001,41.829353],[-73.89133,41.829273],[-73.891516,41.82914],[-73.89163600000001,41.829019],[-73.891744,41.82893],[-73.89196099999999,41.828809],[-73.89206900000001,41.828785],[-73.89216399999999,41.828779],[-73.89252500000001,41.828849],[-73.892644,41.828849],[-73.892926,41.828825],[-73.89309900000001,41.828794],[-73.893233,41.828769],[-73.89335699999999,41.828747],[-73.893672,41.828723],[-73.893823,41.828731],[-73.893997,41.828755],[-73.894358,41.828831],[-73.894735,41.828925],[-73.89491099999999,41.828953],[-73.89504599999999,41.828963],[-73.895269,41.828946],[-73.895437,41.828904],[-73.89560400000001,41.828838],[-73.89569400000001,41.82879],[-73.89584499999999,41.828665],[-73.896068,41.82845],[-73.896207,41.828325],[-73.89628,41.828293],[-73.89647100000001,41.828273],[-73.89659399999999,41.828257],[-73.89647100000001,41.828605],[-73.89638600000001,41.828836],[-73.89634599999999,41.829082],[-73.89629600000001,41.829331],[-73.89627,41.829507],[-73.896233,41.829792],[-73.89622300000001,41.829965],[-73.896221,41.830104],[-73.896213,41.830304],[-73.896207,41.830475],[-73.896193,41.830859],[-73.896181,41.831161],[-73.896171,41.83139],[-73.89615499999999,41.831783],[-73.896151,41.831992],[-73.896151,41.832099],[-73.89614899999999,41.83224],[-73.896171,41.832516],[-73.89618900000001,41.832616],[-73.896213,41.832777],[-73.896241,41.832944],[-73.896278,41.833099],[-73.896308,41.833238],[-73.896366,41.833443],[-73.896474,41.833766],[-73.896496,41.833831],[-73.89654400000001,41.833933],[-73.896613,41.83408],[-73.896743,41.834347],[-73.896953,41.834696],[-73.897051,41.834865],[-73.897249,41.835205],[-73.89739899999999,41.835459],[-73.897586,41.835874],[-73.897711,41.836152],[-73.897766,41.836306],[-73.89782,41.836463],[-73.89791200000001,41.83677],[-73.897991,41.837099],[-73.898053,41.837442],[-73.898138,41.838185],[-73.898236,41.839505],[-73.898364,41.841354],[-73.89836099999999,41.841652]]],"type":"Polygon"}
}