{
  "id": "360050458001",
  "type": "Feature",
  "properties": {
    "area_land":82449,
    "area_water":0,
    "geoid":"360050458001",
    "name":"Block Group 1",
    "state":"ny"
},
  "bbox": [
    -73.847444,
    40.885031,
    -73.84118,
    40.888418
],
  "geometry": {"coordinates":[[[-73.847049,40.887672],[-73.84525600000001,40.887943],[-73.84465400000001,40.888033],[-73.843765,40.888168],[-73.842859,40.888307],[-73.84194100000001,40.888418],[-73.841543,40.887336],[-73.84117999999999,40.886408],[-73.843146,40.885031],[-73.84374099999999,40.885482],[-73.84331,40.885845],[-73.843261,40.885882],[-73.843205,40.885942],[-73.84316800000001,40.886011],[-73.84315100000001,40.886086],[-73.843155,40.886153],[-73.843176,40.886216],[-73.843215,40.886278],[-73.843238,40.886306],[-73.843384,40.886462],[-73.843558,40.886617],[-73.84375900000001,40.886767],[-73.843962,40.886893],[-73.84417999999999,40.887006],[-73.84438,40.887092],[-73.84460799999999,40.887173],[-73.844843,40.887239],[-73.845072,40.887287],[-73.845271,40.887318],[-73.84551,40.887341],[-73.845534,40.887344],[-73.84561100000001,40.887347],[-73.84571800000001,40.887335],[-73.84580099999999,40.887311],[-73.845878,40.887274],[-73.84594300000001,40.887228],[-73.846,40.887168],[-73.84603799999999,40.887103],[-73.84604899999999,40.887064],[-73.846295,40.886612],[-73.847444,40.886978],[-73.847049,40.887672]]],"type":"Polygon"}
}