{
  "id": "361190116004",
  "type": "Feature",
  "properties": {
    "area_land":116149,
    "area_water":0,
    "geoid":"361190116004",
    "name":"Block Group 4",
    "state":"ny"
},
  "bbox": [
    -73.868971,
    41.080478,
    -73.862601,
    41.084185
],
  "geometry": {"coordinates":[[[-73.868971,41.081801],[-73.86896,41.081919],[-73.86893999999999,41.082001],[-73.868909,41.082073],[-73.868791,41.082165],[-73.868585,41.082242],[-73.86822600000001,41.082339],[-73.86809599999999,41.082386],[-73.86779199999999,41.082497],[-73.867527,41.082583],[-73.866981,41.08275],[-73.86656600000001,41.082882],[-73.866438,41.082923],[-73.866384,41.082941],[-73.865948,41.083089],[-73.865861,41.083118],[-73.865094,41.083367],[-73.86488,41.083436],[-73.863637,41.083845],[-73.862899,41.084087],[-73.862601,41.084185],[-73.86277699999999,41.083673],[-73.86284000000001,41.08349],[-73.862943,41.083181],[-73.862995,41.083071],[-73.86300199999999,41.083057],[-73.863022,41.083012],[-73.863028,41.083001],[-73.863033,41.08299],[-73.8634,41.082196],[-73.863592,41.08172],[-73.863939,41.080809],[-73.86407699999999,41.080506],[-73.86409,41.080478],[-73.864487,41.080596],[-73.86585100000001,41.080824],[-73.866523,41.080741],[-73.866541,41.080811],[-73.867262,41.080488],[-73.867391,41.080609],[-73.867543,41.080809],[-73.867656,41.080926],[-73.86788199999999,41.08109],[-73.86815900000001,41.081229],[-73.868572,41.08139],[-73.86887299999999,41.08157],[-73.868937,41.08163],[-73.868955,41.081693],[-73.868961,41.081735],[-73.868971,41.081801]]],"type":"Polygon"}
}