{
  "id": "360810245002",
  "type": "Feature",
  "properties": {
    "area_land":71550,
    "area_water":0,
    "geoid":"360810245002",
    "name":"Block Group 2",
    "state":"ny"
},
  "bbox": [
    -73.908323,
    40.738551,
    -73.90453,
    40.741659
],
  "geometry": {"coordinates":[[[-73.90778400000001,40.740745],[-73.907556,40.741659],[-73.906339,40.741529],[-73.906391,40.740409],[-73.905474,40.740176],[-73.90452999999999,40.739925],[-73.904579,40.738551],[-73.90553300000001,40.738567],[-73.906475,40.738589],[-73.90713100000001,40.738613],[-73.90741,40.738609],[-73.908323,40.738631],[-73.90778400000001,40.740745]]],"type":"Polygon"}
}