{
  "id": "360470572001",
  "type": "Feature",
  "properties": {
    "area_land":121611,
    "area_water":0,
    "geoid":"360470572001",
    "name":"Block Group 1",
    "state":"ny"
},
  "bbox": [
    -73.938637,
    40.594126,
    -73.934949,
    40.598924
],
  "geometry": {"coordinates":[[[-73.938637,40.598609],[-73.93771099999999,40.598712],[-73.936758,40.598818],[-73.935804,40.598924],[-73.93536899999999,40.596542],[-73.935019,40.594782],[-73.934949,40.594429],[-73.93589900000001,40.594335],[-73.93778,40.594126],[-73.93788000000001,40.594644],[-73.938188,40.596232],[-73.938637,40.598609]]],"type":"Polygon"}
}