{
  "id": "360610066006",
  "type": "Feature",
  "properties": {
    "area_land":17914,
    "area_water":0,
    "geoid":"360610066006",
    "name":"Block Group 6",
    "state":"ny"
},
  "bbox": [
    -73.980418,
    40.737554,
    -73.977603,
    40.739168
],
  "geometry": {"coordinates":[[[-73.979967,40.739168],[-73.977603,40.738172],[-73.97805200000001,40.737554],[-73.980418,40.73855],[-73.979967,40.739168]]],"type":"Polygon"}
}