{
  "id": "360290092004",
  "type": "Feature",
  "properties": {
    "area_land":671691,
    "area_water":0,
    "geoid":"360290092004",
    "name":"Block Group 4",
    "state":"ny"
},
  "bbox": [
    -78.822925,
    42.98034,
    -78.813818,
    42.99091
],
  "geometry": {"coordinates":[[[-78.82286000000001,42.982747],[-78.822802,42.984237],[-78.82279699999999,42.984361],[-78.822739,42.985884],[-78.822704,42.986713],[-78.82256099999999,42.99091],[-78.821732,42.990905],[-78.818102,42.990907],[-78.817184,42.990893],[-78.817206,42.990045],[-78.817272,42.987918],[-78.81730899999999,42.986974],[-78.817328,42.986044],[-78.817374,42.985497],[-78.817032,42.985492],[-78.816765,42.985504],[-78.816514,42.985528],[-78.816226,42.985579],[-78.81606600000001,42.985615],[-78.81585200000001,42.986009],[-78.81488400000001,42.986],[-78.81437,42.986003],[-78.814329,42.985975],[-78.814216,42.985884],[-78.814115,42.985785],[-78.814029,42.98568],[-78.813957,42.985568],[-78.813902,42.985452],[-78.813855,42.985318],[-78.813827,42.985181],[-78.813818,42.985043],[-78.813818,42.98495],[-78.81382600000001,42.984552],[-78.813829,42.984257],[-78.813839,42.983665],[-78.813864,42.982772],[-78.813906,42.981621],[-78.813937,42.98034],[-78.815055,42.980394],[-78.81621699999999,42.980461],[-78.81751300000001,42.980522],[-78.81876200000001,42.980607],[-78.820966,42.980775],[-78.82187,42.980803],[-78.822925,42.980859],[-78.82286000000001,42.982747]]],"type":"Polygon"}
}