{
  "id": "360471134002",
  "type": "Feature",
  "properties": {
    "area_land":27590,
    "area_water":0,
    "geoid":"360471134002",
    "name":"Block Group 2",
    "state":"ny"
},
  "bbox": [
    -73.899472,
    40.665608,
    -73.897233,
    40.667419
],
  "geometry": {"coordinates":[[[-73.899472,40.667145],[-73.898552,40.667283],[-73.897633,40.667419],[-73.897233,40.665878],[-73.898158,40.665747],[-73.89907599999999,40.665608],[-73.899472,40.667145]]],"type":"Polygon"}
}