{
  "id": "360099614001",
  "type": "Feature",
  "properties": {
    "area_land":76375811,
    "area_water":268614,
    "geoid":"360099614001",
    "name":"Block Group 1",
    "state":"ny"
},
  "bbox": [
    -78.943504,
    42.051779,
    -78.884709,
    42.234722
],
  "geometry": {"coordinates":[[[-78.943504,42.218746],[-78.94346299999999,42.21954],[-78.943448,42.219952],[-78.943417,42.221394],[-78.94320500000001,42.230422],[-78.941699,42.230427],[-78.939367,42.230419],[-78.934816,42.230454],[-78.93183000000001,42.230492],[-78.92958,42.230505],[-78.92738,42.230515],[-78.92308,42.230587],[-78.921655,42.230604],[-78.92131500000001,42.230628],[-78.920244,42.230708],[-78.919741,42.230758],[-78.919087,42.23085],[-78.918454,42.230964],[-78.917705,42.231136],[-78.915873,42.231612],[-78.913135,42.232331],[-78.91227000000001,42.232538],[-78.91106499999999,42.232855],[-78.910231,42.233057],[-78.90954600000001,42.233234],[-78.907867,42.233622],[-78.90717100000001,42.233747],[-78.90529600000001,42.234014],[-78.901901,42.234518],[-78.90124400000001,42.234596],[-78.900119,42.234699],[-78.899511,42.234722],[-78.898445,42.234718],[-78.8976,42.234692],[-78.896176,42.234622],[-78.895459,42.234559],[-78.893291,42.234397],[-78.891824,42.234279],[-78.89113500000001,42.234215],[-78.888578,42.234036],[-78.888053,42.23401],[-78.887242,42.233958],[-78.885783,42.233882],[-78.88498,42.23386],[-78.884799,42.233878],[-78.884754,42.233673],[-78.884731,42.232657],[-78.884743,42.23217],[-78.884721,42.23072],[-78.884725,42.229256],[-78.884709,42.227473],[-78.88474100000001,42.227139],[-78.884764,42.227029],[-78.884827,42.226837],[-78.88492100000001,42.226677],[-78.885015,42.226561],[-78.885313,42.226237],[-78.886082,42.22544],[-78.887421,42.224019],[-78.887928,42.223458],[-78.8882,42.223074],[-78.888485,42.222591],[-78.888752,42.222102],[-78.889173,42.221295],[-78.889259,42.221136],[-78.88951400000001,42.220667],[-78.89005299999999,42.219706],[-78.89057200000001,42.218753],[-78.891552,42.217078],[-78.891723,42.216771],[-78.891825,42.216541],[-78.89190000000001,42.216304],[-78.891929,42.216166],[-78.89194000000001,42.216033],[-78.891942,42.21323],[-78.89196200000001,42.211384],[-78.891942,42.211197],[-78.89190499999999,42.211018],[-78.891851,42.210842],[-78.89167500000001,42.210364],[-78.891496,42.209936],[-78.891406,42.20968],[-78.891356,42.209428],[-78.891341,42.209186],[-78.891374,42.208912],[-78.891465,42.208638],[-78.891606,42.208309],[-78.891717,42.20808],[-78.89184899999999,42.207786],[-78.891958,42.207401],[-78.89198,42.207242],[-78.891993,42.20702],[-78.891976,42.205165],[-78.891986,42.203667],[-78.89197799999999,42.203197],[-78.891976,42.201283],[-78.89197799999999,42.200729],[-78.89196200000001,42.199797],[-78.89197,42.199394],[-78.89199499999999,42.19903],[-78.89207500000001,42.198768],[-78.89272800000001,42.19758],[-78.893666,42.19596],[-78.89367799999999,42.19594],[-78.89411,42.195194],[-78.89446100000001,42.194587],[-78.894504,42.194516],[-78.894536,42.194425],[-78.89470300000001,42.193656],[-78.89525399999999,42.190951],[-78.89546900000001,42.189825],[-78.895633,42.188859],[-78.89575000000001,42.188278],[-78.895824,42.187909],[-78.89618299999999,42.18602],[-78.896252,42.185612],[-78.896591,42.183914],[-78.896792,42.183022],[-78.89746599999999,42.180402],[-78.897677,42.179534],[-78.897772,42.179109],[-78.897794,42.178963],[-78.897809,42.178725],[-78.897812,42.178552],[-78.89779799999999,42.178344],[-78.897739,42.177954],[-78.897645,42.177524],[-78.897575,42.177091],[-78.89743,42.176267],[-78.897389,42.176125],[-78.897273,42.175841],[-78.897036,42.175502],[-78.896755,42.175196],[-78.89658,42.175051],[-78.896368,42.174894],[-78.896142,42.174759],[-78.895996,42.17469],[-78.895814,42.174621],[-78.89559199999999,42.174551],[-78.895377,42.174497],[-78.89505200000001,42.174395],[-78.89279500000001,42.173725],[-78.89263200000001,42.173664],[-78.892376,42.173568],[-78.892183,42.17348],[-78.891898,42.173306],[-78.891749,42.173178],[-78.890992,42.17239],[-78.89097099999999,42.172368],[-78.89088099999999,42.172267],[-78.890762,42.172096],[-78.890659,42.171917],[-78.890557,42.171694],[-78.890491,42.171548],[-78.890203,42.170861],[-78.890101,42.170577],[-78.88994700000001,42.170063],[-78.889747,42.16932],[-78.88954699999999,42.168471],[-78.889521,42.1683],[-78.889521,42.168191],[-78.889532,42.168041],[-78.88958,42.167892],[-78.88966000000001,42.167673],[-78.88975499999999,42.167506],[-78.89071,42.166128],[-78.89092100000001,42.165884],[-78.891578,42.165167],[-78.892117,42.164547],[-78.892956,42.163615],[-78.893466,42.162981],[-78.893714,42.162631],[-78.893838,42.16242],[-78.893947,42.162172],[-78.894199,42.161396],[-78.89437,42.160773],[-78.894666,42.159811],[-78.894779,42.159512],[-78.894946,42.159268],[-78.895205,42.159021],[-78.895329,42.158933],[-78.89562100000001,42.158755],[-78.896044,42.158529],[-78.897043,42.15803],[-78.897327,42.157844],[-78.897535,42.157654],[-78.897623,42.157545],[-78.89802,42.156988],[-78.898239,42.156649],[-78.89831,42.156522],[-78.898363,42.156427],[-78.898646,42.155836],[-78.899157,42.154593],[-78.899427,42.154156],[-78.899711,42.153744],[-78.900065,42.153271],[-78.900419,42.152797],[-78.90109,42.15185],[-78.901556,42.151245],[-78.902505,42.150198],[-78.90331,42.149339],[-78.903521,42.149066],[-78.903577,42.148965],[-78.903899,42.148733],[-78.90365300000001,42.148732],[-78.903674,42.148549],[-78.903665,42.14828],[-78.903634,42.148141],[-78.90352900000001,42.147795],[-78.902996,42.146228],[-78.902686,42.145259],[-78.90252599999999,42.144891],[-78.902457,42.144785],[-78.90228500000001,42.144585],[-78.901968,42.144305],[-78.901633,42.144035],[-78.901268,42.143718],[-78.900257,42.142874],[-78.89882900000001,42.141685],[-78.897622,42.140665],[-78.89492799999999,42.138381],[-78.894786,42.138282],[-78.89453399999999,42.138151],[-78.89421299999999,42.138016],[-78.892099,42.137375],[-78.890443,42.136902],[-78.890101,42.136828],[-78.890293,42.136281],[-78.89036900000001,42.136038],[-78.89169699999999,42.131202],[-78.89416199999999,42.12506],[-78.894688,42.124138],[-78.894665,42.120187],[-78.89469699999999,42.113421],[-78.894627,42.111582],[-78.894595,42.109781],[-78.894623,42.107519],[-78.894611,42.105778],[-78.89461,42.105694],[-78.89461,42.105609],[-78.89461,42.105558],[-78.89463600000001,42.101908],[-78.894632,42.101577],[-78.89461900000001,42.08848],[-78.894617,42.086532],[-78.894588,42.082421],[-78.89459100000001,42.081522],[-78.89460200000001,42.079082],[-78.894515,42.075176],[-78.894586,42.074735],[-78.89461,42.070572],[-78.89461300000001,42.070023],[-78.894615,42.069703],[-78.89746,42.068148],[-78.89927,42.067182],[-78.907177,42.062868],[-78.909904,42.06146],[-78.92767499999999,42.051779],[-78.927603,42.062688],[-78.942987,42.062899],[-78.94290599999999,42.080034],[-78.942913,42.080389],[-78.942902,42.084263],[-78.942863,42.090769],[-78.942852,42.106521],[-78.94284399999999,42.107321],[-78.94286099999999,42.117147],[-78.942888,42.117213],[-78.94289499999999,42.117721],[-78.942886,42.118633],[-78.942899,42.119416],[-78.94292,42.11996],[-78.942925,42.120287],[-78.942902,42.120791],[-78.942887,42.121066],[-78.942903,42.121467],[-78.942882,42.122241],[-78.942854,42.123279],[-78.942854,42.123296],[-78.942835,42.123998],[-78.94280500000001,42.124564],[-78.942791,42.125353],[-78.942785,42.126027],[-78.942729,42.12806],[-78.942572,42.139341],[-78.942488,42.146785],[-78.942599,42.156849],[-78.94264200000001,42.160766],[-78.94264800000001,42.161247],[-78.942728,42.16834],[-78.94276499999999,42.171616],[-78.942819,42.172536],[-78.94284500000001,42.176458],[-78.942859,42.178135],[-78.942882,42.181233],[-78.94290700000001,42.184301],[-78.942933,42.187864],[-78.942976,42.194564],[-78.943043,42.202766],[-78.943049,42.203586],[-78.943078,42.205252],[-78.94308599999999,42.205626],[-78.943487,42.218365],[-78.94349699999999,42.218605],[-78.943504,42.218746]]],"type":"Polygon"}
}