{
  "id": "361019630003",
  "type": "Feature",
  "properties": {
    "area_land":43119270,
    "area_water":500595,
    "geoid":"361019630003",
    "name":"Block Group 3",
    "state":"ny"
},
  "bbox": [
    -77.158501,
    41.99959,
    -77.083151,
    42.091114
],
  "geometry": {"coordinates":[[[-77.158501,42.09069],[-77.15122599999999,42.090683],[-77.150221,42.090675],[-77.14956599999999,42.090679],[-77.148053,42.090682],[-77.14797,42.090682],[-77.146175,42.090709],[-77.124782,42.090757],[-77.106143,42.090872],[-77.10547699999999,42.090856],[-77.10449699999999,42.090855],[-77.104,42.090863],[-77.101743,42.090851],[-77.099166,42.090874],[-77.099079,42.090867],[-77.08376,42.091114],[-77.08376,42.091048],[-77.083753,42.09076],[-77.08376800000001,42.089564],[-77.083737,42.084937],[-77.083685,42.084018],[-77.083629,42.075211],[-77.083478,42.075061],[-77.083383,42.07187],[-77.08351999999999,42.071706],[-77.083524,42.071276],[-77.083523,42.070015],[-77.08350799999999,42.069855],[-77.083472,42.069732],[-77.083443,42.069577],[-77.08341,42.066002],[-77.083359,42.063612],[-77.083415,42.062743],[-77.083168,42.051881],[-77.083178,42.043291],[-77.083151,42.042178],[-77.08320500000001,42.025998],[-77.083202,42.022569],[-77.08326,42.010847],[-77.083169,42.003914],[-77.08327199999999,42.000073],[-77.087917,42.000073],[-77.096148,41.999862],[-77.096394,41.999854],[-77.099143,41.999795],[-77.111631,41.999609],[-77.111683,41.999608],[-77.111735,41.999608],[-77.112126,41.999609],[-77.11234,41.99961],[-77.113561,41.999608],[-77.11364500000001,41.999612],[-77.113668,41.999607],[-77.113737,41.999618],[-77.11428100000001,41.999612],[-77.11451700000001,41.99959],[-77.114583,41.999598],[-77.11461799999999,41.999597],[-77.114716,41.999595],[-77.11471899999999,41.99966],[-77.11467500000001,42.000086],[-77.114705,42.000185],[-77.11489899999999,42.000791],[-77.115196,42.001562],[-77.115398,42.002089],[-77.11549599999999,42.002285],[-77.115681,42.002712],[-77.11593999999999,42.00341],[-77.115979,42.003603],[-77.115995,42.003952],[-77.115987,42.004461],[-77.11595199999999,42.00492],[-77.115971,42.00532],[-77.116038,42.005638],[-77.116113,42.005881],[-77.11619899999999,42.006093],[-77.11632899999999,42.006305],[-77.116517,42.006542],[-77.11693699999999,42.006914],[-77.11720800000001,42.00711],[-77.11743199999999,42.007252],[-77.117616,42.007346],[-77.117994,42.007485],[-77.118543,42.007587],[-77.118764,42.007852],[-77.119118,42.008072],[-77.119354,42.008707],[-77.11920600000001,42.009671],[-77.118398,42.011167],[-77.118573,42.011884],[-77.119265,42.012673],[-77.12014000000001,42.013525],[-77.12127,42.01436],[-77.12149100000001,42.015313],[-77.12173799999999,42.016287],[-77.12269999999999,42.01642],[-77.123555,42.016058],[-77.124854,42.01621],[-77.12588700000001,42.01676],[-77.1254,42.018332],[-77.125899,42.019222],[-77.127734,42.019578],[-77.128491,42.01973],[-77.12891,42.020117],[-77.13051,42.022571],[-77.130802,42.023665],[-77.13031700000001,42.026013],[-77.130352,42.026726],[-77.130833,42.027954],[-77.131411,42.028713],[-77.13154900000001,42.028842],[-77.131851,42.029129],[-77.13222399999999,42.02993],[-77.133236,42.031074],[-77.134002,42.031861],[-77.13662600000001,42.033448],[-77.137441,42.03426],[-77.138582,42.035774],[-77.13850100000001,42.036646],[-77.137474,42.038938],[-77.137477,42.040339],[-77.137511,42.041405],[-77.137478,42.041902],[-77.137382,42.042169],[-77.13726800000001,42.043585],[-77.136959,42.044603],[-77.136341,42.044966],[-77.136163,42.04522],[-77.136049,42.045912],[-77.135626,42.046263],[-77.134635,42.046454],[-77.133053,42.047089],[-77.13225799999999,42.048041],[-77.131337,42.050046],[-77.13080600000001,42.050357],[-77.130638,42.050614],[-77.131056,42.050721],[-77.13117099999999,42.050817],[-77.13098599999999,42.051103],[-77.13048999999999,42.051771],[-77.129946,42.052371],[-77.12914499999999,42.053239],[-77.128912,42.053618],[-77.128846,42.053775],[-77.12884200000001,42.053921],[-77.12885300000001,42.053986],[-77.12889699999999,42.054063],[-77.128985,42.054179],[-77.12907199999999,42.054256],[-77.13179599999999,42.055629],[-77.132875,42.056238],[-77.133298,42.056412],[-77.13350199999999,42.056485],[-77.133855,42.05654],[-77.134242,42.056529],[-77.134424,42.056511],[-77.13529200000001,42.056343],[-77.13539,42.056336],[-77.135554,42.056347],[-77.13572600000001,42.056369],[-77.13614099999999,42.056463],[-77.136987,42.056693],[-77.137603,42.056912],[-77.139135,42.057589],[-77.13975499999999,42.05784],[-77.13991900000001,42.057921],[-77.1404,42.058252],[-77.14052700000001,42.058354],[-77.140586,42.05842],[-77.140655,42.05854],[-77.14076799999999,42.058682],[-77.140852,42.058853],[-77.140972,42.059465],[-77.141009,42.059724],[-77.14101599999999,42.060055],[-77.141031,42.060096],[-77.14106700000001,42.060125],[-77.141125,42.06015],[-77.14119100000001,42.060157],[-77.141268,42.060143],[-77.141355,42.060139],[-77.141417,42.060157],[-77.14147199999999,42.060194],[-77.141931,42.060722],[-77.141997,42.06082],[-77.14204100000001,42.060915],[-77.142197,42.061345],[-77.142321,42.06156],[-77.142332,42.061673],[-77.142292,42.061771],[-77.142234,42.061859],[-77.142256,42.061983],[-77.142281,42.062055],[-77.14233,42.062505],[-77.14240700000001,42.062726],[-77.142477,42.06326],[-77.142466,42.063406],[-77.142411,42.063494],[-77.142404,42.063556],[-77.14243999999999,42.063618],[-77.142433,42.06372],[-77.14241800000001,42.063753],[-77.142382,42.06379],[-77.142301,42.063947],[-77.14229,42.064035],[-77.142298,42.064112],[-77.142341,42.064236],[-77.142352,42.064452],[-77.142352,42.065073],[-77.14233400000001,42.065121],[-77.142309,42.065146],[-77.142298,42.065238],[-77.14233400000001,42.065296],[-77.142374,42.065391],[-77.14239600000001,42.065527],[-77.142488,42.066638],[-77.142495,42.066821],[-77.142543,42.066927],[-77.142539,42.06719],[-77.142499,42.067344],[-77.142488,42.067432],[-77.142499,42.067516],[-77.142601,42.067794],[-77.14263800000001,42.068009],[-77.142656,42.06821],[-77.142656,42.068346],[-77.142601,42.068803],[-77.14256899999999,42.06898],[-77.14253600000001,42.069075],[-77.142397,42.069298],[-77.142155,42.069649],[-77.142122,42.069733],[-77.142104,42.069825],[-77.142089,42.070242],[-77.14210799999999,42.070337],[-77.14214800000001,42.070457],[-77.142269,42.070655],[-77.14238899999999,42.070812],[-77.142583,42.071009],[-77.142752,42.071123],[-77.143052,42.071273],[-77.143304,42.071445],[-77.143355,42.071488],[-77.14363,42.071631],[-77.14393,42.071755],[-77.14425900000001,42.071876],[-77.14449,42.071949],[-77.14502,42.072088],[-77.145141,42.072125],[-77.14546300000001,42.072269],[-77.145734,42.072441],[-77.14596400000001,42.072646],[-77.146114,42.072799],[-77.14625700000001,42.072909],[-77.146349,42.072967],[-77.146451,42.073073],[-77.146513,42.073161],[-77.14659399999999,42.073381],[-77.14662300000001,42.073611],[-77.14659399999999,42.073885],[-77.14659,42.074072],[-77.14660499999999,42.074342],[-77.14666,42.074755],[-77.146708,42.074949],[-77.14687600000001,42.075424],[-77.147267,42.076324],[-77.147425,42.076657],[-77.147535,42.076839],[-77.147688,42.077037],[-77.14775400000001,42.077154],[-77.147824,42.077417],[-77.147857,42.077911],[-77.147919,42.078489],[-77.14796,42.078624],[-77.148,42.078701],[-77.148015,42.078804],[-77.14798500000001,42.078891],[-77.14797799999999,42.079012],[-77.148106,42.07925],[-77.148143,42.079363],[-77.148143,42.079422],[-77.148234,42.079729],[-77.148337,42.079977],[-77.14834,42.080043],[-77.148329,42.080105],[-77.148355,42.080284],[-77.148689,42.081153],[-77.148228,42.081312],[-77.14846199999999,42.082122],[-77.148663,42.08319],[-77.148988,42.083051],[-77.149833,42.082683],[-77.14999400000001,42.082602],[-77.150148,42.082543],[-77.150353,42.082489],[-77.151077,42.082376],[-77.151476,42.082281],[-77.151937,42.082156],[-77.152378,42.082019],[-77.15307799999999,42.082731],[-77.15365199999999,42.083323],[-77.153893,42.083646],[-77.15454200000001,42.084444],[-77.15468199999999,42.08465],[-77.15524499999999,42.085692],[-77.155522,42.086176],[-77.15575,42.086462],[-77.155996,42.086685],[-77.156791,42.087289],[-77.156927,42.08742],[-77.15712600000001,42.087646],[-77.157268,42.087835],[-77.157588,42.088346],[-77.15796400000001,42.089009],[-77.158171,42.089576],[-77.158378,42.090195],[-77.158501,42.09069]]],"type":"Polygon"}
}