{
  "id": "361170205003",
  "type": "Feature",
  "properties": {
    "area_land":4527040,
    "area_water":15224,
    "geoid":"361170205003",
    "name":"Block Group 3",
    "state":"ny"
},
  "bbox": [
    -77.200889,
    43.12655,
    -77.175536,
    43.156557
],
  "geometry": {"coordinates":[[[-77.200889,43.126858],[-77.20053799999999,43.127208],[-77.200188,43.12756],[-77.199529,43.128183],[-77.19947000000001,43.128241],[-77.199119,43.12859],[-77.198973,43.128746],[-77.198713,43.129079],[-77.198593,43.129258],[-77.198401,43.129644],[-77.198274,43.129951],[-77.19792700000001,43.130796],[-77.197329,43.132253],[-77.196877,43.133285],[-77.196439,43.134178],[-77.196229,43.134605],[-77.195599,43.135888],[-77.195593,43.135902],[-77.19539399999999,43.136318],[-77.19528099999999,43.136694],[-77.19521899999999,43.137028],[-77.195205,43.137222],[-77.195212,43.137365],[-77.19523700000001,43.137675],[-77.19533300000001,43.138228],[-77.19533699999999,43.138251],[-77.195441,43.138727],[-77.19611399999999,43.14252],[-77.196387,43.14396],[-77.196465,43.144367],[-77.19650300000001,43.14465],[-77.19652000000001,43.144971],[-77.1965,43.145302],[-77.196477,43.145452],[-77.19639599999999,43.145718],[-77.196338,43.145868],[-77.19622099999999,43.146123],[-77.196062,43.146386],[-77.19587300000001,43.14663],[-77.195691,43.146822],[-77.195545,43.146961],[-77.195189,43.14727],[-77.19490500000001,43.147518],[-77.194473,43.147867],[-77.193709,43.148506],[-77.19364,43.148561],[-77.19311500000001,43.148981],[-77.191795,43.150067],[-77.190827,43.150865],[-77.19019299999999,43.151398],[-77.189956,43.151597],[-77.189651,43.151866],[-77.18793599999999,43.153442],[-77.186678,43.154599],[-77.186285,43.154957],[-77.18583700000001,43.155366],[-77.18556100000001,43.155635],[-77.18529599999999,43.155939],[-77.18517799999999,43.156099],[-77.185075,43.15624],[-77.18491,43.156557],[-77.184591,43.156414],[-77.18450300000001,43.156356],[-77.184417,43.156268],[-77.184287,43.156075],[-77.18352299999999,43.154938],[-77.18297800000001,43.154157],[-77.182918,43.154067],[-77.182728,43.15378],[-77.182605,43.153574],[-77.182571,43.153497],[-77.182543,43.153359],[-77.182266,43.153348],[-77.182154,43.153344],[-77.18143600000001,43.153331],[-77.18116000000001,43.153327],[-77.18089999999999,43.153322],[-77.180697,43.153324],[-77.179675,43.153337],[-77.17930800000001,43.153346],[-77.17884599999999,43.153358],[-77.178889,43.153196],[-77.17893100000001,43.153063],[-77.178901,43.152874],[-77.17888600000001,43.152539],[-77.17890800000001,43.152504],[-77.178901,43.152472],[-77.178833,43.152447],[-77.178549,43.152472],[-77.178449,43.152459],[-77.178421,43.152444],[-77.178358,43.152376],[-77.178331,43.152366],[-77.17827,43.152374],[-77.17815,43.152366],[-77.17809699999999,43.152336],[-77.178087,43.152276],[-77.17818800000001,43.152122],[-77.17823300000001,43.152081],[-77.17827,43.152061],[-77.17842899999999,43.152024],[-77.178459,43.152006],[-77.17846900000001,43.151976],[-77.178461,43.151941],[-77.178313,43.151718],[-77.178298,43.151665],[-77.178318,43.15162],[-77.178358,43.151575],[-77.17837299999999,43.151527],[-77.17835100000001,43.151429],[-77.17830600000001,43.151105],[-77.178258,43.15097],[-77.17822,43.150717],[-77.1782,43.150649],[-77.17819799999999,43.150589],[-77.17821000000001,43.150529],[-77.17821000000001,43.150386],[-77.17825499999999,43.150301],[-77.17825999999999,43.150145],[-77.17824299999999,43.150075],[-77.178235,43.149981],[-77.178203,43.14996],[-77.178017,43.14984],[-77.177987,43.149795],[-77.17795099999999,43.149582],[-77.177967,43.149461],[-77.177969,43.149351],[-77.17793899999999,43.149245],[-77.177999,43.149092],[-77.177999,43.149002],[-77.177644,43.147765],[-77.177582,43.147489],[-77.177594,43.147344],[-77.177628,43.147282],[-77.177671,43.14724],[-77.177824,43.147148],[-77.177859,43.147091],[-77.177859,43.146983],[-77.17776600000001,43.146721],[-77.177763,43.146629],[-77.177786,43.146468],[-77.177774,43.146437],[-77.177747,43.14641],[-77.177302,43.146173],[-77.177093,43.146023],[-77.177064,43.145975],[-77.17704000000001,43.145876],[-77.177075,43.145583],[-77.177149,43.145237],[-77.177155,43.14513],[-77.177144,43.145056],[-77.176984,43.144613],[-77.17689300000001,43.144457],[-77.17674100000001,43.144289],[-77.176002,43.143704],[-77.17582400000001,43.143517],[-77.17578399999999,43.143443],[-77.17576699999999,43.143344],[-77.175776,43.143257],[-77.176045,43.142662],[-77.17614500000001,43.14238],[-77.176165,43.142104],[-77.17615000000001,43.141858],[-77.176131,43.141776],[-77.176097,43.141718],[-77.176044,43.141669],[-77.17591299999999,43.141587],[-77.175603,43.141437],[-77.17556500000001,43.141384],[-77.175545,43.141336],[-77.17553599999999,43.14121],[-77.175555,43.141133],[-77.175695,43.140905],[-77.175715,43.140857],[-77.17570499999999,43.14076],[-77.175603,43.140615],[-77.175589,43.140485],[-77.175652,43.14018],[-77.175792,43.139791],[-77.175937,43.139284],[-77.175952,43.139182],[-77.175961,43.138904],[-77.17598599999999,43.138609],[-77.17601500000001,43.138468],[-77.17605,43.138358],[-77.176073,43.13829],[-77.176281,43.137743],[-77.176271,43.1377],[-77.17594200000001,43.137429],[-77.175889,43.137376],[-77.175865,43.137337],[-77.175826,43.137226],[-77.175816,43.137153],[-77.175831,43.137071],[-77.17604799999999,43.136592],[-77.17636400000001,43.136062],[-77.17682499999999,43.135438],[-77.176869,43.135345],[-77.177053,43.134748],[-77.177053,43.134676],[-77.177031,43.134594],[-77.17694299999999,43.134472],[-77.17689300000001,43.134412],[-77.17684300000001,43.134329],[-77.17679800000001,43.134199],[-77.176793,43.133987],[-77.176892,43.133271],[-77.176936,43.132963],[-77.177012,43.132558],[-77.17703299999999,43.132447],[-77.17712400000001,43.1321],[-77.177269,43.131676],[-77.17739,43.131375],[-77.177559,43.13101],[-77.177583,43.130969],[-77.177657,43.130847],[-77.177682,43.130807],[-77.17760800000001,43.130622],[-77.177522,43.130343],[-77.177505,43.130252],[-77.177505,43.130154],[-77.177522,43.130047],[-77.17754600000001,43.130018],[-77.177593,43.129992],[-77.177684,43.129961],[-77.177752,43.129923],[-77.177809,43.129893],[-77.177896,43.129803],[-77.17792799999999,43.12974],[-77.177925,43.129667],[-77.177789,43.129375],[-77.17775,43.129232],[-77.17772600000001,43.129181],[-77.177648,43.129125],[-77.177622,43.129081],[-77.17761900000001,43.129021],[-77.177666,43.128761],[-77.177598,43.128629],[-77.17756300000001,43.128469],[-77.177576,43.128308],[-77.177769,43.128015],[-77.177792,43.127959],[-77.17779,43.127906],[-77.177712,43.127794],[-77.177683,43.127703],[-77.17770899999999,43.127659],[-77.177762,43.127627],[-77.178065,43.127543],[-77.178192,43.127499],[-77.178241,43.127459],[-77.178257,43.127425],[-77.178282,43.127377],[-77.178276,43.127332],[-77.178162,43.127229],[-77.177986,43.126929],[-77.17791099999999,43.12685],[-77.17776600000001,43.126741],[-77.177673,43.126671],[-77.17764699999999,43.126631],[-77.17829399999999,43.126614],[-77.18023700000001,43.126566],[-77.180885,43.12655],[-77.183532,43.126572],[-77.191473,43.126639],[-77.194121,43.126662],[-77.194547,43.126691],[-77.19547900000001,43.126697],[-77.195751,43.126699],[-77.19687399999999,43.126695],[-77.19955899999999,43.126717],[-77.20039800000001,43.126724],[-77.200649,43.126742],[-77.20077000000001,43.126779],[-77.200889,43.126858]]],"type":"Polygon"}
}