{
  "id": "360470866001",
  "type": "Feature",
  "properties": {
    "area_land":75962,
    "area_water":0,
    "geoid":"360470866001",
    "name":"Block Group 1",
    "state":"ny"
},
  "bbox": [
    -73.92834,
    40.656802,
    -73.924643,
    40.660177
],
  "geometry": {"coordinates":[[[-73.92819299999999,40.660177],[-73.927948,40.659958],[-73.927255,40.659338],[-73.926464,40.659814],[-73.924643,40.658183],[-73.92540700000001,40.65768],[-73.92519299999999,40.657488],[-73.924654,40.657007],[-73.925141,40.65698],[-73.92609,40.656921],[-73.927024,40.656862],[-73.927995,40.656802],[-73.928172,40.658478],[-73.92834000000001,40.66006],[-73.92819299999999,40.660177]]],"type":"Polygon"}
}