{
  "id": "360811167001",
  "type": "Feature",
  "properties": {
    "area_land":166109,
    "area_water":0,
    "geoid":"360811167001",
    "name":"Block Group 1",
    "state":"ny"
},
  "bbox": [
    -73.816387,
    40.760372,
    -73.807493,
    40.764125
],
  "geometry": {"coordinates":[[[-73.81638700000001,40.76316],[-73.81529399999999,40.763449],[-73.814431,40.763687],[-73.81353,40.763929],[-73.812764,40.764125],[-73.8126,40.763153],[-73.811227,40.763041],[-73.810243,40.762965],[-73.80929,40.762883],[-73.80932799999999,40.762521],[-73.808414,40.762422],[-73.80749299999999,40.762343],[-73.807514,40.762179],[-73.807528,40.762066],[-73.80765700000001,40.761127],[-73.80768,40.76096],[-73.808595,40.761132],[-73.80951399999999,40.7613],[-73.81044300000001,40.761377],[-73.81104999999999,40.761417],[-73.812268,40.76113],[-73.813132,40.760898],[-73.813999,40.760665],[-73.81508700000001,40.760372],[-73.815485,40.761221],[-73.81588000000001,40.762066],[-73.816093,40.762524],[-73.81638700000001,40.76316]]],"type":"Polygon"}
}