{
  "id": "360470142003",
  "type": "Feature",
  "properties": {
    "area_land":40372,
    "area_water":0,
    "geoid":"360470142003",
    "name":"Block Group 3",
    "state":"ny"
},
  "bbox": [
    -74.025345,
    40.621431,
    -74.022389,
    40.624321
],
  "geometry": {"coordinates":[[[-74.025047,40.623589],[-74.02475,40.624321],[-74.022389,40.622896],[-74.022687,40.622178],[-74.02297799999999,40.621431],[-74.025345,40.622859],[-74.025047,40.623589]]],"type":"Polygon"}
}