{
  "id": "360290082025",
  "type": "Feature",
  "properties": {
    "area_land":311646,
    "area_water":0,
    "geoid":"360290082025",
    "name":"Block Group 5",
    "state":"ny"
},
  "bbox": [
    -78.886432,
    42.973813,
    -78.878665,
    42.979049
],
  "geometry": {"coordinates":[[[-78.886286,42.975542],[-78.88614200000001,42.976395],[-78.885947,42.977543],[-78.885698,42.979049],[-78.884013,42.979042],[-78.88400799999999,42.978996],[-78.88398599999999,42.978957],[-78.883949,42.978925],[-78.88390099999999,42.978902],[-78.883832,42.978891],[-78.882029,42.978877],[-78.878665,42.978856],[-78.87867799999999,42.977996],[-78.878675,42.977562],[-78.878675,42.977252],[-78.878682,42.976415],[-78.87868400000001,42.976257],[-78.878692,42.975561],[-78.878694,42.975127],[-78.878699,42.974713],[-78.878703,42.974251],[-78.87870599999999,42.973854],[-78.882418,42.973813],[-78.882441,42.974699],[-78.883284,42.974703],[-78.884484,42.974699],[-78.88512,42.974703],[-78.885757,42.974698],[-78.886183,42.974689],[-78.886432,42.974686],[-78.886286,42.975542]]],"type":"Polygon"}
}