{
  "id": "360810102001",
  "type": "Feature",
  "properties": {
    "area_land":105076,
    "area_water":0,
    "geoid":"360810102001",
    "name":"Block Group 1",
    "state":"ny"
},
  "bbox": [
    -73.82633,
    40.676133,
    -73.819225,
    40.679545
],
  "geometry": {"coordinates":[[[-73.825509,40.679318],[-73.824699,40.679545],[-73.823842,40.677799],[-73.823016,40.678032],[-73.82219000000001,40.678268],[-73.821361,40.678503],[-73.8205,40.678749],[-73.819641,40.677],[-73.819225,40.676133],[-73.820098,40.676276],[-73.82028699999999,40.676306],[-73.82100800000001,40.676426],[-73.82132,40.676488],[-73.821921,40.676575],[-73.82234699999999,40.676648],[-73.82284,40.676726],[-73.82337099999999,40.676816],[-73.823761,40.676877],[-73.824358,40.676981],[-73.824673,40.677031],[-73.825406,40.677147],[-73.82547,40.677336],[-73.82633,40.679084],[-73.825509,40.679318]]],"type":"Polygon"}
}