{
  "id": "360290149012",
  "type": "Feature",
  "properties": {
    "area_land":3558796,
    "area_water":0,
    "geoid":"360290149012",
    "name":"Block Group 2",
    "state":"ny"
},
  "bbox": [
    -78.511332,
    42.885959,
    -78.478252,
    42.900219
],
  "geometry": {"coordinates":[[[-78.51121500000001,42.89475],[-78.511225,42.894887],[-78.50964500000001,42.895274],[-78.50956600000001,42.895293],[-78.508388,42.895605],[-78.50761900000001,42.895805],[-78.506804,42.896022],[-78.506484,42.896113],[-78.50581699999999,42.896301],[-78.505577,42.896375],[-78.505411,42.896443],[-78.505016,42.896611],[-78.50466400000001,42.89675],[-78.504144,42.896941],[-78.50385799999999,42.897076],[-78.50362,42.897188],[-78.503317,42.897324],[-78.502726,42.897578],[-78.502082,42.897837],[-78.501767,42.897956],[-78.50103799999999,42.89826],[-78.500793,42.898371],[-78.498482,42.899446],[-78.49743700000001,42.899895],[-78.49724000000001,42.89998],[-78.496983,42.900091],[-78.49696,42.900096],[-78.496661,42.900167],[-78.49632200000001,42.900219],[-78.496174,42.900217],[-78.49502099999999,42.9002],[-78.49441,42.90019],[-78.493405,42.900173],[-78.492186,42.900153],[-78.491777,42.900147],[-78.489952,42.90011],[-78.48894900000001,42.900089],[-78.487807,42.900066],[-78.486598,42.900046],[-78.484633,42.900015],[-78.483824,42.900003],[-78.482938,42.899989],[-78.480513,42.899951],[-78.478252,42.899926],[-78.478415,42.895582],[-78.47850699999999,42.893272],[-78.47856400000001,42.89193],[-78.47859,42.891234],[-78.47865899999999,42.889361],[-78.484509,42.889255],[-78.484938,42.885959],[-78.496498,42.886254],[-78.511332,42.886572],[-78.51121500000001,42.89475]]],"type":"Polygon"}
}