{
  "id": "360594110004",
  "type": "Feature",
  "properties": {
    "area_land":272213,
    "area_water":0,
    "geoid":"360594110004",
    "name":"Block Group 4",
    "state":"ny"
},
  "bbox": [
    -73.754304,
    40.613747,
    -73.746538,
    40.622222
],
  "geometry": {"coordinates":[[[-73.754294,40.615219],[-73.754277,40.615338],[-73.754276,40.615444],[-73.754194,40.615971],[-73.754158,40.616125],[-73.754104,40.616212],[-73.753792,40.616781],[-73.753632,40.61709],[-73.753625,40.617134],[-73.753636,40.617273],[-73.753711,40.617997],[-73.753803,40.61888],[-73.75290699999999,40.618932],[-73.75200700000001,40.618985],[-73.751538,40.619072],[-73.750573,40.619131],[-73.749588,40.619192],[-73.749628,40.619325],[-73.749655,40.619511],[-73.749653,40.619752],[-73.749584,40.62003],[-73.749439,40.620319],[-73.74940100000001,40.620395],[-73.749235,40.620652],[-73.749011,40.620872],[-73.74862899999999,40.621281],[-73.748356,40.621614],[-73.748311,40.621654],[-73.74818999999999,40.621764],[-73.74802800000001,40.621866],[-73.747962,40.621917],[-73.74784699999999,40.621968],[-73.74761599999999,40.622059],[-73.747483,40.622095],[-73.74731300000001,40.622129],[-73.746647,40.622222],[-73.74659800000001,40.62138],[-73.746538,40.620483],[-73.746539,40.620316],[-73.746555,40.619504],[-73.74656899999999,40.618871],[-73.746622,40.617508],[-73.74664300000001,40.616969],[-73.74811099999999,40.616897],[-73.748746,40.616875],[-73.750049,40.616816],[-73.750381,40.616779],[-73.751796,40.61661],[-73.75182700000001,40.616489],[-73.751969,40.616176],[-73.752132,40.615852],[-73.75224900000001,40.615629],[-73.752425,40.615287],[-73.752481,40.615148],[-73.75254099999999,40.615029],[-73.752577,40.614919],[-73.752658,40.614634],[-73.75267599999999,40.614507],[-73.752816,40.613816],[-73.75420200000001,40.613747],[-73.754284,40.614419],[-73.754304,40.614506],[-73.754294,40.615219]]],"type":"Polygon"}
}