{
  "id": "361190125022",
  "type": "Feature",
  "properties": {
    "area_land":8098923,
    "area_water":378913,
    "geoid":"361190125022",
    "name":"Block Group 2",
    "state":"ny"
},
  "bbox": [
    -73.595619,
    41.264485,
    -73.525208,
    41.293123
],
  "geometry": {"coordinates":[[[-73.595619,41.290889],[-73.595203,41.290935],[-73.592557,41.29127],[-73.590658,41.291538],[-73.589564,41.291662],[-73.58793,41.291868],[-73.587237,41.291942],[-73.58718,41.291949],[-73.58696399999999,41.292026],[-73.586876,41.29207],[-73.58684599999999,41.292099],[-73.586817,41.292161],[-73.58678399999999,41.292286],[-73.586725,41.292668],[-73.58670499999999,41.292708],[-73.586642,41.292748],[-73.586521,41.292792],[-73.58632299999999,41.292844],[-73.58481,41.293093],[-73.58456700000001,41.293123],[-73.584457,41.293119],[-73.584391,41.293104],[-73.58427,41.293049],[-73.583917,41.292844],[-73.583388,41.29251],[-73.582871,41.29216],[-73.58272700000001,41.292038],[-73.58261,41.291934],[-73.5825,41.291816],[-73.58242199999999,41.29171],[-73.582228,41.291563],[-73.582151,41.291519],[-73.58197800000001,41.29146],[-73.58140899999999,41.291335],[-73.58126900000001,41.29128],[-73.581185,41.291236],[-73.58093100000001,41.291134],[-73.580704,41.291005],[-73.58063799999999,41.29095],[-73.58059,41.290877],[-73.58049099999999,41.29066],[-73.57933,41.288315],[-73.579217,41.288107],[-73.57898400000001,41.287674],[-73.578636,41.286998],[-73.578518,41.286807],[-73.57833100000001,41.286594],[-73.57821,41.286488],[-73.57794199999999,41.28629],[-73.577797,41.286209],[-73.577332,41.286029],[-73.57708599999999,41.285901],[-73.576847,41.28571],[-73.57664200000001,41.285468],[-73.57608,41.284579],[-73.575937,41.284374],[-73.575801,41.284253],[-73.575405,41.28401],[-73.575305,41.28393],[-73.575092,41.283695],[-73.57471700000001,41.283306],[-73.574383,41.282917],[-73.57423199999999,41.282704],[-73.573975,41.282389],[-73.57386,41.282215],[-73.57370400000001,41.281956],[-73.57335500000001,41.281067],[-73.573336,41.28099],[-73.573325,41.280928],[-73.573329,41.280605],[-73.57340600000001,41.280312],[-73.573494,41.280058],[-73.573026,41.280273],[-73.572917,41.280313],[-73.57284300000001,41.280341],[-73.57249299999999,41.280471],[-73.57197499999999,41.280669],[-73.571065,41.281003],[-73.57066399999999,41.281165],[-73.569474,41.281565],[-73.568647,41.281804],[-73.568343,41.281888],[-73.56809,41.281979],[-73.567796,41.282086],[-73.567458,41.282221],[-73.566767,41.28253],[-73.566338,41.282719],[-73.56582400000001,41.282915],[-73.56565500000001,41.282963],[-73.565181,41.283073],[-73.564792,41.283146],[-73.56451300000001,41.283209],[-73.56348800000001,41.283535],[-73.56326799999999,41.283594],[-73.562685,41.283696],[-73.56162,41.283811],[-73.56093199999999,41.283832],[-73.560017,41.283837],[-73.560396,41.284576],[-73.560794,41.285421],[-73.561097,41.286166],[-73.56117500000001,41.286386],[-73.561249,41.286594],[-73.561318,41.286864],[-73.56135,41.287066],[-73.56136600000001,41.287188],[-73.561401,41.28746],[-73.561387,41.287797],[-73.561305,41.28802],[-73.56118499999999,41.288148],[-73.56103400000001,41.288243],[-73.560901,41.288309],[-73.56061699999999,41.288404],[-73.560287,41.288476],[-73.55947500000001,41.288591],[-73.555615,41.289063],[-73.555173,41.28911],[-73.55485400000001,41.289135],[-73.55309200000001,41.289225],[-73.552003,41.289323],[-73.551473,41.289542],[-73.551281,41.28967],[-73.551072,41.289839],[-73.55094,41.290008],[-73.550714,41.290339],[-73.550269,41.290955],[-73.550066,41.291141],[-73.549834,41.291286],[-73.549009,41.291706],[-73.548929,41.291751],[-73.548114,41.292095],[-73.543555,41.286577],[-73.540717,41.283144],[-73.54059700000001,41.282999],[-73.538387,41.280385],[-73.53688200000001,41.278604],[-73.536703,41.278391],[-73.536677,41.27836],[-73.528554,41.268749],[-73.52631599999999,41.266101],[-73.52628300000001,41.266062],[-73.525712,41.265348],[-73.52529699999999,41.264832],[-73.52522999999999,41.264764],[-73.52520800000001,41.26473],[-73.52524200000001,41.26476],[-73.525395,41.264722],[-73.528385,41.264525],[-73.52939499999999,41.264489],[-73.52973,41.264485],[-73.53015000000001,41.264493],[-73.530472,41.264521],[-73.53082000000001,41.264567],[-73.531053,41.264621],[-73.53154600000001,41.264766],[-73.53234999999999,41.265071],[-73.532701,41.265171],[-73.533097,41.265248],[-73.533565,41.265317],[-73.533984,41.265368],[-73.53482099999999,41.265438],[-73.53520399999999,41.265471],[-73.536035,41.26554],[-73.53752900000001,41.265735],[-73.53896899999999,41.265981],[-73.545027,41.266932],[-73.547961,41.267419],[-73.54847100000001,41.267511],[-73.548799,41.267574],[-73.549576,41.267792],[-73.55006400000001,41.267946],[-73.55053700000001,41.268137],[-73.55119000000001,41.26847],[-73.552768,41.269463],[-73.55371599999999,41.270053],[-73.554582,41.270614],[-73.555567,41.271215],[-73.55682400000001,41.271928],[-73.556988,41.272015],[-73.558453,41.272709],[-73.55987500000001,41.273324],[-73.560076,41.273421],[-73.560475,41.273613],[-73.560901,41.273818],[-73.56188400000001,41.274173],[-73.562482,41.274317],[-73.562889,41.274385],[-73.563564,41.274448],[-73.563845,41.274473],[-73.56471500000001,41.274503],[-73.565123,41.274492],[-73.56689299999999,41.274506],[-73.567536,41.274532],[-73.568524,41.274532],[-73.570594,41.274563],[-73.57093,41.274559],[-73.571378,41.274569],[-73.57158699999999,41.274563],[-73.57273000000001,41.27458],[-73.574265,41.274605],[-73.574718,41.274646],[-73.57512199999999,41.274711],[-73.575383,41.27476],[-73.57569700000001,41.274842],[-73.57634,41.275028],[-73.576595,41.275099],[-73.57696,41.275174],[-73.577113,41.275198],[-73.577377,41.275224],[-73.577809,41.275238],[-73.57833100000001,41.275229],[-73.578694,41.275218],[-73.579397,41.275224],[-73.579697,41.275239],[-73.580134,41.275281],[-73.580549,41.27534],[-73.58096500000001,41.275424],[-73.58154399999999,41.275586],[-73.58214599999999,41.275778],[-73.582916,41.276037],[-73.584541,41.276542],[-73.585093,41.2767],[-73.586192,41.277021],[-73.58659400000001,41.277129],[-73.587278,41.277263],[-73.588523,41.277433],[-73.58881599999999,41.277481],[-73.589842,41.277629],[-73.590774,41.277771],[-73.591505,41.277872],[-73.59212599999999,41.277896],[-73.592598,41.277853],[-73.592685,41.278268],[-73.592755,41.278477],[-73.59282899999999,41.278653],[-73.593284,41.27951],[-73.593377,41.279721],[-73.593462,41.279958],[-73.59360700000001,41.280514],[-73.593673,41.280852],[-73.593717,41.280976],[-73.59378700000001,41.281083],[-73.59406300000001,41.28145],[-73.594294,41.281854],[-73.594613,41.282536],[-73.59486699999999,41.283171],[-73.594943,41.283468],[-73.594966,41.283604],[-73.594948,41.283792],[-73.59475999999999,41.28472],[-73.59425299999999,41.287036],[-73.594129,41.287664],[-73.594114,41.287887],[-73.59413600000001,41.28799],[-73.59418700000001,41.288111],[-73.594374,41.288479],[-73.595292,41.29028],[-73.595477,41.290644],[-73.595619,41.290889]]],"type":"Polygon"}
}