{
  "id": "361031350023",
  "type": "Feature",
  "properties": {
    "area_land":1146869,
    "area_water":0,
    "geoid":"361031350023",
    "name":"Block Group 3",
    "state":"ny"
},
  "bbox": [
    -73.176625,
    40.855136,
    -73.16612,
    40.873394
],
  "geometry": {"coordinates":[[[-73.17642600000001,40.866404],[-73.176182,40.866659],[-73.17422500000001,40.86904],[-73.1737,40.869587],[-73.17327,40.870054],[-73.172991,40.870338],[-73.17168599999999,40.871683],[-73.17147900000001,40.871955],[-73.17124699999999,40.872328],[-73.171069,40.872703],[-73.1709,40.873189],[-73.16950900000001,40.873348],[-73.16910900000001,40.873394],[-73.16886700000001,40.872181],[-73.168693,40.871303],[-73.168623,40.870993],[-73.168536,40.870566],[-73.16829799999999,40.869357],[-73.16819,40.868644],[-73.168103,40.868332],[-73.16800000000001,40.867779],[-73.16793699999999,40.867545],[-73.167896,40.867284],[-73.167923,40.867102],[-73.16800499999999,40.866931],[-73.168402,40.866431],[-73.168136,40.866324],[-73.167929,40.866198],[-73.167839,40.866046],[-73.167777,40.865786],[-73.167624,40.864974],[-73.16757800000001,40.86473],[-73.167526,40.864421],[-73.16748,40.864093],[-73.166785,40.860682],[-73.166267,40.858104],[-73.16612000000001,40.857337],[-73.16692399999999,40.857074],[-73.16716,40.857004],[-73.167798,40.856747],[-73.16853999999999,40.856528],[-73.169555,40.856205],[-73.170331,40.856009],[-73.17229399999999,40.855605],[-73.17263,40.855522],[-73.17377,40.855307],[-73.173956,40.855278],[-73.17436499999999,40.855219],[-73.174654,40.855178],[-73.174942,40.855136],[-73.17485600000001,40.855426],[-73.174432,40.856326],[-73.174357,40.857532],[-73.17456900000001,40.858303],[-73.174864,40.858786],[-73.1752,40.859617],[-73.17579600000001,40.86146],[-73.17555299999999,40.862549],[-73.175849,40.863551],[-73.176625,40.866143],[-73.17642600000001,40.866404]]],"type":"Polygon"}
}