{
  "id": "360594120006",
  "type": "Feature",
  "properties": {
    "area_land":250193,
    "area_water":0,
    "geoid":"360594120006",
    "name":"Block Group 6",
    "state":"ny"
},
  "bbox": [
    -73.671004,
    40.661756,
    -73.66462,
    40.666696
],
  "geometry": {"coordinates":[[[-73.671004,40.665625],[-73.670601,40.665624],[-73.67056100000001,40.665635],[-73.67034099999999,40.665633],[-73.670481,40.666102],[-73.669844,40.666297],[-73.66987399999999,40.666602],[-73.66548899999999,40.666696],[-73.665477,40.666198],[-73.66532100000001,40.666432],[-73.665235,40.665783],[-73.665144,40.665202],[-73.66497099999999,40.664113],[-73.664939,40.664016],[-73.66493699999999,40.663979],[-73.664936,40.663884],[-73.66462,40.661933],[-73.66562399999999,40.661841],[-73.66617100000001,40.661797],[-73.666501,40.661772],[-73.666701,40.661756],[-73.666715,40.66191],[-73.66675499999999,40.661951],[-73.666776,40.661965],[-73.66701999999999,40.662003],[-73.667389,40.66206],[-73.667835,40.662023],[-73.66912600000001,40.661918],[-73.67076900000001,40.661774],[-73.67077,40.661896],[-73.670688,40.66251],[-73.670654,40.662764],[-73.670635,40.663212],[-73.67065100000001,40.663451],[-73.67069100000001,40.663894],[-73.67074700000001,40.664473],[-73.670756,40.664574],[-73.67079200000001,40.664856],[-73.670866,40.665186],[-73.670889,40.665237],[-73.671004,40.665625]]],"type":"Polygon"}
}