{
  "id": "360470500001",
  "type": "Feature",
  "properties": {
    "area_land":50182,
    "area_water":0,
    "geoid":"360470500001",
    "name":"Block Group 1",
    "state":"ny"
},
  "bbox": [
    -73.980712,
    40.647297,
    -73.978191,
    40.650292
],
  "geometry": {"coordinates":[[[-73.980712,40.649524],[-73.979598,40.649948],[-73.97871600000001,40.650292],[-73.97836700000001,40.64847],[-73.978191,40.647526],[-73.979118,40.647428],[-73.98029099999999,40.647297],[-73.98036399999999,40.647694],[-73.980712,40.649524]]],"type":"Polygon"}
}