{
  "id": "360050444004",
  "type": "Feature",
  "properties": {
    "area_land":168083,
    "area_water":0,
    "geoid":"360050444004",
    "name":"Block Group 4",
    "state":"ny"
},
  "bbox": [
    -73.844569,
    40.897267,
    -73.839149,
    40.902812
],
  "geometry": {"coordinates":[[[-73.84366300000001,40.902233],[-73.842727,40.902441],[-73.841792,40.902646],[-73.840999,40.902812],[-73.840958,40.902516],[-73.840873,40.901979],[-73.84083200000001,40.901819],[-73.84078700000001,40.901693],[-73.840729,40.901567],[-73.84065,40.901414],[-73.84056200000001,40.901284],[-73.840445,40.901124],[-73.84021,40.900804],[-73.84019000000001,40.900777],[-73.84017900000001,40.900762],[-73.840172,40.900753],[-73.840159,40.900735],[-73.840085,40.900634],[-73.84004899999999,40.900585],[-73.840036,40.900567],[-73.83936300000001,40.899713],[-73.839287,40.899594],[-73.83922099999999,40.899475],[-73.839185,40.89936],[-73.83915500000001,40.899226],[-73.83915399999999,40.899199],[-73.83914900000001,40.899061],[-73.839208,40.898819],[-73.839241,40.898744],[-73.839257,40.898707],[-73.83939100000001,40.89841],[-73.83951,40.898184],[-73.83964899999999,40.897891],[-73.840723,40.897653],[-73.84159200000001,40.897462],[-73.84247999999999,40.897267],[-73.843457,40.899824],[-73.84456900000001,40.902037],[-73.84366300000001,40.902233]]],"type":"Polygon"}
}