{
  "id": "361059512004",
  "type": "Feature",
  "properties": {
    "area_land":12624924,
    "area_water":0,
    "geoid":"361059512004",
    "name":"Block Group 4",
    "state":"ny"
},
  "bbox": [
    -74.501171,
    41.503458,
    -74.443647,
    41.560032
],
  "geometry": {"coordinates":[[[-74.500649,41.503836],[-74.50046,41.503972],[-74.499467,41.504591],[-74.49923200000001,41.504769],[-74.499076,41.504918],[-74.498868,41.505168],[-74.498498,41.505644],[-74.498276,41.505902],[-74.498137,41.506033],[-74.497063,41.506873],[-74.49651299999999,41.507322],[-74.496219,41.507539],[-74.49577499999999,41.507881],[-74.495666,41.507961],[-74.49552799999999,41.508062],[-74.494716,41.508642],[-74.49446500000001,41.508808],[-74.49433500000001,41.508912],[-74.494231,41.509017],[-74.49346199999999,41.50987],[-74.493168,41.510175],[-74.493009,41.510342],[-74.492763,41.510587],[-74.49257299999999,41.510821],[-74.49249399999999,41.510937],[-74.49243300000001,41.511027],[-74.49235,41.511172],[-74.491444,41.512759],[-74.49126800000001,41.513145],[-74.49100300000001,41.513855],[-74.49086699999999,41.514477],[-74.49083899999999,41.514596],[-74.490765,41.514911],[-74.490475,41.515945],[-74.490381,41.516203],[-74.490244,41.516451],[-74.49013100000001,41.516603],[-74.489603,41.517181],[-74.48934,41.517454],[-74.48912900000001,41.517665],[-74.48862699999999,41.518105],[-74.48835800000001,41.518365],[-74.48776700000001,41.519053],[-74.487486,41.519444],[-74.487251,41.519823],[-74.486971,41.520422],[-74.486459,41.521326],[-74.48616199999999,41.521929],[-74.48560000000001,41.522813],[-74.485097,41.523583],[-74.485107,41.523873],[-74.48509199999999,41.524107],[-74.485051,41.524415],[-74.48499700000001,41.524671],[-74.484932,41.524982],[-74.484813,41.525847],[-74.48481099999999,41.525936],[-74.484945,41.526689],[-74.485049,41.527176],[-74.48514,41.527485],[-74.48516499999999,41.527629],[-74.485153,41.52783],[-74.48514400000001,41.52798],[-74.485125,41.528166],[-74.48505900000001,41.528387],[-74.484864,41.528934],[-74.484729,41.529352],[-74.48456299999999,41.530059],[-74.4845,41.530425],[-74.48445700000001,41.530631],[-74.484375,41.53089],[-74.484138,41.531535],[-74.484131,41.531657],[-74.484162,41.531762],[-74.484216,41.531855],[-74.484274,41.531916],[-74.48435600000001,41.531974],[-74.48451900000001,41.532035],[-74.484756,41.53207],[-74.484874,41.532082],[-74.485152,41.532125],[-74.485236,41.532144],[-74.485474,41.53223],[-74.48568400000001,41.532352],[-74.485831,41.532452],[-74.48593700000001,41.532539],[-74.486121,41.532736],[-74.486187,41.532843],[-74.486254,41.53299],[-74.486463,41.533615],[-74.486496,41.53374],[-74.48650600000001,41.533829],[-74.48651099999999,41.533915],[-74.486496,41.534001],[-74.48647200000001,41.534094],[-74.486405,41.534212],[-74.486305,41.534323],[-74.485946,41.534624],[-74.485354,41.535082],[-74.485016,41.535337],[-74.484201,41.535905],[-74.483915,41.53609],[-74.483104,41.536594],[-74.482792,41.536784],[-74.482411,41.537031],[-74.48225100000001,41.537159],[-74.48195699999999,41.537411],[-74.48150099999999,41.537839],[-74.481393,41.537965],[-74.481341,41.538054],[-74.48119199999999,41.538309],[-74.48102,41.538669],[-74.480322,41.540331],[-74.480109,41.540721],[-74.47980099999999,41.541176],[-74.47949,41.541716],[-74.479164,41.542308],[-74.478988,41.542592],[-74.478748,41.542907],[-74.478565,41.543106],[-74.47833799999999,41.543335],[-74.478284,41.543408],[-74.47821500000001,41.543579],[-74.478199,41.543734],[-74.478161,41.544117],[-74.478101,41.544547],[-74.47805200000001,41.545092],[-74.478022,41.545204],[-74.477991,41.545295],[-74.477903,41.545441],[-74.47787700000001,41.545485],[-74.47774,41.54562],[-74.47768000000001,41.545673],[-74.47763,41.545707],[-74.477572,41.545746],[-74.477351,41.545855],[-74.47707200000001,41.545957],[-74.476842,41.546027],[-74.476378,41.546133],[-74.476096,41.546218],[-74.475988,41.546262],[-74.47588500000001,41.546304],[-74.475821,41.54633],[-74.475753,41.546365],[-74.47564300000001,41.546421],[-74.47554700000001,41.54647],[-74.475458,41.546524],[-74.474929,41.546843],[-74.474805,41.546951],[-74.474689,41.547114],[-74.474645,41.547223],[-74.47454,41.547684],[-74.474447,41.547857],[-74.47417799999999,41.54825],[-74.47407200000001,41.54839],[-74.473735,41.548772],[-74.473674,41.548831],[-74.473612,41.548891],[-74.47348,41.548994],[-74.472737,41.549449],[-74.472562,41.549552],[-74.47226999999999,41.549725],[-74.471709,41.550025],[-74.471158,41.55025],[-74.47103799999999,41.550294],[-74.47063799999999,41.550399],[-74.470201,41.550505],[-74.470029,41.550546],[-74.469741,41.550603],[-74.468103,41.55085],[-74.467777,41.550912],[-74.46746899999999,41.550997],[-74.46717700000001,41.551109],[-74.46659699999999,41.551388],[-74.466255,41.551575],[-74.466137,41.551652],[-74.465907,41.551846],[-74.465681,41.552089],[-74.465506,41.55233],[-74.465129,41.552944],[-74.465057,41.553028],[-74.46423799999999,41.553706],[-74.46344499999999,41.554311],[-74.46296,41.554672],[-74.461985,41.555479],[-74.461634,41.555785],[-74.46124500000001,41.556075],[-74.461028,41.55629],[-74.46082,41.556517],[-74.4606,41.556717],[-74.45992200000001,41.557357],[-74.45961699999999,41.557758],[-74.45943,41.558018],[-74.45925699999999,41.558205],[-74.459205,41.558252],[-74.45903199999999,41.558406],[-74.458575,41.55877],[-74.458404,41.558918],[-74.458343,41.558979],[-74.458118,41.559221],[-74.457793,41.559608],[-74.45747799999999,41.560032],[-74.457504,41.5599],[-74.457533,41.559616],[-74.457504,41.559354],[-74.457442,41.559145],[-74.457486,41.559045],[-74.45758499999999,41.558689],[-74.457708,41.558036],[-74.45769199999999,41.55793],[-74.457656,41.557865],[-74.457583,41.5578],[-74.457538,41.557777],[-74.45743400000001,41.557746],[-74.45734400000001,41.557734],[-74.45728,41.557607],[-74.457125,41.557544],[-74.457007,41.557539],[-74.456909,41.557461],[-74.45683099999999,41.557343],[-74.456784,41.557299],[-74.456689,41.557245],[-74.456571,41.557133],[-74.45653,41.557066],[-74.456486,41.556941],[-74.45631,41.556762],[-74.456287,41.556714],[-74.456283,41.556586],[-74.456354,41.556464],[-74.456351,41.556404],[-74.45633100000001,41.556353],[-74.456277,41.556295],[-74.45618899999999,41.556251],[-74.456087,41.556214],[-74.455989,41.556113],[-74.455932,41.556082],[-74.45581,41.556049],[-74.45549699999999,41.555989],[-74.45545,41.555955],[-74.455372,41.555827],[-74.45533500000001,41.55581],[-74.45522699999999,41.55579],[-74.45518300000001,41.555817],[-74.45513200000001,41.555871],[-74.45509800000001,41.555882],[-74.455071,41.555884],[-74.45499,41.555864],[-74.454919,41.555824],[-74.454841,41.555756],[-74.454736,41.555617],[-74.454662,41.55559],[-74.454601,41.55559],[-74.454486,41.555611],[-74.454317,41.555695],[-74.454277,41.555688],[-74.454131,41.555594],[-74.453986,41.555587],[-74.453857,41.555604],[-74.453632,41.555678],[-74.453568,41.555691],[-74.453446,41.555694],[-74.45337499999999,41.555667],[-74.45332399999999,41.555624],[-74.45323999999999,41.555515],[-74.453182,41.555455],[-74.45309399999999,41.555384],[-74.45302,41.555343],[-74.452567,41.555221],[-74.451937,41.555116],[-74.45181100000001,41.55511],[-74.45169,41.555106],[-74.45155800000001,41.555146],[-74.451429,41.55514],[-74.451358,41.555102],[-74.45124300000001,41.554998],[-74.451172,41.554906],[-74.451132,41.554869],[-74.451044,41.554835],[-74.45061099999999,41.554822],[-74.45059500000001,41.55482],[-74.450579,41.554814],[-74.45056,41.554802],[-74.45046499999999,41.554683],[-74.45035900000001,41.554609],[-74.45028600000001,41.554565],[-74.449921,41.55445],[-74.449836,41.554457],[-74.449755,41.554531],[-74.449708,41.554548],[-74.449657,41.554552],[-74.449512,41.554535],[-74.449322,41.554467],[-74.44928899999999,41.554445],[-74.44922200000001,41.554364],[-74.44918800000001,41.55434],[-74.449117,41.55433],[-74.44903600000001,41.55433],[-74.448971,41.554317],[-74.44886700000001,41.554239],[-74.448718,41.554181],[-74.448654,41.554141],[-74.448616,41.554104],[-74.448515,41.554087],[-74.448447,41.55405],[-74.448437,41.554016],[-74.448457,41.553942],[-74.44846099999999,41.553896],[-74.448447,41.553881],[-74.44842,41.553877],[-74.448386,41.553884],[-74.448322,41.553942],[-74.448285,41.553965],[-74.448194,41.553948],[-74.448166,41.553925],[-74.448072,41.553732],[-74.448058,41.553658],[-74.448075,41.553553],[-74.44806199999999,41.553526],[-74.447872,41.553465],[-74.447587,41.553321],[-74.44749299999999,41.553257],[-74.447479,41.553227],[-74.447473,41.553115],[-74.447412,41.55299],[-74.447351,41.552936],[-74.447209,41.552868],[-74.44717799999999,41.552828],[-74.447104,41.552679],[-74.44677900000001,41.552341],[-74.446681,41.552274],[-74.44652499999999,41.552213],[-74.446299,41.552091],[-74.44602,41.551873],[-74.44592799999999,41.551778],[-74.445898,41.551714],[-74.445905,41.551643],[-74.44596900000001,41.551572],[-74.445976,41.551457],[-74.445959,41.551417],[-74.445925,41.551413],[-74.44583,41.551423],[-74.445759,41.551447],[-74.44559,41.551447],[-74.44556300000001,41.551423],[-74.44555,41.551376],[-74.44556,41.551325],[-74.44564099999999,41.551217],[-74.445797,41.551156],[-74.445864,41.551116],[-74.445885,41.551065],[-74.445898,41.550923],[-74.44594499999999,41.550883],[-74.446044,41.550869],[-74.446118,41.550842],[-74.446175,41.550805],[-74.446189,41.550781],[-74.446189,41.550731],[-74.44614199999999,41.550676],[-74.44614199999999,41.550471],[-74.446189,41.550278],[-74.446217,41.55025],[-74.446389,41.550148],[-74.446607,41.550058],[-74.446743,41.549989],[-74.44678399999999,41.54995],[-74.446845,41.549845],[-74.44683999999999,41.549745],[-74.446568,41.549435],[-74.44655299999999,41.549389],[-74.44655299999999,41.549323],[-74.446532,41.549239],[-74.446432,41.549118],[-74.44645300000001,41.549072],[-74.446532,41.549044],[-74.446563,41.548972],[-74.446639,41.54891],[-74.44669399999999,41.548865],[-74.44673,41.548816],[-74.44677900000001,41.548655],[-74.446799,41.548552],[-74.446791,41.548378],[-74.44667800000001,41.548202],[-74.446596,41.548123],[-74.446516,41.547975],[-74.446473,41.547854],[-74.44646,41.547713],[-74.446422,41.547597],[-74.44614900000001,41.547281],[-74.446119,41.547188],[-74.446106,41.546876],[-74.446093,41.546845],[-74.446065,41.546822],[-74.44598999999999,41.546797],[-74.445975,41.546771],[-74.445977,41.546727],[-74.445995,41.546686],[-74.446108,41.546599],[-74.446172,41.546446],[-74.44616000000001,41.546353],[-74.446129,41.546303],[-74.44609800000001,41.54628],[-74.44597,41.546257],[-74.445959,41.546231],[-74.44603600000001,41.546146],[-74.446062,41.54609],[-74.446088,41.545939],[-74.446067,41.545885],[-74.445993,41.545767],[-74.445954,41.545614],[-74.44593399999999,41.545588],[-74.445854,41.545555],[-74.44573099999999,41.545565],[-74.44569,41.545542],[-74.445531,41.545281],[-74.44543899999999,41.545065],[-74.445313,41.544943],[-74.445313,41.544901],[-74.44534,41.544844],[-74.44532100000001,41.544772],[-74.44523700000001,41.544719],[-74.445165,41.544643],[-74.445154,41.544567],[-74.445138,41.54454],[-74.44505100000001,41.544472],[-74.44503899999999,41.544449],[-74.44503899999999,41.544411],[-74.445059,41.544344],[-74.445066,41.544323],[-74.445063,41.544229],[-74.445176,41.544094],[-74.44531000000001,41.544066],[-74.445431,41.544012],[-74.445504,41.543948],[-74.445564,41.543867],[-74.445588,41.543667],[-74.445576,41.543395],[-74.445601,41.543032],[-74.445711,41.542271],[-74.445762,41.542037],[-74.44579,41.541861],[-74.445998,41.541488],[-74.446108,41.541261],[-74.446122,41.541209],[-74.446094,41.541095],[-74.446039,41.540981],[-74.445942,41.540919],[-74.445775,41.540873],[-74.44552,41.540908],[-74.445267,41.540918],[-74.444951,41.540925],[-74.444559,41.54095],[-74.44432399999999,41.540978],[-74.44409899999999,41.541011],[-74.443917,41.540993],[-74.443787,41.540923],[-74.44372799999999,41.540842],[-74.443691,41.540738],[-74.44369399999999,41.540592],[-74.443819,41.540102],[-74.444159,41.539521],[-74.444187,41.539438],[-74.44417300000001,41.539365],[-74.44411700000001,41.539272],[-74.443979,41.539231],[-74.44384100000001,41.53922],[-74.443772,41.539179],[-74.443702,41.539106],[-74.44368900000001,41.539044],[-74.443647,41.538962],[-74.443675,41.538868],[-74.44371599999999,41.538775],[-74.44381300000001,41.53862],[-74.444062,41.53834],[-74.444214,41.538061],[-74.44432500000001,41.537595],[-74.444602,41.537233],[-74.444768,41.537139],[-74.44496100000001,41.537067],[-74.44514100000001,41.537025],[-74.445348,41.536953],[-74.445542,41.536829],[-74.445791,41.536663],[-74.44610900000001,41.536497],[-74.446234,41.536363],[-74.4464,41.536208],[-74.44682899999999,41.535856],[-74.446956,41.535729],[-74.447078,41.535607],[-74.447327,41.535483],[-74.447368,41.535452],[-74.44779699999999,41.5354],[-74.44792099999999,41.535379],[-74.447959,41.53536],[-74.448004,41.535318],[-74.448018,41.535226],[-74.447924,41.535009],[-74.44783,41.534608],[-74.447838,41.534489],[-74.44793900000001,41.534353],[-74.448337,41.534196],[-74.448475,41.534196],[-74.44872100000001,41.534126],[-74.448836,41.534052],[-74.44887900000001,41.534006],[-74.449003,41.533801],[-74.449155,41.533643],[-74.449597,41.533367],[-74.44980700000001,41.533297],[-74.45021199999999,41.533074],[-74.450277,41.53302],[-74.45046499999999,41.532955],[-74.450609,41.532936],[-74.450807,41.532945],[-74.45098299999999,41.53291],[-74.45107899999999,41.532898],[-74.451154,41.53288],[-74.45135500000001,41.532809],[-74.451587,41.532771],[-74.451797,41.532717],[-74.451999,41.532635],[-74.452141,41.532567],[-74.452231,41.53254],[-74.452347,41.532543],[-74.452442,41.532581],[-74.452485,41.53263],[-74.452601,41.532673],[-74.452674,41.532692],[-74.452748,41.532704],[-74.452912,41.532684],[-74.453039,41.532618],[-74.453148,41.532571],[-74.453361,41.532581],[-74.45352699999999,41.53263],[-74.45370800000001,41.532722],[-74.453824,41.532798],[-74.453976,41.53289],[-74.454092,41.532988],[-74.454157,41.533058],[-74.454246,41.533364],[-74.454324,41.533415],[-74.454382,41.533421],[-74.45446099999999,41.53341],[-74.45453999999999,41.533369],[-74.454596,41.533253],[-74.454628,41.533166],[-74.45464200000001,41.533098],[-74.454686,41.533026],[-74.454776,41.532968],[-74.454939,41.532933],[-74.455026,41.532906],[-74.455163,41.532847],[-74.455417,41.532608],[-74.45557599999999,41.532414],[-74.45572799999999,41.53217],[-74.455815,41.532078],[-74.455974,41.531986],[-74.45604,41.531884],[-74.455961,41.531656],[-74.455946,41.531502],[-74.45593700000001,41.531336],[-74.455889,41.531137],[-74.45583000000001,41.531007],[-74.455761,41.530907],[-74.45564400000001,41.530822],[-74.455384,41.530676],[-74.455319,41.530589],[-74.455292,41.530473],[-74.45533399999999,41.530291],[-74.45545,41.530112],[-74.455665,41.529951],[-74.456051,41.529817],[-74.456822,41.529676],[-74.457127,41.529573],[-74.45731499999999,41.529462],[-74.45746200000001,41.529361],[-74.457578,41.529229],[-74.45771000000001,41.529088],[-74.457877,41.52886],[-74.457913,41.528759],[-74.457913,41.528647],[-74.457841,41.528524],[-74.457725,41.528412],[-74.457656,41.528392],[-74.457408,41.528392],[-74.45724300000001,41.528368],[-74.45716,41.528343],[-74.457097,41.528292],[-74.45704000000001,41.528151],[-74.45698899999999,41.527979],[-74.45698299999999,41.527876],[-74.45698899999999,41.527784],[-74.457049,41.527621],[-74.457148,41.527502],[-74.457396,41.527328],[-74.457545,41.527236],[-74.457662,41.527182],[-74.45781700000001,41.527151],[-74.458212,41.527113],[-74.458493,41.527079],[-74.458624,41.527044],[-74.458792,41.526963],[-74.458872,41.526903],[-74.459025,41.526746],[-74.45909,41.526671],[-74.45913899999999,41.526599],[-74.459216,41.526416],[-74.459361,41.526208],[-74.459506,41.526071],[-74.459632,41.525962],[-74.45971900000001,41.525861],[-74.459796,41.52568],[-74.45981500000001,41.525499],[-74.459806,41.52513],[-74.459825,41.525058],[-74.45989299999999,41.524971],[-74.460037,41.524829],[-74.46024,41.524656],[-74.460346,41.524605],[-74.460481,41.524598],[-74.460708,41.524638],[-74.461032,41.524685],[-74.46121599999999,41.524694],[-74.46132900000001,41.52468],[-74.46141,41.524633],[-74.461506,41.524569],[-74.461573,41.52446],[-74.461641,41.524316],[-74.461747,41.524178],[-74.461854,41.524023],[-74.462018,41.523874],[-74.462211,41.523708],[-74.462356,41.523563],[-74.462569,41.523419],[-74.462733,41.523332],[-74.462878,41.523274],[-74.463081,41.52323],[-74.463371,41.52318],[-74.463651,41.523173],[-74.463893,41.523173],[-74.46415399999999,41.523194],[-74.46427,41.523209],[-74.46442399999999,41.523187],[-74.464551,41.523136],[-74.46463199999999,41.523085],[-74.46470100000001,41.523024],[-74.464789,41.522977],[-74.46486400000001,41.522963],[-74.464996,41.522963],[-74.465209,41.523005],[-74.465439,41.523093],[-74.46551599999999,41.523093],[-74.465594,41.523071],[-74.465661,41.523014],[-74.465748,41.522862],[-74.465748,41.522768],[-74.46571900000001,41.522666],[-74.465439,41.521545],[-74.465294,41.52088],[-74.46511099999999,41.520453],[-74.46489800000001,41.519997],[-74.46483000000001,41.519867],[-74.464792,41.519693],[-74.46480099999999,41.519491],[-74.46484,41.519375],[-74.465024,41.519151],[-74.465372,41.518774],[-74.465613,41.518543],[-74.46569,41.518442],[-74.465729,41.518326],[-74.4657,41.518123],[-74.465585,41.517834],[-74.465468,41.517501],[-74.465491,41.517374],[-74.465535,41.517215],[-74.465535,41.517197],[-74.465536,41.517125],[-74.46554399999999,41.517089],[-74.465554,41.517042],[-74.465591,41.516972],[-74.465616,41.516882],[-74.465716,41.516783],[-74.46581,41.516722],[-74.465929,41.516652],[-74.46646800000001,41.516375],[-74.46663100000001,41.516258],[-74.466977,41.515983],[-74.467162,41.515955],[-74.46724500000001,41.515903],[-74.467378,41.515848],[-74.467517,41.515824],[-74.467637,41.515821],[-74.46783000000001,41.515834],[-74.46795899999999,41.515879],[-74.468126,41.515897],[-74.46819499999999,41.515886],[-74.468254,41.515841],[-74.468295,41.515779],[-74.468304,41.515707],[-74.468093,41.515054],[-74.468121,41.514965],[-74.468149,41.514913],[-74.46836,41.514657],[-74.46883,41.514125],[-74.46889,41.514042],[-74.46936100000001,41.51379],[-74.470371,41.513549],[-74.47050900000001,41.513474],[-74.471259,41.512856],[-74.471397,41.51279],[-74.47241,41.512696],[-74.47253499999999,41.512659],[-74.47261,41.512565],[-74.472685,41.512443],[-74.47266,41.512284],[-74.472585,41.512172],[-74.472511,41.512097],[-74.47242199999999,41.511919],[-74.472397,41.511651],[-74.47237199999999,41.511544],[-74.47239999999999,41.511486],[-74.47246,41.511451],[-74.472793,41.511446],[-74.472988,41.511429],[-74.47305299999999,41.511419],[-74.473186,41.511397],[-74.473336,41.511369],[-74.473415,41.511355],[-74.47354,41.511304],[-74.473619,41.511272],[-74.473687,41.511236],[-74.473753,41.5112],[-74.47380800000001,41.51117],[-74.474084,41.51103],[-74.474312,41.510937],[-74.474548,41.510863],[-74.474891,41.510779],[-74.475173,41.510731],[-74.475476,41.510691],[-74.475594,41.510661],[-74.475742,41.510603],[-74.475943,41.510509],[-74.47609199999999,41.510399],[-74.476106,41.510341],[-74.476102,41.510239],[-74.476056,41.510153],[-74.47593500000001,41.510007],[-74.47575500000001,41.509854],[-74.474836,41.509165],[-74.47472999999999,41.509053],[-74.47456699999999,41.508983],[-74.47416699999999,41.508973],[-74.47411099999999,41.508945],[-74.47406700000001,41.508823],[-74.47405500000001,41.508734],[-74.47408,41.508646],[-74.47408,41.508355],[-74.47413299999999,41.508114],[-74.47416699999999,41.507917],[-74.47420099999999,41.50779],[-74.47422400000001,41.507723],[-74.474311,41.507592],[-74.47439900000001,41.507471],[-74.474493,41.507434],[-74.47462400000001,41.507414],[-74.474824,41.507465],[-74.47496,41.507449],[-74.47501200000001,41.507405],[-74.47506799999999,41.507227],[-74.47503,41.507115],[-74.474949,41.506993],[-74.474761,41.506886],[-74.474536,41.506858],[-74.474384,41.506901],[-74.474217,41.50696],[-74.47410499999999,41.50697],[-74.474042,41.506951],[-74.47394799999999,41.506899],[-74.473902,41.506794],[-74.47388599999999,41.506664],[-74.47391399999999,41.506553],[-74.473957,41.506461],[-74.474217,41.506252],[-74.47442100000001,41.506152],[-74.47457,41.506092],[-74.474879,41.50605],[-74.47506799999999,41.50606],[-74.475291,41.506129],[-74.475508,41.506308],[-74.475656,41.506298],[-74.475746,41.506231],[-74.47579500000001,41.506145],[-74.47580499999999,41.506046],[-74.47580499999999,41.5059],[-74.47581099999999,41.50577],[-74.47581099999999,41.505622],[-74.47580499999999,41.505517],[-74.475692,41.505351],[-74.475523,41.505105],[-74.47548,41.505022],[-74.475458,41.504952],[-74.475482,41.504851],[-74.475533,41.504716],[-74.475584,41.504603],[-74.47559800000001,41.504521],[-74.47559800000001,41.504396],[-74.47559099999999,41.504334],[-74.475623,41.503987],[-74.47561899999999,41.503953],[-74.476113,41.503955],[-74.47699,41.503973],[-74.47779300000001,41.503999],[-74.478797,41.504018],[-74.479693,41.504038],[-74.480233,41.504058],[-74.480712,41.504089],[-74.48122499999999,41.504101],[-74.481385,41.504119],[-74.481961,41.504129],[-74.481971,41.503967],[-74.48246,41.503963],[-74.48267300000001,41.504261],[-74.482781,41.50426],[-74.483152,41.504427],[-74.48324700000001,41.504258],[-74.48335299999999,41.504046],[-74.483963,41.504256],[-74.48436700000001,41.504235],[-74.484787,41.504],[-74.484937,41.503791],[-74.48544699999999,41.503923],[-74.48588599999999,41.504017],[-74.48604400000001,41.503944],[-74.486165,41.503915],[-74.486504,41.503828],[-74.48669099999999,41.503754],[-74.48702900000001,41.503616],[-74.487092,41.503673],[-74.487174,41.503762],[-74.48726000000001,41.503879],[-74.48731600000001,41.503978],[-74.48739999999999,41.504082],[-74.48741099999999,41.504095],[-74.487574,41.504375],[-74.487652,41.504365],[-74.487956,41.504242],[-74.488119,41.504047],[-74.488165,41.503963],[-74.48835200000001,41.503735],[-74.488518,41.503779],[-74.489227,41.503785],[-74.489593,41.50374],[-74.48972999999999,41.50379],[-74.489985,41.503779],[-74.490224,41.5039],[-74.490449,41.503941],[-74.490566,41.503936],[-74.491162,41.504155],[-74.491319,41.503901],[-74.491691,41.503495],[-74.492682,41.503735],[-74.492807,41.503834],[-74.493234,41.504216],[-74.493801,41.504447],[-74.494148,41.504089],[-74.495358,41.504447],[-74.496341,41.503669],[-74.49960299999999,41.503513],[-74.500265,41.503485],[-74.501171,41.503458],[-74.500649,41.503836]]],"type":"Polygon"}
}