{
  "id": "360810295002",
  "type": "Feature",
  "properties": {
    "area_land":123404,
    "area_water":0,
    "geoid":"360810295002",
    "name":"Block Group 2",
    "state":"ny"
},
  "bbox": [
    -73.910231,
    40.752977,
    -73.904917,
    40.757178
],
  "geometry": {"coordinates":[[[-73.909954,40.753218],[-73.909693,40.75347],[-73.909449,40.753731],[-73.909238,40.753981],[-73.909175,40.754064],[-73.909013,40.75428],[-73.908655,40.754939],[-73.90846500000001,40.755292],[-73.90836,40.755573],[-73.90782799999999,40.756999],[-73.907366,40.756988],[-73.906468,40.757082],[-73.906302,40.757099],[-73.905575,40.757178],[-73.905294,40.755628],[-73.905154,40.754858],[-73.904917,40.753505],[-73.90586399999999,40.753404],[-73.90611699999999,40.753379],[-73.906685,40.753308],[-73.906909,40.753285],[-73.907594,40.753222],[-73.910231,40.752977],[-73.909954,40.753218]]],"type":"Polygon"}
}