{
  "id": "360650251001",
  "type": "Feature",
  "properties": {
    "area_land":1038460,
    "area_water":0,
    "geoid":"360650251001",
    "name":"Block Group 1",
    "state":"ny"
},
  "bbox": [
    -75.298571,
    43.063696,
    -75.27749,
    43.079585
],
  "geometry": {"coordinates":[[[-75.298571,43.076899],[-75.298109,43.076942],[-75.298135,43.077086],[-75.29815600000001,43.077217],[-75.29805399999999,43.077227],[-75.298112,43.077585],[-75.297932,43.077598],[-75.297759,43.077615],[-75.297203,43.077668],[-75.297135,43.077328],[-75.29680999999999,43.077372],[-75.296809,43.077707],[-75.296705,43.077717],[-75.29636499999999,43.077756],[-75.29629199999999,43.077406],[-75.296024,43.077441],[-75.295738,43.07748],[-75.295798,43.077928],[-75.29579200000001,43.077953],[-75.29577,43.078037],[-75.295782,43.078315],[-75.295818,43.078409],[-75.295963,43.07843],[-75.295579,43.078463],[-75.29434999999999,43.079092],[-75.294061,43.079197],[-75.2937,43.079414],[-75.29361,43.079472],[-75.293373,43.079585],[-75.293305,43.079549],[-75.293166,43.079466],[-75.29196,43.078685],[-75.291787,43.078565],[-75.291454,43.078274],[-75.29134999999999,43.078214],[-75.290429,43.077154],[-75.290154,43.076823],[-75.290126,43.07679],[-75.289368,43.07714],[-75.288636,43.077483],[-75.288544,43.077526],[-75.28820399999999,43.077686],[-75.287532,43.076817],[-75.28733099999999,43.076513],[-75.287239,43.076386],[-75.286923,43.07595],[-75.286682,43.075655],[-75.28608800000001,43.075068],[-75.285661,43.074718],[-75.28543000000001,43.074511],[-75.28491,43.074033],[-75.28474300000001,43.073826],[-75.284637,43.073563],[-75.284502,43.073086],[-75.284462,43.072977],[-75.284301,43.072693],[-75.284057,43.072339],[-75.283933,43.072132],[-75.283762,43.071931],[-75.283492,43.071698],[-75.283368,43.071578],[-75.283208,43.071349],[-75.283091,43.071294],[-75.282391,43.071086],[-75.28218699999999,43.070995],[-75.28190600000001,43.070817],[-75.281476,43.070605],[-75.281053,43.07042],[-75.280557,43.070267],[-75.280192,43.070179],[-75.27975499999999,43.070128],[-75.279562,43.070124],[-75.279179,43.070146],[-75.279044,43.070135],[-75.278865,43.070073],[-75.278632,43.069913],[-75.278395,43.069815],[-75.27800000000001,43.069681],[-75.27791000000001,43.069048],[-75.277896,43.068952],[-75.277891,43.068913],[-75.277742,43.067934],[-75.27755999999999,43.066532],[-75.27749,43.066016],[-75.283045,43.064902],[-75.283461,43.064207],[-75.283874,43.063696],[-75.28402,43.064093],[-75.284536,43.065496],[-75.28483900000001,43.06626],[-75.28498999999999,43.066635],[-75.285105,43.066927],[-75.285346,43.067489],[-75.285493,43.067877],[-75.28565999999999,43.068324],[-75.285855,43.068786],[-75.28600900000001,43.06919],[-75.28625700000001,43.069795],[-75.28728099999999,43.072359],[-75.287389,43.072588],[-75.28776499999999,43.073276],[-75.28779400000001,43.073343],[-75.288032,43.073238],[-75.288293,43.07314],[-75.288628,43.073021],[-75.289209,43.072826],[-75.29007900000001,43.072542],[-75.290459,43.072438],[-75.29078,43.072367],[-75.29100200000001,43.072308],[-75.29138399999999,43.072217],[-75.29254299999999,43.071967],[-75.292653,43.071951],[-75.29315,43.071889],[-75.293902,43.071828],[-75.29398,43.071827],[-75.29438399999999,43.071828],[-75.294696,43.071874],[-75.295181,43.072011],[-75.295878,43.072217],[-75.29602300000001,43.072249],[-75.296138,43.072265],[-75.296316,43.072276],[-75.296454,43.072265],[-75.296544,43.072249],[-75.296764,43.072196],[-75.297101,43.072085],[-75.297225,43.072032],[-75.29732300000001,43.071971],[-75.297848,43.072666],[-75.29765500000001,43.073808],[-75.297521,43.074232],[-75.29759300000001,43.074245],[-75.297465,43.074933],[-75.29777799999999,43.074984],[-75.29799199999999,43.076252],[-75.29845400000001,43.076261],[-75.298571,43.076899]]],"type":"Polygon"}
}