{
  "id": "360594131003",
  "type": "Feature",
  "properties": {
    "area_land":361391,
    "area_water":0,
    "geoid":"360594131003",
    "name":"Block Group 3",
    "state":"ny"
},
  "bbox": [
    -73.633904,
    40.644887,
    -73.626421,
    40.652377
],
  "geometry": {"coordinates":[[[-73.633816,40.645874],[-73.633782,40.646069],[-73.63372,40.646255],[-73.63334,40.64722],[-73.63323800000001,40.647428],[-73.633005,40.64806],[-73.632927,40.64832],[-73.632901,40.648402],[-73.63275400000001,40.649632],[-73.632716,40.649858],[-73.632668,40.65],[-73.632599,40.65022],[-73.632587,40.650274],[-73.632535,40.65042],[-73.632171,40.651449],[-73.63182999999999,40.652377],[-73.630781,40.652176],[-73.629402,40.651915],[-73.628962,40.651831],[-73.629215,40.651053],[-73.62827299999999,40.650872],[-73.62732699999999,40.650693],[-73.62642099999999,40.650518],[-73.626846,40.649214],[-73.626953,40.648856],[-73.62700599999999,40.648652],[-73.627202,40.648122],[-73.627562,40.647031],[-73.62772,40.646566],[-73.62784000000001,40.646151],[-73.627999,40.645697],[-73.62824999999999,40.644887],[-73.62832899999999,40.644887],[-73.62944299999999,40.644918],[-73.63055300000001,40.64493],[-73.63185300000001,40.644962],[-73.632599,40.644981],[-73.633644,40.645014],[-73.633904,40.645038],[-73.633816,40.645874]]],"type":"Polygon"}
}