{
  "id": "360510311003",
  "type": "Feature",
  "properties": {
    "area_land":51031032,
    "area_water":17875,
    "geoid":"360510311003",
    "name":"Block Group 3",
    "state":"ny"
},
  "bbox": [
    -77.655738,
    42.579439,
    -77.572356,
    42.671837
],
  "geometry": {"coordinates":[[[-77.655648,42.669261],[-77.655458,42.669195],[-77.65525700000001,42.669152],[-77.65394499999999,42.669021],[-77.652783,42.668887],[-77.651856,42.668761],[-77.651055,42.668635],[-77.650122,42.668506],[-77.649525,42.668409],[-77.649281,42.66835],[-77.648927,42.668208],[-77.647795,42.667654],[-77.64716900000001,42.667379],[-77.646303,42.667009],[-77.64597000000001,42.666904],[-77.645685,42.666834],[-77.644569,42.666738],[-77.64424,42.666698],[-77.64389300000001,42.666644],[-77.64377,42.666613],[-77.643362,42.666471],[-77.64298100000001,42.666359],[-77.642698,42.666292],[-77.64235100000001,42.666242],[-77.642155,42.666238],[-77.641366,42.666265],[-77.64121,42.666279],[-77.641149,42.666292],[-77.640764,42.666382],[-77.640525,42.666475],[-77.640236,42.666606],[-77.639691,42.666896],[-77.63950699999999,42.666961],[-77.63935600000001,42.666992],[-77.638756,42.667042],[-77.63821299999999,42.667131],[-77.63788,42.667221],[-77.637595,42.667283],[-77.637294,42.667326],[-77.63682900000001,42.667336],[-77.635082,42.667426],[-77.63507799999999,42.66737],[-77.63507,42.667206],[-77.63506700000001,42.667151],[-77.635063,42.667078],[-77.63505600000001,42.666945],[-77.63505000000001,42.666859],[-77.63504500000001,42.666787],[-77.634997,42.666208],[-77.634974,42.665919],[-77.634929,42.664966],[-77.63487499999999,42.664472],[-77.634857,42.664308],[-77.634822,42.664162],[-77.634722,42.663917],[-77.634698,42.663872],[-77.63453699999999,42.663642],[-77.63449,42.663592],[-77.634435,42.663534],[-77.634158,42.663296],[-77.633602,42.662896],[-77.633342,42.662709],[-77.63211099999999,42.661768],[-77.63017000000001,42.660331],[-77.62993,42.660145],[-77.62923000000001,42.659603],[-77.629018,42.659407],[-77.628884,42.659265],[-77.628789,42.659137],[-77.62865499999999,42.658935],[-77.627151,42.656781],[-77.627127,42.656746],[-77.62601100000001,42.655102],[-77.625343,42.654083],[-77.623324,42.651126],[-77.622241,42.64951],[-77.62129899999999,42.648106],[-77.62106300000001,42.647724],[-77.62091700000001,42.647443],[-77.620858,42.647286],[-77.620777,42.647012],[-77.62073599999999,42.646737],[-77.620701,42.64626],[-77.62057799999999,42.643995],[-77.620537,42.643241],[-77.620502,42.642504],[-77.620481,42.642035],[-77.620465,42.64188],[-77.620424,42.641689],[-77.62035299999999,42.641538],[-77.62027399999999,42.641423],[-77.620141,42.641296],[-77.619951,42.641161],[-77.619373,42.640828],[-77.618801,42.6405],[-77.61873199999999,42.640466],[-77.61859699999999,42.640387],[-77.61819199999999,42.64015],[-77.61806300000001,42.640063],[-77.617778,42.63984],[-77.617599,42.639661],[-77.61754500000001,42.639607],[-77.61735299999999,42.639364],[-77.617178,42.639064],[-77.61695,42.638522],[-77.61679100000001,42.63829],[-77.616691,42.638178],[-77.616625,42.638113],[-77.616552,42.638043],[-77.616275,42.637848],[-77.616125,42.637759],[-77.61591300000001,42.637664],[-77.615835,42.63763],[-77.61526600000001,42.637406],[-77.61505099999999,42.637322],[-77.614349,42.637046],[-77.61423000000001,42.636999],[-77.613846,42.636904],[-77.61367799999999,42.636872],[-77.612838,42.63681],[-77.612481,42.636783],[-77.612138,42.636786],[-77.612116,42.636788],[-77.611367,42.63686],[-77.61130300000001,42.636865],[-77.611113,42.636884],[-77.61105000000001,42.63689],[-77.610861,42.636908],[-77.61071,42.63691],[-77.61053699999999,42.636913],[-77.610378,42.636916],[-77.610117,42.636892],[-77.60990700000001,42.636861],[-77.609729,42.63682],[-77.60969900000001,42.636811],[-77.60937199999999,42.636721],[-77.60884900000001,42.636582],[-77.608649,42.636529],[-77.608335,42.63647],[-77.608018,42.63644],[-77.607707,42.636445],[-77.607421,42.636472],[-77.607246,42.636507],[-77.607103,42.636537],[-77.60673,42.636664],[-77.60635600000001,42.6368],[-77.605923,42.63696],[-77.605248,42.637238],[-77.605192,42.637262],[-77.604878,42.637382],[-77.604854,42.63739],[-77.604782,42.637414],[-77.604758,42.637422],[-77.604382,42.637529],[-77.604309,42.637537],[-77.603917,42.637584],[-77.60292200000001,42.637574],[-77.602459,42.63757],[-77.602369,42.637569],[-77.602099,42.637566],[-77.60201000000001,42.637566],[-77.601389,42.637561],[-77.599526,42.637546],[-77.598906,42.637542],[-77.598687,42.63754],[-77.598129,42.637537],[-77.59803100000001,42.63753],[-77.597813,42.637516],[-77.597449,42.637471],[-77.59636,42.637337],[-77.595997,42.637293],[-77.595702,42.638141],[-77.595386,42.639053],[-77.594853,42.640696],[-77.594782,42.640917],[-77.59471499999999,42.641253],[-77.594696,42.641576],[-77.594701,42.641827],[-77.594734,42.642149],[-77.594774,42.64253],[-77.594967,42.64386],[-77.59505,42.64443],[-77.59511000000001,42.644906],[-77.595212,42.645729],[-77.595575,42.648999],[-77.595615,42.649355],[-77.595685,42.649969],[-77.595737,42.650465],[-77.595862,42.651555],[-77.595901,42.651892],[-77.595966,42.65255],[-77.595983,42.652783],[-77.595994,42.653198],[-77.59598699999999,42.653618],[-77.595947,42.654092],[-77.59591,42.654394],[-77.595839,42.654789],[-77.59502999999999,42.658085],[-77.595015,42.658147],[-77.59446800000001,42.660228],[-77.59427599999999,42.660896],[-77.594002,42.661858],[-77.59370800000001,42.662815],[-77.59367899999999,42.662896],[-77.593452,42.663554],[-77.59320700000001,42.66428],[-77.59286400000001,42.665204],[-77.592546,42.666129],[-77.592195,42.667117],[-77.592184,42.667149],[-77.59202999999999,42.667616],[-77.59200300000001,42.66772],[-77.591837,42.668239],[-77.591612,42.668945],[-77.591194,42.670734],[-77.59112,42.671037],[-77.591037,42.671382],[-77.59099000000001,42.671535],[-77.59091100000001,42.671837],[-77.588111,42.67179],[-77.57971999999999,42.671654],[-77.57819600000001,42.67163],[-77.576927,42.671618],[-77.57710899999999,42.671321],[-77.577836,42.67029],[-77.57815100000001,42.669817],[-77.578209,42.669682],[-77.578305,42.669417],[-77.578332,42.669294],[-77.57834699999999,42.6691],[-77.578351,42.668781],[-77.57831899999999,42.668524],[-77.578344,42.668034],[-77.57836,42.667745],[-77.57836,42.667377],[-77.57836,42.666645],[-77.578315,42.665523],[-77.57831299999999,42.665406],[-77.578311,42.665104],[-77.578321,42.664885],[-77.57835,42.664753],[-77.57837000000001,42.664707],[-77.578406,42.664628],[-77.578428,42.664568],[-77.578446,42.664522],[-77.57847,42.664379],[-77.57847700000001,42.664313],[-77.578554,42.663685],[-77.57858,42.663476],[-77.57858400000001,42.663446],[-77.578596,42.66333],[-77.57862299999999,42.663087],[-77.578627,42.66305],[-77.57862299999999,42.662892],[-77.578621,42.662746],[-77.57861800000001,42.662581],[-77.57860700000001,42.662493],[-77.57851700000001,42.661737],[-77.578515,42.661716],[-77.57851100000001,42.661484],[-77.578508,42.66126],[-77.578503,42.660862],[-77.578507,42.660588],[-77.57851100000001,42.660365],[-77.57853799999999,42.659576],[-77.57857799999999,42.658429],[-77.57858899999999,42.657552],[-77.578604,42.65721],[-77.57863999999999,42.656422],[-77.57865700000001,42.656108],[-77.578711,42.655169],[-77.578729,42.654856],[-77.57873499999999,42.654736],[-77.578743,42.654597],[-77.578755,42.654377],[-77.578762,42.654258],[-77.578763,42.654248],[-77.57879200000001,42.653484],[-77.578788,42.652284],[-77.578862,42.649572],[-77.57893,42.647079],[-77.578934,42.646778],[-77.578952,42.645539],[-77.57893799999999,42.645264],[-77.57895000000001,42.644707],[-77.578988,42.643866],[-77.579027,42.643435],[-77.579032,42.643143],[-77.57908,42.640909],[-77.579081,42.64082],[-77.579086,42.640554],[-77.579088,42.640466],[-77.579099,42.639854],[-77.579121,42.638599],[-77.579142,42.637984],[-77.579183,42.63666],[-77.57924199999999,42.633775],[-77.579329,42.63038],[-77.57933199999999,42.630097],[-77.579345,42.629249],[-77.57935000000001,42.628967],[-77.579362,42.628027],[-77.579374,42.627532],[-77.579458,42.624138],[-77.579449,42.623229],[-77.579435,42.621795],[-77.579431,42.621224],[-77.57940000000001,42.620712],[-77.579375,42.620575],[-77.579296,42.620309],[-77.579267,42.620247],[-77.579052,42.619777],[-77.578886,42.619469],[-77.57862,42.619045],[-77.578295,42.618567],[-77.577956,42.617989],[-77.577009,42.616128],[-77.576826,42.615768],[-77.57672599999999,42.615635],[-77.576609,42.615519],[-77.576505,42.61544],[-77.576393,42.615381],[-77.576301,42.615344],[-77.576201,42.615319],[-77.57606,42.615298],[-77.57583,42.615297],[-77.57571299999999,42.615309],[-77.575554,42.615327],[-77.575461,42.615355],[-77.575371,42.615382],[-77.57526,42.615416],[-77.574783,42.615559],[-77.57463,42.615606],[-77.57369199999999,42.615814],[-77.573329,42.61591],[-77.57293799999999,42.615993],[-77.572845,42.615996],[-77.572734,42.61598],[-77.572667,42.615959],[-77.572598,42.615922],[-77.57245,42.615816],[-77.57241500000001,42.615776],[-77.572371,42.615704],[-77.572356,42.615623],[-77.57240400000001,42.615465],[-77.572639,42.615094],[-77.573004,42.614587],[-77.57305100000001,42.614509],[-77.573116,42.614404],[-77.573154,42.614292],[-77.573179,42.61404],[-77.57323599999999,42.613468],[-77.573339,42.612462],[-77.57342199999999,42.611868],[-77.573455,42.611762],[-77.573471,42.611714],[-77.573554,42.611604],[-77.57366,42.611508],[-77.573885,42.611417],[-77.575003,42.611426],[-77.57513,42.611428],[-77.578227,42.611444],[-77.57835799999999,42.611448],[-77.57874700000001,42.611461],[-77.578982,42.611459],[-77.579185,42.611442],[-77.579278,42.611417],[-77.579444,42.611316],[-77.57950099999999,42.611258],[-77.57954700000001,42.611187],[-77.579576,42.611108],[-77.579606,42.610934],[-77.579617,42.610722],[-77.579622,42.610638],[-77.579616,42.609175],[-77.579626,42.608808],[-77.579644,42.60817],[-77.57966999999999,42.607254],[-77.579691,42.606019],[-77.57970299999999,42.605337],[-77.579764,42.602442],[-77.57986,42.599569],[-77.57986200000001,42.599532],[-77.579904,42.597419],[-77.579945,42.595615],[-77.579949,42.59546],[-77.58000800000001,42.593652],[-77.580018,42.59272],[-77.57999100000001,42.591768],[-77.579958,42.589847],[-77.579948,42.589585],[-77.579877,42.587628],[-77.579871,42.587474],[-77.579863,42.58723],[-77.57985499999999,42.587015],[-77.57985100000001,42.586862],[-77.57982,42.586025],[-77.57982800000001,42.585655],[-77.57984999999999,42.585344],[-77.57989000000001,42.585186],[-77.579981,42.584974],[-77.580119,42.584706],[-77.58107699999999,42.583268],[-77.581165,42.583155],[-77.581799,42.582205],[-77.583088,42.580292],[-77.58357599999999,42.579606],[-77.583642,42.57953],[-77.58369999999999,42.579439],[-77.586556,42.579504],[-77.586735,42.579515],[-77.586912,42.579518],[-77.587324,42.579525],[-77.58856299999999,42.579547],[-77.58884399999999,42.579553],[-77.588975,42.579572],[-77.58911500000001,42.57958],[-77.590113,42.579602],[-77.59352699999999,42.579678],[-77.594666,42.579704],[-77.60003399999999,42.579833],[-77.60281999999999,42.579867],[-77.60328,42.580017],[-77.60377800000001,42.580061],[-77.60402999999999,42.580047],[-77.604287,42.580034],[-77.604828,42.579921],[-77.604967,42.579976],[-77.605203,42.580044],[-77.605369,42.580066],[-77.605569,42.580079],[-77.60579,42.580073],[-77.60632699999999,42.580042],[-77.607799,42.579949],[-77.607855,42.579949],[-77.608777,42.579974],[-77.610814,42.58001],[-77.61287400000001,42.580025],[-77.613204,42.580031],[-77.614194,42.580051],[-77.614525,42.580058],[-77.61456200000001,42.580071],[-77.614602,42.580085],[-77.614677,42.580097],[-77.614716,42.580104],[-77.614735,42.580108],[-77.615072,42.580123],[-77.61551799999999,42.580144],[-77.61614299999999,42.580143],[-77.61624,42.580143],[-77.6165,42.580128],[-77.616541,42.580125],[-77.616676,42.580119],[-77.61670700000001,42.580116],[-77.616731,42.580114],[-77.61680699999999,42.580109],[-77.616832,42.580108],[-77.616871,42.580105],[-77.616901,42.580104],[-77.616989,42.580098],[-77.617037,42.580096],[-77.617073,42.580091],[-77.617206,42.580077],[-77.617251,42.580073],[-77.61733,42.580071],[-77.617569,42.580067],[-77.617649,42.580066],[-77.617788,42.58005],[-77.617823,42.580047],[-77.618207,42.580027],[-77.618347,42.58002],[-77.61846199999999,42.580029],[-77.618713,42.580051],[-77.618809,42.580065],[-77.618925,42.580082],[-77.618973,42.580084],[-77.61912,42.58009],[-77.619169,42.580093],[-77.619422,42.580105],[-77.619891,42.580128],[-77.620181,42.580146],[-77.620435,42.580163],[-77.620457,42.580164],[-77.620553,42.58016],[-77.62056800000001,42.580158],[-77.62060200000001,42.580156],[-77.62064700000001,42.580152],[-77.62068499999999,42.580149],[-77.620779,42.580121],[-77.620823,42.580109],[-77.620887,42.58008],[-77.620929,42.580063],[-77.62107899999999,42.579992],[-77.621143,42.579963],[-77.62120899999999,42.579932],[-77.621292,42.579899],[-77.62145,42.579858],[-77.62160799999999,42.579852],[-77.621689,42.579863],[-77.62175999999999,42.579881],[-77.62181699999999,42.579897],[-77.622229,42.580091],[-77.622424,42.580123],[-77.622741,42.580138],[-77.62362899999999,42.580151],[-77.624269,42.580161],[-77.624319,42.58016],[-77.624469,42.58016],[-77.62452,42.58016],[-77.624574,42.580163],[-77.624736,42.580172],[-77.62479,42.580176],[-77.62638699999999,42.580185],[-77.62658,42.580188],[-77.627759,42.580211],[-77.62957,42.580252],[-77.631777,42.580274],[-77.63194900000001,42.580273],[-77.632667,42.580271],[-77.63374,42.580267],[-77.633939,42.580266],[-77.634449,42.580278],[-77.63449199999999,42.58028],[-77.634823,42.580297],[-77.635104,42.580297],[-77.635368,42.580278],[-77.635852,42.580266],[-77.636422,42.580272],[-77.636748,42.580272],[-77.636804,42.580272],[-77.6375,42.580305],[-77.63758199999999,42.580302],[-77.637828,42.580297],[-77.637911,42.580295],[-77.638294,42.580295],[-77.638707,42.580295],[-77.639155,42.580303],[-77.639443,42.580302],[-77.639827,42.580302],[-77.640489,42.5803],[-77.643365,42.580326],[-77.650847,42.580369],[-77.650875,42.580639],[-77.650901,42.581003],[-77.651025,42.583883],[-77.651077,42.584843],[-77.65110900000001,42.585793],[-77.651218,42.587953],[-77.65130000000001,42.590785],[-77.651465,42.594423],[-77.65149599999999,42.595392],[-77.651532,42.596117],[-77.65156,42.596724],[-77.651644,42.598547],[-77.651672,42.599155],[-77.651675,42.599233],[-77.651684,42.599468],[-77.65168799999999,42.599547],[-77.651737,42.600698],[-77.651881,42.604028],[-77.651887,42.604153],[-77.65195,42.605304],[-77.652018,42.606743],[-77.652225,42.61106],[-77.652294,42.6125],[-77.652339,42.613654],[-77.652356,42.614017],[-77.652479,42.616544],[-77.652518,42.617509],[-77.65258,42.618569],[-77.65267,42.620086],[-77.65267299999999,42.620148],[-77.65268399999999,42.620336],[-77.652688,42.620399],[-77.652754,42.621694],[-77.652834,42.623247],[-77.65286399999999,42.623638],[-77.652963,42.62558],[-77.65298900000001,42.626069],[-77.653021,42.626877],[-77.653036,42.627214],[-77.65308400000001,42.628228],[-77.65309999999999,42.628566],[-77.653108,42.628753],[-77.65312900000001,42.629198],[-77.653137,42.629314],[-77.65315,42.629502],[-77.653158,42.629622],[-77.653182,42.629982],[-77.65319100000001,42.630103],[-77.653205,42.63034],[-77.653237,42.630871],[-77.65325199999999,42.631052],[-77.653273,42.631289],[-77.653341,42.632642],[-77.653548,42.636704],[-77.653553,42.636798],[-77.6536,42.638059],[-77.65362500000001,42.638746],[-77.653672,42.63999],[-77.653718,42.640529],[-77.65373099999999,42.640808],[-77.653763,42.641496],[-77.653874,42.643396],[-77.653947,42.644085],[-77.653986,42.644704],[-77.65403000000001,42.645848],[-77.654223,42.648826],[-77.65429,42.649646],[-77.654371,42.651066],[-77.654494,42.652946],[-77.65467099999999,42.655362],[-77.654826,42.657654],[-77.655151,42.661901],[-77.655455,42.665346],[-77.655579,42.667186],[-77.655738,42.669009],[-77.655648,42.669261]]],"type":"Polygon"}
}