{
  "id": "360650207051",
  "type": "Feature",
  "properties": {
    "area_land":218902,
    "area_water":0,
    "geoid":"360650207051",
    "name":"Block Group 1",
    "state":"ny"
},
  "bbox": [
    -75.265209,
    43.081164,
    -75.253937,
    43.086754
],
  "geometry": {"coordinates":[[[-75.265209,43.084627],[-75.264211,43.085128],[-75.262683,43.085897],[-75.262518,43.085981],[-75.261797,43.086345],[-75.26130000000001,43.086595],[-75.260986,43.086754],[-75.260614,43.086319],[-75.259748,43.085393],[-75.259237,43.084827],[-75.259063,43.084635],[-75.25825500000001,43.083781],[-75.258156,43.083701],[-75.257925,43.083577],[-75.25763999999999,43.083462],[-75.257237,43.083281],[-75.25668899999999,43.083943],[-75.25559800000001,43.083492],[-75.254622,43.083066],[-75.25393699999999,43.082756],[-75.255281,43.0822],[-75.256529,43.081679],[-75.257171,43.081416],[-75.257785,43.081164],[-75.25805800000001,43.081299],[-75.258416,43.08146],[-75.258618,43.081567],[-75.25890800000001,43.081707],[-75.26057400000001,43.082462],[-75.26243599999999,43.08332],[-75.262873,43.083519],[-75.263409,43.083763],[-75.263927,43.084],[-75.264359,43.084195],[-75.26505400000001,43.084522],[-75.265209,43.084627]]],"type":"Polygon"}
}