{
  "id": "360810204002",
  "type": "Feature",
  "properties": {
    "area_land":91647,
    "area_water":0,
    "geoid":"360810204002",
    "name":"Block Group 2",
    "state":"ny"
},
  "bbox": [
    -73.808902,
    40.690874,
    -73.803818,
    40.694741
],
  "geometry": {"coordinates":[[[-73.808902,40.692564],[-73.808013,40.693296],[-73.80767299999999,40.693569],[-73.80752699999999,40.693687],[-73.807129,40.694014],[-73.806866,40.694228],[-73.80624299999999,40.694741],[-73.805435,40.694182],[-73.80463399999999,40.693638],[-73.80381800000001,40.69308],[-73.804688,40.692346],[-73.805559,40.691609],[-73.806425,40.690874],[-73.80723999999999,40.691432],[-73.808036,40.691983],[-73.808902,40.692564]]],"type":"Polygon"}
}