{
  "id": "360610193006",
  "type": "Feature",
  "properties": {
    "area_land":45366,
    "area_water":0,
    "geoid":"360610193006",
    "name":"Block Group 6",
    "state":"ny"
},
  "bbox": [
    -73.965711,
    40.79924,
    -73.961917,
    40.801741
],
  "geometry": {"coordinates":[[[-73.965215,40.801111],[-73.96476,40.801741],[-73.961917,40.800543],[-73.962377,40.799915],[-73.962869,40.79924],[-73.965711,40.800437],[-73.965215,40.801111]]],"type":"Polygon"}
}