{
  "id": "360670138002",
  "type": "Feature",
  "properties": {
    "area_land":1616958,
    "area_water":0,
    "geoid":"360670138002",
    "name":"Block Group 2",
    "state":"ny"
},
  "bbox": [
    -76.169663,
    43.093184,
    -76.146486,
    43.112911
],
  "geometry": {"coordinates":[[[-76.16963800000001,43.095434],[-76.169545,43.095565],[-76.168719,43.096711],[-76.16822999999999,43.097361],[-76.168069,43.097569],[-76.16704900000001,43.098888],[-76.166495,43.099603],[-76.166102,43.100089],[-76.16569200000001,43.100576],[-76.165319,43.100985],[-76.16425599999999,43.102103],[-76.163543,43.102868],[-76.162058,43.104647],[-76.16179099999999,43.104969],[-76.16124600000001,43.105632],[-76.160957,43.106036],[-76.160826,43.106248],[-76.16063699999999,43.106657],[-76.16051400000001,43.106988],[-76.16044599999999,43.107264],[-76.16039499999999,43.107608],[-76.160217,43.109255],[-76.16010799999999,43.1103],[-76.159925,43.112086],[-76.159898,43.112274],[-76.158721,43.112322],[-76.157838,43.112365],[-76.157022,43.112407],[-76.156941,43.112411],[-76.15598300000001,43.112461],[-76.155703,43.112476],[-76.154939,43.112515],[-76.154335,43.112545],[-76.154111,43.112555],[-76.15349399999999,43.112585],[-76.15291000000001,43.112613],[-76.151338,43.112695],[-76.15060099999999,43.112731],[-76.14962,43.112779],[-76.149128,43.112804],[-76.146694,43.112911],[-76.14662800000001,43.112903],[-76.146486,43.112862],[-76.146867,43.112142],[-76.147131,43.111663],[-76.147505,43.11101],[-76.147651,43.11076],[-76.147994,43.110132],[-76.148076,43.10988],[-76.14807500000001,43.109642],[-76.14881699999999,43.108929],[-76.149793,43.10802],[-76.15077599999999,43.107029],[-76.15131700000001,43.106441],[-76.15167099999999,43.106054],[-76.152028,43.105635],[-76.152308,43.105305],[-76.152805,43.104729],[-76.15493600000001,43.102204],[-76.1558,43.101229],[-76.155964,43.101068],[-76.156784,43.100258],[-76.158839,43.098278],[-76.159659,43.097458],[-76.160796,43.096367],[-76.160875,43.096289],[-76.16180900000001,43.095368],[-76.162263,43.09487],[-76.162313,43.094814],[-76.163607,43.093421],[-76.16371700000001,43.093308],[-76.163826,43.093184],[-76.164417,43.09337],[-76.16619799999999,43.094043],[-76.16780799999999,43.094665],[-76.16787100000001,43.09469],[-76.169428,43.095299],[-76.169663,43.095399],[-76.16963800000001,43.095434]]],"type":"Polygon"}
}