{
  "id": "360050152001",
  "type": "Feature",
  "properties": {
    "area_land":119828,
    "area_water":0,
    "geoid":"360050152001",
    "name":"Block Group 1",
    "state":"ny"
},
  "bbox": [
    -73.831106,
    40.824766,
    -73.823867,
    40.828835
],
  "geometry": {"coordinates":[[[-73.830943,40.826905],[-73.830791,40.82698],[-73.830163,40.827281],[-73.82936100000001,40.827672],[-73.82858400000001,40.828061],[-73.827794,40.828449],[-73.827005,40.828835],[-73.82541500000001,40.826966],[-73.82386700000001,40.825146],[-73.824302,40.824932],[-73.82463799999999,40.824766],[-73.827493,40.825677],[-73.829097,40.826154],[-73.82918600000001,40.82618],[-73.83110600000001,40.826819],[-73.830943,40.826905]]],"type":"Polygon"}
}