{
  "id": "360594049013",
  "type": "Feature",
  "properties": {
    "area_land":175763,
    "area_water":0,
    "geoid":"360594049013",
    "name":"Block Group 3",
    "state":"ny"
},
  "bbox": [
    -73.726781,
    40.7014,
    -73.718974,
    40.705485
],
  "geometry": {"coordinates":[[[-73.726781,40.703145],[-73.72670599999999,40.703206],[-73.726091,40.703116],[-73.72576100000001,40.703856],[-73.725009,40.705485],[-73.72414999999999,40.705267],[-73.72324500000001,40.705037],[-73.72233799999999,40.704808],[-73.72148300000001,40.70459],[-73.720628,40.704376],[-73.719775,40.704156],[-73.719746,40.70414],[-73.719707,40.70414],[-73.718974,40.703952],[-73.719268,40.702472],[-73.71938400000001,40.701858],[-73.719407,40.701791],[-73.719425,40.701677],[-73.719517,40.7014],[-73.719977,40.701484],[-73.722247,40.701923],[-73.72263100000001,40.701996],[-73.72301400000001,40.70207],[-73.724526,40.702354],[-73.72676199999999,40.702768],[-73.726767,40.702872],[-73.726772,40.702954],[-73.72677899999999,40.703082],[-73.726781,40.703145]]],"type":"Polygon"}
}