{
  "id": "360870101012",
  "type": "Feature",
  "properties": {
    "area_land":5333945,
    "area_water":88806,
    "geoid":"360870101012",
    "name":"Block Group 2",
    "state":"ny"
},
  "bbox": [
    -74.015572,
    41.230709,
    -73.987736,
    41.266847
],
  "geometry": {"coordinates":[[[-74.015564,41.251949],[-74.015541,41.251987],[-74.01549900000001,41.252018],[-74.015345,41.252068],[-74.015264,41.25208],[-74.01513300000001,41.252083],[-74.015068,41.252072],[-74.01499800000001,41.25203],[-74.01495199999999,41.251987],[-74.01489100000001,41.251968],[-74.014841,41.251964],[-74.014775,41.251987],[-74.014717,41.252068],[-74.01469400000001,41.252219],[-74.01468300000001,41.252291],[-74.014635,41.252483],[-74.014685,41.252639],[-74.014653,41.2528],[-74.01469299999999,41.252871],[-74.014762,41.253],[-74.014849,41.253085],[-74.01481200000001,41.253223],[-74.014658,41.253422],[-74.01464300000001,41.253535],[-74.014674,41.253621],[-74.014651,41.253767],[-74.01456899999999,41.253888],[-74.01455799999999,41.253992],[-74.014672,41.254023],[-74.01466499999999,41.254081],[-74.014781,41.254133],[-74.014775,41.25427],[-74.014765,41.254403],[-74.01484600000001,41.254542],[-74.01470399999999,41.254622],[-74.014768,41.254879],[-74.015052,41.255001],[-74.01526,41.255119],[-74.015389,41.25522],[-74.01555999999999,41.255815],[-74.015531,41.256067],[-74.015503,41.256304],[-74.015339,41.256631],[-74.015119,41.256919],[-74.014903,41.257126],[-74.014523,41.25729],[-74.014371,41.257447],[-74.014309,41.257559],[-74.01427099999999,41.257601],[-74.014201,41.257624],[-74.014117,41.257632],[-74.014028,41.257667],[-74.01397,41.257701],[-74.013897,41.257767],[-74.01386599999999,41.257955],[-74.013839,41.258017],[-74.013774,41.258086],[-74.01372000000001,41.258124],[-74.013563,41.25819],[-74.013389,41.258263],[-74.01330900000001,41.258311],[-74.013384,41.258371],[-74.013448,41.258407],[-74.013403,41.259293],[-74.013341,41.259609],[-74.01325900000001,41.259823],[-74.013153,41.25999],[-74.012581,41.260677],[-74.012474,41.260786],[-74.01231799999999,41.260915],[-74.012057,41.261105],[-74.011837,41.261226],[-74.011591,41.261347],[-74.011343,41.26149],[-74.011275,41.261537],[-74.01118,41.261603],[-74.011073,41.261711],[-74.010993,41.261827],[-74.010907,41.26204],[-74.01082599999999,41.262254],[-74.010667,41.262578],[-74.01056699999999,41.262723],[-74.010367,41.262934],[-74.01022,41.263023],[-74.010034,41.263097],[-74.00946999999999,41.263203],[-74.009247,41.263266],[-74.009147,41.263314],[-74.00885100000001,41.263479],[-74.008747,41.263503],[-74.00851299999999,41.263502],[-74.007914,41.263513],[-74.007812,41.263524],[-74.007563,41.263577],[-74.007346,41.263647],[-74.006899,41.263815],[-74.00667799999999,41.263937],[-74.006561,41.264043],[-74.00649,41.264137],[-74.00643100000001,41.264269],[-74.00641899999999,41.264412],[-74.006441,41.264504],[-74.006488,41.264621],[-74.006658,41.264941],[-74.0067,41.265086],[-74.00669600000001,41.265245],[-74.006657,41.265355],[-74.006602,41.265433],[-74.00648700000001,41.265528],[-74.006388,41.265579],[-74.006231,41.265635],[-74.00607599999999,41.265666],[-74.00578,41.265677],[-74.005554,41.265672],[-74.00527200000001,41.265642],[-74.005019,41.265591],[-74.00479199999999,41.265526],[-74.004525,41.265464],[-74.004356,41.265444],[-74.004165,41.265467],[-74.003979,41.265551],[-74.003874,41.265628],[-74.003708,41.265818],[-74.003466,41.266016],[-74.00336900000001,41.266077],[-74.003176,41.266165],[-74.00308800000001,41.266187],[-74.002804,41.266225],[-74.00245200000001,41.266249],[-74.002371,41.266244],[-74.002279,41.266238],[-74.00192199999999,41.266187],[-74.00158999999999,41.2661],[-74.00069999999999,41.265797],[-74.000339,41.265697],[-73.999914,41.26564],[-73.999398,41.2656],[-73.998689,41.265482],[-73.99822899999999,41.265414],[-73.997692,41.265365],[-73.997418,41.26536],[-73.997165,41.265383],[-73.996826,41.265492],[-73.99619800000001,41.26577],[-73.995898,41.265854],[-73.995482,41.265929],[-73.99515599999999,41.265953],[-73.994828,41.265949],[-73.994269,41.26591],[-73.994156,41.265913],[-73.99401,41.265931],[-73.993911,41.265964],[-73.993725,41.26606],[-73.993594,41.266146],[-73.993182,41.266503],[-73.99294399999999,41.266648],[-73.99276500000001,41.266724],[-73.992599,41.266756],[-73.992099,41.266825],[-73.991849,41.266846],[-73.991518,41.266847],[-73.991246,41.266821],[-73.991286,41.266761],[-73.99137899999999,41.266705],[-73.991606,41.266604],[-73.991709,41.266546],[-73.991783,41.266491],[-73.99182399999999,41.266444],[-73.991854,41.2664],[-73.991872,41.266362],[-73.99189699999999,41.266232],[-73.991888,41.266107],[-73.99184200000001,41.265982],[-73.991777,41.265884],[-73.99159400000001,41.265645],[-73.991508,41.265478],[-73.991473,41.26535],[-73.99144699999999,41.265163],[-73.99145300000001,41.265075],[-73.99146500000001,41.26499],[-73.99147000000001,41.264847],[-73.991435,41.264562],[-73.99140800000001,41.264447],[-73.991355,41.26432],[-73.990967,41.263697],[-73.990663,41.263099],[-73.99062600000001,41.262962],[-73.990595,41.262799],[-73.99059099999999,41.262634],[-73.990607,41.262337],[-73.990644,41.262132],[-73.990735,41.261887],[-73.990818,41.261739],[-73.990994,41.261343],[-73.991195,41.261048],[-73.99147600000001,41.260598],[-73.991522,41.260535],[-73.991893,41.259921],[-73.99217,41.259484],[-73.992243,41.259422],[-73.992216,41.259328],[-73.99203900000001,41.259169],[-73.9919,41.259019],[-73.991822,41.25891],[-73.991767,41.258772],[-73.991755,41.258564],[-73.99175099999999,41.25854],[-73.99164500000001,41.257921],[-73.991613,41.257037],[-73.992248,41.256992],[-73.99276,41.257034],[-73.992906,41.257054],[-73.99302400000001,41.257093],[-73.99332,41.257253],[-73.993506,41.257357],[-73.993571,41.25738],[-73.993639,41.257386],[-73.99372099999999,41.257364],[-73.993799,41.257305],[-73.994066,41.257031],[-73.994975,41.256125],[-73.996059,41.255026],[-73.995316,41.254605],[-73.99473500000001,41.25427],[-73.993757,41.255187],[-73.993245,41.254878],[-73.99257299999999,41.254503],[-73.992259,41.254337],[-73.992068,41.254266],[-73.991574,41.254217],[-73.99140300000001,41.254273],[-73.99127900000001,41.254104],[-73.991237,41.254016],[-73.99122,41.253941],[-73.991198,41.253683],[-73.99118799999999,41.253481],[-73.99119899999999,41.252575],[-73.991218,41.252355],[-73.991226,41.252121],[-73.991236,41.251887],[-73.99127799999999,41.25163],[-73.991345,41.251352],[-73.99138499999999,41.251187],[-73.991388,41.25098],[-73.99139,41.250861],[-73.991373,41.250667],[-73.991328,41.250567],[-73.991241,41.250472],[-73.99113800000001,41.25037],[-73.990889,41.250233],[-73.990708,41.250141],[-73.990476,41.250042],[-73.99030999999999,41.249976],[-73.99009599999999,41.249946],[-73.9898,41.24997],[-73.989626,41.249979],[-73.989431,41.249968],[-73.989332,41.249941],[-73.98918500000001,41.249886],[-73.989058,41.249821],[-73.988946,41.249739],[-73.988821,41.249502],[-73.988719,41.249281],[-73.988562,41.248855],[-73.988477,41.248499],[-73.988405,41.248265],[-73.988246,41.247944],[-73.988072,41.247724],[-73.98793000000001,41.247612],[-73.987928,41.247277],[-73.987897,41.246989],[-73.987871,41.246892],[-73.987736,41.246498],[-73.987838,41.246476],[-73.98807600000001,41.246443],[-73.988766,41.246348],[-73.988877,41.246351],[-73.98897700000001,41.246366],[-73.98953299999999,41.246447],[-73.98968600000001,41.246457],[-73.989797,41.246454],[-73.989923,41.246437],[-73.989986,41.246424],[-73.990118,41.246374],[-73.990352,41.246248],[-73.990556,41.246155],[-73.99071000000001,41.246085],[-73.990984,41.246008],[-73.991117,41.24598],[-73.991305,41.245942],[-73.991527,41.245913],[-73.992075,41.245866],[-73.992633,41.245838],[-73.993414,41.245816],[-73.99362600000001,41.24582],[-73.994007,41.24586],[-73.994285,41.245935],[-73.99480699999999,41.246115],[-73.994946,41.246153],[-73.995096,41.246182],[-73.99539,41.246228],[-73.99558399999999,41.246229],[-73.995677,41.246204],[-73.995853,41.246095],[-73.996337,41.245765],[-73.99645599999999,41.245697],[-73.99689499999999,41.245478],[-73.99741400000001,41.245283],[-73.99768899999999,41.245197],[-73.997781,41.245153],[-73.997986,41.245026],[-73.998661,41.244532],[-73.99999200000001,41.24345],[-74.000378,41.243212],[-74.00068899999999,41.243082],[-74.000878,41.243025],[-74.00107199999999,41.242956],[-74.001229,41.242882],[-74.00132600000001,41.242818],[-74.001268,41.242749],[-74.000986,41.24251],[-74.000788,41.242368],[-74.000409,41.242148],[-74.000151,41.242013],[-73.999942,41.241892],[-73.99975499999999,41.241738],[-73.999635,41.241566],[-73.99952,41.241368],[-73.999454,41.241279],[-73.999386,41.241216],[-73.99904600000001,41.240823],[-73.998947,41.240743],[-73.998797,41.240665],[-73.99864100000001,41.24063],[-73.998335,41.240596],[-73.998165,41.240557],[-73.99791999999999,41.240464],[-73.99781400000001,41.240404],[-73.99761100000001,41.240255],[-73.997426,41.240076],[-73.99732299999999,41.239945],[-73.997252,41.239802],[-73.99718900000001,41.2396],[-73.99718900000001,41.239448],[-73.997027,41.238773],[-73.997007,41.23864],[-73.99684600000001,41.238055],[-73.996742,41.237773],[-73.99638400000001,41.236947],[-73.995633,41.23548],[-73.995561,41.235364],[-73.995509,41.235307],[-73.995367,41.235187],[-73.995266,41.235135],[-73.994524,41.234924],[-73.994429,41.234875],[-73.994221,41.234728],[-73.994101,41.234618],[-73.99399200000001,41.234526],[-73.993876,41.234379],[-73.993836,41.234243],[-73.993821,41.234056],[-73.993876,41.233674],[-73.993906,41.23342],[-73.993928,41.23205],[-73.993961,41.231701],[-73.99376700000001,41.230709],[-73.993831,41.230748],[-73.993931,41.23079],[-73.994146,41.23084],[-73.9944,41.230863],[-73.99480800000001,41.230961],[-73.99495899999999,41.230988],[-73.99547099999999,41.231046],[-73.99568600000001,41.231096],[-73.99622100000001,41.23125],[-73.99726099999999,41.231638],[-73.998346,41.232092],[-73.998718,41.232238],[-73.99907,41.232377],[-73.999212,41.232419],[-73.999679,41.232496],[-73.999995,41.232525],[-74.000511,41.232508],[-74.001182,41.232399],[-74.001412,41.232326],[-74.001525,41.232271],[-74.00220299999999,41.231772],[-74.002385,41.232027],[-74.00264799999999,41.232595],[-74.00273900000001,41.232741],[-74.00282300000001,41.232912],[-74.002922,41.233456],[-74.00239999999999,41.233067],[-74.00231700000001,41.233036],[-74.002161,41.232995],[-74.001959,41.232973],[-74.00172999999999,41.232985],[-74.00139900000001,41.233021],[-74.000472,41.233086],[-74.000598,41.233118],[-74.00113399999999,41.23317],[-74.00130799999999,41.233197],[-74.00174699999999,41.233342],[-74.001912,41.233424],[-74.002059,41.233514],[-74.00218700000001,41.23361],[-74.00236099999999,41.233803],[-74.002439,41.233941],[-74.002562,41.234244],[-74.00275499999999,41.234908],[-74.002842,41.235073],[-74.002915,41.235187],[-74.00302499999999,41.235314],[-74.00309799999999,41.235373],[-74.003277,41.235494],[-74.00370700000001,41.235858],[-74.00379,41.235903],[-74.00397700000001,41.235962],[-74.00417899999999,41.236],[-74.00497,41.236044],[-74.005364,41.236051],[-74.00561999999999,41.236075],[-74.006101,41.236168],[-74.006275,41.236244],[-74.00645799999999,41.236337],[-74.006747,41.23654],[-74.006811,41.236562],[-74.006918,41.236571],[-74.007015,41.236564],[-74.007114,41.23652],[-74.007267,41.2364],[-74.007295,41.236373],[-74.007293,41.236643],[-74.007311,41.236679],[-74.007428,41.236825],[-74.007446,41.236883],[-74.00736999999999,41.237342],[-74.00738800000001,41.237812],[-74.007406,41.237853],[-74.00746100000001,41.237907],[-74.007614,41.238009],[-74.00776,41.238078],[-74.00797900000001,41.238162],[-74.008332,41.238213],[-74.008409,41.238246],[-74.00846,41.238282],[-74.008482,41.238322],[-74.008584,41.238847],[-74.00862100000001,41.238909],[-74.008679,41.238978],[-74.009536,41.239725],[-74.009568,41.239772],[-74.00959,41.239831],[-74.00959,41.239977],[-74.00956499999999,41.240049],[-74.009135,41.240647],[-74.00857999999999,41.241073],[-74.008482,41.241179],[-74.00846,41.241255],[-74.008464,41.241303],[-74.008482,41.241339],[-74.008529,41.241394],[-74.008613,41.241456],[-74.00883899999999,41.24159],[-74.00966699999999,41.242377],[-74.009787,41.242476],[-74.00988599999999,41.242538],[-74.00999899999999,41.242585],[-74.01025199999999,41.242642],[-74.010457,41.242689],[-74.01063000000001,41.242716],[-74.010724,41.242742],[-74.010786,41.242778],[-74.010841,41.242833],[-74.010867,41.242884],[-74.010938,41.243179],[-74.01095100000001,41.243229],[-74.01105699999999,41.243634],[-74.01115799999999,41.24382],[-74.011312,41.243966],[-74.01179999999999,41.244359],[-74.01203,41.2446],[-74.012252,41.244716],[-74.012325,41.244767],[-74.012394,41.244833],[-74.01262800000001,41.245142],[-74.012843,41.245372],[-74.01288700000001,41.245448],[-74.012934,41.245583],[-74.01300000000001,41.245722],[-74.013244,41.246024],[-74.013448,41.246217],[-74.013682,41.246403],[-74.013733,41.246461],[-74.013805,41.246582],[-74.01382,41.246651],[-74.01383800000001,41.246866],[-74.01388300000001,41.246988],[-74.014,41.247233],[-74.014056,41.24731],[-74.01466000000001,41.248536],[-74.014923,41.250297],[-74.015091,41.250662],[-74.015179,41.250828],[-74.01553,41.251599],[-74.01557200000001,41.251757],[-74.015564,41.251949]]],"type":"Polygon"}
}