{
  "id": "360050462013",
  "type": "Feature",
  "properties": {
    "area_land":177949,
    "area_water":0,
    "geoid":"360050462013",
    "name":"Block Group 3",
    "state":"ny"
},
  "bbox": [
    -73.833893,
    40.874264,
    -73.827647,
    40.879819
],
  "geometry": {"coordinates":[[[-73.833822,40.876529],[-73.833665,40.87718],[-73.83351999999999,40.877653],[-73.833491,40.877713],[-73.833242,40.878229],[-73.83309199999999,40.878492],[-73.832596,40.879174],[-73.831951,40.879819],[-73.831356,40.879194],[-73.830834,40.878702],[-73.830403,40.878456],[-73.83001400000001,40.878333],[-73.829555,40.878264],[-73.829106,40.878259],[-73.828658,40.878352],[-73.828262,40.878467],[-73.82819600000001,40.878324],[-73.82814,40.878167],[-73.82809899999999,40.878006],[-73.82807200000001,40.877826],[-73.828065,40.877618],[-73.82808199999999,40.877428],[-73.828115,40.877256],[-73.828172,40.877072],[-73.828253,40.876885],[-73.828344,40.876722],[-73.828367,40.876687],[-73.828772,40.876004],[-73.828644,40.875947],[-73.828711,40.875833],[-73.828424,40.875735],[-73.828249,40.875813],[-73.827727,40.875701],[-73.827741,40.875581],[-73.827713,40.875476],[-73.827647,40.875381],[-73.827682,40.87537],[-73.82789099999999,40.875188],[-73.828053,40.875077],[-73.82821,40.874928],[-73.82835300000001,40.874765],[-73.82839199999999,40.874635],[-73.82847599999999,40.874465],[-73.828615,40.874372],[-73.82875,40.874335],[-73.828958,40.874348],[-73.829128,40.874368],[-73.829245,40.874313],[-73.829375,40.87427],[-73.829499,40.874264],[-73.829798,40.874329],[-73.829824,40.874342],[-73.82988899999999,40.874544],[-73.830078,40.874934],[-73.83010299999999,40.875015],[-73.830163,40.875208],[-73.83013200000001,40.87533],[-73.83067699999999,40.875423],[-73.831181,40.87551],[-73.832076,40.875665],[-73.83223599999999,40.875665],[-73.832356,40.875685],[-73.832696,40.875812],[-73.832978,40.875916],[-73.83314799999999,40.87598],[-73.833893,40.876028],[-73.833822,40.876529]]],"type":"Polygon"}
}