{
  "id": "360690505005",
  "type": "Feature",
  "properties": {
    "area_land":35514643,
    "area_water":99395,
    "geoid":"360690505005",
    "name":"Block Group 5",
    "state":"ny"
},
  "bbox": [
    -77.477277,
    42.854588,
    -77.370053,
    42.903251
],
  "geometry": {"coordinates":[[[-77.477277,42.903251],[-77.477149,42.903239],[-77.475343,42.903026],[-77.472228,42.902659],[-77.470803,42.902469],[-77.469553,42.902286],[-77.469392,42.902263],[-77.467935,42.902034],[-77.46763199999999,42.901977],[-77.46645599999999,42.901751],[-77.46521,42.901524],[-77.465011,42.901488],[-77.45819400000001,42.900214],[-77.45794600000001,42.900166],[-77.456903,42.899965],[-77.45552499999999,42.899712],[-77.455438,42.899696],[-77.455246,42.899659],[-77.454412,42.8995],[-77.454134,42.899447],[-77.453424,42.89931],[-77.452742,42.899179],[-77.450152,42.898683],[-77.44937400000001,42.898507],[-77.448578,42.898326],[-77.44719600000001,42.898014],[-77.44667699999999,42.897895],[-77.445121,42.897538],[-77.444603,42.89742],[-77.444581,42.897503],[-77.444515,42.897753],[-77.44449400000001,42.897837],[-77.44422,42.897724],[-77.44419000000001,42.897712],[-77.443726,42.897468],[-77.443462,42.89738],[-77.44341,42.897371],[-77.443264,42.897347],[-77.443117,42.897341],[-77.442671,42.897347],[-77.441334,42.897368],[-77.440889,42.897375],[-77.44017599999999,42.89738],[-77.43803800000001,42.897396],[-77.437326,42.897402],[-77.436697,42.897414],[-77.436663,42.897414],[-77.434729,42.897419],[-77.434673,42.89742],[-77.434011,42.897436],[-77.433914,42.897438],[-77.433627,42.897447],[-77.433531,42.89745],[-77.433361,42.897461],[-77.432806,42.897512],[-77.432626,42.89753],[-77.43229100000001,42.897595],[-77.43219000000001,42.897624],[-77.431984,42.897686],[-77.430932,42.898075],[-77.430515,42.898231],[-77.429908,42.89845],[-77.429579,42.89857],[-77.42867,42.898907],[-77.428095,42.899121],[-77.427898,42.899195],[-77.427492,42.899348],[-77.427224,42.899447],[-77.426421,42.899746],[-77.426272,42.899802],[-77.426154,42.899846],[-77.426096,42.899749],[-77.42609400000001,42.899656],[-77.42608799999999,42.899038],[-77.426086,42.898833],[-77.426085,42.89865],[-77.426084,42.898396],[-77.42608300000001,42.898104],[-77.42608300000001,42.897922],[-77.42608300000001,42.89784],[-77.426085,42.897442],[-77.426087,42.897176],[-77.42609299999999,42.896004],[-77.426095,42.895745],[-77.426098,42.895525],[-77.42610500000001,42.895157],[-77.42611100000001,42.894887],[-77.426103,42.894053],[-77.42610000000001,42.893686],[-77.42609899999999,42.893661],[-77.426097,42.893586],[-77.426097,42.893562],[-77.426096,42.893338],[-77.426095,42.892666],[-77.426095,42.892443],[-77.426072,42.892431],[-77.426033,42.892411],[-77.426008,42.892395],[-77.42598700000001,42.892382],[-77.425742,42.892241],[-77.425308,42.891991],[-77.425009,42.891818],[-77.42476499999999,42.891678],[-77.4246,42.891584],[-77.424105,42.891302],[-77.423941,42.891209],[-77.423862,42.891164],[-77.423627,42.891031],[-77.42354899999999,42.890987],[-77.42335199999999,42.890875],[-77.42190100000001,42.890037],[-77.418736,42.888208],[-77.41822000000001,42.88791],[-77.41696,42.887187],[-77.416814,42.887104],[-77.41640599999999,42.886905],[-77.41585600000001,42.886652],[-77.41522999999999,42.886403],[-77.415133,42.886366],[-77.414844,42.886256],[-77.414748,42.88622],[-77.414494,42.886128],[-77.413735,42.885852],[-77.413482,42.88576],[-77.41235,42.885347],[-77.411477,42.885028],[-77.40908899999999,42.884165],[-77.408953,42.884118],[-77.407813,42.883732],[-77.407489,42.883628],[-77.407402,42.883603],[-77.40698500000001,42.883483],[-77.406192,42.883304],[-77.406147,42.883296],[-77.405722,42.88323],[-77.405525,42.883209],[-77.405085,42.883163],[-77.40493499999999,42.883153],[-77.40473799999999,42.88314],[-77.404374,42.883128],[-77.40430600000001,42.883126],[-77.403284,42.883124],[-77.40292100000001,42.883124],[-77.40224000000001,42.883124],[-77.400198,42.883128],[-77.399518,42.883129],[-77.39752900000001,42.883127],[-77.39498,42.883126],[-77.393822,42.883116],[-77.391563,42.883129],[-77.38957499999999,42.883141],[-77.38847199999999,42.883136],[-77.388301,42.883134],[-77.384479,42.883096],[-77.383206,42.883084],[-77.38261300000001,42.883077],[-77.381834,42.88307],[-77.38083399999999,42.883069],[-77.380242,42.883069],[-77.379707,42.883068],[-77.37865499999999,42.883081],[-77.37826099999999,42.883082],[-77.37333,42.883098],[-77.372321,42.883085],[-77.370341,42.883061],[-77.370324,42.880523],[-77.370305,42.877432],[-77.370284,42.875153],[-77.37029099999999,42.872912],[-77.370296,42.871562],[-77.370282,42.870376],[-77.37026899999999,42.869129],[-77.37026899999999,42.869092],[-77.370268,42.865412],[-77.370267,42.865389],[-77.370225,42.864143],[-77.370216,42.864053],[-77.37018999999999,42.863784],[-77.370182,42.863695],[-77.37018500000001,42.862724],[-77.37018399999999,42.862706],[-77.37018,42.859739],[-77.37018,42.859394],[-77.370171,42.858751],[-77.37016300000001,42.857938],[-77.370148,42.856259],[-77.370102,42.855503],[-77.370053,42.854693],[-77.372546,42.854643],[-77.372974,42.854648],[-77.374709,42.854669],[-77.37755900000001,42.854599],[-77.381739,42.854588],[-77.381952,42.854588],[-77.38466099999999,42.854631],[-77.386089,42.854653],[-77.38613100000001,42.854653],[-77.389484,42.854665],[-77.39054400000001,42.854675],[-77.392015,42.85469],[-77.392324,42.854693],[-77.392437,42.854687],[-77.393703,42.854621],[-77.394125,42.854599],[-77.39507,42.85466],[-77.39545699999999,42.854666],[-77.397156,42.854693],[-77.39945899999999,42.85469],[-77.400794,42.854689],[-77.40119300000001,42.854687],[-77.40309600000001,42.854686],[-77.405603,42.854686],[-77.409004,42.854631],[-77.41000200000001,42.854648],[-77.41230400000001,42.85469],[-77.412565,42.854695],[-77.413298,42.854696],[-77.415806,42.854701],[-77.41628,42.854701],[-77.417275,42.854704],[-77.418072,42.854705],[-77.420466,42.854709],[-77.42126399999999,42.854711],[-77.42206299999999,42.854736],[-77.42446,42.854814],[-77.42525999999999,42.85484],[-77.42766399999999,42.854855],[-77.42846299999999,42.854861],[-77.432886,42.854851],[-77.433916,42.854867],[-77.434877,42.854899],[-77.437281,42.85498],[-77.43746400000001,42.854913],[-77.438029,42.854895],[-77.438953,42.854866],[-77.439334,42.854848],[-77.440084,42.854852],[-77.44031,42.854858],[-77.44080200000001,42.854873],[-77.44107099999999,42.854863],[-77.441632,42.854875],[-77.441712,42.854877],[-77.44256799999999,42.854927],[-77.44331699999999,42.854908],[-77.443879,42.854894],[-77.444298,42.854904],[-77.444648,42.854897],[-77.44473600000001,42.854896],[-77.446416,42.85487],[-77.446956,42.85487],[-77.44711599999999,42.85487],[-77.447726,42.854848],[-77.44959900000001,42.854819],[-77.450204,42.854809],[-77.45084900000001,42.8548],[-77.452099,42.85478],[-77.45633100000001,42.854715],[-77.457639,42.854745],[-77.460117,42.854803],[-77.461253,42.854769],[-77.46182899999999,42.854752],[-77.464664,42.854701],[-77.465678,42.854684],[-77.465802,42.854683],[-77.465926,42.85468],[-77.466301,42.854675],[-77.466426,42.854674],[-77.46822899999999,42.854664],[-77.47000800000001,42.854655],[-77.47363799999999,42.854682],[-77.475441,42.854696],[-77.475413,42.855304],[-77.47544000000001,42.855659],[-77.475606,42.857792],[-77.475599,42.858548],[-77.47559200000001,42.859514],[-77.475672,42.860585],[-77.475686,42.860827],[-77.47585599999999,42.863608],[-77.4759,42.864771],[-77.47595099999999,42.866087],[-77.47598000000001,42.866604],[-77.476039,42.867613],[-77.47607499999999,42.868157],[-77.47611000000001,42.868675],[-77.476114,42.868744],[-77.47612599999999,42.868951],[-77.476131,42.869021],[-77.476243,42.870989],[-77.476303,42.872044],[-77.47636300000001,42.875036],[-77.476417,42.876308],[-77.476435,42.876901],[-77.476495,42.878872],[-77.476367,42.87894],[-77.476332,42.878959],[-77.476288,42.879014],[-77.47628400000001,42.879083],[-77.476313,42.879149],[-77.476372,42.879186],[-77.476404,42.879225],[-77.476416,42.879287],[-77.476434,42.879376],[-77.476477,42.87941],[-77.476512,42.880676],[-77.47662,42.884474],[-77.47665600000001,42.885741],[-77.476662,42.886132],[-77.476665,42.886266],[-77.476698,42.887305],[-77.47671099999999,42.887696],[-77.476744,42.889052],[-77.47679100000001,42.890978],[-77.47685799999999,42.893123],[-77.476901,42.89448],[-77.476922,42.894512],[-77.47693599999999,42.894567],[-77.47693700000001,42.894597],[-77.476941,42.894659],[-77.47692000000001,42.894972],[-77.476913,42.895097],[-77.476955,42.896003],[-77.477082,42.898724],[-77.477125,42.899631],[-77.477155,42.900355],[-77.47724599999999,42.902527],[-77.477277,42.903251]]],"type":"Polygon"}
}