{
  "id": "360710005013",
  "type": "Feature",
  "properties": {
    "area_land":236520,
    "area_water":0,
    "geoid":"360710005013",
    "name":"Block Group 3",
    "state":"ny"
},
  "bbox": [
    -74.016251,
    41.495657,
    -74.004875,
    41.498704
],
  "geometry": {"coordinates":[[[-74.016144,41.497322],[-74.016043,41.498013],[-74.015957,41.498704],[-74.015035,41.498641],[-74.01390499999999,41.498564],[-74.013772,41.498556],[-74.01311099999999,41.498514],[-74.01265100000001,41.498487],[-74.010873,41.498358],[-74.010555,41.498332],[-74.00991500000001,41.498298],[-74.009417,41.498271],[-74.008036,41.498163],[-74.007155,41.498116],[-74.006987,41.498102],[-74.006901,41.498095],[-74.006851,41.498091],[-74.006676,41.498077],[-74.00549700000001,41.497984],[-74.00518599999999,41.497965],[-74.00519199999999,41.497915],[-74.00517499999999,41.497877],[-74.005137,41.497855],[-74.005062,41.49786],[-74.00498899999999,41.497891],[-74.004958,41.497889],[-74.004946,41.497873],[-74.004907,41.497789],[-74.004879,41.497574],[-74.004875,41.497432],[-74.004886,41.497372],[-74.004982,41.497115],[-74.004998,41.496991],[-74.00504599999999,41.496793],[-74.005207,41.496569],[-74.00523800000001,41.496483],[-74.005315,41.496401],[-74.00546799999999,41.496294],[-74.005506,41.496248],[-74.005528,41.496203],[-74.005537,41.496155],[-74.005498,41.496135],[-74.005358,41.496221],[-74.00527700000001,41.496246],[-74.005259,41.496228],[-74.00524799999999,41.496192],[-74.005252,41.496155],[-74.005274,41.496126],[-74.005365,41.496068],[-74.005427,41.49605],[-74.00546300000001,41.496024],[-74.005489,41.49598],[-74.0055,41.495929],[-74.005529,41.495889],[-74.00558700000001,41.495875],[-74.00579500000001,41.495875],[-74.005813,41.495827],[-74.00578,41.495657],[-74.006084,41.495693],[-74.006877,41.495778],[-74.00717400000001,41.495773],[-74.00734300000001,41.495763],[-74.00754999999999,41.49575],[-74.008319,41.495818],[-74.009282,41.495888],[-74.010158,41.495964],[-74.011115,41.496052],[-74.01281400000001,41.496173],[-74.013361,41.496211],[-74.014073,41.496262],[-74.015337,41.496361],[-74.015777,41.496383],[-74.016251,41.496405],[-74.016144,41.497322]]],"type":"Polygon"}
}