{
  "id": "360650219001",
  "type": "Feature",
  "properties": {
    "area_land":2137214,
    "area_water":83347,
    "geoid":"360650219001",
    "name":"Block Group 1",
    "state":"ny"
},
  "bbox": [
    -75.48592,
    43.201748,
    -75.459455,
    43.217479
],
  "geometry": {"coordinates":[[[-75.48577,43.20308],[-75.484178,43.207134],[-75.480519,43.21614],[-75.479975,43.217479],[-75.479732,43.217182],[-75.47943600000001,43.216894],[-75.478757,43.216362],[-75.478323,43.216101],[-75.47792800000001,43.2159],[-75.477541,43.215738],[-75.47708299999999,43.215573],[-75.47672300000001,43.215454],[-75.47568099999999,43.215182],[-75.47297,43.214528],[-75.47194399999999,43.214272],[-75.46875799999999,43.213478],[-75.467929,43.21323],[-75.46760500000001,43.213108],[-75.46754199999999,43.213084],[-75.467234,43.212953],[-75.466697,43.212689],[-75.466448,43.212543],[-75.465986,43.212239],[-75.465773,43.21207],[-75.465605,43.211916],[-75.464888,43.211143],[-75.46423299999999,43.210369],[-75.464044,43.210195],[-75.463562,43.209829],[-75.463258,43.209628],[-75.462942,43.209458],[-75.462602,43.209289],[-75.462101,43.209091],[-75.461828,43.209008],[-75.461493,43.208941],[-75.46109800000001,43.208902],[-75.46082699999999,43.208894],[-75.46061899999999,43.208867],[-75.460055,43.20889],[-75.45945500000001,43.208909],[-75.459503,43.208863],[-75.45957300000001,43.208795],[-75.46017999999999,43.20823],[-75.460486,43.207949],[-75.461033,43.207443],[-75.461451,43.207059],[-75.462694,43.205905],[-75.463356,43.205304],[-75.464179,43.204554],[-75.46450900000001,43.204243],[-75.464598,43.204159],[-75.464817,43.203952],[-75.46519600000001,43.203598],[-75.465446,43.203369],[-75.46576399999999,43.203075],[-75.46622000000001,43.202638],[-75.46672,43.202161],[-75.467037,43.201864],[-75.467164,43.201748],[-75.471777,43.201951],[-75.48591999999999,43.202661],[-75.48577,43.20308]]],"type":"Polygon"}
}