{
  "id": "361031595113",
  "type": "Feature",
  "properties": {
    "area_land":563838,
    "area_water":0,
    "geoid":"361031595113",
    "name":"Block Group 3",
    "state":"ny"
},
  "bbox": [
    -72.840558,
    40.794914,
    -72.830742,
    40.802605
],
  "geometry": {"coordinates":[[[-72.840543,40.800369],[-72.840541,40.801063],[-72.840497,40.801673],[-72.83461200000001,40.802334],[-72.83256799999999,40.802514],[-72.831548,40.802605],[-72.83138700000001,40.802357],[-72.832188,40.802275],[-72.83213600000001,40.80141],[-72.830742,40.799443],[-72.83160700000001,40.798755],[-72.831597,40.798256],[-72.831326,40.797954],[-72.83103800000001,40.79637],[-72.831382,40.795247],[-72.833966,40.795219],[-72.835453,40.794914],[-72.837788,40.795634],[-72.839693,40.79632],[-72.839786,40.796707],[-72.839902,40.796913],[-72.839977,40.797031],[-72.840069,40.797218],[-72.840192,40.797443],[-72.840253,40.797588],[-72.840551,40.79826],[-72.840543,40.798961],[-72.840558,40.799671],[-72.840543,40.800369]]],"type":"Polygon"}
}