{
  "id": "360595189001",
  "type": "Feature",
  "properties": {
    "area_land":216007,
    "area_water":0,
    "geoid":"360595189001",
    "name":"Block Group 1",
    "state":"ny"
},
  "bbox": [
    -73.536867,
    40.774536,
    -73.529348,
    40.779313
],
  "geometry": {"coordinates":[[[-73.536867,40.777983],[-73.53632500000001,40.778038],[-73.53532300000001,40.778139],[-73.535234,40.778152],[-73.534351,40.778389],[-73.533552,40.7786],[-73.53264900000001,40.778845],[-73.53179799999999,40.779074],[-73.53090400000001,40.779313],[-73.53064500000001,40.778785],[-73.53034599999999,40.778212],[-73.530062,40.777672],[-73.529348,40.776226],[-73.530158,40.775988],[-73.53039699999999,40.775917],[-73.530976,40.77575],[-73.53134,40.775641],[-73.531783,40.775514],[-73.532539,40.775292],[-73.532568,40.775289],[-73.532594,40.775279],[-73.533399,40.775042],[-73.534167,40.774818],[-73.53421,40.774807],[-73.534746,40.774645],[-73.53483300000001,40.774629],[-73.535877,40.774564],[-73.53637000000001,40.774536],[-73.536441,40.775217],[-73.53651499999999,40.775902],[-73.536592,40.776576],[-73.536602,40.776705],[-73.536714,40.777234],[-73.53681899999999,40.777748],[-73.536867,40.777983]]],"type":"Polygon"}
}