{
  "id": "360259704001",
  "type": "Feature",
  "properties": {
    "area_land":53483890,
    "area_water":428497,
    "geoid":"360259704001",
    "name":"Block Group 1",
    "state":"ny"
},
  "bbox": [
    -75.416109,
    42.247471,
    -75.198201,
    42.32238
],
  "geometry": {"coordinates":[[[-75.41596,42.285677],[-75.41595100000001,42.285924],[-75.41570299999999,42.292581],[-75.415689,42.29298],[-75.413473,42.29327],[-75.413017,42.293307],[-75.41251200000001,42.29333],[-75.41251,42.293385],[-75.412524,42.293519],[-75.412543,42.293717],[-75.412361,42.293724],[-75.411956,42.29374],[-75.41095300000001,42.293778],[-75.40892700000001,42.293807],[-75.407219,42.29377],[-75.406552,42.29375],[-75.406363,42.29374],[-75.40466499999999,42.293655],[-75.40161999999999,42.293399],[-75.40062399999999,42.293368],[-75.39759100000001,42.293181],[-75.397519,42.293179],[-75.396924,42.293167],[-75.395948,42.293189],[-75.394829,42.293264],[-75.394271,42.293324],[-75.39408,42.293345],[-75.393176,42.293481],[-75.391724,42.29378],[-75.390725,42.294043],[-75.389521,42.294433],[-75.388975,42.294619],[-75.38862,42.294807],[-75.388623,42.294908],[-75.388638,42.295043],[-75.38865699999999,42.295475],[-75.388656,42.295629],[-75.38864599999999,42.295782],[-75.388627,42.295939],[-75.388599,42.296097],[-75.388572,42.296223],[-75.388564,42.296259],[-75.38854000000001,42.296353],[-75.388372,42.297025],[-75.388147,42.297963],[-75.38811,42.298184],[-75.38810700000001,42.298219],[-75.388094,42.298386],[-75.38810100000001,42.29858],[-75.388133,42.298846],[-75.388164,42.299012],[-75.38818499999999,42.299093],[-75.388198,42.29919],[-75.388239,42.299503],[-75.38828599999999,42.299854],[-75.387344,42.299881],[-75.387322,42.299407],[-75.38646300000001,42.299429],[-75.38652999999999,42.300733],[-75.383629,42.300819],[-75.38337900000001,42.300836],[-75.383134,42.300862],[-75.38292800000001,42.300905],[-75.382682,42.300992],[-75.382496,42.301101],[-75.38226899999999,42.301254],[-75.380883,42.302328],[-75.37903300000001,42.303706],[-75.37891999999999,42.303798],[-75.37885799999999,42.30385],[-75.378784,42.303911],[-75.37853,42.304151],[-75.378412,42.304273],[-75.3783,42.304399],[-75.378197,42.304526],[-75.378103,42.304652],[-75.377944,42.304918],[-75.377923,42.304964],[-75.377883,42.305054],[-75.377831,42.305189],[-75.377787,42.30532],[-75.377751,42.30545],[-75.37772200000001,42.305581],[-75.377703,42.305707],[-75.377695,42.305812],[-75.377695,42.305834],[-75.37769400000001,42.306031],[-75.377707,42.306572],[-75.377748,42.306995],[-75.37789100000001,42.307971],[-75.377932,42.30844],[-75.37796,42.308665],[-75.377968,42.308809],[-75.377944,42.309012],[-75.37787299999999,42.309246],[-75.37776100000001,42.309484],[-75.377621,42.309747],[-75.377537,42.309863],[-75.37776100000001,42.30988],[-75.37783899999999,42.309885],[-75.378455,42.309955],[-75.378559,42.309971],[-75.379001,42.310039],[-75.37918500000001,42.310057],[-75.379268,42.31007],[-75.379459,42.310101],[-75.379471,42.31018],[-75.37948799999999,42.310308],[-75.37948299999999,42.310605],[-75.379464,42.311064],[-75.379468,42.31119],[-75.37946100000001,42.311384],[-75.379463,42.311524],[-75.37948799999999,42.311609],[-75.379518,42.311641],[-75.379554,42.311659],[-75.379593,42.311685],[-75.379672,42.311707],[-75.379699,42.311717],[-75.37977600000001,42.311734],[-75.379796,42.311878],[-75.379835,42.312185],[-75.378928,42.312367],[-75.37857200000001,42.312438],[-75.378648,42.31507],[-75.378674,42.31591],[-75.37656800000001,42.319896],[-75.37667399999999,42.321432],[-75.376679,42.321501],[-75.37672000000001,42.322093],[-75.37674,42.32238],[-75.37568400000001,42.322362],[-75.375443,42.322277],[-75.37514400000001,42.32212],[-75.374889,42.321865],[-75.37476100000001,42.321552],[-75.374747,42.321097],[-75.37486,42.320714],[-75.37535800000001,42.320145],[-75.375642,42.319762],[-75.375699,42.319506],[-75.375713,42.319222],[-75.375613,42.318866],[-75.37532899999999,42.318397],[-75.374995,42.318074],[-75.374621,42.317754],[-75.37415,42.317548],[-75.37362400000001,42.317172],[-75.373276,42.316859],[-75.373091,42.316639],[-75.37280699999999,42.316461],[-75.37248700000001,42.316362],[-75.37213,42.316191],[-75.372102,42.316167],[-75.371922,42.316014],[-75.371826,42.315983],[-75.371729,42.315951],[-75.37149599999999,42.315875],[-75.371264,42.315799],[-75.371152,42.315756],[-75.369731,42.315676],[-75.369556,42.315712],[-75.36842300000001,42.315907],[-75.36771899999999,42.316135],[-75.366297,42.316595],[-75.364008,42.317495],[-75.36044200000001,42.31811],[-75.35463300000001,42.319183],[-75.35352399999999,42.319221],[-75.35215599999999,42.318936],[-75.351288,42.318484],[-75.350156,42.317661],[-75.350048,42.317564],[-75.350038,42.317556],[-75.349954,42.317486],[-75.349869,42.317412],[-75.349388,42.316995],[-75.349266,42.316889],[-75.34914499999999,42.316783],[-75.34908900000001,42.316734],[-75.347893,42.316105],[-75.34533399999999,42.315379],[-75.342939,42.314941],[-75.341368,42.314797],[-75.33977899999999,42.315015],[-75.338105,42.315523],[-75.336736,42.316199],[-75.335847,42.317014],[-75.33581,42.317156],[-75.335795,42.317212],[-75.335775,42.31725],[-75.335751,42.317282],[-75.335696,42.317341],[-75.335655,42.317405],[-75.335606,42.317467],[-75.335548,42.317524],[-75.33541700000001,42.31763],[-75.33533799999999,42.317672],[-75.33519099999999,42.317767],[-75.334869,42.317927],[-75.334825,42.317943],[-75.334616,42.318035],[-75.334444,42.318095],[-75.33435299999999,42.318127],[-75.33417,42.318178],[-75.333978,42.318202],[-75.33388100000001,42.31821],[-75.333735,42.318211],[-75.333466,42.318194],[-75.333347,42.318186],[-75.333231,42.318169],[-75.33305900000001,42.318144],[-75.332914,42.318133],[-75.332818,42.318118],[-75.332576,42.318096],[-75.33233199999999,42.318096],[-75.33218599999999,42.318106],[-75.332092,42.318124],[-75.331958,42.318167],[-75.33178700000001,42.318236],[-75.331633,42.318304],[-75.33157799999999,42.318328],[-75.33156099999999,42.318336],[-75.331171,42.318524],[-75.33091400000001,42.318627],[-75.33069399999999,42.318704],[-75.330479,42.318788],[-75.329958,42.318982],[-75.32986699999999,42.319009],[-75.329604,42.319103],[-75.32942199999999,42.319155],[-75.329291,42.319203],[-75.32915199999999,42.319236],[-75.329066,42.31927],[-75.328929,42.319307],[-75.32848199999999,42.319448],[-75.328312,42.319518],[-75.328175,42.319556],[-75.32796399999999,42.319646],[-75.327763,42.319747],[-75.32768900000001,42.319793],[-75.327506,42.319844],[-75.32713,42.319919],[-75.32698600000001,42.319937],[-75.326843,42.31996],[-75.326746,42.319964],[-75.326683,42.319973],[-75.32644000000001,42.31999],[-75.32600499999999,42.320031],[-75.325931,42.320034],[-75.32549899999999,42.32009],[-75.32535900000001,42.320121],[-75.325264,42.320137],[-75.32499,42.320213],[-75.324904,42.320246],[-75.324765,42.320347],[-75.324726,42.320369],[-75.324257,42.320682],[-75.32373200000001,42.320942],[-75.3236,42.320989],[-75.32341700000001,42.321038],[-75.323278,42.321071],[-75.32316299999999,42.321089],[-75.32304000000001,42.321109],[-75.322799,42.321138],[-75.322362,42.32117],[-75.322266,42.32118],[-75.322108,42.321184],[-75.32203,42.321186],[-75.321973,42.321187],[-75.32143600000001,42.321199],[-75.32133899999999,42.321192],[-75.321241,42.321191],[-75.32090100000001,42.321212],[-75.320663,42.321252],[-75.32061299999999,42.321264],[-75.320431,42.321306],[-75.32019,42.321332],[-75.31999500000001,42.321344],[-75.31989799999999,42.321338],[-75.319804,42.321352],[-75.31941399999999,42.321356],[-75.319317,42.321364],[-75.31922,42.321359],[-75.31912199999999,42.321364],[-75.31905999999999,42.321363],[-75.31897600000001,42.321362],[-75.318197,42.321323],[-75.317908,42.321294],[-75.31786099999999,42.321283],[-75.317233,42.321222],[-75.316795,42.321199],[-75.31659999999999,42.321194],[-75.31650399999999,42.321181],[-75.316407,42.321179],[-75.316383,42.321181],[-75.316165,42.321199],[-75.315921,42.321212],[-75.315776,42.321226],[-75.315681,42.321242],[-75.31553700000001,42.321259],[-75.31549,42.32127],[-75.315347,42.321294],[-75.315065,42.321352],[-75.314835,42.32141],[-75.314792,42.321428],[-75.314702,42.321455],[-75.31464699999999,42.321438],[-75.314508,42.321404],[-75.31446,42.321397],[-75.314362,42.3214],[-75.31422000000001,42.321423],[-75.313883,42.32146],[-75.313688,42.32146],[-75.31354399999999,42.321475],[-75.313446,42.321479],[-75.313159,42.321516],[-75.313113,42.321527],[-75.31298700000001,42.321581],[-75.31291299999999,42.321628],[-75.31288000000001,42.321654],[-75.312826,42.321714],[-75.312749,42.321833],[-75.312743,42.321843],[-75.31270499999999,42.321862],[-75.312686,42.321867],[-75.312164,42.321861],[-75.31205300000001,42.321853],[-75.311536,42.321816],[-75.31084199999999,42.321627],[-75.310665,42.321589],[-75.31026300000001,42.321502],[-75.309882,42.321421],[-75.309532,42.321345],[-75.30935700000001,42.321307],[-75.309185,42.321271],[-75.308824,42.321194],[-75.308533,42.321132],[-75.30840499999999,42.321151],[-75.308277,42.321086],[-75.308252,42.321045],[-75.308042,42.32069],[-75.307911,42.320479],[-75.30783099999999,42.320371],[-75.30774,42.320267],[-75.30764000000001,42.320169],[-75.307528,42.320074],[-75.30740400000001,42.319994],[-75.30726900000001,42.319922],[-75.307152,42.31987],[-75.30712800000001,42.319859],[-75.306984,42.319801],[-75.306691,42.319698],[-75.306543,42.319658],[-75.306393,42.319623],[-75.306242,42.319596],[-75.30609,42.319574],[-75.305931,42.31957],[-75.305595,42.319584],[-75.30524800000001,42.319612],[-75.305077,42.319631],[-75.304906,42.319636],[-75.304737,42.319632],[-75.30457800000001,42.319614],[-75.30441399999999,42.319587],[-75.304265,42.319547],[-75.304125,42.319494],[-75.303994,42.319435],[-75.303871,42.319368],[-75.30364,42.319225],[-75.303301,42.318991],[-75.303068,42.318852],[-75.302824,42.318731],[-75.302567,42.318633],[-75.302429,42.318597],[-75.301709,42.318356],[-75.301607,42.318311],[-75.301498,42.31828],[-75.301394,42.318244],[-75.301079,42.318097],[-75.29952,42.317182],[-75.299363,42.317065],[-75.29839699999999,42.316283],[-75.298338,42.316235],[-75.29779000000001,42.315773],[-75.297544,42.315539],[-75.297313,42.315301],[-75.297209,42.315175],[-75.29702,42.314919],[-75.29697299999999,42.314844],[-75.296938,42.314789],[-75.296786,42.314519],[-75.296392,42.313687],[-75.296226,42.313282],[-75.296184,42.313152],[-75.29615200000001,42.313021],[-75.29613000000001,42.31289],[-75.296125,42.312764],[-75.29614100000001,42.312629],[-75.29618499999999,42.312512],[-75.29624,42.312399],[-75.29630899999999,42.312291],[-75.296396,42.312178],[-75.296504,42.312056],[-75.296792,42.31179],[-75.296926,42.311655],[-75.297073,42.311519],[-75.297213,42.311379],[-75.297478,42.311099],[-75.29759900000001,42.310959],[-75.297708,42.310824],[-75.297804,42.310689],[-75.29789,42.310558],[-75.297961,42.310432],[-75.298012,42.310301],[-75.29803699999999,42.31017],[-75.298025,42.310044],[-75.297977,42.309914],[-75.29789100000001,42.309788],[-75.297787,42.309657],[-75.29766499999999,42.309527],[-75.297527,42.309392],[-75.296899,42.308845],[-75.296575,42.308584],[-75.29640999999999,42.308459],[-75.29623599999999,42.308347],[-75.296054,42.308239],[-75.295675,42.308055],[-75.294906,42.307747],[-75.294715,42.307662],[-75.294526,42.307572],[-75.294343,42.307478],[-75.294168,42.307375],[-75.294006,42.307258],[-75.29387,42.307128],[-75.29368700000001,42.30693],[-75.293504,42.306732],[-75.29336600000001,42.306607],[-75.293212,42.306481],[-75.293043,42.306355],[-75.292862,42.306234],[-75.292468,42.306001],[-75.29204799999999,42.305768],[-75.291622,42.305539],[-75.290521,42.30502],[-75.29028700000001,42.304921],[-75.29004399999999,42.304836],[-75.289298,42.304631],[-75.28906000000001,42.304555],[-75.288613,42.304385],[-75.28840599999999,42.304291],[-75.28801300000001,42.304103],[-75.287622,42.303946],[-75.28742099999999,42.303893],[-75.287217,42.303844],[-75.287009,42.303808],[-75.28659,42.303778],[-75.286378,42.303774],[-75.286157,42.303779],[-75.286046,42.303794],[-75.285944,42.303807],[-75.285313,42.303903],[-75.284907,42.303949],[-75.284707,42.303958],[-75.28451,42.303959],[-75.284316,42.303946],[-75.284128,42.303924],[-75.283948,42.303884],[-75.283779,42.303839],[-75.283624,42.303781],[-75.283486,42.303709],[-75.283424,42.303665],[-75.283367,42.303624],[-75.283264,42.303534],[-75.28317800000001,42.303435],[-75.283102,42.303336],[-75.282971,42.303129],[-75.28280700000001,42.302851],[-75.282771,42.302774],[-75.282673,42.302449],[-75.282107,42.302387],[-75.281064,42.302274],[-75.280261,42.302154],[-75.27949099999999,42.301967],[-75.278734,42.30169],[-75.27847800000001,42.301582],[-75.277958,42.301363],[-75.27713799999999,42.301045],[-75.27624,42.300849],[-75.2753,42.300811],[-75.274348,42.300818],[-75.27242099999999,42.300822],[-75.27181899999999,42.300818],[-75.271483,42.300816],[-75.27057000000001,42.300696],[-75.27046300000001,42.30066],[-75.269733,42.300414],[-75.26899899999999,42.300033],[-75.268291,42.299652],[-75.26755199999999,42.299321],[-75.266761,42.299043],[-75.266552,42.298972],[-75.265959,42.298771],[-75.26518900000001,42.298448],[-75.265017,42.298353],[-75.264931,42.298305],[-75.264877,42.298275],[-75.26449100000001,42.298063],[-75.263893,42.297605],[-75.263389,42.297097],[-75.262979,42.296558],[-75.262601,42.296],[-75.262173,42.295465],[-75.261646,42.294989],[-75.26105200000001,42.294603],[-75.259879,42.29398],[-75.259338,42.293675],[-75.25882300000001,42.293365],[-75.25854099999999,42.293176],[-75.258341,42.293042],[-75.257868,42.292705],[-75.257694,42.292576],[-75.25742099999999,42.292373],[-75.257243,42.292163],[-75.257141,42.292044],[-75.256705,42.291493],[-75.256435,42.291095],[-75.256165,42.290682],[-75.256044,42.290509],[-75.256017,42.290471],[-75.25560900000001,42.289896],[-75.255263,42.289451],[-75.254987,42.289096],[-75.25462,42.288624],[-75.25393200000001,42.287711],[-75.253615,42.287275],[-75.253304,42.286857],[-75.253045,42.286412],[-75.25267100000001,42.285359],[-75.252461,42.284819],[-75.252287,42.284266],[-75.252228,42.284057],[-75.25213100000001,42.283717],[-75.25196800000001,42.283181],[-75.251942,42.283092],[-75.25182,42.282672],[-75.251863,42.282146],[-75.252054,42.281655],[-75.252077,42.281596],[-75.25228,42.281037],[-75.25231599999999,42.280929],[-75.25264,42.27996],[-75.25281699999999,42.279469],[-75.252944,42.279018],[-75.252843,42.278599],[-75.252611,42.278344],[-75.252533,42.278258],[-75.25211899999999,42.277953],[-75.251628,42.277688],[-75.25107199999999,42.277464],[-75.25047600000001,42.277245],[-75.249848,42.277034],[-75.249163,42.276869],[-75.247657,42.276629],[-75.24684000000001,42.276492],[-75.246205,42.276394],[-75.246067,42.276373],[-75.245971,42.276358],[-75.24508400000001,42.276243],[-75.24421700000001,42.276168],[-75.243397,42.276148],[-75.242626,42.276109],[-75.241927,42.27593],[-75.241884,42.275905],[-75.241596,42.275734],[-75.24136,42.275594],[-75.240943,42.275135],[-75.24041099999999,42.274051],[-75.24012399999999,42.273511],[-75.239814,42.272981],[-75.239493,42.272481],[-75.23905000000001,42.272059],[-75.238924,42.271968],[-75.238544,42.271691],[-75.23819,42.271551],[-75.237911,42.27144],[-75.237443,42.271339],[-75.237188,42.271284],[-75.236445,42.271132],[-75.235704,42.270931],[-75.235406,42.270838],[-75.23508699999999,42.270739],[-75.234971,42.270703],[-75.23493000000001,42.270688],[-75.234236,42.270439],[-75.232787,42.269928],[-75.232467,42.269803],[-75.232101,42.26966],[-75.230722,42.269072],[-75.22998200000001,42.268831],[-75.22920499999999,42.268652],[-75.228481,42.268406],[-75.227818,42.26811],[-75.2272,42.267792],[-75.226631,42.267441],[-75.226161,42.267001],[-75.22577200000001,42.266493],[-75.225436,42.26617],[-75.225286,42.266026],[-75.224947,42.265779],[-75.22472999999999,42.265621],[-75.224362,42.265118],[-75.224087,42.264591],[-75.223821,42.264061],[-75.223589,42.263726],[-75.223473,42.263557],[-75.22300799999999,42.263144],[-75.222493,42.262829],[-75.221868,42.262623],[-75.221198,42.262463],[-75.22053099999999,42.262311],[-75.219836,42.2622],[-75.21964800000001,42.262194],[-75.219103,42.262178],[-75.218383,42.262193],[-75.217698,42.262136],[-75.21705,42.261957],[-75.21637800000001,42.261747],[-75.21607899999999,42.261687],[-75.215643,42.2616],[-75.21485699999999,42.26152],[-75.21406,42.261467],[-75.21328,42.261455],[-75.21180200000001,42.261589],[-75.21110400000001,42.26159],[-75.210441,42.261483],[-75.210356,42.261457],[-75.20983699999999,42.2613],[-75.209272,42.261094],[-75.20869500000001,42.260896],[-75.208035,42.260785],[-75.207849,42.260795],[-75.207285,42.260827],[-75.20653299999999,42.260779],[-75.20586900000001,42.260555],[-75.205838,42.260537],[-75.205355,42.260195],[-75.204897,42.259723],[-75.204425,42.259175],[-75.20396599999999,42.258604],[-75.203504,42.258055],[-75.202985,42.257547],[-75.20241,42.257067],[-75.201795,42.256608],[-75.201167,42.256164],[-75.200547,42.255737],[-75.200126,42.25544],[-75.199966,42.255328],[-75.199933,42.255302],[-75.19966700000001,42.25509],[-75.19944099999999,42.25491],[-75.19895099999999,42.25447],[-75.198487,42.254007],[-75.198364,42.253879],[-75.198232,42.253743],[-75.198201,42.252819],[-75.201999,42.251204],[-75.20412399999999,42.250313],[-75.20465900000001,42.250083],[-75.205851,42.249408],[-75.20686499999999,42.248819],[-75.209108,42.247471],[-75.213623,42.2485],[-75.21512800000001,42.248831],[-75.224214,42.25079],[-75.227462,42.251512],[-75.229466,42.251961],[-75.230554,42.252155],[-75.231033,42.25224],[-75.240981,42.255018],[-75.2418,42.255247],[-75.24206599999999,42.255322],[-75.245908,42.256408],[-75.261101,42.261309],[-75.275977,42.26619],[-75.28823199999999,42.268748],[-75.28879000000001,42.268864],[-75.302188,42.272433],[-75.302392,42.272479],[-75.302549,42.272518],[-75.30469600000001,42.272931],[-75.307288,42.27369],[-75.30845100000001,42.274031],[-75.318939,42.277514],[-75.32063599999999,42.278071],[-75.322891,42.278834],[-75.326092,42.279842],[-75.33074999999999,42.281414],[-75.332178,42.281885],[-75.34270100000001,42.285415],[-75.354905,42.284805],[-75.361909,42.284476],[-75.362995,42.284421],[-75.367092,42.284228],[-75.374521,42.283877],[-75.38194300000001,42.283481],[-75.394732,42.282793],[-75.395793,42.282741],[-75.396615,42.28271],[-75.397819,42.28263],[-75.404893,42.282252],[-75.40594400000001,42.282198],[-75.4063,42.28218],[-75.410201,42.281975],[-75.41610900000001,42.281661],[-75.41596,42.285677]]],"type":"Polygon"}
}