{
  "id": "360470792003",
  "type": "Feature",
  "properties": {
    "area_land":108751,
    "area_water":0,
    "geoid":"360470792003",
    "name":"Block Group 3",
    "state":"ny"
},
  "bbox": [
    -73.958107,
    40.642689,
    -73.954525,
    40.646631
],
  "geometry": {"coordinates":[[[-73.958107,40.646518],[-73.956444,40.646595],[-73.955652,40.646631],[-73.95473,40.644772],[-73.95466500000001,40.644197],[-73.954525,40.642887],[-73.955494,40.642827],[-73.956425,40.642771],[-73.95763700000001,40.642689],[-73.957919,40.644143],[-73.957978,40.644576],[-73.958022,40.64507],[-73.958037,40.645302],[-73.958107,40.646518]]],"type":"Polygon"}
}