{
  "id": "360810052001",
  "type": "Feature",
  "properties": {
    "area_land":72720,
    "area_water":0,
    "geoid":"360810052001",
    "name":"Block Group 1",
    "state":"ny"
},
  "bbox": [
    -73.855353,
    40.67966,
    -73.850991,
    40.682564
],
  "geometry": {"coordinates":[[[-73.85535299999999,40.681607],[-73.854496,40.681851],[-73.85366399999999,40.682088],[-73.852819,40.682331],[-73.851979,40.682564],[-73.85163900000001,40.681886],[-73.85131800000001,40.68124],[-73.85099099999999,40.680568],[-73.852677,40.680079],[-73.85392400000001,40.679686],[-73.854393,40.67966],[-73.854547,40.679969],[-73.854704,40.680283],[-73.855017,40.680925],[-73.85535299999999,40.681607]]],"type":"Polygon"}
}