{
  "id": "360050267021",
  "type": "Feature",
  "properties": {
    "area_land":50195,
    "area_water":0,
    "geoid":"360050267021",
    "name":"Block Group 1",
    "state":"ny"
},
  "bbox": [
    -73.900954,
    40.871682,
    -73.8978,
    40.874426
],
  "geometry": {"coordinates":[[[-73.900316,40.874426],[-73.900147,40.874279],[-73.900006,40.874209],[-73.89986500000001,40.874167],[-73.899665,40.874138],[-73.899435,40.874157],[-73.89920100000001,40.874162],[-73.899001,40.874103],[-73.89879000000001,40.874009],[-73.898578,40.87388],[-73.89848499999999,40.873791],[-73.898433,40.873742],[-73.898302,40.87348],[-73.898179,40.873145],[-73.8978,40.871682],[-73.899086,40.871969],[-73.90003900000001,40.872136],[-73.900954,40.872293],[-73.900316,40.874426]]],"type":"Polygon"}
}