{
  "id": "360810598001",
  "type": "Feature",
  "properties": {
    "area_land":95809,
    "area_water":0,
    "geoid":"360810598001",
    "name":"Block Group 1",
    "state":"ny"
},
  "bbox": [
    -73.741865,
    40.695139,
    -73.737489,
    40.700743
],
  "geometry": {"coordinates":[[[-73.74101400000001,40.697321],[-73.740139,40.698999],[-73.739227,40.700743],[-73.738354,40.700475],[-73.737489,40.700214],[-73.738394,40.698478],[-73.73927500000001,40.696794],[-73.74013600000001,40.695139],[-73.74100199999999,40.69541],[-73.741865,40.695684],[-73.74101400000001,40.697321]]],"type":"Polygon"}
}