{
  "id": "360550142022",
  "type": "Feature",
  "properties": {
    "area_land":3062650,
    "area_water":8219,
    "geoid":"360550142022",
    "name":"Block Group 2",
    "state":"ny"
},
  "bbox": [
    -77.747047,
    43.125415,
    -77.707535,
    43.14761
],
  "geometry": {"coordinates":[[[-77.74704699999999,43.125417],[-77.745165,43.126101],[-77.735865,43.129483],[-77.735866,43.129545],[-77.732237,43.130864],[-77.725781,43.133211],[-77.719769,43.135397],[-77.718842,43.135749],[-77.718739,43.136006],[-77.718384,43.136987],[-77.718293,43.137291],[-77.71815700000001,43.137995],[-77.71812199999999,43.138296],[-77.71809399999999,43.138758],[-77.71808900000001,43.139118],[-77.718075,43.139314],[-77.71806599999999,43.140151],[-77.71803300000001,43.141015],[-77.71798200000001,43.142511],[-77.717957,43.143721],[-77.717951,43.145228],[-77.717264,43.145436],[-77.71677,43.145587],[-77.716019,43.145778],[-77.715463,43.145928],[-77.715065,43.146016],[-77.714564,43.146154],[-77.713555,43.14643],[-77.71330399999999,43.14654],[-77.711246,43.14709],[-77.70932000000001,43.14761],[-77.709109,43.143957],[-77.709084,43.142524],[-77.708883,43.141064],[-77.708626,43.139445],[-77.70861600000001,43.139386],[-77.708578,43.139157],[-77.708094,43.136452],[-77.707588,43.133422],[-77.707566,43.133201],[-77.70753499999999,43.132901],[-77.70777200000001,43.132176],[-77.708163,43.131474],[-77.710094,43.130461],[-77.71041,43.130228],[-77.710544,43.130065],[-77.71057500000001,43.130027],[-77.710643,43.129844],[-77.71065900000001,43.129802],[-77.710695,43.12957],[-77.710785,43.128769],[-77.71087900000001,43.127159],[-77.710784,43.125691],[-77.713212,43.125648],[-77.715226,43.125615],[-77.71694599999999,43.125605],[-77.71708099999999,43.125605],[-77.71803199999999,43.1256],[-77.718982,43.125594],[-77.719454,43.125592],[-77.72061600000001,43.125583],[-77.720733,43.125582],[-77.724273,43.125559],[-77.72439900000001,43.125559],[-77.725576,43.125553],[-77.72697599999999,43.125537],[-77.729055,43.125515],[-77.72994300000001,43.125512],[-77.730593,43.125546],[-77.731461,43.125486],[-77.735792,43.125437],[-77.73726600000001,43.125418],[-77.73823899999999,43.125416],[-77.73831800000001,43.125416],[-77.740576,43.125417],[-77.74449799999999,43.125417],[-77.745631,43.125415],[-77.74704699999999,43.125417]]],"type":"Polygon"}
}