{
  "id": "360810159003",
  "type": "Feature",
  "properties": {
    "area_land":32450,
    "area_water":0,
    "geoid":"360810159003",
    "name":"Block Group 3",
    "state":"ny"
},
  "bbox": [
    -73.920277,
    40.753338,
    -73.916871,
    40.755557
],
  "geometry": {"coordinates":[[[-73.91972199999999,40.754013],[-73.91847,40.755557],[-73.91767,40.755181],[-73.916871,40.754807],[-73.917632,40.753858],[-73.91892300000001,40.753636],[-73.920277,40.753338],[-73.91972199999999,40.754013]]],"type":"Polygon"}
}