{
  "id": "360850251001",
  "type": "Feature",
  "properties": {
    "area_land":468038,
    "area_water":0,
    "geoid":"360850251001",
    "name":"Block Group 1",
    "state":"ny"
},
  "bbox": [
    -74.151983,
    40.6163,
    -74.138266,
    40.624992
],
  "geometry": {"coordinates":[[[-74.151983,40.61753],[-74.14769,40.622072],[-74.147389,40.622476],[-74.147054,40.622971],[-74.146742,40.623546],[-74.14648699999999,40.623991],[-74.14633600000001,40.624416],[-74.146145,40.62493],[-74.14576700000001,40.624958],[-74.144025,40.624992],[-74.143075,40.624847],[-74.14219,40.624715],[-74.141662,40.62464],[-74.14127999999999,40.624594],[-74.138266,40.624248],[-74.138508,40.622633],[-74.13861300000001,40.621773],[-74.138367,40.621738],[-74.13853400000001,40.621128],[-74.13873700000001,40.620374],[-74.139002,40.619395],[-74.13923800000001,40.61852],[-74.139442,40.617766],[-74.139645,40.617015],[-74.139822,40.6163],[-74.140725,40.616415],[-74.14098199999999,40.616447],[-74.141617,40.616522],[-74.142337,40.616608],[-74.142214,40.617755],[-74.142151,40.618188],[-74.142037,40.618972],[-74.141908,40.619867],[-74.141879,40.620091],[-74.14278299999999,40.620202],[-74.143705,40.620317],[-74.144612,40.620425],[-74.14458500000001,40.620666],[-74.146816,40.620714],[-74.147218,40.620932],[-74.147932,40.621336],[-74.14891,40.620337],[-74.149869,40.619354],[-74.15061799999999,40.618592],[-74.15155300000001,40.617513],[-74.151983,40.61753]]],"type":"Polygon"}
}