{
  "id": "360810229001",
  "type": "Feature",
  "properties": {
    "area_land":1341173,
    "area_water":0,
    "geoid":"360810229001",
    "name":"Block Group 1",
    "state":"ny"
},
  "bbox": [
    -73.919038,
    40.727466,
    -73.90108,
    40.742414
],
  "geometry": {"coordinates":[[[-73.919017,40.732089],[-73.918885,40.73272],[-73.91877599999999,40.732699],[-73.91869800000001,40.733204],[-73.918313,40.733154],[-73.918082,40.733907],[-73.917753,40.734926],[-73.917593,40.735239],[-73.917558,40.735292],[-73.91749299999999,40.735421],[-73.91689700000001,40.735445],[-73.916872,40.735541],[-73.916515,40.736757],[-73.917177,40.736898],[-73.917091,40.737145],[-73.916512,40.738945],[-73.916301,40.739069],[-73.91567499999999,40.740785],[-73.915384,40.740729],[-73.914438,40.74056],[-73.913828,40.742414],[-73.91295,40.742307],[-73.911987,40.742189],[-73.91108800000001,40.742078],[-73.910192,40.741972],[-73.90929,40.741867],[-73.908339,40.741757],[-73.907556,40.741659],[-73.90778400000001,40.740745],[-73.908323,40.738631],[-73.90855500000001,40.73793],[-73.909217,40.736496],[-73.90922999999999,40.736455],[-73.90926,40.736403],[-73.909285,40.736334],[-73.909306,40.736287],[-73.909329,40.736232],[-73.90959700000001,40.735656],[-73.90991099999999,40.734997],[-73.910239,40.734339],[-73.910689,40.733471],[-73.906632,40.732796],[-73.906018,40.734011],[-73.905736,40.734633],[-73.90517,40.73586],[-73.904703,40.73568],[-73.90378699999999,40.735217],[-73.902866,40.734767],[-73.901943,40.73434],[-73.90107999999999,40.733908],[-73.901231,40.73372],[-73.901298,40.73364],[-73.902597,40.732104],[-73.904023,40.730365],[-73.904218,40.730127],[-73.905181,40.728957],[-73.905576,40.728635],[-73.90568399999999,40.72855],[-73.90673,40.727733],[-73.906933,40.727574],[-73.90707,40.727466],[-73.90930299999999,40.728846],[-73.909852,40.729023],[-73.91012499999999,40.729323],[-73.91034500000001,40.72943],[-73.91051,40.729511],[-73.910736,40.729605],[-73.910933,40.729687],[-73.911356,40.729843],[-73.911472,40.729886],[-73.91169600000001,40.729952],[-73.911731,40.729964],[-73.911772,40.729849],[-73.911818,40.729735],[-73.91193,40.729458],[-73.91201,40.729229],[-73.912053,40.728469],[-73.91493,40.728591],[-73.915072,40.727971],[-73.917967,40.728501],[-73.91773000000001,40.729879],[-73.917607,40.730572],[-73.91752099999999,40.731003],[-73.917366,40.731328],[-73.91730800000001,40.731439],[-73.919038,40.732021],[-73.919017,40.732089]]],"type":"Polygon"}
}