{
  "id": "360593020003",
  "type": "Feature",
  "properties": {
    "area_land":3504135,
    "area_water":783562,
    "geoid":"360593020003",
    "name":"Block Group 3",
    "state":"ny"
},
  "bbox": [
    -73.654078,
    40.793528,
    -73.627718,
    40.828999
],
  "geometry": {"coordinates":[[[-73.654078,40.804305],[-73.65325300000001,40.804136],[-73.652963,40.803978],[-73.652644,40.803571],[-73.65284800000001,40.804541],[-73.652908,40.804999],[-73.653029,40.80509],[-73.65336000000001,40.80628],[-73.65325,40.806436],[-73.651917,40.807499],[-73.651641,40.80772],[-73.650419,40.811453],[-73.65006700000001,40.814844],[-73.650008,40.815823],[-73.64967300000001,40.8214],[-73.65057299999999,40.8252],[-73.65082700000001,40.825623],[-73.652058,40.827595],[-73.65213300000001,40.827793],[-73.652205,40.828006],[-73.65096,40.828495],[-73.650649,40.82862],[-73.65023600000001,40.828637],[-73.64827699999999,40.828888],[-73.64775400000001,40.828954],[-73.64737100000001,40.828999],[-73.647356,40.828987],[-73.647165,40.828862],[-73.646513,40.828427],[-73.64546300000001,40.827727],[-73.645138,40.827517],[-73.64502400000001,40.827433],[-73.64417400000001,40.826868],[-73.644046,40.82679],[-73.643978,40.826748],[-73.64328999999999,40.826307],[-73.643066,40.826158],[-73.64192,40.825355],[-73.636743,40.821977],[-73.635199,40.821793],[-73.63440799999999,40.820307],[-73.631602,40.8183],[-73.63103,40.817901],[-73.63089600000001,40.817808],[-73.62839,40.816061],[-73.628102,40.816038],[-73.628175,40.815905],[-73.62834599999999,40.815595],[-73.627718,40.81541],[-73.627816,40.815116],[-73.628342,40.81528],[-73.628404,40.815308],[-73.62849199999999,40.81533],[-73.628838,40.814696],[-73.629184,40.814057],[-73.629549,40.813382],[-73.629564,40.813333],[-73.629553,40.813289],[-73.629524,40.813256],[-73.629355,40.812913],[-73.628467,40.812913],[-73.629447,40.812002],[-73.63082900000001,40.810936],[-73.632772,40.8097],[-73.633572,40.8092],[-73.633741,40.807667],[-73.63399200000001,40.807602],[-73.634343,40.80751],[-73.634897,40.807395],[-73.635265,40.807308],[-73.63598500000001,40.807165],[-73.636386,40.807103],[-73.636516,40.807077],[-73.636875,40.80702],[-73.637022,40.806915],[-73.637631,40.80648],[-73.63847699999999,40.805709],[-73.640366,40.803981],[-73.64143199999999,40.802756],[-73.642702,40.801297],[-73.643171,40.800684],[-73.64360600000001,40.799632],[-73.64395399999999,40.798461],[-73.644058,40.797022],[-73.644041,40.79613],[-73.643502,40.794346],[-73.643407,40.793946],[-73.643308,40.793528],[-73.643663,40.793661],[-73.643867,40.793736],[-73.644446,40.793977],[-73.64476999999999,40.794143],[-73.64497900000001,40.79422],[-73.645794,40.794481],[-73.646075,40.79458],[-73.64624999999999,40.794655],[-73.646479,40.794744],[-73.646641,40.79484],[-73.646821,40.794981],[-73.648028,40.79622],[-73.648563,40.796806],[-73.648617,40.796891],[-73.648667,40.79697],[-73.64876700000001,40.797119],[-73.648939,40.797485],[-73.649064,40.797688],[-73.649261,40.797925],[-73.649908,40.798569],[-73.649998,40.798674],[-73.650288,40.799086],[-73.65049500000001,40.799442],[-73.650746,40.799885],[-73.65102400000001,40.799962],[-73.651121,40.800001],[-73.651489,40.800176],[-73.65170500000001,40.800318],[-73.651892,40.80048],[-73.65207100000001,40.800689],[-73.65246500000001,40.801294],[-73.65260499999999,40.801468],[-73.652839,40.801688],[-73.65315200000001,40.801905],[-73.65345000000001,40.802187],[-73.653532,40.80227],[-73.653662,40.802489],[-73.653775,40.80272],[-73.653836,40.802996],[-73.653863,40.80315],[-73.653887,40.803285],[-73.653899,40.803353],[-73.653913,40.803428],[-73.654078,40.804305]]],"type":"Polygon"}
}