{
  "id": "360550058001",
  "type": "Feature",
  "properties": {
    "area_land":312602,
    "area_water":0,
    "geoid":"360550058001",
    "name":"Block Group 1",
    "state":"ny"
},
  "bbox": [
    -77.5751,
    43.167963,
    -77.559346,
    43.171528
],
  "geometry": {"coordinates":[[[-77.574017,43.168584],[-77.57314,43.169088],[-77.572575,43.169416],[-77.57241500000001,43.169507],[-77.571614,43.169965],[-77.571682,43.171236],[-77.570759,43.171255],[-77.56947,43.171285],[-77.56863800000001,43.171308],[-77.567852,43.171331],[-77.56745600000001,43.171342],[-77.56699,43.171354],[-77.566418,43.171365],[-77.566052,43.171377],[-77.565365,43.171396],[-77.56509800000001,43.171399],[-77.564305,43.171419],[-77.563953,43.171426],[-77.561944,43.171479],[-77.559884,43.171528],[-77.55950199999999,43.17148],[-77.55934600000001,43.170598],[-77.559631,43.170587],[-77.56000299999999,43.171305],[-77.560294,43.170772],[-77.560715,43.169995],[-77.56098299999999,43.169493],[-77.56121400000001,43.169072],[-77.564961,43.16895],[-77.565449,43.168858],[-77.56559300000001,43.168843],[-77.566654,43.168821],[-77.566616,43.16818],[-77.567746,43.168153],[-77.568669,43.168134],[-77.569622,43.168104],[-77.571629,43.168047],[-77.572514,43.168016],[-77.57510000000001,43.167963],[-77.574017,43.168584]]],"type":"Polygon"}
}