{
  "id": "361031472001",
  "type": "Feature",
  "properties": {
    "area_land":666768,
    "area_water":0,
    "geoid":"361031472001",
    "name":"Block Group 1",
    "state":"ny"
},
  "bbox": [
    -73.267457,
    40.723962,
    -73.251653,
    40.733998
],
  "geometry": {"coordinates":[[[-73.26745699999999,40.732041],[-73.26718,40.732082],[-73.266671,40.732163],[-73.266105,40.732273],[-73.264748,40.732535],[-73.26424799999999,40.732631],[-73.264162,40.732649],[-73.261976,40.733057],[-73.261807,40.733092],[-73.261567,40.73313],[-73.261369,40.733184],[-73.25962199999999,40.733564],[-73.259094,40.733661],[-73.257459,40.733998],[-73.257364,40.733871],[-73.257255,40.733723],[-73.257149,40.733579],[-73.25614299999999,40.731991],[-73.255897,40.73166],[-73.25588,40.731637],[-73.255833,40.731621],[-73.255443,40.731269],[-73.254,40.730057],[-73.253398,40.729542],[-73.253238,40.729389],[-73.253232,40.729326],[-73.253108,40.729224],[-73.252763,40.728937],[-73.252011,40.728286],[-73.251653,40.728],[-73.25229,40.72777],[-73.25309,40.727448],[-73.25405499999999,40.727076],[-73.25456,40.726871],[-73.25470799999999,40.726815],[-73.255521,40.726514],[-73.256576,40.726102],[-73.25766,40.72567],[-73.25781600000001,40.725609],[-73.258814,40.725213],[-73.25815799999999,40.724783],[-73.25879,40.724494],[-73.259308,40.724256],[-73.259829,40.723962],[-73.261098,40.725306],[-73.262917,40.730265],[-73.263497,40.730343],[-73.264593,40.730463],[-73.265278,40.730545],[-73.265556,40.731201],[-73.26580300000001,40.731095],[-73.26732199999999,40.731477],[-73.26737199999999,40.731678],[-73.26741,40.731826],[-73.26745699999999,40.732041]]],"type":"Polygon"}
}