{
  "id": "360670120004",
  "type": "Feature",
  "properties": {
    "area_land":24963699,
    "area_water":0,
    "geoid":"360670120004",
    "name":"Block Group 4",
    "state":"ny"
},
  "bbox": [
    -76.49725,
    43.004964,
    -76.439869,
    43.07711
],
  "geometry": {"coordinates":[[[-76.49724999999999,43.074978],[-76.492141,43.075648],[-76.49169000000001,43.075714],[-76.488052,43.076184],[-76.48441,43.076676],[-76.483266,43.07684],[-76.48301499999999,43.076876],[-76.482457,43.076962],[-76.481509,43.07711],[-76.481454,43.076916],[-76.481447,43.076889],[-76.481284,43.076521],[-76.481222,43.076382],[-76.480861,43.075643],[-76.480664,43.075249],[-76.480587,43.075093],[-76.480559,43.075036],[-76.480508,43.074934],[-76.480435,43.074781],[-76.480276,43.074449],[-76.480133,43.074161],[-76.48000399999999,43.0739],[-76.479839,43.073565],[-76.479643,43.073021],[-76.479125,43.071531],[-76.47901899999999,43.071165],[-76.478962,43.070697],[-76.47863599999999,43.070665],[-76.47854,43.07063],[-76.47842199999999,43.070548],[-76.477209,43.06935],[-76.474992,43.067188],[-76.473676,43.065913],[-76.473153,43.065394],[-76.472666,43.064889],[-76.47234899999999,43.064558],[-76.472171,43.064384],[-76.471766,43.064358],[-76.471654,43.064352],[-76.47037400000001,43.064221],[-76.47021700000001,43.064201],[-76.469976,43.064171],[-76.469246,43.064058],[-76.469122,43.064034],[-76.468924,43.06398],[-76.468727,43.063918],[-76.468638,43.063871],[-76.46852,43.063773],[-76.467872,43.063083],[-76.46715500000001,43.062278],[-76.466882,43.061972],[-76.466131,43.061165],[-76.465613,43.060597],[-76.46525699999999,43.060207],[-76.46518,43.060122],[-76.465172,43.060114],[-76.464512,43.059389],[-76.463812,43.058616],[-76.463471,43.058237],[-76.46306199999999,43.057783],[-76.46284199999999,43.057537],[-76.461405,43.055974],[-76.46082,43.055332],[-76.459318,43.053682],[-76.458977,43.053308],[-76.458804,43.053107],[-76.45780999999999,43.052017],[-76.457446,43.051619],[-76.455693,43.049696],[-76.454341,43.048149],[-76.45206899999999,43.045601],[-76.45177200000001,43.045246],[-76.451571,43.044957],[-76.451459,43.044782],[-76.45132,43.044464],[-76.451212,43.044095],[-76.451144,43.043762],[-76.450731,43.040019],[-76.450648,43.03969],[-76.450596,43.039573],[-76.450446,43.039306],[-76.45021800000001,43.039037],[-76.449484,43.038393],[-76.449183,43.038121],[-76.449044,43.037985],[-76.44890100000001,43.037844],[-76.448689,43.03755],[-76.44864099999999,43.03746],[-76.448583,43.037316],[-76.448522,43.037141],[-76.44849600000001,43.036981],[-76.44828099999999,43.034436],[-76.448093,43.032627],[-76.44801099999999,43.031813],[-76.447947,43.031389],[-76.447914,43.031226],[-76.447777,43.030811],[-76.447283,43.029263],[-76.44714999999999,43.02884],[-76.446983,43.028308],[-76.446849,43.027923],[-76.446743,43.027619],[-76.44627199999999,43.026308],[-76.446046,43.025391],[-76.445964,43.025114],[-76.44582699999999,43.024684],[-76.445159,43.022777],[-76.44470699999999,43.02143],[-76.444157,43.019774],[-76.44362700000001,43.018075],[-76.44293999999999,43.016097],[-76.442538,43.015009],[-76.441839,43.013125],[-76.441327,43.01168],[-76.44120700000001,43.011288],[-76.440315,43.008678],[-76.440067,43.007976],[-76.439924,43.007555],[-76.439869,43.007322],[-76.455016,43.00666],[-76.457087,43.006583],[-76.46010099999999,43.006463],[-76.462999,43.006316],[-76.463066,43.006313],[-76.47144900000001,43.00592],[-76.471879,43.005902],[-76.491941,43.004964],[-76.492525,43.013287],[-76.492526,43.013302],[-76.492667,43.015312],[-76.492864,43.018111],[-76.49294500000001,43.019499],[-76.49304600000001,43.021204],[-76.493104,43.022153],[-76.493183,43.023492],[-76.49330399999999,43.024898],[-76.49365899999999,43.028945],[-76.493707,43.029532],[-76.493841,43.031635],[-76.493842,43.031646],[-76.49413,43.036151],[-76.494354,43.039662],[-76.49452599999999,43.041874],[-76.494688,43.04395],[-76.495149,43.049869],[-76.495233,43.050949],[-76.495429,43.053454],[-76.49565800000001,43.056367],[-76.495664,43.05644],[-76.496517,43.066042],[-76.49651799999999,43.066052],[-76.496557,43.066518],[-76.49655799999999,43.066531],[-76.49658100000001,43.066807],[-76.49686699999999,43.070156],[-76.497055,43.072532],[-76.497176,43.074072],[-76.497182,43.074143],[-76.49722800000001,43.074724],[-76.497231,43.074758],[-76.49724999999999,43.074978]]],"type":"Polygon"}
}