{
  "id": "361190041003",
  "type": "Feature",
  "properties": {
    "area_land":359688,
    "area_water":0,
    "geoid":"361190041003",
    "name":"Block Group 3",
    "state":"ny"
},
  "bbox": [
    -73.827755,
    40.912604,
    -73.817156,
    40.918465
],
  "geometry": {"coordinates":[[[-73.827755,40.918316],[-73.827371,40.918349],[-73.82673,40.918403],[-73.826472,40.918426],[-73.826093,40.918449],[-73.825731,40.918461],[-73.82546000000001,40.918465],[-73.82526,40.918459],[-73.824974,40.91843],[-73.823615,40.918332],[-73.82307400000001,40.918298],[-73.823003,40.91829],[-73.822447,40.918238],[-73.821612,40.918137],[-73.82145,40.918113],[-73.820536,40.917974],[-73.820277,40.917933],[-73.819881,40.917871],[-73.819357,40.917763],[-73.818713,40.917636],[-73.818541,40.917592],[-73.818397,40.917555],[-73.817714,40.917371],[-73.817156,40.91721],[-73.818427,40.915687],[-73.818866,40.915149],[-73.818917,40.915015],[-73.819292,40.913676],[-73.819445,40.91313],[-73.819705,40.913155],[-73.81993300000001,40.913164],[-73.82002300000001,40.913139],[-73.82006199999999,40.913106],[-73.82017,40.912891],[-73.820206,40.912834],[-73.820302,40.912751],[-73.82041,40.912694],[-73.820701,40.912615],[-73.820819,40.912604],[-73.82092299999999,40.912612],[-73.821178,40.912748],[-73.82129999999999,40.912792],[-73.821431,40.912766],[-73.82184700000001,40.914117],[-73.82201999999999,40.914648],[-73.822425,40.914346],[-73.82258400000001,40.914298],[-73.82289400000001,40.914258],[-73.823971,40.91414],[-73.824938,40.914043],[-73.82652299999999,40.913884],[-73.826638,40.914576],[-73.826714,40.915037],[-73.826842,40.915761],[-73.826887,40.915896],[-73.827308,40.916919],[-73.827528,40.917586],[-73.827719,40.918164],[-73.827755,40.918316]]],"type":"Polygon"}
}