{
  "id": "361190084041",
  "type": "Feature",
  "properties": {
    "area_land":289632,
    "area_water":0,
    "geoid":"361190084041",
    "name":"Block Group 1",
    "state":"ny"
},
  "bbox": [
    -73.712893,
    40.964855,
    -73.703012,
    40.973211
],
  "geometry": {"coordinates":[[[-73.71289299999999,40.969461],[-73.711122,40.969805],[-73.709529,40.970139],[-73.70924100000001,40.970209],[-73.708538,40.970379],[-73.708415,40.970417],[-73.70802399999999,40.970536],[-73.707945,40.970564],[-73.70745599999999,40.970735],[-73.70731499999999,40.970795],[-73.706648,40.971081],[-73.706135,40.971343],[-73.705241,40.971876],[-73.70501899999999,40.972041],[-73.70325099999999,40.973211],[-73.703147,40.973077],[-73.703102,40.973047],[-73.703023,40.972993],[-73.703012,40.972902],[-73.703086,40.972802],[-73.70317,40.972748],[-73.703344,40.972686],[-73.70354399999999,40.972582],[-73.703611,40.972504],[-73.703655,40.972451],[-73.70375900000001,40.972278],[-73.703801,40.972139],[-73.703808,40.972015],[-73.70375900000001,40.971932],[-73.703731,40.971842],[-73.70375199999999,40.971703],[-73.704002,40.97133],[-73.704654,40.970721],[-73.704823,40.970528],[-73.704953,40.970336],[-73.70504699999999,40.970165],[-73.70516000000001,40.969918],[-73.705366,40.969451],[-73.705394,40.969333],[-73.705455,40.969237],[-73.70575599999999,40.968926],[-73.70612,40.968676],[-73.70635799999999,40.968347],[-73.706436,40.968258],[-73.706506,40.968177],[-73.70701699999999,40.967337],[-73.707324,40.966395],[-73.70772700000001,40.965726],[-73.70775500000001,40.96568],[-73.70805,40.965237],[-73.708484,40.964855],[-73.710177,40.965981],[-73.71026999999999,40.966024],[-73.71036100000001,40.966066],[-73.71108700000001,40.966325],[-73.711657,40.966528],[-73.711924,40.966613],[-73.712222,40.966693],[-73.71236,40.966715],[-73.71248300000001,40.967391],[-73.712536,40.967736],[-73.712642,40.968174],[-73.71278700000001,40.968898],[-73.71286000000001,40.969292],[-73.71289299999999,40.969461]]],"type":"Polygon"}
}