{
  "id": "360594096002",
  "type": "Feature",
  "properties": {
    "area_land":593014,
    "area_water":0,
    "geoid":"360594096002",
    "name":"Block Group 2",
    "state":"ny"
},
  "bbox": [
    -73.52627,
    40.698466,
    -73.505473,
    40.707896
],
  "geometry": {"coordinates":[[[-73.52615,40.707743],[-73.52579799999999,40.707803],[-73.525762,40.707816],[-73.525612,40.707834],[-73.52549500000001,40.707859],[-73.525148,40.707896],[-73.524855,40.707896],[-73.524902,40.70756],[-73.52489199999999,40.707489],[-73.524849,40.70739],[-73.524722,40.707202],[-73.524772,40.707123],[-73.524855,40.707044],[-73.52488099999999,40.706978],[-73.524878,40.706901],[-73.52481400000001,40.70678],[-73.524387,40.706209],[-73.52429600000001,40.706078],[-73.523903,40.705544],[-73.523763,40.705368],[-73.523617,40.70521],[-73.52278200000001,40.704258],[-73.521916,40.703269],[-73.521781,40.703117],[-73.52165599999999,40.703023],[-73.52149799999999,40.702946],[-73.521339,40.702907],[-73.521254,40.702896],[-73.521109,40.702895],[-73.52095,40.702919],[-73.520776,40.702976],[-73.52063200000001,40.703047],[-73.520431,40.702965],[-73.520256,40.702893],[-73.51968599999999,40.702658],[-73.519549,40.702578],[-73.51928599999999,40.702333],[-73.518978,40.702208],[-73.51775499999999,40.701838],[-73.517596,40.701799],[-73.517402,40.701776],[-73.517214,40.701781],[-73.517099,40.701799],[-73.51691,40.701861],[-73.516817,40.701886],[-73.516519,40.70199],[-73.516092,40.702136],[-73.515294,40.702413],[-73.515078,40.702488],[-73.51485700000001,40.702548],[-73.51451,40.702615],[-73.514172,40.70265],[-73.51379900000001,40.702684],[-73.51327499999999,40.702737],[-73.51237999999999,40.702827],[-73.512652,40.704389],[-73.512703,40.704623],[-73.51276300000001,40.704803],[-73.51250400000001,40.704701],[-73.510998,40.704166],[-73.50732499999999,40.702861],[-73.50547299999999,40.702175],[-73.505792,40.701751],[-73.505887,40.701573],[-73.50592,40.701485],[-73.50594,40.701432],[-73.505971,40.701342],[-73.50613300000001,40.700869],[-73.50614400000001,40.700803],[-73.506293,40.700294],[-73.50636900000001,40.700017],[-73.506518,40.699972],[-73.50660999999999,40.69995],[-73.50748,40.699735],[-73.508275,40.699536],[-73.508731,40.699447],[-73.509619,40.699223],[-73.509821,40.699177],[-73.51016799999999,40.699118],[-73.51358999999999,40.698735],[-73.51471600000001,40.698622],[-73.51497500000001,40.698612],[-73.51537999999999,40.698553],[-73.51637599999999,40.698494],[-73.517083,40.69847],[-73.517501,40.698466],[-73.51768800000001,40.698491],[-73.518056,40.698518],[-73.51837999999999,40.698555],[-73.518469,40.69857],[-73.51859399999999,40.698592],[-73.52014,40.698804],[-73.520146,40.698949],[-73.520128,40.699243],[-73.520183,40.699616],[-73.52025399999999,40.699847],[-73.52037900000001,40.700165],[-73.520416,40.700276],[-73.520537,40.700534],[-73.52062599999999,40.70071],[-73.520742,40.700909],[-73.52098700000001,40.701291],[-73.521153,40.70148],[-73.521317,40.701687],[-73.52201700000001,40.702481],[-73.523008,40.70354],[-73.523869,40.704532],[-73.524384,40.705158],[-73.524748,40.705617],[-73.525415,40.706492],[-73.52590499999999,40.707187],[-73.52627,40.707722],[-73.52615,40.707743]]],"type":"Polygon"}
}