{
  "id": "360339505011",
  "type": "Feature",
  "properties": {
    "area_land":1368817,
    "area_water":0,
    "geoid":"360339505011",
    "name":"Block Group 1",
    "state":"ny"
},
  "bbox": [
    -74.310869,
    44.848086,
    -74.292412,
    44.861091
],
  "geometry": {"coordinates":[[[-74.310869,44.857494],[-74.309444,44.857591],[-74.309382,44.857595],[-74.307334,44.857716],[-74.30676099999999,44.857748],[-74.29836,44.858231],[-74.298362,44.858252],[-74.29840799999999,44.858656],[-74.298401,44.858796],[-74.29835799999999,44.858926],[-74.298289,44.859043],[-74.298162,44.859193],[-74.297645,44.859747],[-74.297494,44.859883],[-74.297257,44.860042],[-74.29709099999999,44.86013],[-74.29647799999999,44.860425],[-74.29615099999999,44.860621],[-74.295968,44.860796],[-74.29583100000001,44.860944],[-74.295748,44.861001],[-74.29562799999999,44.861051],[-74.295462,44.861091],[-74.295462,44.860997],[-74.29548699999999,44.860892],[-74.295535,44.860786],[-74.29583100000001,44.860318],[-74.296014,44.859959],[-74.29606099999999,44.859704],[-74.296063,44.859645],[-74.296074,44.85934],[-74.296173,44.859103],[-74.296278,44.858924],[-74.296505,44.858357],[-74.296514,44.858335],[-74.296638,44.858025],[-74.297082,44.856673],[-74.297104,44.856556],[-74.297104,44.856469],[-74.29708599999999,44.856247],[-74.296998,44.855933],[-74.29688899999999,44.855737],[-74.296818,44.855642],[-74.296654,44.85546],[-74.29654499999999,44.855365],[-74.296359,44.85526],[-74.296291,44.855225],[-74.295361,44.854746],[-74.295002,44.854539],[-74.294927,44.854488],[-74.294211,44.853999],[-74.293453,44.853474],[-74.292652,44.852892],[-74.292576,44.852819],[-74.292503,44.852698],[-74.292434,44.852454],[-74.292412,44.852338],[-74.29243200000001,44.851824],[-74.29244300000001,44.851764],[-74.292464,44.851651],[-74.29257,44.851212],[-74.292931,44.850331],[-74.29307,44.850046],[-74.293183,44.849744],[-74.29320300000001,44.84969],[-74.293227,44.849624],[-74.29328099999999,44.84934],[-74.293279,44.84891],[-74.29327000000001,44.848779],[-74.293357,44.848773],[-74.293722,44.848763],[-74.294318,44.848788],[-74.29536299999999,44.848804],[-74.29558299999999,44.8488],[-74.29563,44.848799],[-74.295682,44.848798],[-74.295733,44.848798],[-74.29665900000001,44.848753],[-74.297454,44.848709],[-74.297513,44.848706],[-74.298153,44.848677],[-74.29993399999999,44.8486],[-74.29998000000001,44.848598],[-74.30083999999999,44.848559],[-74.302944,44.84847],[-74.303343,44.848455],[-74.304277,44.848414],[-74.304802,44.848391],[-74.305879,44.848346],[-74.30723399999999,44.848272],[-74.30856300000001,44.848187],[-74.30861,44.848184],[-74.309619,44.848117],[-74.310081,44.848086],[-74.310869,44.857494]]],"type":"Polygon"}
}