{
  "id": "360471104004",
  "type": "Feature",
  "properties": {
    "area_land":115093,
    "area_water":0,
    "geoid":"360471104004",
    "name":"Block Group 4",
    "state":"ny"
},
  "bbox": [
    -73.886814,
    40.659061,
    -73.880892,
    40.66415
],
  "geometry": {"coordinates":[[[-73.885936,40.662394],[-73.88511800000001,40.662746],[-73.88430200000001,40.663095],[-73.883487,40.663448],[-73.88267,40.663798],[-73.881856,40.66415],[-73.880961,40.662928],[-73.880892,40.662834],[-73.881703,40.662472],[-73.882491,40.662136],[-73.883334,40.661773],[-73.884131,40.661433],[-73.884047,40.661317],[-73.884002,40.661253],[-73.882912,40.659781],[-73.88373900000001,40.659427],[-73.88458199999999,40.659061],[-73.88566899999999,40.660501],[-73.88574,40.660594],[-73.885824,40.660705],[-73.885891,40.660793],[-73.886814,40.662014],[-73.885936,40.662394]]],"type":"Polygon"}
}