{
  "id": "360110408002",
  "type": "Feature",
  "properties": {
    "area_land":34708616,
    "area_water":1921655,
    "geoid":"360110408002",
    "name":"Block Group 2",
    "state":"ny"
},
  "bbox": [
    -76.481906,
    42.691777,
    -76.418228,
    42.782356
],
  "geometry": {"coordinates":[[[-76.481906,42.780623],[-76.47976300000001,42.780743],[-76.47331800000001,42.7811],[-76.472255,42.781163],[-76.46599399999999,42.781516],[-76.464991,42.781571],[-76.451072,42.782356],[-76.45058400000001,42.778666],[-76.44901299999999,42.778727],[-76.444957,42.778882],[-76.44415600000001,42.778911],[-76.442564,42.778938],[-76.441844,42.778847],[-76.44151100000001,42.778837],[-76.440791,42.778916],[-76.438759,42.779105],[-76.436149,42.77921],[-76.43109800000001,42.779397],[-76.4302,42.779436],[-76.42995500000001,42.779004],[-76.42981,42.77873],[-76.428873,42.777054],[-76.428704,42.77676],[-76.428522,42.776425],[-76.427498,42.774599],[-76.42696599999999,42.773655],[-76.426804,42.773354],[-76.426699,42.773177],[-76.426548,42.772891],[-76.42637999999999,42.772584],[-76.426266,42.772363],[-76.425004,42.770089],[-76.424233,42.76861],[-76.423822,42.767838],[-76.423535,42.767266],[-76.42297000000001,42.766188],[-76.42247399999999,42.765211],[-76.422292,42.764799],[-76.421997,42.764097],[-76.421516,42.762939],[-76.42148400000001,42.762838],[-76.421406,42.762662],[-76.421262,42.762298],[-76.42085899999999,42.761318],[-76.420751,42.761035],[-76.4207,42.760846],[-76.420675,42.760733],[-76.420644,42.760367],[-76.420637,42.759822],[-76.42062900000001,42.759753],[-76.420631,42.759696],[-76.420618,42.75941],[-76.420569,42.757726],[-76.420554,42.757399],[-76.420553,42.757126],[-76.420536,42.756876],[-76.42048699999999,42.755665],[-76.420464,42.75495],[-76.420436,42.754361],[-76.42041399999999,42.753987],[-76.420404,42.753604],[-76.42032500000001,42.751512],[-76.420286,42.750786],[-76.42021699999999,42.749776],[-76.420204,42.74967],[-76.420199,42.749632],[-76.420147,42.748825],[-76.420125,42.748541],[-76.420118,42.748388],[-76.41998100000001,42.746372],[-76.41994099999999,42.745663],[-76.41983500000001,42.744316],[-76.419729,42.743225],[-76.419704,42.742873],[-76.419685,42.742745],[-76.41966499999999,42.742501],[-76.419616,42.742021],[-76.41958099999999,42.741565],[-76.419566,42.741449],[-76.419527,42.741011],[-76.41951,42.740904],[-76.41950199999999,42.74078],[-76.419437,42.740125],[-76.419327,42.739233],[-76.419229,42.738169],[-76.419189,42.73782],[-76.419128,42.737079],[-76.41909800000001,42.736842],[-76.41902399999999,42.736102],[-76.41901799999999,42.735983],[-76.418981,42.735594],[-76.41893399999999,42.735176],[-76.41885000000001,42.733729],[-76.41882099999999,42.733443],[-76.41878,42.732753],[-76.41876999999999,42.732208],[-76.418752,42.731927],[-76.418744,42.731703],[-76.418713,42.73134],[-76.418693,42.73095],[-76.418672,42.730726],[-76.418668,42.730311],[-76.418645,42.729956],[-76.418645,42.729839],[-76.418632,42.729581],[-76.418621,42.72912],[-76.418604,42.728666],[-76.41860699999999,42.728495],[-76.41859100000001,42.72812],[-76.418566,42.727812],[-76.418479,42.727005],[-76.418295,42.725066],[-76.418238,42.72456],[-76.418228,42.724328],[-76.418233,42.72396],[-76.418252,42.723702],[-76.418299,42.723202],[-76.418319,42.723057],[-76.418328,42.722938],[-76.418452,42.721883],[-76.41846099999999,42.721773],[-76.418463,42.721748],[-76.418536,42.72121],[-76.418881,42.718092],[-76.418932,42.717716],[-76.418995,42.717074],[-76.419032,42.716805],[-76.41909099999999,42.716267],[-76.41913700000001,42.715911],[-76.41918699999999,42.715675],[-76.41922,42.715579],[-76.419262,42.715497],[-76.41929500000001,42.715446],[-76.419318,42.715412],[-76.41940099999999,42.715332],[-76.419506,42.715253],[-76.41990300000001,42.715002],[-76.420067,42.714931],[-76.420188,42.714889],[-76.420311,42.714862],[-76.42042600000001,42.714851],[-76.421357,42.714824],[-76.421846,42.714824],[-76.421796,42.714474],[-76.42168700000001,42.713575],[-76.42167600000001,42.713403],[-76.42157400000001,42.712568],[-76.42152,42.712152],[-76.421488,42.711819],[-76.421485,42.711784],[-76.421481,42.711748],[-76.421436,42.711389],[-76.42132700000001,42.710656],[-76.421243,42.710128],[-76.421179,42.709678],[-76.421171,42.70958],[-76.421136,42.709332],[-76.421116,42.709113],[-76.42108399999999,42.70888],[-76.421003,42.7082],[-76.420993,42.708133],[-76.420937,42.707486],[-76.42088099999999,42.70679],[-76.42085299999999,42.706435],[-76.420788,42.705619],[-76.420682,42.704346],[-76.420613,42.703513],[-76.420602,42.703316],[-76.420599,42.703262],[-76.42045299999999,42.701248],[-76.420435,42.701004],[-76.420419,42.700782],[-76.420367,42.700143],[-76.420214,42.697541],[-76.420208,42.697284],[-76.420208,42.69711],[-76.420208,42.69671],[-76.42021800000001,42.696506],[-76.420283,42.695914],[-76.420322,42.695657],[-76.420366,42.695438],[-76.42037999999999,42.695366],[-76.420416,42.695195],[-76.420546,42.694666],[-76.42067,42.694249],[-76.420706,42.694129],[-76.420816,42.693841],[-76.420942,42.69353],[-76.420969,42.693466],[-76.427196,42.693215],[-76.428139,42.693177],[-76.428291,42.693171],[-76.428389,42.693167],[-76.434175,42.692934],[-76.4477,42.692388],[-76.45225499999999,42.69221],[-76.456282,42.692042],[-76.46259999999999,42.691777],[-76.46262400000001,42.692116],[-76.462735,42.693576],[-76.462766,42.693859],[-76.462772,42.694007],[-76.462774,42.694031],[-76.46278700000001,42.694173],[-76.462795,42.69448],[-76.462806,42.694721],[-76.462823,42.695094],[-76.462879,42.695904],[-76.462907,42.696523],[-76.462908,42.696712],[-76.462931,42.697089],[-76.46293900000001,42.697522],[-76.462986,42.698515],[-76.463058,42.699607],[-76.46308999999999,42.700021],[-76.463131,42.700757],[-76.463184,42.701668],[-76.463249,42.702791],[-76.463403,42.705117],[-76.463544,42.707807],[-76.463735,42.710769],[-76.46377,42.711541],[-76.463818,42.712254],[-76.463875,42.713111],[-76.46392400000001,42.714115],[-76.463939,42.714385],[-76.463943,42.714456],[-76.463973,42.714924],[-76.46399700000001,42.715232],[-76.464016,42.715705],[-76.46404699999999,42.716216],[-76.46407000000001,42.716681],[-76.464072,42.71673],[-76.464156,42.717916],[-76.46416600000001,42.718086],[-76.46418799999999,42.718516],[-76.46421100000001,42.718833],[-76.464286,42.720061],[-76.464361,42.721471],[-76.464416,42.722215],[-76.46442399999999,42.722363],[-76.464483,42.723469],[-76.46453099999999,42.724221],[-76.46454199999999,42.724419],[-76.46456000000001,42.724642],[-76.46459400000001,42.725257],[-76.464688,42.726965],[-76.464698,42.727351],[-76.464688,42.727483],[-76.46467199999999,42.727582],[-76.464652,42.727647],[-76.464623,42.727714],[-76.46455400000001,42.727846],[-76.46451,42.727911],[-76.46468400000001,42.727971],[-76.46476699999999,42.729293],[-76.464777,42.729636],[-76.464786,42.729774],[-76.464809,42.729903],[-76.464822,42.730102],[-76.46482,42.730231],[-76.46481199999999,42.730345],[-76.464816,42.730535],[-76.46484100000001,42.730869],[-76.46485199999999,42.731112],[-76.46487,42.73166],[-76.46490300000001,42.732426],[-76.46491399999999,42.732669],[-76.46494199999999,42.733319],[-76.464946,42.7334],[-76.464992,42.734097],[-76.465014,42.734517],[-76.465068,42.735896],[-76.46514000000001,42.737242],[-76.465397,42.742053],[-76.465632,42.747084],[-76.46571299999999,42.748338],[-76.46572500000001,42.749252],[-76.46573600000001,42.75007],[-76.465763,42.752795],[-76.46577600000001,42.754078],[-76.46578700000001,42.755162],[-76.465805,42.756872],[-76.465915,42.757036],[-76.46732799999999,42.75913],[-76.46874200000001,42.761231],[-76.46880299999999,42.761322],[-76.472386,42.766738],[-76.47329999999999,42.76812],[-76.474339,42.76969],[-76.47561399999999,42.771652],[-76.47657599999999,42.773134],[-76.47701499999999,42.773819],[-76.477379,42.774387],[-76.47934100000001,42.777099],[-76.48098299999999,42.77937],[-76.481906,42.780623]]],"type":"Polygon"}
}