{
  "id": "360550131015",
  "type": "Feature",
  "properties": {
    "area_land":743407,
    "area_water":0,
    "geoid":"360550131015",
    "name":"Block Group 5",
    "state":"ny"
},
  "bbox": [
    -77.598646,
    43.068646,
    -77.58135,
    43.075163
],
  "geometry": {"coordinates":[[[-77.598629,43.068727],[-77.59862,43.068802],[-77.59862099999999,43.068892],[-77.598613,43.068977],[-77.598572,43.069126],[-77.598539,43.069202],[-77.59768800000001,43.070605],[-77.597345,43.071259],[-77.597145,43.071605],[-77.596673,43.072493],[-77.59662,43.072593],[-77.59638699999999,43.072998],[-77.59582899999999,43.074028],[-77.595062,43.073797],[-77.594959,43.07378],[-77.594838,43.07377],[-77.594768,43.073768],[-77.594359,43.073773],[-77.594084,43.073776],[-77.592956,43.073797],[-77.59283000000001,43.073813],[-77.592704,43.07384],[-77.59258,43.073885],[-77.592466,43.073937],[-77.59236199999999,43.073997],[-77.592269,43.074064],[-77.59220999999999,43.074117],[-77.592159,43.074173],[-77.59211500000001,43.074233],[-77.59208,43.074296],[-77.59204699999999,43.07437],[-77.592022,43.074441],[-77.592007,43.074524],[-77.59200300000001,43.074768],[-77.59201299999999,43.075081],[-77.590703,43.075099],[-77.590045,43.075109],[-77.589383,43.075119],[-77.58875500000001,43.075127],[-77.588089,43.075136],[-77.587273,43.075146],[-77.58656999999999,43.075159],[-77.586394,43.075163],[-77.586074,43.075162],[-77.585863,43.075141],[-77.585624,43.075096],[-77.58487700000001,43.074892],[-77.585251,43.074147],[-77.58450999999999,43.073932],[-77.584036,43.073796],[-77.58387500000001,43.073739],[-77.58381300000001,43.073711],[-77.583764,43.073736],[-77.583719,43.073765],[-77.583665,43.073813],[-77.583568,43.073931],[-77.583084,43.07483],[-77.58305799999999,43.074872],[-77.58304699999999,43.074889],[-77.582992,43.074957],[-77.58293500000001,43.075016],[-77.58286099999999,43.07507],[-77.58277200000001,43.075111],[-77.58268,43.075137],[-77.582573,43.075154],[-77.582483,43.075155],[-77.58240000000001,43.075149],[-77.5823,43.075128],[-77.582207,43.0751],[-77.58212,43.075061],[-77.58202199999999,43.075003],[-77.58190999999999,43.074917],[-77.58166799999999,43.074693],[-77.58144900000001,43.074441],[-77.581385,43.074325],[-77.58135299999999,43.074233],[-77.58135,43.074148],[-77.58136399999999,43.074091],[-77.58139799999999,43.073994],[-77.58183,43.073172],[-77.582279,43.072352],[-77.583119,43.070736],[-77.58317700000001,43.070613],[-77.58323,43.070514],[-77.58329500000001,43.070423],[-77.583388,43.07033],[-77.58349200000001,43.070253],[-77.583656,43.070182],[-77.58387399999999,43.070133],[-77.58409899999999,43.070106],[-77.58435,43.070092],[-77.584604,43.070091],[-77.584851,43.070108],[-77.585149,43.070158],[-77.58551300000001,43.07024],[-77.585892,43.069555],[-77.585955,43.069367],[-77.585977,43.069184],[-77.585984,43.068989],[-77.585945,43.068832],[-77.58714000000001,43.068819],[-77.588065,43.06881],[-77.590699,43.068765],[-77.59118599999999,43.068757],[-77.595,43.068705],[-77.59645999999999,43.068687],[-77.59751300000001,43.068668],[-77.598646,43.068646],[-77.598629,43.068727]]],"type":"Polygon"}
}