{
  "id": "360850146052",
  "type": "Feature",
  "properties": {
    "area_land":414516,
    "area_water":0,
    "geoid":"360850146052",
    "name":"Block Group 2",
    "state":"ny"
},
  "bbox": [
    -74.153012,
    40.550818,
    -74.144218,
    40.559716
],
  "geometry": {"coordinates":[[[-74.153012,40.557331],[-74.15219399999999,40.557545],[-74.15052,40.557981],[-74.149818,40.558315],[-74.148094,40.559175],[-74.147548,40.558578],[-74.14706700000001,40.558856],[-74.14635800000001,40.559282],[-74.145653,40.559716],[-74.14461799999999,40.558719],[-74.144218,40.558336],[-74.14485999999999,40.557824],[-74.145487,40.55732],[-74.146551,40.556235],[-74.14636299999999,40.55576],[-74.14606999999999,40.554642],[-74.14579000000001,40.553814],[-74.14562599999999,40.553377],[-74.14555799999999,40.553195],[-74.14557600000001,40.552708],[-74.145599,40.552081],[-74.145572,40.552017],[-74.145293,40.551563],[-74.14589599999999,40.55136],[-74.147385,40.551572],[-74.147648,40.551607],[-74.14796800000001,40.551634],[-74.14825500000001,40.551646],[-74.148555,40.551646],[-74.148843,40.551632],[-74.14899200000001,40.551593],[-74.149157,40.551534],[-74.14931199999999,40.551461],[-74.149447,40.55138],[-74.14957,40.551288],[-74.14967799999999,40.551189],[-74.14972,40.551143],[-74.15010599999999,40.550818],[-74.15037,40.551294],[-74.150503,40.551635],[-74.150637,40.55195],[-74.150913,40.552605],[-74.15122,40.553312],[-74.151687,40.55436],[-74.152072,40.555217],[-74.152323,40.555782],[-74.152629,40.556473],[-74.153012,40.557331]]],"type":"Polygon"}
}