{
  "id": "360470208002",
  "type": "Feature",
  "properties": {
    "area_land":56461,
    "area_water":0,
    "geoid":"360470208002",
    "name":"Block Group 2",
    "state":"ny"
},
  "bbox": [
    -74.012245,
    40.623355,
    -74.00726,
    40.627134
],
  "geometry": {"coordinates":[[[-74.01166499999999,40.626574],[-74.011082,40.627134],[-74.00887899999999,40.625802],[-74.009462,40.625243],[-74.00726,40.623915],[-74.007839,40.623355],[-74.010042,40.624686],[-74.01224499999999,40.626016],[-74.01166499999999,40.626574]]],"type":"Polygon"}
}