{
  "id": "360957406001",
  "type": "Feature",
  "properties": {
    "area_land":122331362,
    "area_water":3397,
    "geoid":"360957406001",
    "name":"Block Group 1",
    "state":"ny"
},
  "bbox": [
    -74.550018,
    42.501808,
    -74.342885,
    42.645301
],
  "geometry": {"coordinates":[[[-74.55001799999999,42.575043],[-74.548199,42.579156],[-74.546783,42.582386],[-74.546617,42.58248],[-74.544183,42.583751],[-74.53977399999999,42.586032],[-74.53886,42.586504],[-74.53801199999999,42.586947],[-74.537661,42.587125],[-74.53663899999999,42.58761],[-74.53561999999999,42.588112],[-74.535263,42.588352],[-74.535073,42.58845],[-74.534088,42.588998],[-74.53319399999999,42.589453],[-74.53211400000001,42.590069],[-74.53200099999999,42.590126],[-74.53012,42.591028],[-74.52915,42.591539],[-74.528695,42.591782],[-74.527897,42.592233],[-74.527084,42.592705],[-74.52692399999999,42.592783],[-74.524849,42.593897],[-74.52449900000001,42.594054],[-74.524432,42.594092],[-74.523332,42.594679],[-74.522863,42.594941],[-74.522594,42.595092],[-74.522482,42.595172],[-74.513828,42.599694],[-74.51048299999999,42.601397],[-74.508619,42.602374],[-74.50484299999999,42.604431],[-74.504403,42.604662],[-74.50164100000001,42.606126],[-74.50046399999999,42.606751],[-74.50003100000001,42.606959],[-74.499538,42.607227],[-74.495615,42.609324],[-74.48923600000001,42.612732],[-74.488286,42.613241],[-74.48464800000001,42.61511],[-74.480495,42.617281],[-74.47353,42.620924],[-74.46918100000001,42.623116],[-74.46813400000001,42.623697],[-74.46771,42.62395],[-74.465763,42.624998],[-74.46043,42.627779],[-74.45693199999999,42.629615],[-74.44249600000001,42.637193],[-74.44054800000001,42.638211],[-74.437506,42.63981],[-74.431363,42.644895],[-74.43125999999999,42.644861],[-74.430864,42.644964],[-74.43076600000001,42.645019],[-74.430598,42.645116],[-74.43047300000001,42.645137],[-74.430066,42.645219],[-74.429928,42.64522],[-74.42841799999999,42.645301],[-74.428271,42.645204],[-74.427938,42.645036],[-74.42721299999999,42.644578],[-74.42642499999999,42.644272],[-74.42598599999999,42.644212],[-74.42474,42.64404],[-74.423821,42.643716],[-74.423508,42.643605],[-74.42323399999999,42.643466],[-74.42301,42.6434],[-74.422918,42.643363],[-74.422804,42.643304],[-74.42270499999999,42.643198],[-74.421969,42.642679],[-74.421539,42.642597],[-74.421178,42.642331],[-74.42100499999999,42.64222],[-74.420641,42.642013],[-74.41903600000001,42.641396],[-74.418639,42.641209],[-74.418474,42.64109],[-74.41839299999999,42.641009],[-74.41809499999999,42.640618],[-74.417985,42.640465],[-74.417862,42.640331],[-74.41762300000001,42.640134],[-74.417373,42.639946],[-74.417096,42.639756],[-74.417064,42.639736],[-74.416802,42.639745],[-74.416679,42.639618],[-74.416664,42.639602],[-74.41661499999999,42.639549],[-74.416509,42.639464],[-74.416383,42.63938],[-74.415924,42.638978],[-74.415718,42.63884],[-74.415471,42.638601],[-74.415288,42.638368],[-74.415182,42.638263],[-74.415098,42.638199],[-74.41499899999999,42.638101],[-74.41492100000001,42.638002],[-74.41481899999999,42.637923],[-74.414682,42.637847],[-74.414576,42.637727],[-74.41452700000001,42.63765],[-74.414513,42.637565],[-74.414513,42.637467],[-74.414597,42.637263],[-74.41461099999999,42.637199],[-74.41461099999999,42.637079],[-74.41455499999999,42.636946],[-74.41449799999999,42.636854],[-74.41443599999999,42.636721],[-74.4144,42.636593],[-74.414329,42.636558],[-74.414249,42.636456],[-74.414216,42.636403],[-74.414213,42.636377],[-74.414202,42.636255],[-74.414174,42.636206],[-74.413977,42.635973],[-74.413949,42.635854],[-74.413899,42.635727],[-74.413822,42.635635],[-74.41370000000001,42.635524],[-74.413686,42.635467],[-74.413686,42.635291],[-74.413721,42.6352],[-74.413742,42.635094],[-74.413742,42.634981],[-74.41372800000001,42.634869],[-74.41364299999999,42.634707],[-74.413573,42.634643],[-74.41353100000001,42.634566],[-74.413467,42.6342],[-74.413411,42.634101],[-74.413291,42.633967],[-74.413157,42.633904],[-74.413051,42.633819],[-74.412981,42.633699],[-74.41296699999999,42.633587],[-74.413028,42.633391],[-74.413044,42.63334],[-74.413043,42.633253],[-74.412975,42.633177],[-74.412931,42.63314],[-74.41289500000001,42.633084],[-74.41289500000001,42.632985],[-74.412966,42.632914],[-74.412994,42.63283],[-74.412987,42.63276],[-74.41289500000001,42.632717],[-74.412747,42.632682],[-74.412656,42.632633],[-74.412599,42.632534],[-74.412592,42.632457],[-74.41255700000001,42.632372],[-74.412494,42.632295],[-74.41238800000001,42.632231],[-74.41224,42.632203],[-74.412014,42.632189],[-74.411979,42.632111],[-74.411979,42.632055],[-74.412035,42.631999],[-74.412064,42.631928],[-74.412064,42.631837],[-74.412014,42.631773],[-74.411856,42.631713],[-74.411602,42.631645],[-74.411517,42.631564],[-74.41148200000001,42.631507],[-74.411418,42.631443],[-74.41134700000001,42.631411],[-74.411294,42.631404],[-74.411106,42.631404],[-74.41098599999999,42.63139],[-74.410932,42.631362],[-74.410911,42.631326],[-74.41086900000001,42.631153],[-74.410833,42.631089],[-74.41073400000001,42.631004],[-74.410653,42.630898],[-74.410631,42.630882],[-74.410599,42.630859],[-74.41052500000001,42.630831],[-74.41035100000001,42.630792],[-74.410291,42.630732],[-74.410259,42.630594],[-74.410235,42.630548],[-74.41016,42.630456],[-74.41010300000001,42.630314],[-74.41005699999999,42.630254],[-74.40996199999999,42.63019],[-74.409919,42.630151],[-74.40988,42.629939],[-74.40983799999999,42.629907],[-74.409767,42.629907],[-74.409508,42.629847],[-74.409448,42.629801],[-74.409367,42.629695],[-74.40936000000001,42.62961],[-74.40923600000001,42.629295],[-74.40915,42.629164],[-74.40913399999999,42.629044],[-74.409097,42.628951],[-74.40901599999999,42.62881],[-74.408906,42.62847],[-74.408874,42.628445],[-74.40881400000001,42.62842],[-74.408619,42.628388],[-74.408495,42.62831],[-74.408278,42.628303],[-74.407644,42.628372],[-74.407574,42.628359],[-74.407505,42.628333],[-74.407393,42.62824],[-74.407163,42.62804],[-74.40700200000001,42.627825],[-74.40691700000001,42.627666],[-74.406903,42.627606],[-74.40691,42.627546],[-74.406949,42.627496],[-74.406953,42.627415],[-74.406921,42.627312],[-74.406818,42.627266],[-74.40670799999999,42.627255],[-74.4064,42.627213],[-74.406308,42.627181],[-74.406223,42.627131],[-74.406166,42.627071],[-74.406138,42.627007],[-74.406127,42.626937],[-74.406099,42.626855],[-74.406053,42.626809],[-74.405929,42.626714],[-74.405897,42.626657],[-74.405901,42.626388],[-74.405879,42.626335],[-74.40580199999999,42.626246],[-74.405738,42.626147],[-74.405688,42.626038],[-74.40562799999999,42.625946],[-74.405529,42.625737],[-74.40547599999999,42.625659],[-74.405387,42.625574],[-74.405214,42.625443],[-74.405097,42.625397],[-74.405072,42.625308],[-74.40479499999999,42.625092],[-74.40467700000001,42.625],[-74.404554,42.624913],[-74.40451899999999,42.624878],[-74.40450300000001,42.624847],[-74.404515,42.624623],[-74.404562,42.624541],[-74.404566,42.624425],[-74.404554,42.624368],[-74.40450300000001,42.624321],[-74.404354,42.624239],[-74.40425999999999,42.624129],[-74.404178,42.624078],[-74.404115,42.624066],[-74.404037,42.624035],[-74.404025,42.624019],[-74.40401300000001,42.623921],[-74.404028,42.623819],[-74.404056,42.623764],[-74.404087,42.623729],[-74.404264,42.623641],[-74.40428,42.62359],[-74.404268,42.623554],[-74.40418200000001,42.623472],[-74.40366299999999,42.623217],[-74.403514,42.623092],[-74.403357,42.622923],[-74.403216,42.622794],[-74.40314100000001,42.622758],[-74.402545,42.622658],[-74.402451,42.622631],[-74.40236,42.622592],[-74.40227400000001,42.622537],[-74.402243,42.622505],[-74.40217199999999,42.622337],[-74.402129,42.622262],[-74.402058,42.622176],[-74.401976,42.622],[-74.401921,42.621929],[-74.401563,42.621562],[-74.401163,42.621143],[-74.401053,42.620982],[-74.400994,42.620809],[-74.40092799999999,42.620674],[-74.400873,42.620588],[-74.400802,42.620509],[-74.400547,42.620317],[-74.40047199999999,42.620098],[-74.400445,42.620051],[-74.40035399999999,42.619996],[-74.40027600000001,42.619976],[-74.400119,42.619964],[-74.399738,42.619774],[-74.39966,42.619719],[-74.39960499999999,42.61966],[-74.39952599999999,42.619503],[-74.399342,42.619362],[-74.399322,42.619327],[-74.39931,42.619241],[-74.399377,42.619127],[-74.399393,42.61908],[-74.399389,42.618939],[-74.39927900000001,42.6186],[-74.399255,42.618392],[-74.399263,42.618184],[-74.39922799999999,42.617988],[-74.399208,42.617554],[-74.399193,42.617515],[-74.39904,42.617405],[-74.398989,42.617354],[-74.39891799999999,42.617174],[-74.39885099999999,42.616737],[-74.398859,42.616682],[-74.398945,42.616521],[-74.398957,42.616435],[-74.398934,42.616384],[-74.398875,42.616298],[-74.398855,42.616243],[-74.398871,42.6159],[-74.398859,42.615766],[-74.39878,42.615633],[-74.398612,42.615421],[-74.398584,42.615362],[-74.398565,42.615217],[-74.398612,42.614972],[-74.398612,42.614886],[-74.3986,42.614827],[-74.398572,42.614772],[-74.398521,42.614713],[-74.398364,42.614588],[-74.398325,42.614537],[-74.398298,42.61447],[-74.39827,42.614325],[-74.39828199999999,42.614041],[-74.398247,42.613998],[-74.398121,42.613919],[-74.397823,42.613356],[-74.397638,42.613243],[-74.397603,42.613196],[-74.397587,42.61309],[-74.39761900000001,42.612866],[-74.397513,42.612233],[-74.397418,42.611915],[-74.39713999999999,42.611558],[-74.396979,42.61139],[-74.39668,42.611153],[-74.396264,42.610882],[-74.396174,42.610792],[-74.39600900000001,42.610439],[-74.395852,42.610158],[-74.39577,42.610053],[-74.39575000000001,42.609998],[-74.39575000000001,42.60988],[-74.39572699999999,42.609719],[-74.395656,42.609515],[-74.39561500000001,42.609448],[-74.395538,42.609341],[-74.395369,42.609196],[-74.395236,42.609054],[-74.395083,42.608788],[-74.39489500000001,42.608582],[-74.394792,42.608402],[-74.394588,42.608096],[-74.39451800000001,42.608021],[-74.394341,42.607892],[-74.394282,42.607864],[-74.39424699999999,42.607868],[-74.394188,42.607951],[-74.394125,42.60799],[-74.394051,42.608002],[-74.39381899999999,42.607888],[-74.393717,42.607864],[-74.393277,42.607854],[-74.393136,42.607858],[-74.39275499999999,42.607772],[-74.392696,42.607737],[-74.392571,42.607611],[-74.392539,42.6076],[-74.39250800000001,42.607611],[-74.392343,42.607796],[-74.39228799999999,42.607839],[-74.392061,42.607943],[-74.391974,42.607974],[-74.391915,42.607978],[-74.391841,42.607966],[-74.391676,42.607896],[-74.391621,42.607888],[-74.391554,42.6079],[-74.391487,42.607931],[-74.391064,42.608072],[-74.391024,42.608103],[-74.39095,42.608278],[-74.39091000000001,42.608341],[-74.390867,42.60838],[-74.390804,42.608411],[-74.390671,42.608447],[-74.390604,42.608451],[-74.390333,42.608431],[-74.390255,42.608451],[-74.39021200000001,42.608474],[-74.390196,42.608498],[-74.390196,42.608521],[-74.390275,42.608662],[-74.39030200000001,42.608745],[-74.390292,42.608774],[-74.390271,42.608796],[-74.390184,42.608827],[-74.38992500000001,42.608788],[-74.38987,42.608792],[-74.38982300000001,42.608807],[-74.389768,42.608839],[-74.38967100000001,42.608838],[-74.389571,42.608815],[-74.38948600000001,42.608796],[-74.389313,42.608692],[-74.389101,42.608476],[-74.38901799999999,42.608433],[-74.38892,42.608417],[-74.388814,42.608437],[-74.38874,42.608433],[-74.388559,42.608362],[-74.38851200000001,42.608323],[-74.388457,42.608256],[-74.38840999999999,42.608127],[-74.38840999999999,42.608064],[-74.38842200000001,42.608041],[-74.388496,42.608002],[-74.388504,42.607954],[-74.388485,42.607931],[-74.388445,42.607911],[-74.38822999999999,42.607841],[-74.387719,42.607635],[-74.38754299999999,42.607521],[-74.387488,42.607454],[-74.38743700000001,42.607341],[-74.38739,42.607266],[-74.387291,42.607298],[-74.387225,42.607294],[-74.38708699999999,42.607219],[-74.38704,42.60718],[-74.386934,42.607035],[-74.386824,42.606927],[-74.386785,42.606864],[-74.38663200000001,42.606754],[-74.386601,42.606711],[-74.38654200000001,42.60666],[-74.38636099999999,42.606602],[-74.385698,42.606292],[-74.385509,42.606239],[-74.385407,42.606227],[-74.38530900000001,42.6062],[-74.38508899999999,42.606121],[-74.384956,42.606047],[-74.38484200000001,42.605968],[-74.384512,42.60569],[-74.384446,42.605651],[-74.384351,42.605635],[-74.383916,42.605652],[-74.383708,42.605676],[-74.383613,42.605664],[-74.383551,42.605641],[-74.383264,42.605472],[-74.383174,42.605437],[-74.382938,42.605392],[-74.382895,42.605376],[-74.382805,42.605247],[-74.382766,42.605211],[-74.382734,42.6052],[-74.38258500000001,42.605247],[-74.38252199999999,42.605247],[-74.38243199999999,42.605211],[-74.382193,42.605031],[-74.38210599999999,42.604988],[-74.38200399999999,42.604956],[-74.381933,42.604953],[-74.381867,42.604964],[-74.38143100000001,42.605196],[-74.381349,42.605223],[-74.381207,42.605241],[-74.38091300000001,42.605225],[-74.38029299999999,42.605162],[-74.379834,42.605068],[-74.379519,42.604984],[-74.37925300000001,42.604866],[-74.378958,42.604686],[-74.378868,42.604615],[-74.378699,42.604442],[-74.37865600000001,42.604382],[-74.37862800000001,42.604315],[-74.377635,42.603392],[-74.37698399999999,42.602829],[-74.376846,42.602727],[-74.376603,42.602558],[-74.376085,42.602353],[-74.37594799999999,42.602282],[-74.375822,42.602192],[-74.375451,42.602103],[-74.37490699999999,42.601997],[-74.374706,42.601921],[-74.374636,42.601802],[-74.374409,42.601457],[-74.37432,42.601388],[-74.374123,42.601259],[-74.373994,42.6012],[-74.37373700000001,42.601101],[-74.373653,42.601095],[-74.37342099999999,42.601082],[-74.37325300000001,42.601032],[-74.373115,42.600894],[-74.372957,42.600707],[-74.372838,42.600608],[-74.372739,42.600499],[-74.37269000000001,42.600361],[-74.37267,42.600104],[-74.37271,42.599749],[-74.37272900000001,42.599423],[-74.37272,42.599325],[-74.372631,42.599186],[-74.372552,42.599117],[-74.372117,42.599019],[-74.371781,42.598653],[-74.371613,42.598505],[-74.370908,42.598175],[-74.37074,42.598057],[-74.370661,42.598018],[-74.37056200000001,42.597998],[-74.370345,42.597919],[-74.370285,42.597879],[-74.370216,42.59781],[-74.370028,42.597573],[-74.36987000000001,42.597484],[-74.369692,42.597425],[-74.369623,42.597415],[-74.36947499999999,42.597336],[-74.369129,42.597119],[-74.36906999999999,42.59707],[-74.36899099999999,42.596942],[-74.368922,42.596803],[-74.368793,42.596665],[-74.368438,42.596517],[-74.368174,42.59652],[-74.367845,42.596537],[-74.367795,42.596497],[-74.36765699999999,42.59631],[-74.367519,42.596201],[-74.36720200000001,42.596004],[-74.36697100000001,42.595872],[-74.366517,42.595684],[-74.366359,42.595595],[-74.366299,42.595516],[-74.36626,42.595428],[-74.36623,42.595052],[-74.366181,42.594904],[-74.366112,42.594776],[-74.36604199999999,42.594727],[-74.365944,42.594677],[-74.365785,42.594618],[-74.365667,42.594598],[-74.36547899999999,42.594598],[-74.365252,42.594638],[-74.365005,42.594628],[-74.364797,42.594658],[-74.36446100000001,42.594786],[-74.363916,42.595081],[-74.363589,42.595215],[-74.363342,42.595281],[-74.363288,42.595281],[-74.363235,42.595268],[-74.363101,42.595155],[-74.36297500000001,42.595074],[-74.362827,42.594968],[-74.362593,42.594868],[-74.362179,42.594794],[-74.36208600000001,42.594788],[-74.36201199999999,42.594761],[-74.361799,42.594721],[-74.361418,42.594728],[-74.361304,42.594754],[-74.360984,42.594754],[-74.36081,42.594728],[-74.360636,42.594668],[-74.360556,42.594661],[-74.36036900000001,42.594674],[-74.360135,42.594754],[-74.35997500000001,42.594774],[-74.35982199999999,42.594774],[-74.359621,42.594788],[-74.35889299999999,42.594808],[-74.358813,42.594828],[-74.358728,42.594881],[-74.358554,42.594961],[-74.35845999999999,42.594981],[-74.35834,42.594988],[-74.35792600000001,42.594975],[-74.35745900000001,42.595001],[-74.35727199999999,42.595048],[-74.357118,42.595068],[-74.356938,42.595061],[-74.356759,42.595023],[-74.356601,42.594964],[-74.35647,42.594901],[-74.35631600000001,42.594841],[-74.356149,42.594848],[-74.35596200000001,42.594901],[-74.355842,42.594908],[-74.355769,42.594895],[-74.355475,42.594815],[-74.355234,42.594808],[-74.355148,42.594828],[-74.355081,42.594861],[-74.354767,42.595075],[-74.354707,42.595102],[-74.354533,42.595108],[-74.35427900000001,42.595082],[-74.354106,42.594988],[-74.353887,42.594748],[-74.353827,42.594715],[-74.3537,42.594668],[-74.353633,42.594668],[-74.353559,42.594654],[-74.353506,42.594634],[-74.35344600000001,42.594594],[-74.353319,42.594574],[-74.353219,42.594588],[-74.35290500000001,42.594695],[-74.352671,42.594748],[-74.352457,42.594775],[-74.35225,42.594768],[-74.352137,42.594735],[-74.35204299999999,42.594721],[-74.35187000000001,42.594728],[-74.351642,42.594781],[-74.35154900000001,42.594781],[-74.35136199999999,42.594761],[-74.351242,42.594701],[-74.35118799999999,42.594661],[-74.351061,42.594594],[-74.350988,42.594568],[-74.350894,42.594548],[-74.350787,42.594541],[-74.350514,42.594581],[-74.350413,42.594574],[-74.35037699999999,42.594555],[-74.350273,42.594501],[-74.350213,42.594441],[-74.35015300000001,42.594348],[-74.350086,42.594134],[-74.350053,42.594094],[-74.349946,42.594007],[-74.349852,42.593954],[-74.349588,42.593856],[-74.349407,42.59377],[-74.34926,42.593689],[-74.34922,42.593649],[-74.349087,42.593282],[-74.349019,42.593236],[-74.34898,42.593216],[-74.348893,42.593196],[-74.348759,42.593136],[-74.34863900000001,42.593035],[-74.348359,42.592651],[-74.348258,42.592515],[-74.348212,42.592475],[-74.347904,42.592308],[-74.34737699999999,42.592088],[-74.34705599999999,42.591981],[-74.347003,42.591948],[-74.346949,42.591894],[-74.34635,42.591423],[-74.346165,42.59129],[-74.345724,42.591063],[-74.345304,42.590969],[-74.345197,42.590969],[-74.345023,42.590983],[-74.34493000000001,42.590976],[-74.344843,42.590956],[-74.344702,42.590903],[-74.344669,42.590863],[-74.34460900000001,42.590709],[-74.34456900000001,42.590669],[-74.34420799999999,42.590449],[-74.34403500000001,42.590382],[-74.34402799999999,42.590349],[-74.34403500000001,42.590309],[-74.34402799999999,42.590215],[-74.34392099999999,42.590122],[-74.34378700000001,42.590048],[-74.34370800000001,42.589985],[-74.343805,42.589841],[-74.34384799999999,42.589557],[-74.34384799999999,42.589382],[-74.343695,42.589097],[-74.343542,42.588944],[-74.34341000000001,42.588791],[-74.343301,42.588682],[-74.34321300000001,42.58855],[-74.342973,42.588157],[-74.342907,42.587982],[-74.342885,42.587741],[-74.342885,42.587544],[-74.34295299999999,42.587313],[-74.34305999999999,42.586866],[-74.343148,42.586647],[-74.34325699999999,42.586472],[-74.343389,42.586297],[-74.34352,42.586188],[-74.34382600000001,42.586013],[-74.344943,42.585794],[-74.346211,42.585717],[-74.347549,42.585663],[-74.347965,42.585663],[-74.348271,42.585619],[-74.348512,42.585575],[-74.348731,42.58551],[-74.34884,42.585444],[-74.349125,42.585203],[-74.34923499999999,42.585094],[-74.3493,42.584963],[-74.3493,42.584853],[-74.349322,42.5847],[-74.3493,42.584569],[-74.34921300000001,42.58446],[-74.349081,42.584372],[-74.348906,42.584285],[-74.348341,42.584037],[-74.347728,42.583644],[-74.347553,42.583447],[-74.347465,42.583294],[-74.34737800000001,42.583075],[-74.347356,42.582812],[-74.347356,42.582331],[-74.34758600000001,42.581041],[-74.34767100000001,42.580818],[-74.347792,42.580628],[-74.34787,42.580549],[-74.34797,42.580472],[-74.348101,42.580403],[-74.34824,42.580373],[-74.348662,42.580373],[-74.348862,42.580419],[-74.349852,42.580778],[-74.350246,42.580866],[-74.350509,42.580909],[-74.351012,42.580975],[-74.351231,42.580997],[-74.35145,42.580997],[-74.351625,42.580953],[-74.351822,42.580887],[-74.352749,42.580463],[-74.35340600000001,42.580108],[-74.353909,42.579828],[-74.35421599999999,42.579588],[-74.354522,42.579325],[-74.35472,42.579106],[-74.354873,42.578909],[-74.35500399999999,42.578647],[-74.355136,42.578341],[-74.35520099999999,42.578122],[-74.355311,42.577859],[-74.355464,42.577597],[-74.35579199999999,42.577116],[-74.35598899999999,42.576853],[-74.35618599999999,42.576656],[-74.356471,42.576481],[-74.35680000000001,42.576372],[-74.35713199999999,42.57633],[-74.357653,42.576263],[-74.358836,42.576263],[-74.35936100000001,42.576306],[-74.35975500000001,42.57635],[-74.361276,42.576566],[-74.361954,42.576653],[-74.362239,42.576719],[-74.363246,42.577025],[-74.363738,42.577242],[-74.36386,42.577314],[-74.364013,42.577424],[-74.364155,42.577547],[-74.364397,42.578231],[-74.36444,42.578385],[-74.364704,42.578932],[-74.36482100000001,42.579214],[-74.36508000000001,42.579626],[-74.365227,42.579829],[-74.365454,42.580058],[-74.365577,42.58016],[-74.366122,42.580545],[-74.366422,42.580721],[-74.366609,42.580812],[-74.36690299999999,42.580913],[-74.366962,42.580913],[-74.367058,42.580887],[-74.367144,42.580849],[-74.36732000000001,42.580817],[-74.367593,42.580812],[-74.36806900000001,42.580871],[-74.368533,42.580961],[-74.368731,42.581008],[-74.368985,42.581092],[-74.36922,42.581186],[-74.369418,42.581299],[-74.369747,42.581544],[-74.369973,42.581666],[-74.370114,42.581732],[-74.370406,42.581816],[-74.370688,42.581854],[-74.371272,42.581882],[-74.37159200000001,42.581873],[-74.372344,42.581816],[-74.37279599999999,42.581751],[-74.373031,42.581704],[-74.37322899999999,42.581647],[-74.37374699999999,42.581459],[-74.37417000000001,42.581233],[-74.374358,42.581158],[-74.37457499999999,42.581027],[-74.375001,42.580545],[-74.375173,42.580286],[-74.37529499999999,42.580251],[-74.375913,42.580254],[-74.37813,42.577544],[-74.378685,42.576836],[-74.375378,42.564937],[-74.37460799999999,42.562177],[-74.37406300000001,42.559538],[-74.37388199999999,42.558659],[-74.37313899999999,42.558273],[-74.37302,42.558211],[-74.371624,42.557486],[-74.37126499999999,42.557265],[-74.35121700000001,42.546841],[-74.350593,42.546516],[-74.348224,42.545281],[-74.348952,42.542995],[-74.34952199999999,42.54121],[-74.353228,42.528747],[-74.353402,42.52851],[-74.353424,42.528456],[-74.353548,42.528203],[-74.353679,42.527882],[-74.353915,42.527179],[-74.354122,42.526545],[-74.35428,42.525995],[-74.35449300000001,42.525459],[-74.354601,42.525163],[-74.35476300000001,42.524541],[-74.354912,42.523819],[-74.35494799999999,42.523606],[-74.35494,42.52353],[-74.354893,42.523432],[-74.355914,42.520482],[-74.358673,42.512099],[-74.360276,42.507225],[-74.36030100000001,42.507145],[-74.360339,42.507031],[-74.360602,42.506231],[-74.361001,42.505159],[-74.361092,42.504743],[-74.362032,42.501879],[-74.36265400000001,42.501841],[-74.363831,42.501808],[-74.367087,42.501819],[-74.368759,42.501827],[-74.37239700000001,42.501873],[-74.374075,42.501915],[-74.37810500000001,42.501994],[-74.382516,42.501955],[-74.390019,42.501914],[-74.390728,42.501881],[-74.39435899999999,42.501926],[-74.394831,42.501928],[-74.40087,42.501892],[-74.402126,42.501917],[-74.414812,42.501935],[-74.418592,42.501948],[-74.418595,42.502026],[-74.418631,42.502844],[-74.41865799999999,42.50331],[-74.41869800000001,42.504506],[-74.418662,42.504899],[-74.418584,42.505202],[-74.418437,42.505687],[-74.41802,42.506958],[-74.417783,42.507608],[-74.41751600000001,42.508322],[-74.41741500000001,42.508556],[-74.416365,42.510462],[-74.415682,42.511731],[-74.415623,42.511842],[-74.413702,42.515382],[-74.413269,42.516182],[-74.41283199999999,42.516961],[-74.41261799999999,42.51729],[-74.412508,42.517417],[-74.412435,42.517504],[-74.41222,42.517747],[-74.41162199999999,42.518254],[-74.41131,42.518566],[-74.411091,42.518809],[-74.410843,42.519149],[-74.410793,42.519247],[-74.41066499999999,42.519545],[-74.410579,42.519869],[-74.41055,42.520031],[-74.410534,42.520202],[-74.41054200000001,42.520592],[-74.41058099999999,42.520937],[-74.41094200000001,42.52233],[-74.411137,42.523106],[-74.411337,42.523875],[-74.411413,42.524162],[-74.412088,42.526821],[-74.41266,42.528922],[-74.41270299999999,42.529188],[-74.41271500000001,42.529514],[-74.41269699999999,42.529774],[-74.41263600000001,42.530106],[-74.412582,42.530312],[-74.412373,42.530883],[-74.41203400000001,42.531751],[-74.410859,42.534861],[-74.41072,42.535135],[-74.410563,42.535673],[-74.41050300000001,42.535945],[-74.410466,42.536239],[-74.41041800000001,42.536622],[-74.41040599999999,42.536862],[-74.410409,42.537102],[-74.41042,42.537342],[-74.410422,42.537352],[-74.410473,42.537814],[-74.410544,42.538144],[-74.410742,42.538927],[-74.411227,42.540676],[-74.411992,42.54336],[-74.41330000000001,42.543151],[-74.41345699999999,42.54312],[-74.41380700000001,42.54304],[-74.414033,42.542949],[-74.41422900000001,42.54285],[-74.415401,42.542099],[-74.416415,42.541413],[-74.416758,42.541219],[-74.41710999999999,42.541041],[-74.417723,42.54075],[-74.418522,42.540349],[-74.41869,42.540273],[-74.41965399999999,42.539924],[-74.41991400000001,42.539846],[-74.42010500000001,42.539816],[-74.420266,42.539806],[-74.420479,42.539827],[-74.42123100000001,42.539991],[-74.421521,42.540024],[-74.422309,42.540059],[-74.423177,42.540057],[-74.423692,42.540052],[-74.423911,42.540033],[-74.425506,42.539744],[-74.425777,42.539709],[-74.426374,42.539649],[-74.427273,42.539622],[-74.42797899999999,42.539614],[-74.42929100000001,42.539627],[-74.43000000000001,42.539637],[-74.43089000000001,42.539679],[-74.43113700000001,42.539705],[-74.431674,42.539775],[-74.433303,42.539988],[-74.434787,42.540194],[-74.43506499999999,42.540244],[-74.43528000000001,42.540298],[-74.435496,42.540367],[-74.435835,42.540494],[-74.436198,42.540642],[-74.436364,42.540727],[-74.43692900000001,42.541049],[-74.43740200000001,42.541387],[-74.43763800000001,42.541578],[-74.437941,42.541852],[-74.438722,42.542617],[-74.43889,42.542833],[-74.439149,42.543217],[-74.439425,42.543518],[-74.439498,42.543582],[-74.439612,42.543681],[-74.44121699999999,42.545116],[-74.441377,42.545287],[-74.441599,42.545571],[-74.441774,42.545829],[-74.44202300000001,42.546199],[-74.44261299999999,42.547039],[-74.443411,42.548051],[-74.44358,42.548321],[-74.443608,42.548429],[-74.443603,42.548569],[-74.44356399999999,42.54871],[-74.443173,42.549447],[-74.442847,42.550067],[-74.442684,42.550476],[-74.442595,42.550724],[-74.442477,42.550952],[-74.442155,42.55147],[-74.442038,42.551683],[-74.44196100000001,42.551856],[-74.441834,42.552215],[-74.441784,42.552436],[-74.441766,42.552627],[-74.441773,42.552854],[-74.441784,42.553204],[-74.441778,42.553296],[-74.44176899999999,42.553421],[-74.44172500000001,42.553674],[-74.441614,42.554212],[-74.44156700000001,42.55469],[-74.44152099999999,42.555504],[-74.44154,42.555619],[-74.44157199999999,42.555707],[-74.441783,42.556057],[-74.442142,42.556603],[-74.442453,42.556987],[-74.442567,42.557101],[-74.442798,42.557289],[-74.44314199999999,42.557537],[-74.44333899999999,42.557658],[-74.44379000000001,42.557896],[-74.44429599999999,42.558116],[-74.444532,42.558201],[-74.445215,42.558386],[-74.445843,42.558545],[-74.44646,42.558702],[-74.447464,42.558926],[-74.44799999999999,42.559058],[-74.448577,42.559195],[-74.448865,42.559234],[-74.44927300000001,42.55927],[-74.44994,42.559329],[-74.45107899999999,42.559483],[-74.452474,42.559707],[-74.45287500000001,42.559794],[-74.45310499999999,42.559865],[-74.453237,42.559905],[-74.453811,42.560156],[-74.45408399999999,42.560315],[-74.45424,42.560446],[-74.45433199999999,42.560534],[-74.45474,42.560987],[-74.454926,42.561193],[-74.45514,42.561389],[-74.45547000000001,42.5616],[-74.45594800000001,42.561887],[-74.456169,42.562037],[-74.45695600000001,42.562671],[-74.457329,42.562915],[-74.457707,42.563116],[-74.458106,42.56328],[-74.458223,42.56332],[-74.45852499999999,42.56339],[-74.45891399999999,42.563442],[-74.45969100000001,42.563499],[-74.46028699999999,42.563606],[-74.46169500000001,42.563915],[-74.462231,42.564012],[-74.463274,42.564175],[-74.46338299999999,42.564213],[-74.463531,42.564294],[-74.463633,42.564372],[-74.463683,42.56442],[-74.463892,42.564345],[-74.465079,42.563854],[-74.467012,42.563019],[-74.46825,42.562502],[-74.46874800000001,42.562348],[-74.469007,42.562286],[-74.470411,42.561996],[-74.47065499999999,42.561929],[-74.471014,42.561807],[-74.471356,42.561622],[-74.47192699999999,42.561313],[-74.472213,42.561201],[-74.472863,42.56106],[-74.47499999999999,42.560738],[-74.47543899999999,42.560716],[-74.475971,42.560728],[-74.477372,42.560789],[-74.47805099999999,42.560783],[-74.478762,42.560752],[-74.47930100000001,42.560695],[-74.479477,42.560676],[-74.480165,42.56057],[-74.481134,42.560403],[-74.481745,42.560298],[-74.482303,42.560181],[-74.482821,42.560027],[-74.48293,42.559995],[-74.483633,42.559745],[-74.484719,42.559376],[-74.485545,42.559185],[-74.48565600000001,42.559163],[-74.486276,42.559046],[-74.48675799999999,42.558975],[-74.48724,42.558939],[-74.487816,42.558935],[-74.489858,42.55899],[-74.49038299999999,42.559023],[-74.49074,42.559064],[-74.490904,42.559092],[-74.491765,42.559267],[-74.492222,42.559387],[-74.492687,42.55954],[-74.49413300000001,42.56019],[-74.496313,42.561071],[-74.49741899999999,42.561498],[-74.498143,42.561776],[-74.498254,42.561812],[-74.498616,42.561926],[-74.499211,42.562063],[-74.50000799999999,42.562201],[-74.500638,42.562285],[-74.50143799999999,42.562362],[-74.502588,42.562493],[-74.502836,42.562533],[-74.50331,42.56265],[-74.50358799999999,42.56273],[-74.505663,42.563444],[-74.506274,42.563685],[-74.50751,42.564215],[-74.508443,42.564657],[-74.508764,42.564831],[-74.509112,42.565059],[-74.510147,42.565833],[-74.510237,42.565896],[-74.510694,42.566215],[-74.51160299999999,42.566776],[-74.512338,42.567193],[-74.512863,42.567503],[-74.513282,42.567802],[-74.51340500000001,42.567914],[-74.51364700000001,42.568149],[-74.51389399999999,42.568487],[-74.51409099999999,42.56885],[-74.51420899999999,42.569091],[-74.514343,42.56932],[-74.514505,42.569513],[-74.514674,42.569661],[-74.51499800000001,42.569869],[-74.51530700000001,42.570029],[-74.51617,42.570424],[-74.516434,42.570515],[-74.516739,42.570587],[-74.517088,42.570644],[-74.51743,42.570675],[-74.51812700000001,42.570761],[-74.518711,42.570871],[-74.520009,42.571183],[-74.520962,42.571413],[-74.52237,42.57169],[-74.523579,42.571901],[-74.52396,42.571954],[-74.525504,42.572065],[-74.526678,42.572114],[-74.52725599999999,42.572119],[-74.529241,42.572154],[-74.52946900000001,42.572167],[-74.529701,42.572195],[-74.529988,42.572248],[-74.530388,42.572343],[-74.531132,42.572554],[-74.531689,42.572645],[-74.53302600000001,42.572787],[-74.53411800000001,42.572922],[-74.534508,42.572989],[-74.534609,42.573007],[-74.53504,42.573094],[-74.535115,42.573109],[-74.539281,42.573978],[-74.540092,42.574118],[-74.540391,42.574158],[-74.541078,42.574225],[-74.541555,42.574251],[-74.542294,42.574306],[-74.542683,42.574349],[-74.542875,42.574366],[-74.54450799999999,42.574589],[-74.545,42.574665],[-74.54611,42.574799],[-74.54641599999999,42.574827],[-74.54680399999999,42.574848],[-74.54776200000001,42.574925],[-74.549166,42.575024],[-74.549815,42.575045],[-74.55001799999999,42.575043]]],"type":"Polygon"}
}