{
  "id": "361190106001",
  "type": "Feature",
  "properties": {
    "area_land":1000338,
    "area_water":0,
    "geoid":"361190106001",
    "name":"Block Group 1",
    "state":"ny"
},
  "bbox": [
    -73.844394,
    41.013896,
    -73.823639,
    41.023878
],
  "geometry": {"coordinates":[[[-73.84423099999999,41.017889],[-73.844099,41.018113],[-73.84405,41.018226],[-73.844021,41.018295],[-73.843959,41.018506],[-73.843896,41.018765],[-73.843842,41.019135],[-73.84382600000001,41.019634],[-73.843951,41.020228],[-73.844083,41.021602],[-73.84406799999999,41.021749],[-73.84400599999999,41.022037],[-73.84374200000001,41.023041],[-73.843633,41.023506],[-73.843514,41.023878],[-73.84204,41.023491],[-73.839859,41.02292],[-73.834895,41.021866],[-73.834844,41.022016],[-73.833617,41.022152],[-73.83325000000001,41.022278],[-73.83278900000001,41.022436],[-73.83241200000001,41.022573],[-73.831998,41.022722],[-73.831968,41.022722],[-73.83170200000001,41.022785],[-73.830761,41.020954],[-73.83047999999999,41.020901],[-73.82907299999999,41.020875],[-73.824516,41.01981],[-73.823639,41.019605],[-73.823725,41.019525],[-73.82392900000001,41.019254],[-73.824062,41.019015],[-73.82419299999999,41.018814],[-73.82431099999999,41.01869],[-73.824484,41.018565],[-73.824699,41.018344],[-73.824862,41.0181],[-73.82495299999999,41.017963],[-73.825187,41.017634],[-73.825238,41.017524],[-73.82528499999999,41.017382],[-73.82560700000001,41.01743],[-73.82594,41.017493],[-73.826497,41.017567],[-73.826988,41.01762],[-73.82722,41.01763],[-73.82740699999999,41.017615],[-73.828401,41.017401],[-73.82860700000001,41.017373],[-73.829671,41.017265],[-73.830366,41.017226],[-73.831261,41.017278],[-73.83172500000001,41.017332],[-73.832221,41.017374],[-73.832644,41.017384],[-73.833668,41.017356],[-73.834018,41.017358],[-73.834487,41.017361],[-73.834965,41.017325],[-73.835134,41.017311],[-73.83586,41.017197],[-73.83710000000001,41.017007],[-73.8372,41.016992],[-73.837304,41.016983],[-73.83781,41.01695],[-73.83798,41.016955],[-73.838424,41.016982],[-73.83842300000001,41.016831],[-73.838399,41.016531],[-73.83837699999999,41.015977],[-73.838342,41.015553],[-73.838323,41.015159],[-73.83829299999999,41.014913],[-73.83823099999999,41.014746],[-73.838371,41.014664],[-73.838568,41.014566],[-73.83881,41.014531],[-73.839125,41.014501],[-73.839214,41.014472],[-73.839258,41.014428],[-73.83927799999999,41.014408],[-73.83936,41.014361],[-73.839557,41.014312],[-73.84013400000001,41.014267],[-73.840684,41.01425],[-73.841633,41.014308],[-73.84204800000001,41.014297],[-73.84236799999999,41.014258],[-73.84350499999999,41.013896],[-73.843593,41.01427],[-73.843622,41.014556],[-73.843637,41.014916],[-73.843701,41.015762],[-73.8438,41.01576],[-73.843977,41.015735],[-73.844036,41.015712],[-73.844067,41.015776],[-73.844077,41.01583],[-73.84401800000001,41.016126],[-73.84402799999999,41.016239],[-73.84413600000001,41.01679],[-73.844132,41.016973],[-73.844058,41.017298],[-73.844055,41.017379],[-73.844072,41.017464],[-73.844075,41.017478],[-73.844149,41.017537],[-73.84439399999999,41.017688],[-73.84423099999999,41.017889]]],"type":"Polygon"}
}