{
  "id": "360290157001",
  "type": "Feature",
  "properties": {
    "area_land":60732903,
    "area_water":447040,
    "geoid":"360290157001",
    "name":"Block Group 1",
    "state":"ny"
},
  "bbox": [
    -78.872745,
    42.532224,
    -78.783366,
    42.609528
],
  "geometry": {"coordinates":[[[-78.872277,42.53304],[-78.87217699999999,42.533214],[-78.872167,42.533231],[-78.87207600000001,42.533426],[-78.87200300000001,42.533627],[-78.871949,42.53383],[-78.871914,42.534036],[-78.8719,42.538547],[-78.871897,42.53921],[-78.871883,42.542738],[-78.87181699999999,42.547038],[-78.87172099999999,42.553246],[-78.87171499999999,42.553609],[-78.87164,42.565481],[-78.871595,42.571013],[-78.87155,42.576707],[-78.871543,42.579708],[-78.871503,42.587381],[-78.87150200000001,42.587425],[-78.871405,42.59343],[-78.87132699999999,42.598736],[-78.8712,42.6072],[-78.871213,42.607551],[-78.87121399999999,42.60775],[-78.87134399999999,42.608263],[-78.871561,42.608774],[-78.871582,42.608806],[-78.87163700000001,42.608855],[-78.871652,42.608881],[-78.861812,42.608985],[-78.856849,42.609014],[-78.84745599999999,42.609056],[-78.846149,42.609069],[-78.84025800000001,42.609128],[-78.837407,42.609153],[-78.834513,42.609186],[-78.828107,42.609254],[-78.826875,42.609256],[-78.82058499999999,42.609346],[-78.820286,42.60935],[-78.819986,42.609353],[-78.81692700000001,42.609381],[-78.81290199999999,42.609402],[-78.812183,42.609413],[-78.806462,42.609441],[-78.80074,42.609468],[-78.80042400000001,42.60951],[-78.800196,42.609527],[-78.79856599999999,42.609528],[-78.788873,42.609519],[-78.788027,42.609518],[-78.784385,42.609515],[-78.78427600000001,42.605444],[-78.78421,42.602876],[-78.78412,42.599142],[-78.783991,42.593551],[-78.783894,42.589972],[-78.78384,42.588333],[-78.78384200000001,42.586421],[-78.783784,42.584161],[-78.783615,42.57691],[-78.783559,42.575043],[-78.783366,42.568424],[-78.783388,42.565756],[-78.783389,42.564643],[-78.783395,42.562459],[-78.78342000000001,42.554878],[-78.783509,42.537508],[-78.7835,42.533548],[-78.797439,42.533568],[-78.800963,42.533586],[-78.804767,42.533608],[-78.807956,42.533631],[-78.81189000000001,42.533658],[-78.814396,42.533675],[-78.81617,42.533683],[-78.819507,42.533701],[-78.821743,42.53372],[-78.822845,42.533729],[-78.82425000000001,42.533743],[-78.824409,42.533728],[-78.824562,42.533693],[-78.82467699999999,42.533651],[-78.82478399999999,42.533598],[-78.824986,42.533463],[-78.826319,42.53265],[-78.826427,42.532599],[-78.82656900000001,42.532549],[-78.82674799999999,42.532508],[-78.826778,42.532504],[-78.826885,42.53249],[-78.82705199999999,42.532483],[-78.82740800000001,42.532483],[-78.827905,42.532479],[-78.83040699999999,42.532464],[-78.832909,42.53244],[-78.84076899999999,42.532354],[-78.841015,42.532351],[-78.844239,42.532319],[-78.844696,42.532314],[-78.849311,42.532275],[-78.85138600000001,42.53226],[-78.853926,42.532241],[-78.855934,42.532229],[-78.856099,42.532224],[-78.861689,42.53241],[-78.87274499999999,42.532339],[-78.872277,42.53304]]],"type":"Polygon"}
}