{
  "id": "360050421002",
  "type": "Feature",
  "properties": {
    "area_land":26107,
    "area_water":0,
    "geoid":"360050421002",
    "name":"Block Group 2",
    "state":"ny"
},
  "bbox": [
    -73.884286,
    40.880466,
    -73.881244,
    40.883133
],
  "geometry": {"coordinates":[[[-73.884286,40.881255],[-73.882087,40.883133],[-73.881244,40.88271],[-73.883464,40.880783],[-73.88383,40.880466],[-73.884286,40.881255]]],"type":"Polygon"}
}