{
  "id": "360470569001",
  "type": "Feature",
  "properties": {
    "area_land":47151,
    "area_water":0,
    "geoid":"360470569001",
    "name":"Block Group 1",
    "state":"ny"
},
  "bbox": [
    -73.951736,
    40.721705,
    -73.949078,
    40.725721
],
  "geometry": {"coordinates":[[[-73.951736,40.725436],[-73.950875,40.725721],[-73.949924,40.724056],[-73.949078,40.72254],[-73.949866,40.722179],[-73.95064600000001,40.721705],[-73.951646,40.723486],[-73.950788,40.723772],[-73.95097800000001,40.724097],[-73.951736,40.725436]]],"type":"Polygon"}
}