{
  "id": "360594052001",
  "type": "Feature",
  "properties": {
    "area_land":257488,
    "area_water":0,
    "geoid":"360594052001",
    "name":"Block Group 1",
    "state":"ny"
},
  "bbox": [
    -73.692976,
    40.700653,
    -73.688525,
    40.70834
],
  "geometry": {"coordinates":[[[-73.692859,40.702917],[-73.692742,40.703592],[-73.692735,40.703626],[-73.692622,40.704277],[-73.692503,40.70496],[-73.692385,40.705636],[-73.692267,40.706319],[-73.69212899999999,40.707101],[-73.692004,40.70781],[-73.691462,40.707929],[-73.690732,40.708103],[-73.69047999999999,40.708128],[-73.690395,40.708137],[-73.69007000000001,40.708184],[-73.689016,40.708299],[-73.688901,40.708322],[-73.688682,40.70834],[-73.688677,40.707416],[-73.688683,40.706849],[-73.688693,40.706297],[-73.6887,40.705723],[-73.68870699999999,40.705156],[-73.688715,40.704607],[-73.68871300000001,40.704258],[-73.68872399999999,40.704047],[-73.688731,40.703471],[-73.688739,40.702912],[-73.68874,40.702416],[-73.68875,40.70234],[-73.688749,40.702198],[-73.68874599999999,40.701969],[-73.68865099999999,40.70179],[-73.688525,40.701543],[-73.68852800000001,40.701466],[-73.688576,40.701208],[-73.688671,40.700653],[-73.69004700000001,40.700702],[-73.690691,40.700714],[-73.69067800000001,40.700953],[-73.69143200000001,40.701028],[-73.691666,40.701046],[-73.692559,40.701143],[-73.69237699999999,40.702175],[-73.692976,40.702237],[-73.692859,40.702917]]],"type":"Polygon"}
}