{
  "id": "360550113012",
  "type": "Feature",
  "properties": {
    "area_land":4836463,
    "area_water":228441,
    "geoid":"360550113012",
    "name":"Block Group 2",
    "state":"ny"
},
  "bbox": [
    -77.451662,
    43.232361,
    -77.41847,
    43.267744
],
  "geometry": {"coordinates":[[[-77.451662,43.261894],[-77.445427,43.263369],[-77.437968,43.265832],[-77.43454,43.267744],[-77.433746,43.266893],[-77.43281500000001,43.266439],[-77.432777,43.266328],[-77.432757,43.266315],[-77.432378,43.266289],[-77.431892,43.266441],[-77.431805,43.266485],[-77.43139600000001,43.266689],[-77.43125000000001,43.266747],[-77.431133,43.266794],[-77.431028,43.266876],[-77.430983,43.266986],[-77.430983,43.267145],[-77.430938,43.267233],[-77.43090100000001,43.267271],[-77.43089999999999,43.267289],[-77.430826,43.267353],[-77.43076600000001,43.267397],[-77.43067499999999,43.267414],[-77.430555,43.267414],[-77.430531,43.267407],[-77.43033800000001,43.267386],[-77.430142,43.267359],[-77.42994,43.267304],[-77.429827,43.267265],[-77.42975199999999,43.267222],[-77.429602,43.267084],[-77.42952699999999,43.267041],[-77.429467,43.267019],[-77.429339,43.267002],[-77.429016,43.267002],[-77.428828,43.26698],[-77.42876099999999,43.266964],[-77.428513,43.266936],[-77.42819799999999,43.266936],[-77.42806299999999,43.266953],[-77.42795,43.266997],[-77.42786,43.26704],[-77.427747,43.267134],[-77.427744,43.267152],[-77.42771,43.267178],[-77.42771,43.2672],[-77.427672,43.267227],[-77.42767000000001,43.267245],[-77.42759700000001,43.267309],[-77.427537,43.267353],[-77.427424,43.267386],[-77.42725900000001,43.267424],[-77.427162,43.267435],[-77.427138,43.267442],[-77.426523,43.267523],[-77.426503,43.267534],[-77.426373,43.267551],[-77.42601999999999,43.267567],[-77.425758,43.26755],[-77.425738,43.267539],[-77.425532,43.26749],[-77.425442,43.267463],[-77.42538999999999,43.267457],[-77.42536699999999,43.267435],[-77.425342,43.267434],[-77.42527699999999,43.267408],[-77.42524,43.267402],[-77.425217,43.26738],[-77.425157,43.267364],[-77.425044,43.267298],[-77.424857,43.267161],[-77.424744,43.267062],[-77.424744,43.26704],[-77.424707,43.267013],[-77.424706,43.266985],[-77.424684,43.266969],[-77.42466899999999,43.26693],[-77.424646,43.266914],[-77.424504,43.266777],[-77.42444399999999,43.266749],[-77.424346,43.266733],[-77.424199,43.266729],[-77.423866,43.266749],[-77.42359500000001,43.266782],[-77.423565,43.266804],[-77.42350500000001,43.26681],[-77.42314500000001,43.26681],[-77.42292,43.266793],[-77.422901,43.266781],[-77.422529,43.266705],[-77.42224400000001,43.266617],[-77.422079,43.266579],[-77.42192900000001,43.266584],[-77.421909,43.266596],[-77.421778,43.266634],[-77.421756,43.26665],[-77.421538,43.266705],[-77.421385,43.266722],[-77.42129,43.266738],[-77.421065,43.26676],[-77.420637,43.266776],[-77.420427,43.266738],[-77.420239,43.266661],[-77.420202,43.266656],[-77.42017199999999,43.266634],[-77.420112,43.266617],[-77.42005899999999,43.26659],[-77.420034,43.266589],[-77.419961,43.266551],[-77.41979600000001,43.266496],[-77.41975100000001,43.266469],[-77.41969899999999,43.266452],[-77.419601,43.266409],[-77.419571,43.266409],[-77.41945800000001,43.266348],[-77.41909099999999,43.266101],[-77.418865,43.265959],[-77.418807,43.265929],[-77.41847,43.265692],[-77.41864200000001,43.265636],[-77.418932,43.265547],[-77.41916000000001,43.265485],[-77.419426,43.265425],[-77.41970600000001,43.265376],[-77.420119,43.265315],[-77.41999800000001,43.261487],[-77.41998700000001,43.261131],[-77.419962,43.260025],[-77.419923,43.258256],[-77.419848,43.25482],[-77.419776,43.251773],[-77.41975100000001,43.251079],[-77.419732,43.250063],[-77.419726,43.249756],[-77.419721,43.249448],[-77.419697,43.248206],[-77.419526,43.240525],[-77.41950199999999,43.239215],[-77.419481,43.238057],[-77.419448,43.236866],[-77.419437,43.236488],[-77.41935700000001,43.232487],[-77.422213,43.23245],[-77.426149,43.232399],[-77.428549,43.232361],[-77.428561,43.233719],[-77.42857100000001,43.234032],[-77.42858099999999,43.235195],[-77.42861000000001,43.237496],[-77.428651,43.240423],[-77.428673,43.241847],[-77.42871,43.243775],[-77.42871100000001,43.243969],[-77.42871700000001,43.244909],[-77.42872199999999,43.245814],[-77.428764,43.247825],[-77.42877,43.248635],[-77.428786,43.250489],[-77.428803,43.252263],[-77.432125,43.252195],[-77.433897,43.25216],[-77.43413700000001,43.252168],[-77.43440699999999,43.252189],[-77.43464899999999,43.252229],[-77.434878,43.252284],[-77.435086,43.252349],[-77.435366,43.252471],[-77.436587,43.253044],[-77.43819000000001,43.25378],[-77.43851600000001,43.253893],[-77.438737,43.253927],[-77.43908399999999,43.253883],[-77.439663,43.253684],[-77.441047,43.253208],[-77.441343,43.253103],[-77.441821,43.252985],[-77.44201200000001,43.252959],[-77.442238,43.252918],[-77.442539,43.252854],[-77.44292299999999,43.252661],[-77.443122,43.252553],[-77.443218,43.252485],[-77.443293,43.252405],[-77.443324,43.252333],[-77.44333399999999,43.252233],[-77.443338,43.252028],[-77.44327699999999,43.251302],[-77.443901,43.250886],[-77.445549,43.250806],[-77.44678500000001,43.250751],[-77.446764,43.25456],[-77.446741,43.256812],[-77.446738,43.257524],[-77.446735,43.257709],[-77.446724,43.258288],[-77.44670600000001,43.259272],[-77.446701,43.260337],[-77.449335,43.259913],[-77.45070699999999,43.259696],[-77.45090999999999,43.259665],[-77.450923,43.259721],[-77.450889,43.259808],[-77.450935,43.260068],[-77.451071,43.260447],[-77.45126500000001,43.260694],[-77.451662,43.261894]]],"type":"Polygon"}
}