{
  "id": "360630217005",
  "type": "Feature",
  "properties": {
    "area_land":3420221,
    "area_water":3116466,
    "geoid":"360630217005",
    "name":"Block Group 5",
    "state":"ny"
},
  "bbox": [
    -79.043774,
    43.067958,
    -78.990521,
    43.093366
],
  "geometry": {"coordinates":[[[-79.043774,43.088598],[-79.04355099999999,43.088599],[-79.042885,43.088602],[-79.042663,43.088604],[-79.042401,43.088603],[-79.041617,43.088603],[-79.04135599999999,43.088603],[-79.04109200000001,43.0886],[-79.040685,43.088597],[-79.040301,43.088594],[-79.040038,43.088592],[-79.039815,43.088589],[-79.039491,43.088585],[-79.039147,43.08858],[-79.03892500000001,43.088577],[-79.038923,43.088424],[-79.038918,43.087968],[-79.038917,43.087816],[-79.03891400000001,43.087631],[-79.03891,43.087364],[-79.038905,43.087077],[-79.038903,43.086893],[-79.038901,43.086725],[-79.038898,43.086473],[-79.038895,43.086222],[-79.038893,43.086055],[-79.03888999999999,43.085871],[-79.038887,43.08557],[-79.038882,43.085318],[-79.03888000000001,43.085135],[-79.036779,43.085083],[-79.03588499999999,43.085064],[-79.03586799999999,43.085063],[-79.035819,43.085062],[-79.035803,43.085062],[-79.035802,43.084917],[-79.035799,43.084485],[-79.035798,43.084341],[-79.035258,43.084322],[-79.03478699999999,43.084306],[-79.03364500000001,43.084286],[-79.033102,43.084277],[-79.033101,43.084056],[-79.03309900000001,43.083396],[-79.03309900000001,43.083315],[-79.033091,43.083176],[-79.03234399999999,43.083194],[-79.03223300000001,43.083192],[-79.031582,43.083185],[-79.030016,43.083077],[-79.02966600000001,43.083051],[-79.028812,43.08299],[-79.02825199999999,43.082943],[-79.02752700000001,43.082884],[-79.026571,43.082817],[-79.026011,43.082779],[-79.025899,43.08277],[-79.02556300000001,43.082745],[-79.025451,43.082737],[-79.02543300000001,43.082895],[-79.025385,43.082996],[-79.025246,43.083127],[-79.024884,43.083347],[-79.02474599999999,43.083482],[-79.023737,43.084736],[-79.023278,43.085171],[-79.02316500000001,43.085298],[-79.023078,43.085437],[-79.02290000000001,43.085766],[-79.022828,43.08587],[-79.02276500000001,43.085921],[-79.022611,43.08602],[-79.022476,43.086141],[-79.02237700000001,43.086269],[-79.022347,43.086328],[-79.022307,43.086404],[-79.022245,43.086593],[-79.022199,43.08684],[-79.022156,43.086967],[-79.02209499999999,43.087139],[-79.02201100000001,43.087273],[-79.021861,43.087434],[-79.02181899999999,43.087483],[-79.021754,43.087568],[-79.02164399999999,43.087847],[-79.021632,43.087911],[-79.021619,43.08799],[-79.021604,43.088185],[-79.02152599999999,43.088182],[-79.021292,43.088176],[-79.021214,43.088174],[-79.021064,43.087838],[-79.020776,43.087201],[-79.02069,43.087014],[-79.02064900000001,43.086925],[-79.02030600000001,43.086926],[-79.019886,43.086928],[-79.019278,43.08693],[-79.018936,43.086932],[-79.01871300000001,43.086934],[-79.018376,43.086938],[-79.018044,43.08694],[-79.017822,43.086943],[-79.017715,43.086942],[-79.01739600000001,43.086942],[-79.01729,43.086942],[-79.01559399999999,43.086946],[-79.013088,43.086954],[-79.01249300000001,43.086954],[-79.010507,43.086965],[-79.00881200000001,43.086975],[-79.008809,43.088253],[-79.008809,43.088806],[-79.008788,43.092087],[-79.008781,43.093366],[-79.007468,43.09298],[-79.00560299999999,43.092433],[-79.003525,43.09184],[-79.00281,43.091637],[-79.002212,43.091459],[-79.00227,43.09127],[-79.002447,43.090707],[-79.002506,43.090519],[-79.00256299999999,43.090342],[-79.002621,43.090168],[-79.002736,43.089812],[-79.00279399999999,43.089636],[-79.002943,43.089163],[-79.003056,43.088805],[-79.003073,43.088743],[-79.003343,43.087811],[-79.00387600000001,43.086056],[-79.00389699999999,43.08599],[-79.004141,43.08516],[-79.004358,43.084422],[-79.004768,43.083032],[-79.00501800000001,43.082211],[-79.00508499999999,43.081993],[-79.00518,43.081646],[-79.005201,43.081575],[-79.00524,43.081475],[-79.005363,43.08108],[-79.00543,43.080855],[-79.00561999999999,43.080231],[-79.00570500000001,43.080015],[-79.005942,43.079661],[-79.006068,43.079506],[-79.006207,43.079359],[-79.006387,43.079214],[-79.006503,43.079122],[-79.00691999999999,43.078847],[-79.00626800000001,43.078664],[-79.00588500000001,43.078557],[-79.005512,43.078465],[-79.00454999999999,43.078284],[-79.004288,43.078232],[-79.003625,43.078103],[-79.00292399999999,43.077976],[-79.002911,43.077974],[-79.002408,43.077883],[-79.002208,43.077845],[-79.000826,43.077581],[-79.000128,43.077448],[-79.00000300000001,43.077435],[-78.999894,43.077415],[-78.999199,43.077291],[-78.998968,43.07725],[-78.99873599999999,43.077205],[-78.99804,43.077072],[-78.997809,43.077028],[-78.997557,43.076986],[-78.997085,43.076907],[-78.996803,43.076861],[-78.996769,43.076856],[-78.99655300000001,43.076814],[-78.996286,43.076764],[-78.995486,43.076614],[-78.99522,43.076564],[-78.99494199999999,43.07651],[-78.994111,43.076351],[-78.99383400000001,43.076298],[-78.99370999999999,43.076273],[-78.99333900000001,43.076199],[-78.993216,43.076175],[-78.99316399999999,43.076164],[-78.993009,43.076132],[-78.992958,43.076122],[-78.992823,43.076099],[-78.992732,43.076083],[-78.992171,43.075984],[-78.992057,43.075962],[-78.991833,43.075921],[-78.99173399999999,43.075903],[-78.991437,43.07585],[-78.991338,43.075833],[-78.99119399999999,43.075804],[-78.990923,43.07575],[-78.990779,43.075721],[-78.990763,43.075718],[-78.990619,43.075696],[-78.990616,43.075606],[-78.990619,43.075523],[-78.990619,43.07543],[-78.990617,43.075045],[-78.990617,43.074576],[-78.990616,43.074322],[-78.990616,43.074224],[-78.99059699999999,43.074049],[-78.990587,43.073868],[-78.990577,43.073688],[-78.990521,43.068759],[-78.99060900000001,43.068765],[-78.99084499999999,43.06878],[-78.990915,43.068785],[-78.998538,43.069282],[-78.999664,43.069355],[-78.999768,43.069356],[-78.99987299999999,43.069356],[-79.00173700000001,43.069401],[-79.003602,43.069439],[-79.005516,43.069476],[-79.007431,43.069513],[-79.009664,43.069558],[-79.01632600000001,43.068445],[-79.019228,43.067958],[-79.02075499999999,43.068199],[-79.025336,43.068922],[-79.02686300000001,43.069164],[-79.028654,43.069483],[-79.032771,43.070216],[-79.039765,43.071462],[-79.04004500000001,43.077903],[-79.04002300000001,43.078203],[-79.04003299999999,43.07834],[-79.040048,43.078535],[-79.04012299999999,43.079535],[-79.040149,43.079868],[-79.04019599999999,43.080473],[-79.04025,43.081159],[-79.040319,43.082292],[-79.04035,43.082792],[-79.040367,43.082831],[-79.040379,43.082894],[-79.04042800000001,43.083029],[-79.040434,43.083101],[-79.040403,43.083383],[-79.04034299999999,43.083835],[-79.04033099999999,43.083935],[-79.0403,43.084228],[-79.04030400000001,43.084293],[-79.040323,43.084358],[-79.040651,43.084792],[-79.040891,43.08511],[-79.04096800000001,43.085187],[-79.04116500000001,43.085324],[-79.041195,43.085345],[-79.041303,43.085433],[-79.04147,43.08562],[-79.04164900000001,43.085856],[-79.04179499999999,43.086048],[-79.041927,43.086219],[-79.042326,43.086734],[-79.04245899999999,43.086906],[-79.04258,43.087062],[-79.04294400000001,43.08753],[-79.043066,43.087687],[-79.043085,43.087712],[-79.043144,43.087787],[-79.043164,43.087813],[-79.04328599999999,43.08797],[-79.04365199999999,43.08844],[-79.043774,43.088598]]],"type":"Polygon"}
}