{
  "id": "360470441002",
  "type": "Feature",
  "properties": {
    "area_land":46187,
    "area_water":0,
    "geoid":"360470441002",
    "name":"Block Group 2",
    "state":"ny"
},
  "bbox": [
    -73.917068,
    40.699693,
    -73.913644,
    40.703239
],
  "geometry": {"coordinates":[[[-73.917068,40.700548],[-73.9156,40.702046],[-73.91438599999999,40.703239],[-73.91364400000001,40.702799],[-73.91485,40.701617],[-73.91408800000001,40.701198],[-73.915565,40.699693],[-73.91631599999999,40.700122],[-73.917068,40.700548]]],"type":"Polygon"}
}