{
  "id": "360870114031",
  "type": "Feature",
  "properties": {
    "area_land":1047642,
    "area_water":0,
    "geoid":"360870114031",
    "name":"Block Group 1",
    "state":"ny"
},
  "bbox": [
    -74.002188,
    41.129875,
    -73.977218,
    41.136551
],
  "geometry": {"coordinates":[[[-74.002174,41.133316],[-74.00215300000001,41.133424],[-74.00208000000001,41.133601],[-74.001701,41.134276],[-74.001167,41.135182],[-74.00067300000001,41.136068],[-74.000463,41.136443],[-74.000412,41.136551],[-74.00000300000001,41.13653],[-73.999758,41.13653],[-73.99938899999999,41.136508],[-73.999075,41.136503],[-73.998454,41.136473],[-73.99773500000001,41.13645],[-73.99679999999999,41.136426],[-73.996555,41.136413],[-73.995508,41.136357],[-73.99498199999999,41.136331],[-73.994225,41.136285],[-73.99310699999999,41.136227],[-73.99252799999999,41.136207],[-73.990917,41.136139],[-73.990961,41.135624],[-73.99045599999999,41.135584],[-73.990189,41.135547],[-73.990008,41.135521],[-73.98980899999999,41.135488],[-73.989395,41.135419],[-73.989046,41.135375],[-73.98844,41.135374],[-73.986828,41.135393],[-73.98576,41.135409],[-73.985196,41.135417],[-73.98372500000001,41.13543],[-73.983087,41.135429],[-73.982148,41.135435],[-73.98166399999999,41.135432],[-73.98123099999999,41.135407],[-73.980772,41.13536],[-73.97892299999999,41.135092],[-73.978455,41.135022],[-73.97789400000001,41.134956],[-73.977751,41.134947],[-73.97721799999999,41.134914],[-73.97727,41.134447],[-73.977345,41.133967],[-73.97735900000001,41.133503],[-73.977345,41.133383],[-73.977255,41.133096],[-73.977234,41.132944],[-73.97724599999999,41.13284],[-73.97726299999999,41.132796],[-73.97748199999999,41.132419],[-73.97750000000001,41.132286],[-73.977356,41.131271],[-73.977774,41.131232],[-73.97852,41.131161],[-73.978555,41.131428],[-73.97859,41.1315],[-73.978731,41.131623],[-73.978872,41.131763],[-73.978908,41.131821],[-73.978926,41.132062],[-73.978953,41.132268],[-73.979361,41.13228],[-73.979675,41.132317],[-73.98032499999999,41.132363],[-73.98039900000001,41.132375],[-73.980588,41.132451],[-73.98078,41.13255],[-73.98129900000001,41.132847],[-73.981455,41.132896],[-73.981686,41.132932],[-73.982007,41.132957],[-73.98214,41.13299],[-73.98239100000001,41.133101],[-73.98316,41.133496],[-73.983273,41.133349],[-73.983352,41.133166],[-73.983401,41.132976],[-73.983689,41.132948],[-73.984509,41.132897],[-73.984431,41.132703],[-73.984416,41.132516],[-73.984433,41.132422],[-73.984488,41.132363],[-73.984759,41.132179],[-73.98483299999999,41.1321],[-73.98486699999999,41.131995],[-73.98499200000001,41.131431],[-73.985043,41.131145],[-73.986327,41.131302],[-73.98640399999999,41.130905],[-73.986559,41.129926],[-73.988041,41.129941],[-73.988292,41.129941],[-73.988764,41.129923],[-73.98906599999999,41.129883],[-73.98929200000001,41.129875],[-73.98945999999999,41.129875],[-73.99043500000001,41.129909],[-73.991535,41.129959],[-73.991479,41.130514],[-73.991432,41.131033],[-73.992307,41.131058],[-73.994041,41.131109],[-73.994761,41.131132],[-73.99520200000001,41.131156],[-73.995817,41.13119],[-73.997773,41.131271],[-73.99797700000001,41.130277],[-73.998079,41.130328],[-73.998169,41.130352],[-73.9984,41.130382],[-73.998609,41.130385],[-73.998931,41.130375],[-73.999168,41.130357],[-73.999582,41.130292],[-73.999972,41.130265],[-74.000209,41.13027],[-74.00046500000001,41.13029],[-74.00111099999999,41.130368],[-74.001795,41.130456],[-74.00197300000001,41.130469],[-74.001925,41.130696],[-74.00189899999999,41.13091],[-74.001893,41.131081],[-74.001903,41.131533],[-74.001931,41.131821],[-74.001975,41.13209],[-74.00217000000001,41.132987],[-74.002188,41.133154],[-74.002174,41.133316]]],"type":"Polygon"}
}