{
  "id": "360470594024",
  "type": "Feature",
  "properties": {
    "area_land":85904,
    "area_water":0,
    "geoid":"360470594024",
    "name":"Block Group 4",
    "state":"ny"
},
  "bbox": [
    -73.94623,
    40.595398,
    -73.942032,
    40.598201
],
  "geometry": {"coordinates":[[[-73.94623,40.597789],[-73.94526500000001,40.597894],[-73.944339,40.597995],[-73.943411,40.598098],[-73.94248399999999,40.598201],[-73.942032,40.595809],[-73.942959,40.595707],[-73.943884,40.595605],[-73.944813,40.595503],[-73.945775,40.595398],[-73.94623,40.597789]]],"type":"Polygon"}
}