{
  "id": "360150101003",
  "type": "Feature",
  "properties": {
    "area_land":57855126,
    "area_water":105415,
    "geoid":"360150101003",
    "name":"Block Group 3",
    "state":"ny"
},
  "bbox": [
    -76.642256,
    42.200739,
    -76.535782,
    42.282853
],
  "geometry": {"coordinates":[[[-76.639369,42.235654],[-76.633686,42.239462],[-76.63364,42.239495],[-76.633602,42.239518],[-76.631686,42.240785],[-76.631136,42.241145],[-76.631095,42.241172],[-76.63103599999999,42.24121],[-76.630999,42.241234],[-76.628905,42.242547],[-76.628367,42.242889],[-76.628226,42.242972],[-76.624599,42.24555],[-76.622775,42.246689],[-76.619533,42.248664],[-76.61921,42.25002],[-76.61922,42.250767],[-76.61922300000001,42.250933],[-76.619299,42.255146],[-76.61930099999999,42.255257],[-76.619426,42.262162],[-76.619432,42.262507],[-76.61943599999999,42.262635],[-76.61943599999999,42.262669],[-76.619437,42.262771],[-76.619438,42.262805],[-76.619449,42.263423],[-76.619485,42.26528],[-76.61949799999999,42.265899],[-76.619497,42.265992],[-76.619497,42.266028],[-76.619501,42.266272],[-76.61950299999999,42.266366],[-76.619471,42.267851],[-76.619376,42.272309],[-76.619345,42.273796],[-76.619326,42.273987],[-76.619302,42.274509],[-76.619293,42.275641],[-76.619292,42.275891],[-76.619342,42.276541],[-76.61927900000001,42.282199],[-76.61927799999999,42.282369],[-76.61928,42.282567],[-76.619303,42.282853],[-76.618686,42.282848],[-76.609134,42.282783],[-76.59567800000001,42.282691],[-76.59556499999999,42.28269],[-76.595512,42.28269],[-76.584585,42.282624],[-76.58257500000001,42.282613],[-76.57961400000001,42.282595],[-76.579489,42.28259],[-76.571354,42.282314],[-76.571198,42.28231],[-76.561797,42.281992],[-76.561601,42.281986],[-76.561519,42.281985],[-76.55302500000001,42.281882],[-76.548929,42.281832],[-76.544951,42.281785],[-76.542396,42.281773],[-76.54122099999999,42.281752],[-76.54097899999999,42.281751],[-76.538349,42.281755],[-76.538245,42.280501],[-76.538183,42.279742],[-76.53746700000001,42.271091],[-76.537424,42.270543],[-76.53720800000001,42.267861],[-76.53720300000001,42.267796],[-76.537189,42.267638],[-76.537173,42.267429],[-76.53630099999999,42.256551],[-76.536297,42.256502],[-76.536295,42.256472],[-76.535782,42.250074],[-76.535856,42.248687],[-76.535858,42.248503],[-76.535859,42.248303],[-76.53586199999999,42.247871],[-76.535867,42.247241],[-76.536024,42.225111],[-76.53606000000001,42.22003],[-76.53609,42.215831],[-76.536142,42.208509],[-76.536145,42.207951],[-76.53617,42.204349],[-76.53616700000001,42.204213],[-76.53616599999999,42.203654],[-76.53616599999999,42.203599],[-76.53641500000001,42.203551],[-76.537796,42.203398],[-76.53920100000001,42.203258],[-76.54013999999999,42.203165],[-76.540334,42.203147],[-76.541972,42.202997],[-76.542738,42.202916],[-76.547899,42.202387],[-76.54807,42.202376],[-76.548807,42.20233],[-76.550449,42.202059],[-76.55105,42.201967],[-76.55112200000001,42.201956],[-76.55186999999999,42.201813],[-76.554644,42.201357],[-76.556163,42.201112],[-76.55718400000001,42.200952],[-76.558161,42.200827],[-76.559664,42.200739],[-76.56020599999999,42.200739],[-76.562518,42.20086],[-76.56289200000001,42.20088],[-76.56421899999999,42.201116],[-76.56505799999999,42.201258],[-76.566737,42.201681],[-76.567317,42.201919],[-76.56936899999999,42.202787],[-76.56956700000001,42.202906],[-76.569827,42.20302],[-76.57055200000001,42.203405],[-76.572085,42.204176],[-76.57370299999999,42.20508],[-76.574055,42.20529],[-76.57432799999999,42.205454],[-76.57563399999999,42.206271],[-76.57868499999999,42.208288],[-76.579295,42.208696],[-76.579723,42.208902],[-76.58185899999999,42.210138],[-76.583263,42.210853],[-76.583911,42.211183],[-76.584171,42.211324],[-76.585537,42.212084],[-76.586072,42.212506],[-76.58633399999999,42.212735],[-76.586474,42.212833],[-76.587113,42.21345],[-76.587791,42.214149],[-76.589191,42.215517],[-76.591205,42.217443],[-76.591503,42.217641],[-76.59502000000001,42.219978],[-76.59525499999999,42.220149],[-76.59567800000001,42.220133],[-76.59914000000001,42.220072],[-76.59922,42.220075],[-76.59940899999999,42.220082],[-76.599529,42.220087],[-76.599751,42.22006],[-76.60014700000001,42.220068],[-76.60064300000001,42.220121],[-76.60126,42.22028],[-76.601626,42.220382],[-76.602018,42.220561],[-76.60248199999999,42.22085],[-76.602948,42.221195],[-76.60333,42.221519],[-76.60373,42.221809],[-76.604298,42.222117],[-76.60532000000001,42.222563],[-76.607946,42.223589],[-76.608288,42.223742],[-76.608619,42.223977],[-76.60879199999999,42.224108],[-76.608998,42.224229],[-76.60910800000001,42.224262],[-76.60917600000001,42.224282],[-76.609371,42.224296],[-76.609677,42.224286],[-76.609818,42.224265],[-76.60988399999999,42.22422],[-76.610265,42.223833],[-76.61047000000001,42.223654],[-76.61072799999999,42.223443],[-76.61095899999999,42.223271],[-76.611137,42.223125],[-76.61134800000001,42.222967],[-76.611783,42.222769],[-76.61203500000001,42.222677],[-76.61212999999999,42.222666],[-76.612324,42.222643],[-76.612538,42.222654],[-76.612729,42.222651],[-76.613011,42.222573],[-76.613193,42.222454],[-76.61327300000001,42.222324],[-76.613411,42.222162],[-76.613546,42.222055],[-76.61375099999999,42.222021],[-76.61416199999999,42.222008],[-76.614576,42.222044],[-76.61519699999999,42.222129],[-76.61547,42.222172],[-76.615819,42.22222],[-76.61615500000001,42.222204],[-76.616467,42.222162],[-76.616803,42.222067],[-76.617649,42.221689],[-76.618459,42.221327],[-76.618711,42.221197],[-76.618916,42.221071],[-76.61916100000001,42.220892],[-76.619342,42.220742],[-76.620847,42.219496],[-76.621076,42.219336],[-76.62132800000001,42.219278],[-76.62156899999999,42.219248],[-76.621905,42.219211],[-76.622151,42.219107],[-76.622347,42.21901],[-76.62244,42.219085],[-76.624663,42.22063],[-76.63273100000001,42.226638],[-76.642256,42.233721],[-76.639369,42.235654]]],"type":"Polygon"}
}