{
  "id": "360290145022",
  "type": "Feature",
  "properties": {
    "area_land":1453466,
    "area_water":0,
    "geoid":"360290145022",
    "name":"Block Group 2",
    "state":"ny"
},
  "bbox": [
    -78.696931,
    42.892394,
    -78.682469,
    42.906208
],
  "geometry": {"coordinates":[[[-78.69693100000001,42.89543],[-78.696928,42.895899],[-78.696926,42.898796],[-78.696912,42.899746],[-78.69691,42.900842],[-78.696911,42.901931],[-78.69690900000001,42.902828],[-78.696912,42.903838],[-78.696912,42.904805],[-78.69691400000001,42.905622],[-78.69692499999999,42.906037],[-78.696928,42.906208],[-78.696527,42.906182],[-78.68748100000001,42.905581],[-78.686615,42.905524],[-78.685198,42.905465],[-78.68377599999999,42.905406],[-78.682502,42.905353],[-78.682469,42.904371],[-78.682474,42.902532],[-78.682806,42.901219],[-78.682845,42.898701],[-78.682846,42.898611],[-78.682855,42.898076],[-78.682852,42.898002],[-78.68286000000001,42.897657],[-78.6829,42.895862],[-78.68407000000001,42.895868],[-78.684702,42.895918],[-78.685008,42.895951],[-78.685086,42.895991],[-78.68634400000001,42.896006],[-78.68744,42.89602],[-78.68843099999999,42.896032],[-78.688456,42.895882],[-78.688632,42.892534],[-78.69036199999999,42.892485],[-78.69139300000001,42.892449],[-78.69189,42.892423],[-78.692458,42.892394],[-78.69245100000001,42.893442],[-78.692448,42.893951],[-78.694613,42.893957],[-78.695083,42.893964],[-78.696055,42.893978],[-78.696055,42.894554],[-78.6952,42.894554],[-78.695063,42.894554],[-78.695064,42.894977],[-78.69538,42.894834],[-78.695543,42.894729],[-78.695691,42.894696],[-78.695832,42.894705],[-78.696055,42.894713],[-78.69605300000001,42.89525],[-78.69605199999999,42.895396],[-78.69675599999999,42.895394],[-78.696844,42.895394],[-78.69693100000001,42.895393],[-78.69693100000001,42.89543]]],"type":"Polygon"}
}