{
  "id": "360550148031",
  "type": "Feature",
  "properties": {
    "area_land":15215503,
    "area_water":1284383,
    "geoid":"360550148031",
    "name":"Block Group 1",
    "state":"ny"
},
  "bbox": [
    -77.832577,
    43.28725,
    -77.773596,
    43.344519
],
  "geometry": {"coordinates":[[[-77.83118399999999,43.290367],[-77.82771099999999,43.298138],[-77.82608999999999,43.301803],[-77.825399,43.303388],[-77.82495900000001,43.304396],[-77.82285400000001,43.309225],[-77.818853,43.31853],[-77.816568,43.323844],[-77.81414100000001,43.329516],[-77.813564,43.330903],[-77.811076,43.336829],[-77.810787,43.337517],[-77.81000400000001,43.339415],[-77.80995,43.339546],[-77.809924,43.339611],[-77.80985699999999,43.339776],[-77.809236,43.341292],[-77.809156,43.341492],[-77.809078,43.341689],[-77.80756,43.344519],[-77.78549599999999,43.344168],[-77.774317,43.343999],[-77.774438,43.339703],[-77.77440900000001,43.339493],[-77.77437500000001,43.339232],[-77.77419,43.337798],[-77.774098,43.337003],[-77.774075,43.3368],[-77.773596,43.333274],[-77.7736,43.333251],[-77.77360899999999,43.333234],[-77.773628,43.333222],[-77.773652,43.333215],[-77.775132,43.333145],[-77.7765,43.333075],[-77.77587200000001,43.326684],[-77.775809,43.325954],[-77.775572,43.323058],[-77.775505,43.322104],[-77.775187,43.318302],[-77.77493200000001,43.31467],[-77.774727,43.311117],[-77.78441100000001,43.310773],[-77.79433899999999,43.310382],[-77.794212,43.308801],[-77.79386100000001,43.303478],[-77.793851,43.303356],[-77.793815,43.302897],[-77.794843,43.302858],[-77.799465,43.302704],[-77.80145400000001,43.302635],[-77.81314500000001,43.302232],[-77.812939,43.29895],[-77.81276699999999,43.296257],[-77.81275100000001,43.296009],[-77.81269,43.294983],[-77.812667,43.294616],[-77.812241,43.287733],[-77.81399500000001,43.287687],[-77.814992,43.287667],[-77.817449,43.287595],[-77.82055099999999,43.287533],[-77.828013,43.287364],[-77.829421,43.287339],[-77.830144,43.287312],[-77.83045,43.287304],[-77.832577,43.28725],[-77.83118399999999,43.290367]]],"type":"Polygon"}
}