{
  "id": "360470085003",
  "type": "Feature",
  "properties": {
    "area_land":68334,
    "area_water":0,
    "geoid":"360470085003",
    "name":"Block Group 3",
    "state":"ny"
},
  "bbox": [
    -74.007711,
    40.673182,
    -74.002016,
    40.675903
],
  "geometry": {"coordinates":[[[-74.00742,40.675229],[-74.007098,40.675903],[-74.00541,40.675426],[-74.003823,40.674905],[-74.002016,40.674482],[-74.00229299999999,40.673837],[-74.002608,40.673182],[-74.00443199999999,40.673701],[-74.006005,40.674146],[-74.007711,40.674625],[-74.00742,40.675229]]],"type":"Polygon"}
}