{
  "id": "360811227013",
  "type": "Feature",
  "properties": {
    "area_land":121347,
    "area_water":0,
    "geoid":"360811227013",
    "name":"Block Group 3",
    "state":"ny"
},
  "bbox": [
    -73.811124,
    40.727833,
    -73.805166,
    40.730458
],
  "geometry": {"coordinates":[[[-73.8109,40.730311],[-73.808994,40.730366],[-73.808071,40.730398],[-73.807121,40.730422],[-73.806185,40.730437],[-73.805166,40.730458],[-73.805222,40.728484],[-73.806245,40.72837],[-73.80717,40.728269],[-73.808064,40.72817],[-73.808958,40.728073],[-73.809856,40.727974],[-73.81112400000001,40.727833],[-73.8109,40.730311]]],"type":"Polygon"}
}