{
  "id": "360050132001",
  "type": "Feature",
  "properties": {
    "area_land":74394,
    "area_water":0,
    "geoid":"360050132001",
    "name":"Block Group 1",
    "state":"ny"
},
  "bbox": [
    -73.827509,
    40.813234,
    -73.82297,
    40.816351
],
  "geometry": {"coordinates":[[[-73.826652,40.815466],[-73.825801,40.815764],[-73.824973,40.81605],[-73.82408100000001,40.816351],[-73.82297,40.814405],[-73.82382200000001,40.814123],[-73.82467699999999,40.813827],[-73.82553799999999,40.813543],[-73.826391,40.813234],[-73.82750900000001,40.81517],[-73.826652,40.815466]]],"type":"Polygon"}
}