{
  "id": "360610229003",
  "type": "Feature",
  "properties": {
    "area_land":46826,
    "area_water":0,
    "geoid":"360610229003",
    "name":"Block Group 3",
    "state":"ny"
},
  "bbox": [
    -73.95094,
    40.824563,
    -73.947117,
    40.827104
],
  "geometry": {"coordinates":[[[-73.950453,40.82643],[-73.94996,40.827104],[-73.94711700000001,40.825904],[-73.947604,40.825233],[-73.948099,40.824563],[-73.95094,40.825757],[-73.950453,40.82643]]],"type":"Polygon"}
}