{
  "id": "360550047011",
  "type": "Feature",
  "properties": {
    "area_land":400374,
    "area_water":0,
    "geoid":"360550047011",
    "name":"Block Group 1",
    "state":"ny"
},
  "bbox": [
    -77.615337,
    43.191243,
    -77.599896,
    43.195319
],
  "geometry": {"coordinates":[[[-77.615285,43.191442],[-77.615216,43.191755],[-77.614874,43.193296],[-77.61441000000001,43.193464],[-77.613463,43.193807],[-77.61228800000001,43.194223],[-77.61122,43.194612],[-77.61068899999999,43.194804],[-77.610556,43.194845],[-77.61042500000001,43.194871],[-77.61014400000001,43.194917],[-77.608996,43.19511],[-77.60781799999999,43.195319],[-77.607761,43.194404],[-77.606183,43.194496],[-77.604264,43.194608],[-77.602417,43.19491],[-77.60009700000001,43.19516],[-77.599998,43.193728],[-77.59990500000001,43.192394],[-77.599896,43.192071],[-77.60087,43.192016],[-77.601246,43.191995],[-77.60599999999999,43.191667],[-77.607314,43.191577],[-77.608403,43.191557],[-77.60869599999999,43.191553],[-77.609565,43.191554],[-77.61281700000001,43.191487],[-77.613615,43.191472],[-77.613771,43.191335],[-77.613998,43.191323],[-77.615337,43.191243],[-77.615285,43.191442]]],"type":"Polygon"}
}