{
  "id": "360179702003",
  "type": "Feature",
  "properties": {
    "area_land":115477230,
    "area_water":518794,
    "geoid":"360179702003",
    "name":"Block Group 3",
    "state":"ny"
},
  "bbox": [
    -75.852265,
    42.533787,
    -75.59689,
    42.636977
],
  "geometry": {"coordinates":[[[-75.852265,42.585899],[-75.851795,42.586214],[-75.851157,42.586677],[-75.850734,42.586971],[-75.850343,42.587188],[-75.849237,42.587688],[-75.84881900000001,42.587905],[-75.84852100000001,42.58808],[-75.848159,42.588341],[-75.847883,42.588596],[-75.846918,42.589609],[-75.845995,42.590535],[-75.84559,42.590935],[-75.84458600000001,42.591937],[-75.844115,42.592421],[-75.84349899999999,42.593085],[-75.842484,42.594171],[-75.84229999999999,42.594342],[-75.841741,42.59481],[-75.84125400000001,42.595192],[-75.84081999999999,42.595528],[-75.839247,42.596763],[-75.83882199999999,42.597101],[-75.83830500000001,42.597502],[-75.83799399999999,42.597706],[-75.836568,42.598512],[-75.83628299999999,42.598717],[-75.836127,42.598839],[-75.835938,42.599029],[-75.83585600000001,42.599135],[-75.835757,42.599275],[-75.835565,42.599708],[-75.835441,42.600084],[-75.83522000000001,42.601274],[-75.835172,42.601441],[-75.83515300000001,42.601499],[-75.83504600000001,42.601742],[-75.83497,42.601868],[-75.834869,42.602004],[-75.834774,42.60211],[-75.83457900000001,42.602288],[-75.83430300000001,42.602488],[-75.834255,42.602516],[-75.83407699999999,42.602617],[-75.833816,42.602733],[-75.83354,42.602836],[-75.831845,42.603388],[-75.83126300000001,42.603589],[-75.831155,42.603626],[-75.830889,42.603737],[-75.830664,42.603853],[-75.83050799999999,42.603948],[-75.83024899999999,42.604156],[-75.83011500000001,42.604281],[-75.829989,42.604423],[-75.829909,42.604531],[-75.829804,42.604705],[-75.82969,42.605006],[-75.82965,42.605174],[-75.829627,42.605486],[-75.829716,42.607071],[-75.829725,42.60722],[-75.82976600000001,42.607877],[-75.829764,42.608352],[-75.829655,42.609305],[-75.829561,42.609961],[-75.82951199999999,42.610265],[-75.829435,42.610481],[-75.82930899999999,42.610752],[-75.829037,42.611219],[-75.82842100000001,42.612206],[-75.826374,42.615577],[-75.825495,42.61698],[-75.824872,42.617993],[-75.823888,42.619573],[-75.823419,42.620307],[-75.823133,42.620635],[-75.822926,42.620826],[-75.822637,42.621041],[-75.822225,42.621297],[-75.82039899999999,42.622347],[-75.81955499999999,42.622834],[-75.818715,42.623316],[-75.817847,42.623844],[-75.816149,42.624999],[-75.81406,42.626442],[-75.813699,42.626694],[-75.8125,42.627531],[-75.812121,42.627806],[-75.81003,42.629453],[-75.809471,42.629921],[-75.809224,42.630139],[-75.809006,42.630351],[-75.808857,42.630683],[-75.80873099999999,42.631147],[-75.808661,42.631379],[-75.80865300000001,42.631443],[-75.808116,42.631385],[-75.80723500000001,42.63132],[-75.807057,42.631313],[-75.80679600000001,42.631316],[-75.80645699999999,42.631297],[-75.805548,42.63124],[-75.804841,42.63121],[-75.804384,42.631203],[-75.803408,42.631237],[-75.80191600000001,42.63135],[-75.797461,42.63172],[-75.795946,42.631841],[-75.794487,42.632012],[-75.794195,42.632068],[-75.793718,42.632187],[-75.793554,42.632235],[-75.793205,42.632359],[-75.79300499999999,42.632442],[-75.79264499999999,42.6326],[-75.792314,42.632294],[-75.79201999999999,42.632067],[-75.791726,42.631882],[-75.791381,42.631711],[-75.791147,42.631616],[-75.79065300000001,42.631446],[-75.786788,42.630209],[-75.785302,42.629719],[-75.784244,42.629389],[-75.784071,42.629343],[-75.783911,42.629311],[-75.783661,42.629261],[-75.78345299999999,42.629237],[-75.78297600000001,42.629206],[-75.78263800000001,42.629206],[-75.780165,42.6293],[-75.77877599999999,42.629342],[-75.775767,42.629457],[-75.77485799999999,42.629501],[-75.77450899999999,42.629543],[-75.77424600000001,42.629604],[-75.773824,42.629746],[-75.773122,42.630051],[-75.77225799999999,42.630434],[-75.77142499999999,42.630809],[-75.77104,42.631017],[-75.770371,42.63144],[-75.768978,42.632364],[-75.768546,42.63263],[-75.768253,42.632771],[-75.76769899999999,42.632987],[-75.76638,42.633402],[-75.765683,42.633607],[-75.76352199999999,42.634282],[-75.760621,42.635172],[-75.759466,42.635507],[-75.75555,42.636619],[-75.755195,42.63671],[-75.75457900000001,42.636837],[-75.754262,42.636881],[-75.753822,42.636917],[-75.75262600000001,42.636977],[-75.75232,42.636965],[-75.75215,42.636943],[-75.75187200000001,42.636884],[-75.75172999999999,42.636837],[-75.751485,42.636729],[-75.751182,42.636559],[-75.750444,42.636036],[-75.749999,42.635744],[-75.749296,42.635365],[-75.748653,42.635031],[-75.748425,42.634909],[-75.74822,42.63478],[-75.748026,42.634627],[-75.747913,42.634512],[-75.747843,42.634429],[-75.747733,42.634267],[-75.74761599999999,42.633989],[-75.747422,42.633276],[-75.74732299999999,42.632976],[-75.747173,42.632659],[-75.746658,42.631895],[-75.74657999999999,42.631754],[-75.74651,42.631543],[-75.746484,42.631198],[-75.746495,42.631022],[-75.746551,42.630734],[-75.746959,42.629109],[-75.746994,42.628795],[-75.746985,42.628415],[-75.746961,42.628072],[-75.746734,42.626387],[-75.746408,42.624186],[-75.746269,42.623344],[-75.74588300000001,42.620463],[-75.745774,42.619561],[-75.74553899999999,42.617857],[-75.745366,42.616697],[-75.745273,42.616021],[-75.74515,42.615268],[-75.745126,42.61506],[-75.745091,42.614604],[-75.745091,42.614337],[-75.745148,42.613789],[-75.74522399999999,42.613277],[-75.745333,42.612327],[-75.745327,42.612153],[-75.745278,42.611887],[-75.745217,42.611718],[-75.745081,42.611425],[-75.744972,42.61125],[-75.744851,42.611094],[-75.744697,42.61092],[-75.744291,42.610506],[-75.743797,42.610061],[-75.74347,42.609708],[-75.743359,42.609551],[-75.743056,42.609091],[-75.74287699999999,42.608859],[-75.742558,42.608608],[-75.742422,42.608748],[-75.742251,42.608905],[-75.74203300000001,42.609077],[-75.741781,42.609261],[-75.74132899999999,42.609534],[-75.7411,42.609646],[-75.74060900000001,42.609847],[-75.74038,42.609927],[-75.73927500000001,42.610242],[-75.737911,42.610613],[-75.737742,42.610658],[-75.737449,42.610737],[-75.736958,42.610844],[-75.736729,42.610885],[-75.736452,42.610919],[-75.735969,42.610953],[-75.735716,42.610956],[-75.7353,42.610947],[-75.73500199999999,42.610926],[-75.73457399999999,42.610874],[-75.73429299999999,42.610821],[-75.734212,42.610803],[-75.73368600000001,42.610685],[-75.73322,42.61054],[-75.730251,42.609654],[-75.72899099999999,42.609276],[-75.728641,42.609171],[-75.728341,42.609078],[-75.727683,42.608812],[-75.727424,42.608683],[-75.727181,42.608543],[-75.726558,42.60817],[-75.726151,42.607918],[-75.72578900000001,42.607738],[-75.725438,42.60761],[-75.72512500000001,42.607534],[-75.725054,42.607523],[-75.72490999999999,42.6075],[-75.724735,42.607481],[-75.72441600000001,42.607464],[-75.724116,42.607468],[-75.722762,42.607524],[-75.722038,42.607558],[-75.721723,42.60759],[-75.721192,42.607669],[-75.719555,42.607969],[-75.719092,42.608051],[-75.718875,42.608079],[-75.718642,42.608098],[-75.718423,42.608098],[-75.718029,42.608072],[-75.717804,42.608036],[-75.717443,42.607942],[-75.71717700000001,42.607846],[-75.71698600000001,42.607762],[-75.71670399999999,42.607607],[-75.71558899999999,42.606897],[-75.715176,42.606633],[-75.714996,42.606529],[-75.71463199999999,42.606358],[-75.714321,42.606249],[-75.71405,42.606172],[-75.713858,42.606136],[-75.713627,42.606093],[-75.713414,42.606067],[-75.712969,42.606052],[-75.71249299999999,42.60609],[-75.712279,42.606123],[-75.71186899999999,42.606216],[-75.71159299999999,42.606302],[-75.711288,42.606427],[-75.71089000000001,42.606651],[-75.710414,42.606974],[-75.70987700000001,42.60736],[-75.709621,42.607526],[-75.709215,42.60774],[-75.708884,42.607879],[-75.70844099999999,42.60803],[-75.707465,42.608332],[-75.705736,42.608842],[-75.70542,42.608909],[-75.70521599999999,42.608941],[-75.704914,42.60896],[-75.704752,42.608961],[-75.70433800000001,42.608926],[-75.703947,42.608864],[-75.703559,42.608784],[-75.703172,42.608705],[-75.703001,42.60867],[-75.70269500000001,42.608605],[-75.702535,42.608572],[-75.702237,42.608519],[-75.701994,42.608497],[-75.701688,42.608487],[-75.70140600000001,42.608499],[-75.70072399999999,42.608581],[-75.69933,42.608764],[-75.69850599999999,42.608865],[-75.69727,42.609026],[-75.69596900000001,42.609205],[-75.69567000000001,42.609246],[-75.69417799999999,42.609459],[-75.69208399999999,42.609777],[-75.68816700000001,42.610342],[-75.685582,42.610712],[-75.68499300000001,42.610822],[-75.68463300000001,42.610913],[-75.684274,42.611029],[-75.68309000000001,42.611498],[-75.68235199999999,42.611733],[-75.679424,42.612509],[-75.678798,42.612628],[-75.67828,42.612693],[-75.677734,42.612733],[-75.676789,42.612738],[-75.67555299999999,42.612714],[-75.674594,42.612716],[-75.67406,42.612752],[-75.67379,42.612783],[-75.67319500000001,42.612873],[-75.671192,42.613219],[-75.670754,42.613262],[-75.670372,42.613277],[-75.66988499999999,42.613267],[-75.669332,42.613217],[-75.668656,42.613094],[-75.668204,42.612972],[-75.666093,42.612271],[-75.665233,42.611987],[-75.662769,42.611178],[-75.66194900000001,42.610891],[-75.661621,42.610747],[-75.661214,42.610531],[-75.660994,42.610396],[-75.660585,42.61011],[-75.660422,42.609976],[-75.660105,42.609667],[-75.65979799999999,42.609327],[-75.65919700000001,42.60862],[-75.659041,42.608457],[-75.658717,42.608157],[-75.658468,42.607978],[-75.65810399999999,42.607735],[-75.65761000000001,42.607459],[-75.655517,42.606327],[-75.65508,42.606096],[-75.65481,42.605946],[-75.653914,42.605478],[-75.653488,42.605294],[-75.653173,42.605179],[-75.65290299999999,42.605095],[-75.652367,42.60494],[-75.649171,42.604195],[-75.64587400000001,42.603426],[-75.64546300000001,42.603337],[-75.64507999999999,42.603254],[-75.644243,42.60305],[-75.6434,42.602859],[-75.642455,42.602633],[-75.64172000000001,42.602457],[-75.639194,42.60188],[-75.63872600000001,42.601791],[-75.638228,42.601716],[-75.63779599999999,42.601664],[-75.63710399999999,42.601609],[-75.63639499999999,42.601587],[-75.635701,42.601593],[-75.635009,42.601647],[-75.63431799999999,42.601718],[-75.633623,42.601801],[-75.632946,42.601904],[-75.63017499999999,42.602366],[-75.628843,42.602583],[-75.628365,42.602618],[-75.627959,42.602613],[-75.627759,42.6026],[-75.62728300000001,42.602538],[-75.62709599999999,42.602497],[-75.626807,42.602419],[-75.626441,42.602307],[-75.625462,42.60195],[-75.624816,42.601674],[-75.62417000000001,42.601344],[-75.623328,42.600877],[-75.62280199999999,42.600614],[-75.622272,42.600402],[-75.621836,42.60027],[-75.621469,42.600181],[-75.620987,42.600097],[-75.620285,42.600006],[-75.619006,42.599898],[-75.618278,42.59989],[-75.617536,42.599914],[-75.61425800000001,42.600106],[-75.61389200000001,42.600119],[-75.613528,42.600111],[-75.61327900000001,42.600096],[-75.61262000000001,42.600012],[-75.612173,42.599924],[-75.61197199999999,42.599869],[-75.61171,42.599781],[-75.61138099999999,42.599652],[-75.611143,42.599539],[-75.610964,42.599457],[-75.61076199999999,42.599342],[-75.610404,42.599138],[-75.610162,42.598989],[-75.609667,42.598737],[-75.609318,42.598592],[-75.60904499999999,42.598502],[-75.60860599999999,42.59838],[-75.60821799999999,42.598302],[-75.60559600000001,42.597876],[-75.605178,42.59783],[-75.60489200000001,42.597808],[-75.604809,42.597802],[-75.604342,42.597786],[-75.60330399999999,42.597791],[-75.602664,42.59778],[-75.601877,42.597733],[-75.59911,42.597463],[-75.59909,42.597359],[-75.599053,42.597272],[-75.598889,42.597073],[-75.598612,42.596807],[-75.598263,42.59652],[-75.598136,42.596402],[-75.59801,42.596235],[-75.59781099999999,42.595828],[-75.597796,42.595796],[-75.597632,42.595277],[-75.597584,42.595199],[-75.597238,42.594781],[-75.597145,42.594624],[-75.597078,42.594406],[-75.59699500000001,42.593806],[-75.596993,42.593599],[-75.597013,42.593454],[-75.597043,42.593318],[-75.597115,42.593201],[-75.59719200000001,42.593142],[-75.597325,42.593085],[-75.597678,42.592978],[-75.597807,42.592931],[-75.598097,42.59277],[-75.59835699999999,42.592584],[-75.598485,42.592449],[-75.598575,42.59234],[-75.598581,42.59229],[-75.598555,42.592212],[-75.598494,42.5921],[-75.59844,42.592034],[-75.598291,42.591937],[-75.59800300000001,42.591807],[-75.597848,42.591717],[-75.597735,42.591644],[-75.597644,42.591543],[-75.597582,42.591441],[-75.597534,42.591303],[-75.597465,42.590277],[-75.59726000000001,42.587903],[-75.59722499999999,42.587287],[-75.597233,42.587129],[-75.597211,42.587109],[-75.59718100000001,42.587052],[-75.597161,42.586832],[-75.59716299999999,42.586497],[-75.59720900000001,42.586157],[-75.59723099999999,42.585944],[-75.59721,42.585857],[-75.597145,42.585773],[-75.59716899999999,42.585668],[-75.597177,42.585482],[-75.59713600000001,42.585291],[-75.59706199999999,42.585076],[-75.59693300000001,42.584779],[-75.59689299999999,42.58463],[-75.59689,42.584453],[-75.59695000000001,42.584261],[-75.59698299999999,42.584082],[-75.596947,42.583417],[-75.596953,42.583086],[-75.596981,42.582935],[-75.597104,42.582661],[-75.597228,42.582469],[-75.59812599999999,42.581344],[-75.598535,42.580848],[-75.598831,42.58048],[-75.599073,42.580147],[-75.599211,42.579921],[-75.599341,42.579681],[-75.599773,42.579095],[-75.599808,42.578993],[-75.599965,42.577911],[-75.600047,42.577429],[-75.600114,42.577197],[-75.600251,42.576928],[-75.600291,42.576851],[-75.600415,42.576673],[-75.600596,42.576484],[-75.60149199999999,42.575699],[-75.60322600000001,42.574279],[-75.603796,42.573772],[-75.604112,42.57353],[-75.604579,42.573174],[-75.606121,42.571929],[-75.607338,42.570868],[-75.60835299999999,42.570066],[-75.609516,42.569038],[-75.609784,42.568824],[-75.61054300000001,42.56818],[-75.61227100000001,42.566753],[-75.612881,42.566263],[-75.613169,42.566042],[-75.613286,42.565926],[-75.613411,42.565778],[-75.613477,42.565684],[-75.61372799999999,42.565328],[-75.614024,42.564862],[-75.614266,42.564443],[-75.61507899999999,42.562919],[-75.615708,42.561853],[-75.61608200000001,42.561186],[-75.61624999999999,42.560855],[-75.61639599999999,42.560531],[-75.616473,42.560299],[-75.616514,42.560069],[-75.61653,42.559983],[-75.616782,42.55923],[-75.617575,42.556546],[-75.617942,42.555303],[-75.618385,42.553707],[-75.618405,42.553632],[-75.618549,42.553095],[-75.618948,42.551437],[-75.61963299999999,42.548523],[-75.6199,42.547448],[-75.62050600000001,42.545182],[-75.620919,42.543586],[-75.621458,42.541375],[-75.62195,42.539088],[-75.622255,42.537813],[-75.62298699999999,42.535063],[-75.62303900000001,42.534741],[-75.62305000000001,42.534435],[-75.62304399999999,42.5344],[-75.622981,42.53404],[-75.623031,42.53402],[-75.623323,42.533932],[-75.623341,42.533926],[-75.623509,42.533896],[-75.623582,42.533892],[-75.623831,42.533893],[-75.624999,42.533959],[-75.626003,42.533954],[-75.627377,42.533918],[-75.62839700000001,42.533926],[-75.62915099999999,42.533918],[-75.630357,42.533834],[-75.63056400000001,42.533815],[-75.63095800000001,42.533801],[-75.631355,42.533787],[-75.63188,42.533801],[-75.632614,42.533863],[-75.633105,42.533915],[-75.63421700000001,42.534097],[-75.63492599999999,42.534202],[-75.636769,42.534449],[-75.637322,42.534539],[-75.63751600000001,42.534574],[-75.638082,42.534716],[-75.63854000000001,42.53487],[-75.639157,42.535122],[-75.639239,42.53516],[-75.639438,42.535253],[-75.639685,42.535385],[-75.639858,42.535478],[-75.640367,42.535786],[-75.641116,42.536293],[-75.641845,42.536756],[-75.643249,42.537623],[-75.643483,42.537776],[-75.64396600000001,42.538064],[-75.644532,42.538467],[-75.64484400000001,42.538713],[-75.645178,42.538996],[-75.646468,42.540279],[-75.646711,42.540492],[-75.646986,42.5407],[-75.64834999999999,42.54158],[-75.64867,42.541821],[-75.649193,42.542264],[-75.649914,42.542919],[-75.65015200000001,42.543117],[-75.65042800000001,42.543314],[-75.650755,42.543514],[-75.65217199999999,42.544318],[-75.65323600000001,42.544975],[-75.65422,42.545509],[-75.654582,42.545694],[-75.655886,42.546421],[-75.656289,42.546605],[-75.65677700000001,42.546776],[-75.658692,42.547288],[-75.659481,42.547499],[-75.659885,42.547595],[-75.660166,42.547661],[-75.660901,42.547882],[-75.661832,42.548242],[-75.662205,42.548395],[-75.66253,42.548515],[-75.66346900000001,42.548823],[-75.664075,42.548993],[-75.664399,42.549074],[-75.664934,42.54917],[-75.665268,42.549267],[-75.66553999999999,42.549381],[-75.665685,42.549455],[-75.66637299999999,42.549852],[-75.666527,42.549918],[-75.666957,42.550061],[-75.667564,42.550237],[-75.66833099999999,42.550436],[-75.66951299999999,42.550707],[-75.66985099999999,42.550789],[-75.67005,42.550837],[-75.670053,42.550873],[-75.67017300000001,42.550867],[-75.670618,42.550973],[-75.670829,42.551032],[-75.67292500000001,42.551634],[-75.677537,42.552781],[-75.67915499999999,42.55322],[-75.67979699999999,42.553354],[-75.68129500000001,42.553634],[-75.683352,42.554055],[-75.68360699999999,42.554118],[-75.68519499999999,42.554532],[-75.688515,42.555431],[-75.690861,42.55606],[-75.69241100000001,42.556483],[-75.693184,42.556689],[-75.693957,42.556883],[-75.69626700000001,42.557431],[-75.698215,42.557909],[-75.69953099999999,42.558237],[-75.70225000000001,42.558917],[-75.702975,42.559107],[-75.70375799999999,42.559301],[-75.70450599999999,42.55947],[-75.705316,42.559653],[-75.706086,42.559799],[-75.706661,42.559886],[-75.706863,42.559916],[-75.707803,42.560032],[-75.707892,42.560042],[-75.708574,42.560116],[-75.709118,42.560146],[-75.70983099999999,42.560153],[-75.71056299999999,42.560146],[-75.71091800000001,42.560152],[-75.711073,42.560143],[-75.711467,42.560122],[-75.71153099999999,42.560119],[-75.71175100000001,42.5601],[-75.712244,42.560019],[-75.71250999999999,42.559963],[-75.712779,42.559893],[-75.71307400000001,42.559793],[-75.71326999999999,42.559713],[-75.713666,42.559523],[-75.714015,42.559329],[-75.71419299999999,42.559239],[-75.714517,42.559107],[-75.714741,42.559029],[-75.71516800000001,42.558903],[-75.71677800000001,42.558391],[-75.717405,42.558177],[-75.71754799999999,42.558134],[-75.717783,42.558086],[-75.718109,42.558059],[-75.71835799999999,42.558054],[-75.71919200000001,42.558016],[-75.721542,42.557896],[-75.72211900000001,42.557884],[-75.72299099999999,42.55792],[-75.723406,42.557964],[-75.724795,42.558188],[-75.725476,42.558315],[-75.72604200000001,42.558453],[-75.726911,42.558703],[-75.727312,42.558836],[-75.727782,42.559032],[-75.728729,42.559478],[-75.732129,42.561111],[-75.73358,42.561819],[-75.73441200000001,42.56225],[-75.73485700000001,42.562499],[-75.736085,42.563242],[-75.73793999999999,42.564384],[-75.73859899999999,42.564789],[-75.739013,42.565018],[-75.739137,42.565077],[-75.73929200000001,42.565151],[-75.740264,42.565619],[-75.74055799999999,42.56577],[-75.74111600000001,42.565442],[-75.741474,42.565221],[-75.741772,42.564974],[-75.742559,42.564237],[-75.742779,42.564052],[-75.743297,42.563659],[-75.74396900000001,42.563207],[-75.74475,42.562699],[-75.745059,42.562499],[-75.745431,42.56231],[-75.745752,42.562187],[-75.745884,42.562152],[-75.74621999999999,42.56209],[-75.746813,42.56204],[-75.74923800000001,42.56189],[-75.75017800000001,42.561858],[-75.75026,42.561854],[-75.75218599999999,42.561744],[-75.753837,42.561664],[-75.75635699999999,42.561569],[-75.757042,42.561524],[-75.757437,42.561524],[-75.75776999999999,42.561565],[-75.75798899999999,42.561607],[-75.758287,42.5617],[-75.758566,42.561828],[-75.759125,42.562134],[-75.759764,42.562432],[-75.760644,42.562784],[-75.762128,42.563301],[-75.762479,42.563405],[-75.762798,42.563478],[-75.762972,42.563509],[-75.76334,42.563542],[-75.763482,42.563554],[-75.764478,42.563594],[-75.764696,42.563624],[-75.765094,42.563714],[-75.76539200000001,42.563813],[-75.765682,42.563949],[-75.765934,42.564101],[-75.766131,42.564242],[-75.767166,42.565139],[-75.76754800000001,42.565438],[-75.76773799999999,42.565564],[-75.768608,42.566056],[-75.768979,42.566265],[-75.76960200000001,42.566619],[-75.770382,42.567086],[-75.77077800000001,42.567338],[-75.77092399999999,42.567409],[-75.77125700000001,42.567533],[-75.77136299999999,42.567564],[-75.771716,42.567646],[-75.772318,42.567785],[-75.773331,42.568044],[-75.774636,42.568429],[-75.77476,42.568492],[-75.774793,42.568522],[-75.77481899999999,42.568568],[-75.77484699999999,42.56863],[-75.77486,42.568706],[-75.774951,42.569935],[-75.774997,42.570872],[-75.775086,42.571809],[-75.77511800000001,42.572289],[-75.77516199999999,42.573255],[-75.775277,42.57473],[-75.77531399999999,42.575094],[-75.775378,42.575711],[-75.775426,42.577133],[-75.77544,42.577393],[-75.77541600000001,42.57769],[-75.77537,42.57784],[-75.775222,42.578197],[-75.77508,42.578596],[-75.77497700000001,42.578782],[-75.774929,42.578847],[-75.774857,42.578921],[-75.774694,42.579029],[-75.773161,42.57975],[-75.77415499999999,42.579544],[-75.77457800000001,42.579478],[-75.774844,42.579461],[-75.775305,42.579464],[-75.77565,42.579507],[-75.77600099999999,42.579573],[-75.77649599999999,42.579697],[-75.776704,42.579767],[-75.777186,42.579961],[-75.77745400000001,42.580069],[-75.778198,42.580394],[-75.77895100000001,42.580694],[-75.780759,42.581359],[-75.780986,42.581463],[-75.781092,42.58155],[-75.78114600000001,42.581632],[-75.781171,42.581722],[-75.78122999999999,42.582695],[-75.78124099999999,42.582836],[-75.78125199999999,42.582974],[-75.78136000000001,42.582937],[-75.781487,42.582909],[-75.781749,42.58285],[-75.781901,42.582831],[-75.783192,42.582759],[-75.783816,42.58273],[-75.78492199999999,42.582642],[-75.785752,42.58259],[-75.787458,42.582429],[-75.787716,42.582417],[-75.79054600000001,42.582351],[-75.792214,42.582333],[-75.792733,42.582326],[-75.794155,42.582279],[-75.794878,42.582265],[-75.797072,42.582181],[-75.798412,42.582116],[-75.7988,42.582108],[-75.80006299999999,42.582037],[-75.80081800000001,42.582016],[-75.80221899999999,42.581945],[-75.803687,42.5819],[-75.80440900000001,42.581871],[-75.805117,42.581832],[-75.806546,42.581765],[-75.806804,42.581734],[-75.807199,42.581706],[-75.808154,42.581676],[-75.808772,42.581656],[-75.81038700000001,42.581595],[-75.810929,42.581538],[-75.811615,42.581456],[-75.811967,42.581354],[-75.812483,42.581164],[-75.812668,42.581138],[-75.813115,42.581015],[-75.81459,42.580588],[-75.814908,42.58052],[-75.81524,42.580468],[-75.815427,42.580449],[-75.815639,42.58045],[-75.816363,42.580477],[-75.816562,42.580492],[-75.817154,42.580516],[-75.817841,42.580494],[-75.819879,42.580348],[-75.820128,42.580321],[-75.820885,42.580208],[-75.821938,42.580009],[-75.822377,42.579927],[-75.823099,42.579819],[-75.823818,42.579695],[-75.824252,42.579594],[-75.82532,42.579284],[-75.826497,42.578931],[-75.826809,42.578862],[-75.827017,42.578826],[-75.827737,42.578745],[-75.828453,42.578705],[-75.8292,42.578639],[-75.830724,42.578563],[-75.83143099999999,42.578536],[-75.834703,42.578378],[-75.836528,42.578274],[-75.837267,42.578256],[-75.83874900000001,42.57818],[-75.841673,42.578025],[-75.84241400000001,42.577996],[-75.84563799999999,42.577807],[-75.845883,42.577824],[-75.84591500000001,42.577826],[-75.846025,42.577863],[-75.846092,42.577917],[-75.846131,42.577988],[-75.846232,42.578458],[-75.84638099999999,42.57943],[-75.84647,42.579913],[-75.84666,42.580602],[-75.846813,42.581341],[-75.84688300000001,42.581808],[-75.84695000000001,42.582116],[-75.847013,42.582298],[-75.847149,42.582537],[-75.847235,42.582641],[-75.847379,42.582765],[-75.848793,42.583676],[-75.849498,42.584111],[-75.850154,42.584588],[-75.850442,42.584782],[-75.85100799999999,42.585138],[-75.851564,42.585433],[-75.852031,42.585721],[-75.852265,42.585899]]],"type":"Polygon"}
}