{
  "id": "360850114012",
  "type": "Feature",
  "properties": {
    "area_land":366829,
    "area_water":0,
    "geoid":"360850114012",
    "name":"Block Group 2",
    "state":"ny"
},
  "bbox": [
    -74.105259,
    40.581242,
    -74.096169,
    40.590179
],
  "geometry": {"coordinates":[[[-74.10454900000001,40.5865],[-74.103926,40.587076],[-74.102079,40.588741],[-74.101761,40.589067],[-74.101494,40.589344],[-74.100883,40.590179],[-74.098939,40.589181],[-74.097584,40.588488],[-74.098506,40.587808],[-74.097931,40.587516],[-74.09747900000001,40.587298],[-74.098094,40.58685],[-74.09879599999999,40.586301],[-74.098001,40.585916],[-74.09721999999999,40.585497],[-74.098485,40.584455],[-74.097801,40.584026],[-74.09702,40.583559],[-74.096169,40.583044],[-74.096631,40.582672],[-74.096993,40.582386],[-74.09704000000001,40.582349],[-74.097718,40.581815],[-74.09844,40.581242],[-74.100612,40.582712],[-74.102497,40.584016],[-74.102617,40.584104],[-74.102789,40.584225],[-74.105259,40.585923],[-74.10454900000001,40.5865]]],"type":"Polygon"}
}