{
  "id": "361190147013",
  "type": "Feature",
  "properties": {
    "area_land":1763136,
    "area_water":0,
    "geoid":"361190147013",
    "name":"Block Group 3",
    "state":"ny"
},
  "bbox": [
    -73.924555,
    41.302928,
    -73.890438,
    41.320083
],
  "geometry": {"coordinates":[[[-73.924412,41.305557],[-73.92421400000001,41.305693],[-73.92349400000001,41.306243],[-73.92313,41.306471],[-73.92283999999999,41.306632],[-73.922613,41.306728],[-73.92206899999999,41.306893],[-73.921768,41.306966],[-73.921426,41.307036],[-73.921048,41.30708],[-73.920655,41.307106],[-73.920424,41.307135],[-73.920222,41.307187],[-73.919777,41.307352],[-73.91954200000001,41.307469],[-73.91934000000001,41.307598],[-73.919021,41.307869],[-73.918859,41.308027],[-73.918459,41.308489],[-73.918076,41.309076],[-73.91789300000001,41.309355],[-73.917728,41.309528],[-73.916758,41.310093],[-73.916072,41.31051],[-73.91584,41.310651],[-73.915117,41.31119],[-73.914929,41.311359],[-73.914815,41.311487],[-73.914731,41.311623],[-73.914691,41.311733],[-73.914672,41.31192],[-73.914698,41.312241],[-73.91463400000001,41.312311],[-73.914412,41.312547],[-73.91428000000001,41.312664],[-73.914069,41.312811],[-73.91391299999999,41.3129],[-73.91336200000001,41.313094],[-73.913028,41.313191],[-73.91108199999999,41.313705],[-73.91036,41.313864],[-73.91025999999999,41.313892],[-73.909976,41.313936],[-73.909509,41.31408],[-73.90930299999999,41.31416],[-73.90895399999999,41.31434],[-73.908984,41.31441],[-73.90897699999999,41.314489],[-73.908959,41.314573],[-73.908895,41.314688],[-73.908844,41.314765],[-73.908755,41.314842],[-73.90852,41.315031],[-73.908,41.315467],[-73.90788000000001,41.315585],[-73.907798,41.315709],[-73.90774,41.315821],[-73.907427,41.316478],[-73.90736099999999,41.316642],[-73.90725500000001,41.316879],[-73.907104,41.317144],[-73.906902,41.317466],[-73.906661,41.317834],[-73.906413,41.31815],[-73.906156,41.318461],[-73.905788,41.318874],[-73.905569,41.319111],[-73.90528399999999,41.319393],[-73.904876,41.319819],[-73.904556,41.320083],[-73.90488999999999,41.319646],[-73.905626,41.318717],[-73.90565100000001,41.318588],[-73.905636,41.318381],[-73.905604,41.318244],[-73.905529,41.318036],[-73.905421,41.317893],[-73.905322,41.317805],[-73.904713,41.317336],[-73.90455799999999,41.317157],[-73.90436699999999,41.316836],[-73.90428799999999,41.316639],[-73.90387200000001,41.315321],[-73.90385000000001,41.314929],[-73.903796,41.314531],[-73.903739,41.31433],[-73.90363499999999,41.314101],[-73.903558,41.313967],[-73.903192,41.313515],[-73.903012,41.313149],[-73.902838,41.313244],[-73.90268399999999,41.313302],[-73.90244,41.313366],[-73.902103,41.313434],[-73.901597,41.313553],[-73.901466,41.313592],[-73.901324,41.313651],[-73.901191,41.313714],[-73.901034,41.313493],[-73.900509,41.312624],[-73.900436,41.312505],[-73.900361,41.312409],[-73.90029699999999,41.312328],[-73.89995500000001,41.311851],[-73.899849,41.311686],[-73.899496,41.311076],[-73.899404,41.310893],[-73.89925700000001,41.310548],[-73.89919500000001,41.31046],[-73.89900400000001,41.310258],[-73.898824,41.310144],[-73.89866600000001,41.310078],[-73.89838,41.309986],[-73.898133,41.309931],[-73.897898,41.309891],[-73.89728100000001,41.30981],[-73.89644800000001,41.309678],[-73.89611499999999,41.309583],[-73.89489399999999,41.308966],[-73.894775,41.308886],[-73.894549,41.308728],[-73.894428,41.308607],[-73.894272,41.308377],[-73.89402699999999,41.307935],[-73.893917,41.307755],[-73.89380300000001,41.307612],[-73.893429,41.307183],[-73.89331,41.307074],[-73.893181,41.306957],[-73.89284499999999,41.306599],[-73.892533,41.30632],[-73.892353,41.30621],[-73.89207,41.306071],[-73.89175400000001,41.305898],[-73.891012,41.305531],[-73.89082500000001,41.305451],[-73.890652,41.305399],[-73.890438,41.30536],[-73.890494,41.304253],[-73.89054299999999,41.304258],[-73.891572,41.304253],[-73.892368,41.30423],[-73.893165,41.304184],[-73.893655,41.304147],[-73.89394299999999,41.304133],[-73.89440500000001,41.304076],[-73.894875,41.304026],[-73.89524299999999,41.303994],[-73.895562,41.303994],[-73.895847,41.304023],[-73.89591799999999,41.30404],[-73.89601,41.303883],[-73.89608,41.303843],[-73.896209,41.303806],[-73.896653,41.303754],[-73.896973,41.30374],[-73.89733699999999,41.303766],[-73.89739400000001,41.303706],[-73.897937,41.303427],[-73.89853100000001,41.303163],[-73.89874,41.303076],[-73.89912699999999,41.302928],[-73.899372,41.303038],[-73.899691,41.303377],[-73.899793,41.303539],[-73.906513,41.305529],[-73.907877,41.305921],[-73.90925799999999,41.306317],[-73.910454,41.306661],[-73.911523,41.306875],[-73.912262,41.307023],[-73.915201,41.307613],[-73.915976,41.306974],[-73.916973,41.307652],[-73.91703200000001,41.307652],[-73.91720100000001,41.307672],[-73.917343,41.307706],[-73.917492,41.30776],[-73.917675,41.307848],[-73.917845,41.307868],[-73.91796600000001,41.307862],[-73.918116,41.307807],[-73.91856199999999,41.307584],[-73.919037,41.30732],[-73.919937,41.306873],[-73.92053300000001,41.306488],[-73.92116300000001,41.30623],[-73.92149499999999,41.306081],[-73.921753,41.30598],[-73.923412,41.305459],[-73.92426399999999,41.305167],[-73.924555,41.305488],[-73.924412,41.305557]]],"type":"Polygon"}
}