{
  "id": "360550062002",
  "type": "Feature",
  "properties": {
    "area_land":294100,
    "area_water":0,
    "geoid":"360550062002",
    "name":"Block Group 2",
    "state":"ny"
},
  "bbox": [
    -77.658386,
    43.138651,
    -77.650985,
    43.145307
],
  "geometry": {"coordinates":[[[-77.658151,43.139439],[-77.65812099999999,43.139525],[-77.658083,43.139704],[-77.65803,43.140117],[-77.65802600000001,43.140349],[-77.65801500000001,43.140582],[-77.65802600000001,43.140849],[-77.658081,43.141187],[-77.65810399999999,43.141263],[-77.65818,43.141572],[-77.658235,43.141726],[-77.658325,43.141938],[-77.657273,43.142082],[-77.65702,43.142113],[-77.65678200000001,43.142122],[-77.65576900000001,43.142141],[-77.65388400000001,43.142183],[-77.653892,43.14293],[-77.653892,43.143033],[-77.65390600000001,43.143879],[-77.653915,43.144341],[-77.65345000000001,43.144494],[-77.65293800000001,43.144666],[-77.65226699999999,43.144883],[-77.65212200000001,43.144933],[-77.651016,43.145307],[-77.651011,43.145042],[-77.651008,43.144796],[-77.651,43.143899],[-77.650993,43.143037],[-77.650993,43.142236],[-77.650993,43.141271],[-77.65098500000001,43.140397],[-77.65098500000001,43.13952],[-77.65098500000001,43.138677],[-77.65838599999999,43.138651],[-77.658151,43.139439]]],"type":"Polygon"}
}