{
  "id": "360191008005",
  "type": "Feature",
  "properties": {
    "area_land":4625988,
    "area_water":19929031,
    "geoid":"360191008005",
    "name":"Block Group 5",
    "state":"ny"
},
  "bbox": [
    -73.439755,
    44.672688,
    -73.361231,
    44.729504
],
  "geometry": {"coordinates":[[[-73.439143,44.67655],[-73.43864000000001,44.679802],[-73.438243,44.682049],[-73.437887,44.684237],[-73.437714,44.685306],[-73.43752600000001,44.686426],[-73.437423,44.687156],[-73.43732799999999,44.68784],[-73.43725000000001,44.688269],[-73.437189,44.688606],[-73.437147,44.688914],[-73.437003,44.68971],[-73.436823,44.691053],[-73.43670400000001,44.691798],[-73.43640000000001,44.693694],[-73.43567299999999,44.697087],[-73.434594,44.701112],[-73.43443000000001,44.701726],[-73.43420500000001,44.702569],[-73.43381599999999,44.703983],[-73.432942,44.707165],[-73.43261200000001,44.708368],[-73.42954,44.71969],[-73.42998799999999,44.721025],[-73.430362,44.722141],[-73.430893,44.723516],[-73.42998799999999,44.723688],[-73.426458,44.724388],[-73.425344,44.724633],[-73.424542,44.724799],[-73.422996,44.725075],[-73.422613,44.725127],[-73.42196300000001,44.725185],[-73.42133200000001,44.725196],[-73.420858,44.725181],[-73.420361,44.725143],[-73.41988499999999,44.725106],[-73.419557,44.725053],[-73.418961,44.72494],[-73.418458,44.72487],[-73.418367,44.724826],[-73.41792100000001,44.724544],[-73.417309,44.724067],[-73.41609099999999,44.7246],[-73.415718,44.724638],[-73.415396,44.7246],[-73.415054,44.724511],[-73.414858,44.724511],[-73.41465599999999,44.724556],[-73.414491,44.724688],[-73.41440299999999,44.724821],[-73.41437999999999,44.724951],[-73.41433600000001,44.725169],[-73.41428000000001,44.725286],[-73.414171,44.725395],[-73.41374999999999,44.725577],[-73.41340599999999,44.725711],[-73.411553,44.726494],[-73.408511,44.727781],[-73.407329,44.728296],[-73.404768,44.729393],[-73.40455900000001,44.729472],[-73.404397,44.729504],[-73.40439000000001,44.729475],[-73.404222,44.728736],[-73.403744,44.726631],[-73.39730299999999,44.71876],[-73.389543,44.702928],[-73.389515,44.702871],[-73.38891099999999,44.701637],[-73.385971,44.701846],[-73.385812,44.701857],[-73.381811,44.702144],[-73.38134700000001,44.702137],[-73.381157,44.702079],[-73.374577,44.70073],[-73.365752,44.698821],[-73.36578900000001,44.698534],[-73.365977,44.697559],[-73.36583899999999,44.697043],[-73.36524900000001,44.69657],[-73.364661,44.696394],[-73.36389200000001,44.696202],[-73.363146,44.696131],[-73.362264,44.696004],[-73.361744,44.69582],[-73.36144899999999,44.695531],[-73.361323,44.69537],[-73.361231,44.695016],[-73.36130799999999,44.694524],[-73.361476,44.694097],[-73.361621,44.693726],[-73.36219,44.692716],[-73.36231600000001,44.692492],[-73.363135,44.691395],[-73.36412300000001,44.690136],[-73.36437100000001,44.689878],[-73.36445999999999,44.689652],[-73.364537,44.689249],[-73.364726,44.688435],[-73.365297,44.687548],[-73.365736,44.687169],[-73.36694199999999,44.686546],[-73.368235,44.685922],[-73.369376,44.685372],[-73.369962,44.685032],[-73.370142,44.684855],[-73.37007199999999,44.684436],[-73.369924,44.684146],[-73.369798,44.683943],[-73.369685,44.68376],[-73.369197,44.683262],[-73.369001,44.683102],[-73.368233,44.682475],[-73.367983,44.682169],[-73.367687,44.681751],[-73.367414,44.681293],[-73.36721799999999,44.680407],[-73.367155,44.678982],[-73.367209,44.678514],[-73.367546,44.678151],[-73.36951000000001,44.677857],[-73.370413,44.677718],[-73.370555,44.677679],[-73.371089,44.677531],[-73.37163,44.67724],[-73.371843,44.676957],[-73.37187,44.676013],[-73.435501,44.673059],[-73.436555,44.672956],[-73.43975500000001,44.672688],[-73.439143,44.67655]]],"type":"Polygon"}
}