{
  "id": "360550123014",
  "type": "Feature",
  "properties": {
    "area_land":4036271,
    "area_water":205711,
    "geoid":"360550123014",
    "name":"Block Group 4",
    "state":"ny"
},
  "bbox": [
    -77.558113,
    43.077176,
    -77.519503,
    43.100475
],
  "geometry": {"coordinates":[[[-77.55811300000001,43.087413],[-77.556967,43.089533],[-77.556696,43.090094],[-77.556228,43.090893],[-77.555965,43.091332],[-77.55595099999999,43.091332],[-77.555897,43.091444],[-77.555378,43.09244],[-77.555272,43.092645],[-77.555224,43.092733],[-77.555098,43.09295],[-77.55399,43.094839],[-77.55284,43.096876],[-77.55343499999999,43.096856],[-77.55184199999999,43.099753],[-77.551728,43.099765],[-77.551599,43.099788],[-77.55157,43.099795],[-77.551439,43.099824],[-77.551006,43.099921],[-77.55049099999999,43.100029],[-77.549285,43.100284],[-77.547006,43.100215],[-77.54415899999999,43.100197],[-77.543548,43.100194],[-77.54208199999999,43.10002],[-77.541428,43.099946],[-77.53788400000001,43.099871],[-77.53660000000001,43.100175],[-77.536472,43.100205],[-77.535833,43.100389],[-77.535481,43.100475],[-77.535355,43.100406],[-77.53440399999999,43.09983],[-77.533661,43.099401],[-77.53140399999999,43.098099],[-77.530738,43.097711],[-77.530376,43.0975],[-77.529415,43.096956],[-77.52914800000001,43.096806],[-77.527422,43.095832],[-77.525524,43.094885],[-77.524328,43.094375],[-77.52227999999999,43.093499],[-77.52212900000001,43.093435],[-77.521978,43.09337],[-77.521939,43.093354],[-77.521721,43.09326],[-77.520748,43.092844],[-77.519503,43.092331],[-77.520799,43.090519],[-77.521818,43.089113],[-77.523141,43.087366],[-77.52373,43.087356],[-77.523762,43.087356],[-77.52616,43.087346],[-77.527867,43.087332],[-77.52783100000001,43.08524],[-77.52783599999999,43.085144],[-77.527851,43.085046],[-77.527871,43.084959],[-77.527901,43.084871],[-77.527942,43.084779],[-77.527991,43.084687],[-77.528184,43.084394],[-77.528251,43.084261],[-77.52831,43.084084],[-77.528334,43.083972],[-77.52835399999999,43.083733],[-77.528362,43.083389],[-77.528352,43.082439],[-77.528339,43.082335],[-77.52830899999999,43.08223],[-77.52825900000001,43.082128],[-77.528195,43.082041],[-77.528113,43.081959],[-77.528018,43.081884],[-77.527913,43.08182],[-77.52779700000001,43.081769],[-77.527669,43.081733],[-77.52753199999999,43.081708],[-77.52741399999999,43.081697],[-77.52728500000001,43.081693],[-77.524523,43.081693],[-77.523968,43.081693],[-77.523843,43.081691],[-77.523849,43.080442],[-77.524629,43.08044],[-77.52573599999999,43.080438],[-77.526133,43.080437],[-77.52626100000001,43.080432],[-77.526371,43.080421],[-77.526473,43.080406],[-77.52656399999999,43.080386],[-77.526742,43.080337],[-77.526836,43.0803],[-77.526927,43.080259],[-77.527021,43.080211],[-77.527818,43.079775],[-77.52909699999999,43.079091],[-77.529295,43.078993],[-77.52937799999999,43.078941],[-77.529447,43.078884],[-77.529511,43.078818],[-77.52956500000001,43.07874],[-77.52960400000001,43.078648],[-77.529627,43.078545],[-77.529641,43.078384],[-77.529652,43.077745],[-77.529663,43.077176],[-77.529996,43.077226],[-77.53046399999999,43.077277],[-77.530788,43.077416],[-77.53104500000001,43.077553],[-77.531209,43.077647],[-77.531344,43.077726],[-77.532173,43.078323],[-77.533008,43.078911],[-77.533641,43.079587],[-77.53398199999999,43.079996],[-77.534572,43.080695],[-77.535166,43.081315],[-77.535865,43.081982],[-77.536655,43.082641],[-77.53723599999999,43.08311],[-77.537503,43.083325],[-77.537859,43.083578],[-77.53850300000001,43.083951],[-77.53899,43.084233],[-77.53921200000001,43.08433],[-77.53948800000001,43.084421],[-77.539711,43.08448],[-77.54001700000001,43.084527],[-77.54029,43.08455],[-77.54062500000001,43.084563],[-77.540852,43.084577],[-77.540926,43.084581],[-77.541144,43.084603],[-77.54142400000001,43.084645],[-77.541676,43.084688],[-77.542041,43.084761],[-77.542866,43.08493],[-77.54275699999999,43.085168],[-77.542666,43.085418],[-77.542597,43.085669],[-77.542539,43.085962],[-77.542513,43.086307],[-77.54257699999999,43.086861],[-77.542654,43.087283],[-77.542683,43.08737],[-77.545829,43.087418],[-77.550004,43.087392],[-77.55274300000001,43.08743],[-77.553355,43.087434],[-77.55338500000001,43.087435],[-77.553933,43.087439],[-77.554592,43.087443],[-77.557545,43.087418],[-77.557653,43.087417],[-77.55811300000001,43.087413]]],"type":"Polygon"}
}