{
  "id": "360810934010",
  "type": "Feature",
  "properties": {
    "area_land":0,
    "area_water":554670,
    "geoid":"360810934010",
    "name":"Block Group 0",
    "state":"ny"
},
  "bbox": [
    -73.854937,
    40.581547,
    -73.838752,
    40.586087
],
  "geometry": {"coordinates":[[[-73.85493700000001,40.585974],[-73.840704,40.586087],[-73.838752,40.582629],[-73.838829,40.582594],[-73.838888,40.582574],[-73.83891800000001,40.582535],[-73.838972,40.582485],[-73.839023,40.58242],[-73.839045,40.58237],[-73.839097,40.582291],[-73.83916600000001,40.582173],[-73.83921599999999,40.582072],[-73.83926599999999,40.581993],[-73.839296,40.581864],[-73.839354,40.581857],[-73.840333,40.581808],[-73.8413,40.581758],[-73.84225000000001,40.58171],[-73.84230599999999,40.581707],[-73.843154,40.58167],[-73.844176,40.581625],[-73.844922,40.581592],[-73.845181,40.581581],[-73.84614999999999,40.581753],[-73.847258,40.581949],[-73.848196,40.582115],[-73.84861100000001,40.582188],[-73.849307,40.582166],[-73.850444,40.58213],[-73.851347,40.581828],[-73.85218999999999,40.581547],[-73.85493700000001,40.585974]]],"type":"Polygon"}
}