{
  "id": "360550024003",
  "type": "Feature",
  "properties": {
    "area_land":188129,
    "area_water":0,
    "geoid":"360550024003",
    "name":"Block Group 3",
    "state":"ny"
},
  "bbox": [
    -77.649059,
    43.168698,
    -77.643005,
    43.173863
],
  "geometry": {"coordinates":[[[-77.64904900000001,43.172896],[-77.64904799999999,43.173852],[-77.648984,43.173853],[-77.648246,43.173863],[-77.648246,43.173518],[-77.648246,43.173093],[-77.648239,43.172322],[-77.643028,43.172338],[-77.64302000000001,43.171941],[-77.643005,43.171605],[-77.643005,43.170491],[-77.643005,43.169003],[-77.64330200000001,43.169003],[-77.644317,43.169011],[-77.644531,43.169011],[-77.645438,43.169014],[-77.64585700000001,43.169012],[-77.646565,43.169012],[-77.64730900000001,43.169006],[-77.647375,43.169001],[-77.64743900000001,43.16899],[-77.64768100000001,43.168933],[-77.647722,43.168923],[-77.64858,43.16872],[-77.648734,43.168698],[-77.64872699999999,43.170377],[-77.648877,43.170664],[-77.648893,43.171024],[-77.64884000000001,43.171195],[-77.648899,43.171392],[-77.64896899999999,43.17169],[-77.649019,43.17199],[-77.64904900000001,43.172292],[-77.64905899999999,43.172594],[-77.64904900000001,43.172896]]],"type":"Polygon"}
}