{
  "id": "360550126004",
  "type": "Feature",
  "properties": {
    "area_land":1520693,
    "area_water":0,
    "geoid":"360550126004",
    "name":"Block Group 4",
    "state":"ny"
},
  "bbox": [
    -77.548378,
    43.116697,
    -77.517138,
    43.129302
],
  "geometry": {"coordinates":[[[-77.548365,43.123938],[-77.548344,43.124065],[-77.548306,43.124197],[-77.54826300000001,43.124354],[-77.548123,43.124644],[-77.547443,43.125828],[-77.54676600000001,43.127021],[-77.54455,43.127089],[-77.543142,43.127132],[-77.54261,43.127157],[-77.541478,43.127211],[-77.539276,43.127289],[-77.538324,43.127362],[-77.537406,43.127475],[-77.53675200000001,43.12756],[-77.536395,43.127595],[-77.533968,43.12774],[-77.53118600000001,43.127907],[-77.530357,43.127962],[-77.53029600000001,43.127966],[-77.530128,43.127984],[-77.52999199999999,43.128005],[-77.52985200000001,43.128034],[-77.529617,43.128102],[-77.529511,43.128145],[-77.528907,43.128439],[-77.528587,43.128081],[-77.528074,43.127287],[-77.528289,43.128721],[-77.52797200000001,43.128828],[-77.527711,43.128906],[-77.52717199999999,43.129054],[-77.526797,43.129129],[-77.526742,43.129137],[-77.52641800000001,43.129187],[-77.526364,43.12923],[-77.52602899999999,43.129283],[-77.525965,43.129172],[-77.525766,43.129128],[-77.52561900000001,43.129082],[-77.525524,43.129045],[-77.52544399999999,43.129],[-77.525285,43.128917],[-77.525409,43.129177],[-77.525446,43.129254],[-77.525468,43.129295],[-77.525357,43.129302],[-77.525013,43.129288],[-77.524947,43.129285],[-77.52475,43.129267],[-77.52448099999999,43.129236],[-77.524197,43.129194],[-77.523889,43.129142],[-77.523612,43.12908],[-77.52334,43.129013],[-77.523127,43.128953],[-77.522929,43.128899],[-77.52273700000001,43.128829],[-77.52253399999999,43.128753],[-77.52230299999999,43.128648],[-77.52206700000001,43.128519],[-77.52188599999999,43.128395],[-77.521674,43.128243],[-77.521832,43.128197],[-77.522504,43.128101],[-77.52188200000001,43.128031],[-77.52177,43.12803],[-77.52165100000001,43.128037],[-77.52160000000001,43.128042],[-77.521501,43.128054],[-77.52147100000001,43.12806],[-77.521146,43.128125],[-77.52109299999999,43.128136],[-77.52095199999999,43.128151],[-77.52081800000001,43.12815],[-77.52069299999999,43.128138],[-77.518912,43.127763],[-77.51869600000001,43.127705],[-77.51855399999999,43.127645],[-77.51821700000001,43.127408],[-77.51786800000001,43.127162],[-77.517563,43.126947],[-77.51746900000001,43.126891],[-77.517366,43.126855],[-77.51728900000001,43.126851],[-77.517257,43.126853],[-77.517138,43.126857],[-77.51714800000001,43.126499],[-77.517155,43.126324],[-77.517207,43.124318],[-77.51721000000001,43.124181],[-77.517211,43.124134],[-77.517212,43.124111],[-77.517219,43.124017],[-77.520064,43.124056],[-77.522507,43.124078],[-77.522778,43.124081],[-77.523005,43.124085],[-77.52310300000001,43.124085],[-77.523258,43.124086],[-77.523366,43.124088],[-77.52375499999999,43.124092],[-77.52498799999999,43.124112],[-77.52546599999999,43.124121],[-77.527297,43.124157],[-77.527439,43.12416],[-77.528682,43.124182],[-77.529269,43.124189],[-77.53023899999999,43.1242],[-77.538633,43.124215],[-77.53894200000001,43.123637],[-77.539411,43.122749],[-77.54011800000001,43.121408],[-77.54063499999999,43.120478],[-77.540736,43.120297],[-77.54104,43.11975],[-77.541878,43.118208],[-77.542556,43.11694],[-77.54264000000001,43.116907],[-77.54272899999999,43.116889],[-77.54311800000001,43.116873],[-77.548029,43.116697],[-77.548118,43.118408],[-77.54816099999999,43.11934],[-77.548378,43.123453],[-77.548365,43.123938]]],"type":"Polygon"}
}