{
  "id": "360010132003",
  "type": "Feature",
  "properties": {
    "area_land":182981,
    "area_water":13403,
    "geoid":"360010132003",
    "name":"Block Group 3",
    "state":"ny"
},
  "bbox": [
    -73.704792,
    42.727675,
    -73.697263,
    42.732674
],
  "geometry": {"coordinates":[[[-73.704685,42.728901],[-73.704633,42.729341],[-73.704418,42.73092],[-73.704353,42.731359],[-73.703738,42.731311],[-73.702562,42.731218],[-73.701356,42.731152],[-73.700599,42.7311],[-73.699881,42.731029],[-73.699786,42.731608],[-73.699697,42.73227],[-73.699158,42.732674],[-73.698911,42.732661],[-73.69895099999999,42.732195],[-73.698474,42.731805],[-73.698306,42.731669],[-73.698469,42.731208],[-73.699034,42.729831],[-73.69917599999999,42.72946],[-73.699183,42.729429],[-73.699207,42.729362],[-73.698903,42.729267],[-73.69813600000001,42.729047],[-73.69726300000001,42.728778],[-73.697346,42.728365],[-73.697484,42.727675],[-73.69881599999999,42.727765],[-73.699117,42.727772],[-73.699495,42.72778],[-73.699719,42.727822],[-73.700164,42.727905],[-73.70056099999999,42.727937],[-73.701812,42.728036],[-73.701936,42.728043],[-73.70200800000001,42.728098],[-73.70302100000001,42.728151],[-73.704184,42.728251],[-73.704792,42.7283],[-73.704685,42.728901]]],"type":"Polygon"}
}