{
  "id": "360610279005",
  "type": "Feature",
  "properties": {
    "area_land":28223,
    "area_water":0,
    "geoid":"360610279005",
    "name":"Block Group 5",
    "state":"ny"
},
  "bbox": [
    -73.933681,
    40.856503,
    -73.931313,
    40.859536
],
  "geometry": {"coordinates":[[[-73.933432,40.857271],[-73.93340600000001,40.857323],[-73.93298299999999,40.858113],[-73.932284,40.859448],[-73.932264,40.859469],[-73.93223999999999,40.859488],[-73.93221200000001,40.859504],[-73.932182,40.859517],[-73.93214999999999,40.859527],[-73.93211700000001,40.859533],[-73.93208199999999,40.859536],[-73.93204799999999,40.859535],[-73.932014,40.85953],[-73.93198099999999,40.859522],[-73.931313,40.859328],[-73.93181800000001,40.858271],[-73.93204299999999,40.857841],[-73.932631,40.856716],[-73.932761,40.856503],[-73.93368100000001,40.856783],[-73.933432,40.857271]]],"type":"Polygon"}
}