{
  "id": "360379503002",
  "type": "Feature",
  "properties": {
    "area_land":36426065,
    "area_water":163107,
    "geoid":"360379503002",
    "name":"Block Group 2",
    "state":"ny"
},
  "bbox": [
    -78.413597,
    43.030638,
    -78.310956,
    43.074727
],
  "geometry": {"coordinates":[[[-78.413428,43.074725],[-78.41067,43.074718],[-78.408997,43.074698],[-78.407623,43.074702],[-78.40508800000001,43.074683],[-78.404045,43.074676],[-78.40263,43.074657],[-78.399283,43.07462],[-78.39766400000001,43.074621],[-78.397577,43.074621],[-78.396038,43.074605],[-78.394417,43.074599],[-78.391588,43.074557],[-78.391122,43.074545],[-78.38875,43.074497],[-78.385991,43.074451],[-78.37560499999999,43.074236],[-78.375046,43.074227],[-78.372946,43.074176],[-78.36963,43.074117],[-78.366546,43.074089],[-78.36631800000001,43.074087],[-78.364816,43.074081],[-78.36211400000001,43.07405],[-78.360343,43.074031],[-78.357373,43.074017],[-78.355456,43.07398],[-78.350037,43.073934],[-78.349192,43.07392],[-78.34755,43.073902],[-78.345292,43.073885],[-78.343369,43.07386],[-78.337005,43.073811],[-78.335503,43.073801],[-78.323899,43.073726],[-78.32051199999999,43.07369],[-78.31941500000001,43.073689],[-78.316157,43.073666],[-78.31271700000001,43.073623],[-78.311913,43.073608],[-78.310956,43.073605],[-78.310976,43.070641],[-78.31101,43.067821],[-78.311015,43.065946],[-78.311016,43.065802],[-78.311016,43.065772],[-78.31101700000001,43.065684],[-78.31103,43.064494],[-78.311053,43.06331],[-78.311076,43.061985],[-78.311115,43.060021],[-78.311132,43.058774],[-78.311262,43.053429],[-78.311381,43.048839],[-78.311487,43.043714],[-78.31138799999999,43.039034],[-78.31126399999999,43.035097],[-78.3112,43.033218],[-78.31250300000001,43.033211],[-78.315263,43.033233],[-78.31911100000001,43.033281],[-78.32057500000001,43.033286],[-78.324901,43.033337],[-78.32632599999999,43.033364],[-78.330206,43.033395],[-78.33201200000001,43.033413],[-78.335689,43.033424],[-78.336095,43.033431],[-78.33609,43.036539],[-78.336089,43.036645],[-78.33617700000001,43.03665],[-78.34335799999999,43.036598],[-78.349355,43.036559],[-78.356371,43.036514],[-78.356393,43.034797],[-78.374746,43.034461],[-78.377802,43.034264],[-78.385169,43.033789],[-78.387248,43.033823],[-78.387229,43.032132],[-78.387224,43.03207],[-78.387221,43.03147],[-78.38839,43.031488],[-78.38865199999999,43.03149],[-78.388696,43.032141],[-78.396102,43.032185],[-78.397319,43.032826],[-78.397577,43.032802],[-78.397801,43.032619],[-78.39809200000001,43.032437],[-78.39894700000001,43.031968],[-78.399924,43.031893],[-78.400491,43.032101],[-78.401139,43.032325],[-78.401808,43.032322],[-78.402131,43.032209],[-78.402624,43.031948],[-78.403172,43.031701],[-78.404623,43.031945],[-78.405148,43.032033],[-78.40519,43.031693],[-78.40673200000001,43.032273],[-78.40742299999999,43.032515],[-78.409052,43.033147],[-78.410257,43.031361],[-78.410742,43.030638],[-78.41169600000001,43.030958],[-78.41256,43.031227],[-78.412505,43.031848],[-78.41215200000001,43.045261],[-78.41166800000001,43.060261],[-78.41168,43.061467],[-78.411598,43.062494],[-78.41151499999999,43.063803],[-78.41138100000001,43.067413],[-78.411264,43.070385],[-78.411259,43.070754],[-78.413597,43.074727],[-78.413428,43.074725]]],"type":"Polygon"}
}