{
  "id": "360810260001",
  "type": "Feature",
  "properties": {
    "area_land":86582,
    "area_water":0,
    "geoid":"360810260001",
    "name":"Block Group 1",
    "state":"ny"
},
  "bbox": [
    -73.793635,
    40.691921,
    -73.788931,
    40.696565
],
  "geometry": {"coordinates":[[[-73.79289300000001,40.693821],[-73.79213,40.694116],[-73.791005,40.694595],[-73.792163,40.69618],[-73.791247,40.696565],[-73.790087,40.694981],[-73.78893100000001,40.693398],[-73.789845,40.693007],[-73.790954,40.692526],[-73.791723,40.6922],[-73.792384,40.691921],[-73.79363499999999,40.693471],[-73.79289300000001,40.693821]]],"type":"Polygon"}
}