{
  "id": "360810997051",
  "type": "Feature",
  "properties": {
    "area_land":440081,
    "area_water":0,
    "geoid":"360810997051",
    "name":"Block Group 1",
    "state":"ny"
},
  "bbox": [
    -73.792657,
    40.782385,
    -73.781715,
    40.791749
],
  "geometry": {"coordinates":[[[-73.79258,40.790717],[-73.79227299999999,40.790447],[-73.792068,40.790102],[-73.79183999999999,40.789841],[-73.791524,40.78957],[-73.791434,40.789631],[-73.790757,40.790106],[-73.790282,40.790317],[-73.78988699999999,40.790372],[-73.788831,40.790357],[-73.788354,40.790328],[-73.787994,40.79035],[-73.787502,40.790309],[-73.785681,40.790341],[-73.784738,40.790513],[-73.783838,40.790641],[-73.78334700000001,40.790801],[-73.783179,40.790866],[-73.78253100000001,40.791277],[-73.782546,40.791356],[-73.784407,40.791676],[-73.784402,40.791718],[-73.784342,40.791749],[-73.782388,40.791376],[-73.78171500000001,40.79053],[-73.781998,40.789743],[-73.782048,40.789613],[-73.78209699999999,40.789486],[-73.78214199999999,40.789371],[-73.78218099999999,40.789279],[-73.782229,40.789127],[-73.782259,40.788972],[-73.782273,40.788816],[-73.78227,40.788661],[-73.782518,40.788618],[-73.782713,40.788669],[-73.78291400000001,40.788707],[-73.783118,40.788745],[-73.78332399999999,40.788746],[-73.783529,40.788745],[-73.782617,40.784312],[-73.78237,40.782969],[-73.785196,40.782429],[-73.785422,40.782385],[-73.78569299999999,40.783181],[-73.785731,40.783295],[-73.785894,40.783638],[-73.786045,40.783894],[-73.78622,40.784154],[-73.786458,40.784502],[-73.78652200000001,40.784597],[-73.786582,40.784685],[-73.787127,40.785357],[-73.78746599999999,40.785728],[-73.78758500000001,40.785858],[-73.78807999999999,40.786267],[-73.78814,40.786317],[-73.789804,40.787535],[-73.79029300000001,40.787893],[-73.790402,40.787987],[-73.790583,40.788129],[-73.790705,40.788225],[-73.790896,40.788382],[-73.791017,40.788484],[-73.79141799999999,40.788851],[-73.79159,40.789008],[-73.79164,40.789061],[-73.791848,40.789304],[-73.79189599999999,40.789363],[-73.792056,40.789567],[-73.792411,40.79007],[-73.79265700000001,40.790521],[-73.79258,40.790717]]],"type":"Polygon"}
}