{
  "id": "360470422002",
  "type": "Feature",
  "properties": {
    "area_land":117597,
    "area_water":0,
    "geoid":"360470422002",
    "name":"Block Group 2",
    "state":"ny"
},
  "bbox": [
    -73.97259,
    40.604195,
    -73.966959,
    40.607259
],
  "geometry": {"coordinates":[[[-73.97259,40.606671],[-73.97150600000001,40.606791],[-73.970488,40.606905],[-73.96956,40.607005],[-73.96863399999999,40.607106],[-73.96755400000001,40.607226],[-73.96726099999999,40.607259],[-73.966959,40.605662],[-73.96722699999999,40.605568],[-73.96751,40.605395],[-73.968219,40.604937],[-73.968687,40.604602],[-73.969094,40.604551],[-73.970021,40.604444],[-73.970991,40.604322],[-73.972178,40.604195],[-73.972398,40.605652],[-73.97259,40.606671]]],"type":"Polygon"}
}