{
  "id": "360050403041",
  "type": "Feature",
  "properties": {
    "area_land":23445,
    "area_water":0,
    "geoid":"360050403041",
    "name":"Block Group 1",
    "state":"ny"
},
  "bbox": [
    -73.897403,
    40.867038,
    -73.894963,
    40.86923
],
  "geometry": {"coordinates":[[[-73.89656100000001,40.868565],[-73.89603700000001,40.86923],[-73.89582900000001,40.869137],[-73.894963,40.868749],[-73.89631300000001,40.867038],[-73.897403,40.867474],[-73.89656100000001,40.868565]]],"type":"Polygon"}
}