{
  "id": "360470746002",
  "type": "Feature",
  "properties": {
    "area_land":118078,
    "area_water":0,
    "geoid":"360470746002",
    "name":"Block Group 2",
    "state":"ny"
},
  "bbox": [
    -73.946514,
    40.615363,
    -73.940805,
    40.620331
],
  "geometry": {"coordinates":[[[-73.94651399999999,40.619494],[-73.945516,40.619606],[-73.944518,40.619714],[-73.943591,40.619816],[-73.94266399999999,40.619918],[-73.941727,40.620023],[-73.94157,40.620086],[-73.94142600000001,40.620229],[-73.94129100000001,40.620301],[-73.941174,40.620327],[-73.941024,40.620331],[-73.94097499999999,40.620322],[-73.94088499999999,40.620247],[-73.940805,40.620125],[-73.940879,40.619994],[-73.940978,40.619841],[-73.941141,40.619724],[-73.941276,40.61967],[-73.941402,40.619661],[-73.941519,40.61967],[-73.941639,40.619516],[-73.94241599999999,40.618593],[-73.94319400000001,40.617678],[-73.94347,40.617385],[-73.94395799999999,40.616816],[-73.944061,40.616718],[-73.944676,40.616165],[-73.944827,40.616046],[-73.94573699999999,40.615363],[-73.945829,40.615848],[-73.946067,40.617104],[-73.94651399999999,40.619494]]],"type":"Polygon"}
}