{
  "id": "360810884004",
  "type": "Feature",
  "properties": {
    "area_land":152387,
    "area_water":41898,
    "geoid":"360810884004",
    "name":"Block Group 4",
    "state":"ny"
},
  "bbox": [
    -73.838554,
    40.652508,
    -73.831067,
    40.657039
],
  "geometry": {"coordinates":[[[-73.838554,40.655892],[-73.837757,40.656],[-73.837132,40.656105],[-73.83621100000001,40.656236],[-73.83529799999999,40.656366],[-73.83437600000001,40.656498],[-73.833455,40.656631],[-73.833061,40.656688],[-73.83284500000001,40.657039],[-73.83248500000001,40.655874],[-73.832241,40.655087],[-73.832182,40.654895],[-73.83212899999999,40.654875],[-73.83207,40.654894],[-73.832007,40.654901],[-73.831917,40.654883],[-73.831852,40.654885],[-73.83175300000001,40.654962],[-73.831687,40.655091],[-73.831614,40.655194],[-73.831553,40.655243],[-73.831559,40.655355],[-73.831547,40.655416],[-73.83151100000001,40.655475],[-73.83147,40.655553],[-73.831474,40.655633],[-73.831463,40.655701],[-73.831442,40.655767],[-73.831411,40.65583],[-73.831367,40.655898],[-73.83132500000001,40.655949],[-73.831271,40.656003],[-73.83121,40.656053],[-73.831142,40.656097],[-73.83110499999999,40.656119],[-73.831067,40.656138],[-73.831103,40.655947],[-73.83116099999999,40.655919],[-73.83130800000001,40.655599],[-73.83135799999999,40.655471],[-73.83138099999999,40.655352],[-73.83140899999999,40.655193],[-73.83148799999999,40.654994],[-73.83154999999999,40.654917],[-73.831602,40.654842],[-73.831847,40.65461],[-73.83190999999999,40.654638],[-73.83204600000001,40.654481],[-73.832166,40.65453],[-73.832217,40.65446],[-73.83219800000001,40.654454],[-73.832161,40.65451],[-73.832052,40.654466],[-73.83200100000001,40.654441],[-73.832123,40.654273],[-73.832148,40.654168],[-73.832111,40.654094],[-73.831919,40.653954],[-73.83158299999999,40.653814],[-73.831613,40.653749],[-73.831592,40.653647],[-73.83156,40.653603],[-73.831399,40.653514],[-73.831292,40.653471],[-73.83217500000001,40.653361],[-73.832627,40.653285],[-73.833545,40.653152],[-73.83446600000001,40.65302],[-73.835381,40.65289],[-73.83630599999999,40.65276],[-73.836827,40.652667],[-73.83763,40.652508],[-73.83803399999999,40.654253],[-73.838554,40.655892]]],"type":"Polygon"}
}