{
  "id": "361031700022",
  "type": "Feature",
  "properties": {
    "area_land":3414824,
    "area_water":447642,
    "geoid":"361031700022",
    "name":"Block Group 2",
    "state":"ny"
},
  "bbox": [
    -72.484173,
    41.003397,
    -72.454061,
    41.030927
],
  "geometry": {"coordinates":[[[-72.483835,41.013227],[-72.482828,41.015754],[-72.48271699999999,41.016023],[-72.48217699999999,41.016923],[-72.48192299999999,41.017279],[-72.481813,41.017424],[-72.48066900000001,41.018524],[-72.480572,41.018617],[-72.479697,41.019457],[-72.478633,41.020515],[-72.47807299999999,41.021131],[-72.47780400000001,41.021439],[-72.477288,41.022058],[-72.477216,41.022142],[-72.477099,41.02228],[-72.477017,41.022375],[-72.47621599999999,41.023386],[-72.476043,41.023629],[-72.47599099999999,41.023716],[-72.475888,41.023888],[-72.475812,41.024043],[-72.475751,41.024168],[-72.475588,41.024453],[-72.475556,41.024508],[-72.475217,41.024924],[-72.47510699999999,41.025027],[-72.474875,41.025227],[-72.47456699999999,41.025437],[-72.473682,41.025903],[-72.472481,41.026516],[-72.470263,41.02749],[-72.46903500000001,41.028026],[-72.46807699999999,41.028741],[-72.46717599999999,41.029474],[-72.466595,41.030009],[-72.46578599999999,41.030927],[-72.464913,41.030382],[-72.46462200000001,41.029358],[-72.46414,41.027867],[-72.46338900000001,41.02582],[-72.462875,41.024139],[-72.46198099999999,41.023466],[-72.46254500000001,41.022987],[-72.462802,41.02276],[-72.462535,41.022565],[-72.462097,41.02222],[-72.461749,41.021933],[-72.461401,41.021607],[-72.461146,41.021338],[-72.461007,41.021157],[-72.460921,41.021012],[-72.460821,41.02082],[-72.46071999999999,41.020544],[-72.46067499999999,41.020311],[-72.460646,41.019993],[-72.46062499999999,41.019632],[-72.460629,41.018952],[-72.460635,41.018485],[-72.46062999999999,41.018038],[-72.46056,41.017352],[-72.460458,41.016582],[-72.46005599999999,41.015684],[-72.45980299999999,41.015134],[-72.459587,41.014691],[-72.45977499999999,41.01462],[-72.459825,41.014582],[-72.459148,41.013109],[-72.45853700000001,41.012949],[-72.458887,41.012613],[-72.458652,41.011717],[-72.458957,41.012037],[-72.45911599999999,41.011396],[-72.45765900000001,41.010671],[-72.457492,41.010689],[-72.45724800000001,41.010716],[-72.45675300000001,41.010967],[-72.454061,41.00937],[-72.455516,41.00823],[-72.455195,41.007814],[-72.455485,41.007668],[-72.45697199999999,41.008324],[-72.457964,41.008478],[-72.459749,41.008806],[-72.459834,41.008611],[-72.46031499999999,41.008566],[-72.460216,41.008195],[-72.460475,41.00786],[-72.462619,41.006918],[-72.465099,41.005715],[-72.468599,41.003397],[-72.46892,41.003426],[-72.470505,41.003729],[-72.47098800000001,41.003878],[-72.470508,41.004324],[-72.47150000000001,41.003861],[-72.471805,41.004309],[-72.47130900000001,41.004774],[-72.471996,41.004403],[-72.474231,41.005109],[-72.47456699999999,41.005555],[-72.474071,41.005475],[-72.473964,41.005686],[-72.473224,41.005731],[-72.47304800000001,41.005926],[-72.473575,41.006596],[-72.474475,41.006903],[-72.47475,41.007558],[-72.474779,41.009222],[-72.475397,41.010004],[-72.47634499999999,41.010117],[-72.47656600000001,41.01004],[-72.477672,41.009656],[-72.478792,41.010012],[-72.478843,41.009971],[-72.47890599999999,41.009933],[-72.47906999999999,41.009889],[-72.479304,41.009863],[-72.47950299999999,41.009863],[-72.47973,41.009873],[-72.480075,41.009924],[-72.48036500000001,41.010163],[-72.484173,41.012369],[-72.483835,41.013227]]],"type":"Polygon"}
}