{
  "id": "360594092003",
  "type": "Feature",
  "properties": {
    "area_land":378328,
    "area_water":0,
    "geoid":"360594092003",
    "name":"Block Group 3",
    "state":"ny"
},
  "bbox": [
    -73.516417,
    40.715515,
    -73.50481,
    40.722288
],
  "geometry": {"coordinates":[[[-73.516391,40.716769],[-73.51638699999999,40.716835],[-73.515996,40.718705],[-73.51598,40.718779],[-73.51570700000001,40.720091],[-73.51525100000001,40.722288],[-73.514329,40.72218],[-73.514521,40.721211],[-73.51363499999999,40.721106],[-73.51274600000001,40.720999],[-73.51029200000001,40.720704],[-73.510149,40.721383],[-73.51007799999999,40.721711],[-73.50919399999999,40.721604],[-73.50921,40.721564],[-73.509214,40.721488],[-73.50936799999999,40.72075],[-73.509781,40.71876],[-73.509872,40.71833],[-73.509974,40.717819],[-73.50918299999999,40.717851],[-73.50905299999999,40.717875],[-73.508966,40.717905],[-73.508684,40.718036],[-73.508521,40.718122],[-73.50838,40.718176],[-73.508217,40.718209],[-73.50803999999999,40.718216],[-73.50793899999999,40.718208],[-73.506541,40.717959],[-73.50481000000001,40.717647],[-73.505015,40.716979],[-73.505574,40.717079],[-73.506455,40.717237],[-73.507289,40.717387],[-73.507383,40.717384],[-73.507469,40.717366],[-73.507542,40.717333],[-73.507593,40.717287],[-73.50761799999999,40.717243],[-73.50763000000001,40.717177],[-73.507622,40.716288],[-73.507605,40.716123],[-73.50753400000001,40.715829],[-73.508441,40.715803],[-73.51033099999999,40.715755],[-73.51085399999999,40.71574],[-73.51140599999999,40.715727],[-73.514573,40.715515],[-73.514692,40.715856],[-73.514702,40.715966],[-73.514529,40.716804],[-73.515455,40.716745],[-73.516417,40.716684],[-73.516391,40.716769]]],"type":"Polygon"}
}