{
  "id": "360810368001",
  "type": "Feature",
  "properties": {
    "area_land":126189,
    "area_water":0,
    "geoid":"360810368001",
    "name":"Block Group 1",
    "state":"ny"
},
  "bbox": [
    -73.769676,
    40.684328,
    -73.763482,
    40.688992
],
  "geometry": {"coordinates":[[[-73.76955599999999,40.685139],[-73.768495,40.686232],[-73.768286,40.686444],[-73.76736699999999,40.687365],[-73.766541,40.687975],[-73.76582999999999,40.688486],[-73.765085,40.688992],[-73.764813,40.688776],[-73.76425399999999,40.687448],[-73.764105,40.687042],[-73.763999,40.686799],[-73.76384400000001,40.686494],[-73.763595,40.686009],[-73.763482,40.685872],[-73.764396,40.685642],[-73.765254,40.685425],[-73.766111,40.685212],[-73.766792,40.685041],[-73.766969,40.684997],[-73.76782300000001,40.684783],[-73.76826199999999,40.68467],[-73.769159,40.684439],[-73.769361,40.684387],[-73.769676,40.684328],[-73.76955599999999,40.685139]]],"type":"Polygon"}
}