{
  "id": "360270400031",
  "type": "Feature",
  "properties": {
    "area_land":47640320,
    "area_water":1303586,
    "geoid":"360270400031",
    "name":"Block Group 1",
    "state":"ny"
},
  "bbox": [
    -73.636037,
    41.608322,
    -73.55584,
    41.716397
],
  "geometry": {"coordinates":[[[-73.636037,41.704591],[-73.63603500000001,41.704604],[-73.636031,41.704626],[-73.636026,41.704645],[-73.636002,41.704746],[-73.635959,41.704936],[-73.63575299999999,41.705835],[-73.635632,41.706367],[-73.63554999999999,41.706732],[-73.63538800000001,41.707437],[-73.635285,41.707885],[-73.635215,41.708193],[-73.634978,41.709247],[-73.634525,41.71123],[-73.63450400000001,41.711323],[-73.63447600000001,41.711448],[-73.63444699999999,41.711572],[-73.63443100000001,41.711645],[-73.634393,41.711813],[-73.634336,41.712064],[-73.63427,41.712354],[-73.634208,41.712621],[-73.63413300000001,41.712944],[-73.63411600000001,41.71302],[-73.63393000000001,41.713814],[-73.633753,41.714567],[-73.633734,41.714654],[-73.633653,41.715032],[-73.63359,41.715303],[-73.633566,41.715404],[-73.633523,41.715597],[-73.633499,41.715709],[-73.633472,41.71583],[-73.633363,41.716301],[-73.633341,41.716397],[-73.633308,41.716387],[-73.633084,41.716329],[-73.632966,41.716299],[-73.63206700000001,41.716095],[-73.63063,41.715796],[-73.62994399999999,41.715645],[-73.629712,41.715604],[-73.629518,41.715587],[-73.629272,41.715583],[-73.628382,41.71564],[-73.628029,41.715635],[-73.627922,41.715625],[-73.627835,41.715597],[-73.627731,41.715521],[-73.62758599999999,41.715313],[-73.62740599999999,41.715005],[-73.627306,41.714808],[-73.627143,41.71454],[-73.627015,41.714363],[-73.626796,41.714114],[-73.626474,41.713829],[-73.626419,41.713746],[-73.626322,41.713445],[-73.626274,41.713064],[-73.62621799999999,41.712728],[-73.62606599999999,41.712069],[-73.625969,41.711837],[-73.625792,41.711555],[-73.625671,41.711407],[-73.625557,41.711292],[-73.625175,41.711022],[-73.624948,41.711191],[-73.624853,41.711236],[-73.624702,41.711259],[-73.624432,41.711274],[-73.624182,41.7113],[-73.624054,41.711304],[-73.623946,41.71129],[-73.623655,41.711202],[-73.623541,41.711174],[-73.623465,41.71117],[-73.623316,41.711188],[-73.622911,41.711295],[-73.622828,41.711299],[-73.622772,41.711288],[-73.622693,41.711247],[-73.62240199999999,41.711053],[-73.621938,41.710844],[-73.62177200000001,41.710781],[-73.621481,41.710729],[-73.621314,41.710686],[-73.620501,41.710477],[-73.62013899999999,41.71037],[-73.620046,41.710325],[-73.619984,41.710273],[-73.619784,41.710036],[-73.619691,41.709974],[-73.619366,41.709801],[-73.618656,41.709374],[-73.618471,41.70925],[-73.618317,41.709179],[-73.618206,41.709148],[-73.61812,41.709124],[-73.617994,41.709077],[-73.617852,41.708982],[-73.617749,41.708935],[-73.617631,41.708896],[-73.617158,41.708781],[-73.616934,41.708687],[-73.61684700000001,41.708632],[-73.616721,41.708482],[-73.616579,41.708218],[-73.616536,41.708116],[-73.616221,41.707683],[-73.616147,41.707569],[-73.61609,41.707439],[-73.61603700000001,41.707276],[-73.61596400000001,41.706954],[-73.615943,41.70677],[-73.61594700000001,41.70657],[-73.616013,41.706038],[-73.616013,41.705891],[-73.615996,41.705667],[-73.616041,41.704531],[-73.616021,41.704323],[-73.615916,41.703615],[-73.61586699999999,41.702994],[-73.61582199999999,41.702724],[-73.615649,41.702243],[-73.61555799999999,41.7015],[-73.615539,41.701343],[-73.61553499999999,41.701314],[-73.615469,41.701044],[-73.61541699999999,41.700952],[-73.615337,41.700872],[-73.614901,41.700573],[-73.614707,41.700452],[-73.614419,41.700293],[-73.614406,41.700286],[-73.613963,41.700075],[-73.613073,41.699519],[-73.61273,41.699398],[-73.612657,41.69935],[-73.612605,41.699315],[-73.61210699999999,41.698912],[-73.611732,41.698631],[-73.61150600000001,41.698486],[-73.61116699999999,41.698323],[-73.61099400000001,41.69821],[-73.610877,41.698006],[-73.610843,41.697885],[-73.610844,41.697776],[-73.61085,41.697643],[-73.61083600000001,41.697515],[-73.61075599999999,41.697361],[-73.610613,41.697124],[-73.6105,41.696936],[-73.610247,41.696627],[-73.60988399999999,41.696248],[-73.60942,41.695869],[-73.608909,41.695382],[-73.60871299999999,41.695217],[-73.60865800000001,41.695185],[-73.608564,41.695168],[-73.60847800000001,41.695185],[-73.608194,41.695275],[-73.608093,41.695286],[-73.607927,41.695282],[-73.607754,41.695269],[-73.60767800000001,41.695234],[-73.60677699999999,41.694692],[-73.606622,41.694609],[-73.606438,41.69454],[-73.606345,41.694511],[-73.606241,41.694478],[-73.60607400000001,41.694447],[-73.60521199999999,41.694331],[-73.60413200000001,41.694277],[-73.60401,41.694263],[-73.60386800000001,41.694229],[-73.60337,41.694042],[-73.60325899999999,41.694012],[-73.602289,41.693815],[-73.601895,41.693715],[-73.601437,41.693637],[-73.601174,41.693582],[-73.601067,41.693547],[-73.60028800000001,41.693172],[-73.599737,41.692981],[-73.59918,41.692767],[-73.59880200000001,41.692651],[-73.59836199999999,41.69253],[-73.59811999999999,41.692423],[-73.598033,41.692364],[-73.59780499999999,41.692109],[-73.59768,41.691999],[-73.59714700000001,41.691597],[-73.596631,41.69126],[-73.59653400000001,41.691187],[-73.59644400000001,41.691083],[-73.59615700000001,41.690814],[-73.596035,41.690744],[-73.595918,41.690699],[-73.595803,41.690672],[-73.595675,41.690661],[-73.595516,41.690661],[-73.595433,41.690675],[-73.595336,41.690717],[-73.59527,41.690758],[-73.595225,41.690807],[-73.59519,41.690869],[-73.59514900000001,41.690981],[-73.59501400000001,41.691542],[-73.594938,41.691784],[-73.594858,41.691935],[-73.59477099999999,41.69207],[-73.59465,41.692215],[-73.594515,41.69234],[-73.594352,41.692468],[-73.59419,41.692564],[-73.594093,41.692606],[-73.59385,41.692637],[-73.593687,41.692634],[-73.593355,41.692601],[-73.593054,41.692528],[-73.59251500000001,41.69233],[-73.592225,41.692262],[-73.592097,41.692237],[-73.59205300000001,41.692237],[-73.59147299999999,41.692345],[-73.59113000000001,41.692454],[-73.59105099999999,41.692246],[-73.59103399999999,41.692153],[-73.59105099999999,41.691694],[-73.591105,41.690794],[-73.59111,41.690654],[-73.591162,41.690353],[-73.591266,41.689944],[-73.591301,41.689739],[-73.59128699999999,41.68968],[-73.591235,41.689573],[-73.591162,41.689455],[-73.590923,41.689157],[-73.590857,41.68906],[-73.590604,41.688533],[-73.59022400000001,41.6875],[-73.58989099999999,41.686576],[-73.58963799999999,41.685929],[-73.589519,41.685584],[-73.58936199999999,41.685293],[-73.589299,41.685215],[-73.58915500000001,41.685094],[-73.58892899999999,41.684931],[-73.58881,41.684849],[-73.58853499999999,41.684731],[-73.587644,41.684438],[-73.586854,41.684217],[-73.58581100000001,41.683918],[-73.585374,41.683836],[-73.58502,41.683781],[-73.584519,41.683717],[-73.584243,41.683728],[-73.583714,41.683817],[-73.58362200000001,41.683829],[-73.583504,41.683844],[-73.58327300000001,41.683874],[-73.582353,41.683854],[-73.582009,41.683859],[-73.58177000000001,41.683844],[-73.58147700000001,41.683776],[-73.58128000000001,41.683713],[-73.58109899999999,41.683642],[-73.580752,41.683489],[-73.580606,41.683408],[-73.580507,41.683338],[-73.580348,41.683219],[-73.579859,41.682801],[-73.579723,41.68267],[-73.579674,41.682627],[-73.57938,41.682375],[-73.579311,41.68233],[-73.579049,41.682178],[-73.578867,41.682087],[-73.57745,41.681457],[-73.57733899999999,41.681377],[-73.577178,41.681193],[-73.576975,41.680989],[-73.57660300000001,41.680645],[-73.57681599999999,41.679424],[-73.57685499999999,41.679061],[-73.576874,41.678921],[-73.576888,41.678755],[-73.576903,41.678594],[-73.576916,41.678441],[-73.576931,41.678204],[-73.57694100000001,41.677969],[-73.576944,41.677715],[-73.576939,41.677416],[-73.576531,41.67738],[-73.576042,41.677363],[-73.57558400000001,41.677394],[-73.575024,41.677426],[-73.574496,41.67741],[-73.57402999999999,41.677382],[-73.573835,41.677353],[-73.573374,41.677266],[-73.57288,41.677142],[-73.572464,41.676987],[-73.571934,41.676732],[-73.57111500000001,41.676206],[-73.57092799999999,41.676069],[-73.57063100000001,41.675837],[-73.57051199999999,41.675713],[-73.569867,41.674814],[-73.569453,41.674218],[-73.569362,41.674044],[-73.569303,41.673871],[-73.56912699999999,41.672964],[-73.568811,41.671124],[-73.568601,41.669233],[-73.56845800000001,41.668194],[-73.568153,41.667083],[-73.567987,41.666568],[-73.567797,41.666182],[-73.56772100000001,41.666078],[-73.567256,41.665446],[-73.567178,41.66534],[-73.566463,41.664439],[-73.56640899999999,41.664372],[-73.565753,41.66341],[-73.565594,41.663113],[-73.565242,41.662453],[-73.565091,41.662129],[-73.564949,41.661689],[-73.564921,41.66152],[-73.564663,41.660549],[-73.564537,41.660209],[-73.564268,41.659606],[-73.56414100000001,41.659368],[-73.564041,41.659252],[-73.56397,41.659194],[-73.56383099999999,41.659083],[-73.56356700000001,41.65895],[-73.56343200000001,41.658888],[-73.563256,41.658836],[-73.563,41.658774],[-73.562889,41.658764],[-73.56262599999999,41.658759],[-73.562505,41.658747],[-73.56229500000001,41.658761],[-73.56146200000001,41.658779],[-73.56096100000001,41.658776],[-73.560821,41.658768],[-73.56037600000001,41.658711],[-73.559791,41.658562],[-73.559586,41.658506],[-73.559344,41.65841],[-73.55921499999999,41.658324],[-73.558967,41.658102],[-73.558734,41.657909],[-73.558668,41.657818],[-73.557467,41.656588],[-73.55708300000001,41.656137],[-73.556517,41.655404],[-73.556178,41.655012],[-73.555967,41.654701],[-73.555907,41.654578],[-73.555843,41.654391],[-73.55584,41.654147],[-73.555879,41.653421],[-73.555915,41.653196],[-73.55594600000001,41.653071],[-73.555999,41.652957],[-73.55608599999999,41.652831],[-73.55617599999999,41.652727],[-73.556376,41.652523],[-73.556578,41.652336],[-73.556748,41.652185],[-73.557039,41.651915],[-73.557275,41.651654],[-73.55737499999999,41.651547],[-73.557569,41.651317],[-73.557683,41.651194],[-73.557863,41.65098],[-73.558226,41.650553],[-73.558555,41.650176],[-73.55859,41.650137],[-73.558807,41.649922],[-73.559298,41.649417],[-73.560303,41.648392],[-73.560739,41.647931],[-73.56112400000001,41.647421],[-73.561637,41.646671],[-73.561955,41.646225],[-73.56204,41.646121],[-73.562135,41.646001],[-73.56247999999999,41.645636],[-73.56272800000001,41.645428],[-73.56302700000001,41.645176],[-73.56362900000001,41.644779],[-73.563693,41.644744],[-73.564024,41.644562],[-73.56444999999999,41.644349],[-73.56500699999999,41.64408],[-73.565129,41.644031],[-73.565217,41.643972],[-73.565507,41.64381],[-73.566214,41.643451],[-73.567547,41.642729],[-73.56777599999999,41.642604],[-73.567905,41.642524],[-73.56796799999999,41.642486],[-73.56831200000001,41.642241],[-73.568585,41.641975],[-73.56872300000001,41.641814],[-73.56887500000001,41.641599],[-73.569851,41.6399],[-73.570138,41.639371],[-73.57098999999999,41.637793],[-73.57259000000001,41.63482],[-73.573009,41.634029],[-73.573018,41.634014],[-73.573447,41.633223],[-73.57349499999999,41.633132],[-73.573801,41.632509],[-73.573858,41.632405],[-73.57391699999999,41.632252],[-73.57397400000001,41.632092],[-73.574021,41.631948],[-73.574084,41.631675],[-73.574101,41.631611],[-73.574125,41.631472],[-73.574135,41.631318],[-73.57414300000001,41.631104],[-73.57414300000001,41.630945],[-73.574127,41.630769],[-73.57411500000001,41.630625],[-73.574102,41.630534],[-73.574084,41.630365],[-73.574046,41.63013],[-73.574018,41.629941],[-73.57397400000001,41.629706],[-73.573921,41.629236],[-73.573914,41.6291],[-73.573909,41.628911],[-73.57391200000001,41.628707],[-73.573916,41.628545],[-73.573931,41.628339],[-73.573955,41.628064],[-73.574011,41.627694],[-73.574033,41.627572],[-73.57404699999999,41.627487],[-73.574108,41.627181],[-73.574183,41.626817],[-73.574319,41.626158],[-73.574422,41.62563],[-73.574527,41.625114],[-73.57455,41.625005],[-73.574591,41.624818],[-73.574642,41.624619],[-73.57468799999999,41.62443],[-73.57473400000001,41.624285],[-73.574797,41.624066],[-73.57487,41.623829],[-73.575025,41.623273],[-73.575158,41.62265],[-73.575412,41.62135],[-73.57547700000001,41.620954],[-73.575503,41.620806],[-73.575571,41.620486],[-73.575641,41.620124],[-73.57570200000001,41.619831],[-73.57578700000001,41.619396],[-73.575884,41.618889],[-73.575954,41.618504],[-73.576013,41.618191],[-73.57613600000001,41.617584],[-73.576172,41.617411],[-73.576232,41.617098],[-73.576302,41.616754],[-73.57638799999999,41.616334],[-73.57642800000001,41.61612],[-73.57648,41.615851],[-73.57650700000001,41.615714],[-73.576536,41.61557],[-73.576581,41.615338],[-73.57668200000001,41.614847],[-73.576688,41.614802],[-73.57670299999999,41.614724],[-73.57673800000001,41.61455],[-73.576804,41.614275],[-73.57687900000001,41.614024],[-73.577045,41.614006],[-73.57855499999999,41.613847],[-73.578654,41.613837],[-73.579002,41.613801],[-73.579143,41.613787],[-73.58048100000001,41.613652],[-73.580833,41.613617],[-73.58214099999999,41.613486],[-73.582694,41.61343],[-73.583155,41.61338],[-73.583343,41.613359],[-73.5834,41.613353],[-73.58346,41.613346],[-73.586091,41.613056],[-73.59383099999999,41.612171],[-73.59849199999999,41.611628],[-73.598505,41.611626],[-73.598534,41.611623],[-73.598861,41.611585],[-73.608374,41.610493],[-73.61031,41.610271],[-73.610952,41.610197],[-73.61265400000001,41.610007],[-73.617233,41.6095],[-73.618335,41.609367],[-73.62099499999999,41.609065],[-73.622664,41.608881],[-73.626544,41.608459],[-73.627155,41.608409],[-73.62822799999999,41.608322],[-73.62834700000001,41.610329],[-73.628456,41.612149],[-73.628467,41.612343],[-73.628474,41.612451],[-73.62857700000001,41.614187],[-73.628629,41.615063],[-73.62876799999999,41.617396],[-73.628861,41.618972],[-73.62888,41.619308],[-73.62891,41.619791],[-73.62897100000001,41.620829],[-73.629052,41.622173],[-73.62905600000001,41.622243],[-73.629139,41.623648],[-73.62917299999999,41.624215],[-73.629226,41.625106],[-73.62924099999999,41.625349],[-73.62928599999999,41.626113],[-73.62931,41.626509],[-73.62984299999999,41.635479],[-73.62984899999999,41.635574],[-73.62985399999999,41.63566],[-73.629868,41.635893],[-73.630095,41.639703],[-73.630099,41.639765],[-73.63010300000001,41.639838],[-73.630109,41.639908],[-73.63011899999999,41.640019],[-73.63013100000001,41.640163],[-73.630151,41.640404],[-73.63018599999999,41.640812],[-73.630222,41.641226],[-73.63029400000001,41.64207],[-73.63033799999999,41.642497],[-73.63036,41.642743],[-73.630374,41.642901],[-73.63040700000001,41.643269],[-73.630425,41.643547],[-73.630729,41.647153],[-73.630747,41.647364],[-73.630765,41.647564],[-73.630771,41.64763],[-73.630808,41.648057],[-73.631364,41.654455],[-73.631596,41.657167],[-73.632031,41.661988],[-73.63213500000001,41.663189],[-73.632763,41.670363],[-73.63281000000001,41.670732],[-73.63318099999999,41.674588],[-73.633183,41.674624],[-73.63332699999999,41.676128],[-73.63339999999999,41.676909],[-73.63354099999999,41.678407],[-73.63368,41.679922],[-73.63380600000001,41.681274],[-73.634067,41.683992],[-73.634083,41.684162],[-73.634158,41.684938],[-73.634289,41.68627],[-73.634449,41.687916],[-73.63460600000001,41.689562],[-73.63473399999999,41.690912],[-73.634811,41.691719],[-73.634837,41.691996],[-73.634862,41.692264],[-73.63488700000001,41.692527],[-73.63491,41.69278],[-73.634933,41.69303],[-73.63495500000001,41.693266],[-73.634975,41.693489],[-73.635047,41.694266],[-73.635064,41.69445],[-73.635082,41.694638],[-73.63509999999999,41.694832],[-73.63512,41.695037],[-73.635141,41.695256],[-73.635159,41.695443],[-73.63516300000001,41.695489],[-73.63516799999999,41.695541],[-73.635187,41.695735],[-73.63521299999999,41.695996],[-73.63524,41.696269],[-73.635268,41.696555],[-73.635328,41.697163],[-73.63533700000001,41.697246],[-73.63534900000001,41.697372],[-73.635361,41.697394],[-73.63539400000001,41.697814],[-73.635552,41.699413],[-73.635604,41.699976],[-73.63566400000001,41.700634],[-73.635718,41.701194],[-73.635785,41.701897],[-73.635853,41.702625],[-73.635857,41.702668],[-73.635908,41.703213],[-73.63600099999999,41.704173],[-73.636019,41.704356],[-73.63603500000001,41.704535],[-73.636036,41.704547],[-73.636037,41.704567],[-73.636037,41.704591]]],"type":"Polygon"}
}