{
  "id": "360810992001",
  "type": "Feature",
  "properties": {
    "area_land":168232,
    "area_water":0,
    "geoid":"360810992001",
    "name":"Block Group 1",
    "state":"ny"
},
  "bbox": [
    -73.767212,
    40.594572,
    -73.761288,
    40.600435
],
  "geometry": {"coordinates":[[[-73.767212,40.597189],[-73.767201,40.597306],[-73.767191,40.597403],[-73.767156,40.597552],[-73.76706799999999,40.597779],[-73.76696099999999,40.597966],[-73.76688,40.598077],[-73.766744,40.598231],[-73.76661900000001,40.598347],[-73.76638800000001,40.598518],[-73.766171,40.598642],[-73.765997,40.598721],[-73.766542,40.599434],[-73.76444600000001,40.600435],[-73.763868,40.599727],[-73.763361,40.599105],[-73.761658,40.599973],[-73.761588,40.599901],[-73.76128799999999,40.599549],[-73.761815,40.598951],[-73.762553,40.598318],[-73.763335,40.597823],[-73.7632,40.597145],[-73.762997,40.595987],[-73.762778,40.594757],[-73.76363000000001,40.594667],[-73.764402,40.594572],[-73.764622,40.595675],[-73.76464799999999,40.595806],[-73.765559,40.595869],[-73.76652300000001,40.596182],[-73.766723,40.596326],[-73.767157,40.596712],[-73.767145,40.596743],[-73.767185,40.596894],[-73.767206,40.597036],[-73.767212,40.597189]]],"type":"Polygon"}
}