{
  "id": "360050204001",
  "type": "Feature",
  "properties": {
    "area_land":30991,
    "area_water":0,
    "geoid":"360050204001",
    "name":"Block Group 1",
    "state":"ny"
},
  "bbox": [
    -73.853335,
    40.840617,
    -73.850835,
    40.842715
],
  "geometry": {"coordinates":[[[-73.853335,40.84247],[-73.852802,40.842531],[-73.852312,40.842587],[-73.851799,40.842648],[-73.851208,40.842715],[-73.851112,40.842254],[-73.850835,40.842019],[-73.85223499999999,40.840617],[-73.85290000000001,40.841072],[-73.853095,40.841047],[-73.853335,40.84247]]],"type":"Polygon"}
}