{
  "id": "360594097004",
  "type": "Feature",
  "properties": {
    "area_land":425237,
    "area_water":0,
    "geoid":"360594097004",
    "name":"Block Group 4",
    "state":"ny"
},
  "bbox": [
    -73.507686,
    40.691052,
    -73.492788,
    40.69706
],
  "geometry": {"coordinates":[[[-73.50719700000001,40.696262],[-73.506186,40.696159],[-73.505768,40.695969],[-73.505557,40.695794],[-73.505342,40.695689],[-73.504895,40.695643],[-73.50420200000001,40.69578],[-73.503203,40.696177],[-73.50172600000001,40.696408],[-73.500443,40.696601],[-73.497665,40.696998],[-73.497406,40.696928],[-73.49726200000001,40.696837],[-73.496932,40.696393],[-73.496538,40.696263],[-73.496076,40.696332],[-73.49575,40.696548],[-73.495645,40.696827],[-73.495149,40.6968],[-73.494467,40.696874],[-73.492788,40.69706],[-73.49284900000001,40.69687],[-73.492985,40.696505],[-73.493364,40.695772],[-73.493844,40.694868],[-73.49418799999999,40.694271],[-73.494641,40.693527],[-73.494857,40.693117],[-73.494952,40.692859],[-73.495029,40.692672],[-73.495178,40.692112],[-73.4953,40.691214],[-73.495322,40.691052],[-73.495626,40.691158],[-73.49590499999999,40.691277],[-73.49624900000001,40.691488],[-73.49673,40.691813],[-73.496819,40.691915],[-73.49727300000001,40.692217],[-73.49737399999999,40.692127],[-73.49821300000001,40.69267],[-73.498565,40.692849],[-73.499612,40.693181],[-73.500497,40.693431],[-73.500604,40.69347],[-73.50061599999999,40.693537],[-73.500919,40.693712],[-73.501521,40.693778],[-73.502567,40.693836],[-73.504002,40.693757],[-73.506384,40.693602],[-73.50768600000001,40.693539],[-73.50719700000001,40.696262]]],"type":"Polygon"}
}