{
  "id": "360050340003",
  "type": "Feature",
  "properties": {
    "area_land":20518,
    "area_water":0,
    "geoid":"360050340003",
    "name":"Block Group 3",
    "state":"ny"
},
  "bbox": [
    -73.864461,
    40.865489,
    -73.863446,
    40.867839
],
  "geometry": {"coordinates":[[[-73.864385,40.867839],[-73.863446,40.867821],[-73.86351999999999,40.865508],[-73.86446100000001,40.865489],[-73.864385,40.867839]]],"type":"Polygon"}
}