{
  "id": "360810855004",
  "type": "Feature",
  "properties": {
    "area_land":45483,
    "area_water":0,
    "geoid":"360810855004",
    "name":"Block Group 4",
    "state":"ny"
},
  "bbox": [
    -73.826211,
    40.757649,
    -73.823213,
    40.760289
],
  "geometry": {"coordinates":[[[-73.826211,40.759828],[-73.82410900000001,40.760289],[-73.823933,40.759894],[-73.82355699999999,40.759042],[-73.823213,40.75818],[-73.825185,40.757649],[-73.82557,40.758498],[-73.82561,40.758581],[-73.825968,40.759329],[-73.826211,40.759828]]],"type":"Polygon"}
}