{
  "id": "360594087002",
  "type": "Feature",
  "properties": {
    "area_land":182345,
    "area_water":0,
    "geoid":"360594087002",
    "name":"Block Group 2",
    "state":"ny"
},
  "bbox": [
    -73.532924,
    40.739196,
    -73.524391,
    40.7433
],
  "geometry": {"coordinates":[[[-73.532903,40.742474],[-73.532882,40.742798],[-73.53288000000001,40.743158],[-73.532324,40.74315],[-73.53232199999999,40.743299],[-73.527812,40.7433],[-73.52439099999999,40.743206],[-73.524394,40.743059],[-73.524407,40.742368],[-73.524433,40.741007],[-73.524473,40.739196],[-73.525131,40.739217],[-73.525239,40.739248],[-73.525325,40.739314],[-73.525364,40.73938],[-73.52537100000001,40.739424],[-73.52535399999999,40.740295],[-73.52687299999999,40.74034],[-73.528136,40.740379],[-73.528491,40.740381],[-73.528458,40.741067],[-73.528423,40.741726],[-73.530154,40.741755],[-73.531035,40.741764],[-73.531127,40.741758],[-73.53149000000001,40.741686],[-73.531649,40.741665],[-73.532038,40.741655],[-73.532022,40.74199],[-73.53292399999999,40.742017],[-73.532903,40.742474]]],"type":"Polygon"}
}