{
  "id": "360910612003",
  "type": "Feature",
  "properties": {
    "area_land":673941,
    "area_water":0,
    "geoid":"360910612003",
    "name":"Block Group 3",
    "state":"ny"
},
  "bbox": [
    -73.80464,
    43.079495,
    -73.791809,
    43.08835
],
  "geometry": {"coordinates":[[[-73.80464000000001,43.085173],[-73.804435,43.085157],[-73.801987,43.084944],[-73.801104,43.084866],[-73.80004599999999,43.084794],[-73.79947900000001,43.084759],[-73.798947,43.084741],[-73.798445,43.084728],[-73.797957,43.084734],[-73.79800299999999,43.085002],[-73.798132,43.085712],[-73.79821200000001,43.086234],[-73.798394,43.087175],[-73.798597,43.088158],[-73.798607,43.088238],[-73.798574,43.088288],[-73.798429,43.088305],[-73.797431,43.088304],[-73.796312,43.088324],[-73.796097,43.088328],[-73.794798,43.08835],[-73.794763,43.087819],[-73.79474399999999,43.087427],[-73.79473,43.08727],[-73.794724,43.086984],[-73.79468300000001,43.08665],[-73.793333,43.086775],[-73.793217,43.08613],[-73.793144,43.085774],[-73.793036,43.085098],[-73.79244,43.085156],[-73.792427,43.084935],[-73.792395,43.084615],[-73.79227400000001,43.083671],[-73.79216599999999,43.083037],[-73.792092,43.082515],[-73.79201999999999,43.081747],[-73.791809,43.080379],[-73.792309,43.080396],[-73.792581,43.080406],[-73.793109,43.080445],[-73.79357,43.080472],[-73.79391800000001,43.080464],[-73.794265,43.080426],[-73.794652,43.080394],[-73.796054,43.080254],[-73.797738,43.080091],[-73.79815600000001,43.080048],[-73.799212,43.079943],[-73.80023300000001,43.079832],[-73.803839,43.079495],[-73.80416700000001,43.081214],[-73.804428,43.083001],[-73.804558,43.083891],[-73.804618,43.084367],[-73.80461,43.084755],[-73.804615,43.084869],[-73.804624,43.084981],[-73.80464000000001,43.085173]]],"type":"Polygon"}
}