{
  "id": "360810466001",
  "type": "Feature",
  "properties": {
    "area_land":165959,
    "area_water":0,
    "geoid":"360810466001",
    "name":"Block Group 1",
    "state":"ny"
},
  "bbox": [
    -73.791402,
    40.712344,
    -73.781234,
    40.716434
],
  "geometry": {"coordinates":[[[-73.79140200000001,40.713021],[-73.790916,40.713164],[-73.790756,40.713206],[-73.790424,40.713279],[-73.790087,40.713339],[-73.78974700000001,40.713385],[-73.789405,40.713418],[-73.789008,40.713435],[-73.788611,40.71347],[-73.788218,40.713523],[-73.78783,40.713593],[-73.787448,40.71368],[-73.787485,40.713819],[-73.787502,40.713962],[-73.787499,40.714107],[-73.787475,40.714251],[-73.787441,40.714391],[-73.787368,40.714527],[-73.787288,40.714655],[-73.787145,40.714835],[-73.786985,40.715008],[-73.78681,40.715171],[-73.786621,40.715325],[-73.786429,40.715472],[-73.786224,40.71561],[-73.786007,40.715737],[-73.78578,40.715854],[-73.785545,40.715958],[-73.785287,40.716065],[-73.78501900000001,40.716159],[-73.78474300000001,40.71624],[-73.78446099999999,40.716305],[-73.784175,40.716356],[-73.783919,40.716393],[-73.783661,40.716418],[-73.783402,40.716432],[-73.783141,40.716434],[-73.78281200000001,40.716419],[-73.782484,40.716387],[-73.782158,40.716338],[-73.78183900000001,40.716273],[-73.781527,40.716191],[-73.78160099999999,40.716032],[-73.78165300000001,40.715865],[-73.781683,40.715691],[-73.781689,40.715514],[-73.78167000000001,40.715336],[-73.781627,40.715161],[-73.78154499999999,40.714967],[-73.781469,40.71483],[-73.78136000000001,40.71468],[-73.781234,40.714541],[-73.782796,40.71404],[-73.785719,40.713172],[-73.78710100000001,40.71284],[-73.787487,40.712739],[-73.78786599999999,40.712622],[-73.788236,40.71249],[-73.788597,40.712344],[-73.788668,40.712414],[-73.78875600000001,40.712476],[-73.788859,40.712525],[-73.788972,40.71256],[-73.789089,40.712579],[-73.78920599999999,40.712582],[-73.79050700000001,40.712475],[-73.790649,40.712499],[-73.790789,40.712538],[-73.790924,40.712591],[-73.791049,40.712658],[-73.791162,40.712737],[-73.791259,40.712825],[-73.79133899999999,40.712921],[-73.79140200000001,40.713021]]],"type":"Polygon"}
}