{
  "id": "361150860001",
  "type": "Feature",
  "properties": {
    "area_land":54165666,
    "area_water":464552,
    "geoid":"361150860001",
    "name":"Block Group 1",
    "state":"ny"
},
  "bbox": [
    -73.410285,
    43.217377,
    -73.253288,
    43.353
],
  "geometry": {"coordinates":[[[-73.410285,43.303095],[-73.404225,43.303714],[-73.40011699999999,43.304126],[-73.399196,43.304215],[-73.382543,43.305915],[-73.379974,43.306216],[-73.37956,43.306255],[-73.376333,43.306532],[-73.374579,43.306728],[-73.373676,43.306944],[-73.37238499999999,43.30706],[-73.36581700000001,43.307667],[-73.360197,43.308179],[-73.35802200000001,43.30843],[-73.353657,43.308938],[-73.351432,43.309195],[-73.35216,43.313862],[-73.353021,43.318737],[-73.354463,43.326769],[-73.35497100000001,43.329465],[-73.355385,43.331687],[-73.356971,43.340677],[-73.35726,43.342302],[-73.355593,43.342471],[-73.346154,43.343432],[-73.345057,43.343544],[-73.336845,43.344409],[-73.33392499999999,43.344716],[-73.318674,43.346295],[-73.318178,43.346344],[-73.314852,43.346694],[-73.31305,43.346876],[-73.300973,43.34817],[-73.292664,43.349016],[-73.29218899999999,43.349062],[-73.28951600000001,43.349334],[-73.280579,43.350236],[-73.270287,43.351294],[-73.265586,43.351743],[-73.262258,43.352061],[-73.260643,43.352228],[-73.25636299999999,43.352676],[-73.253288,43.353],[-73.25330599999999,43.352677],[-73.25364999999999,43.352369],[-73.25458999999999,43.351678],[-73.254727,43.351562],[-73.254958,43.351325],[-73.255486,43.350711],[-73.255724,43.350404],[-73.255838,43.350236],[-73.25589600000001,43.35013],[-73.255948,43.349991],[-73.256123,43.349286],[-73.256236,43.349037],[-73.25630200000001,43.348945],[-73.256394,43.348861],[-73.256512,43.348773],[-73.256621,43.348711],[-73.256854,43.348606],[-73.257176,43.348481],[-73.25740500000001,43.348416],[-73.257576,43.348393],[-73.257701,43.348387],[-73.258078,43.348433],[-73.258421,43.348501],[-73.25860900000001,43.348524],[-73.25881,43.348541],[-73.259041,43.348528],[-73.259176,43.3485],[-73.259359,43.348454],[-73.25962199999999,43.348348],[-73.25978600000001,43.348251],[-73.259927,43.348159],[-73.260059,43.348045],[-73.26129299999999,43.346875],[-73.26167599999999,43.346484],[-73.26196299999999,43.346131],[-73.26333200000001,43.344249],[-73.263526,43.343968],[-73.263913,43.343287],[-73.26405,43.343097],[-73.264304,43.342785],[-73.264691,43.342415],[-73.265108,43.342107],[-73.26526699999999,43.342021],[-73.26556100000001,43.34189],[-73.266261,43.341549],[-73.266481,43.341426],[-73.26662899999999,43.341323],[-73.266796,43.34119],[-73.267135,43.340878],[-73.26743500000001,43.340547],[-73.26772800000001,43.340256],[-73.268096,43.339853],[-73.268681,43.339107],[-73.269081,43.338635],[-73.26952199999999,43.338146],[-73.270038,43.337535],[-73.270059,43.337503],[-73.270571,43.336733],[-73.271156,43.335799],[-73.271495,43.335315],[-73.272575,43.333727],[-73.27288299999999,43.333303],[-73.27297299999999,43.333211],[-73.273208,43.332999],[-73.273785,43.332622],[-73.27481299999999,43.332033],[-73.27552,43.331607],[-73.27602,43.331255],[-73.27638,43.331014],[-73.27641300000001,43.330999],[-73.27668799999999,43.330875],[-73.27687899999999,43.330805],[-73.277389,43.330674],[-73.27875,43.330366],[-73.278902,43.330332],[-73.27908100000001,43.330281],[-73.280169,43.329939],[-73.28023399999999,43.329918],[-73.280669,43.32978],[-73.28096499999999,43.329702],[-73.280992,43.329697],[-73.281716,43.329549],[-73.28334,43.329259],[-73.283626,43.329407],[-73.28421899999999,43.329676],[-73.28494499999999,43.330028],[-73.285622,43.330347],[-73.286152,43.330609],[-73.286737,43.330848],[-73.286839,43.330883],[-73.287014,43.330915],[-73.287251,43.330924],[-73.28734300000001,43.33092],[-73.287678,43.330837],[-73.288031,43.330768],[-73.2889,43.330617],[-73.28921,43.330554],[-73.289441,43.330497],[-73.289559,43.330455],[-73.289807,43.33033],[-73.290024,43.33016],[-73.29034799999999,43.329861],[-73.290556,43.329689],[-73.290998,43.329388],[-73.291376,43.329165],[-73.291624,43.329001],[-73.292209,43.328542],[-73.292531,43.328333],[-73.29364099999999,43.327763],[-73.29494200000001,43.327055],[-73.295323,43.326865],[-73.29556599999999,43.326783],[-73.29570099999999,43.326754],[-73.295832,43.326738],[-73.29697299999999,43.326699],[-73.29797000000001,43.326678],[-73.298952,43.326676],[-73.300674,43.326707],[-73.301421,43.326696],[-73.301856,43.326661],[-73.302975,43.326512],[-73.303234,43.3265],[-73.303433,43.32651],[-73.303619,43.326536],[-73.303893,43.326592],[-73.304793,43.326799],[-73.305542,43.326993],[-73.30681800000001,43.327289],[-73.307652,43.327491],[-73.308031,43.32759],[-73.30880500000001,43.327793],[-73.309684,43.327998],[-73.30991899999999,43.328037],[-73.310273,43.328082],[-73.310705,43.328113],[-73.311015,43.328123],[-73.31151300000001,43.328107],[-73.312208,43.328032],[-73.31267800000001,43.327972],[-73.315455,43.327049],[-73.316018,43.326829],[-73.317421,43.326231],[-73.317736,43.326086],[-73.318038,43.325918],[-73.318235,43.325788],[-73.318528,43.325523],[-73.318704,43.325304],[-73.318865,43.32504],[-73.318929,43.324874],[-73.319101,43.324157],[-73.319142,43.324031],[-73.319237,43.323841],[-73.319586,43.32342],[-73.31992,43.323069],[-73.320267,43.322659],[-73.320353,43.322539],[-73.320527,43.322242],[-73.320804,43.321696],[-73.320943,43.321348],[-73.321037,43.321031],[-73.32113099999999,43.320544],[-73.321151,43.320444],[-73.321241,43.319925],[-73.321347,43.319543],[-73.322019,43.317802],[-73.322354,43.316998],[-73.32253900000001,43.316634],[-73.32292700000001,43.316005],[-73.323359,43.315445],[-73.323813,43.314873],[-73.32514399999999,43.313222],[-73.325722,43.312501],[-73.325834,43.312326],[-73.325934,43.312134],[-73.32608399999999,43.311808],[-73.32675,43.31023],[-73.32697,43.309656],[-73.32723,43.308727],[-73.32731800000001,43.308322],[-73.327331,43.308141],[-73.327331,43.307808],[-73.327274,43.307012],[-73.327276,43.30687],[-73.32731200000001,43.306588],[-73.327445,43.306049],[-73.32751399999999,43.305858],[-73.327601,43.305652],[-73.32816099999999,43.304573],[-73.328498,43.30387],[-73.328683,43.303353],[-73.328858,43.302787],[-73.329408,43.301224],[-73.32956799999999,43.30086],[-73.32975999999999,43.300473],[-73.32985100000001,43.300313],[-73.33051,43.299308],[-73.331069,43.298457],[-73.331262,43.298173],[-73.332322,43.296646],[-73.33248399999999,43.296431],[-73.332982,43.295862],[-73.33330599999999,43.295427],[-73.333895,43.294521],[-73.33449299999999,43.293691],[-73.334833,43.293241],[-73.334987,43.29306],[-73.335697,43.292343],[-73.336096,43.291981],[-73.336286,43.291852],[-73.33635200000001,43.29181],[-73.336664,43.291673],[-73.33726799999999,43.291463],[-73.33842300000001,43.291133],[-73.33988600000001,43.290682],[-73.34137,43.290278],[-73.341756,43.29019],[-73.342248,43.290081],[-73.34278999999999,43.28998],[-73.343283,43.289893],[-73.343695,43.289792],[-73.344576,43.289484],[-73.34493999999999,43.289326],[-73.34534600000001,43.289091],[-73.34560500000001,43.288902],[-73.34574499999999,43.2888],[-73.34598099999999,43.288581],[-73.346932,43.287519],[-73.347157,43.287222],[-73.34768099999999,43.286426],[-73.348332,43.285469],[-73.349155,43.284349],[-73.34976399999999,43.283517],[-73.35016899999999,43.283037],[-73.350545,43.282591],[-73.350886,43.282161],[-73.35111499999999,43.281824],[-73.351321,43.281465],[-73.35154199999999,43.281128],[-73.352149,43.280404],[-73.35247,43.280006],[-73.35283200000001,43.279558],[-73.353038,43.279315],[-73.353292,43.279047],[-73.353391,43.278957],[-73.353802,43.27857],[-73.35492000000001,43.277304],[-73.355232,43.27698],[-73.35541499999999,43.276818],[-73.356008,43.276356],[-73.356691,43.275851],[-73.35681200000001,43.275762],[-73.35746899999999,43.275234],[-73.35784200000001,43.274909],[-73.358287,43.274452],[-73.359886,43.272728],[-73.360192,43.272444],[-73.360389,43.272269],[-73.360899,43.271861],[-73.361182,43.27166],[-73.36168600000001,43.271327],[-73.36199000000001,43.271107],[-73.362194,43.270923],[-73.362317,43.270791],[-73.362427,43.270643],[-73.36257500000001,43.270393],[-73.36292,43.269649],[-73.36376300000001,43.267732],[-73.364159,43.266965],[-73.36426299999999,43.266794],[-73.36502,43.26567],[-73.365365,43.26508],[-73.365886,43.264181],[-73.36610899999999,43.263836],[-73.366767,43.262917],[-73.367366,43.261975],[-73.36806300000001,43.260902],[-73.368178,43.260723],[-73.368567,43.260056],[-73.368685,43.259836],[-73.368813,43.259565],[-73.368942,43.259204],[-73.369016,43.258933],[-73.369068,43.258692],[-73.369158,43.258164],[-73.369257,43.2574],[-73.36928899999999,43.257149],[-73.369383,43.25626],[-73.369407,43.255913],[-73.36954900000001,43.254066],[-73.36954299999999,43.253012],[-73.369558,43.252881],[-73.36959899999999,43.252711],[-73.36970700000001,43.25237],[-73.36979700000001,43.252158],[-73.369957,43.251823],[-73.37020699999999,43.251413],[-73.370357,43.251145],[-73.370502,43.250846],[-73.37065,43.250507],[-73.37091700000001,43.249771],[-73.371014,43.249429],[-73.37112,43.248917],[-73.37132200000001,43.248021],[-73.371455,43.247558],[-73.37162600000001,43.24709],[-73.371743,43.246809],[-73.371905,43.246525],[-73.373333,43.244207],[-73.37440599999999,43.242525],[-73.37471600000001,43.242075],[-73.374928,43.241809],[-73.37534599999999,43.241339],[-73.375657,43.241012],[-73.375919,43.240712],[-73.37639799999999,43.240118],[-73.37660099999999,43.239812],[-73.376739,43.239566],[-73.376812,43.2394],[-73.376909,43.239112],[-73.377133,43.237976],[-73.377365,43.236975],[-73.37769900000001,43.236148],[-73.37773799999999,43.235995],[-73.377763,43.235796],[-73.377759,43.235616],[-73.377736,43.235458],[-73.37764799999999,43.235196],[-73.37747,43.234876],[-73.377087,43.234287],[-73.37688199999999,43.234027],[-73.376465,43.233383],[-73.37625800000001,43.233062],[-73.37602099999999,43.232571],[-73.37585900000001,43.232171],[-73.37567900000001,43.231187],[-73.37565600000001,43.231106],[-73.375505,43.230814],[-73.375232,43.230387],[-73.374803,43.229675],[-73.374596,43.229303],[-73.374471,43.229038],[-73.374405,43.228839],[-73.374405,43.228679],[-73.374442,43.2285],[-73.37451900000001,43.228264],[-73.374548,43.228085],[-73.374528,43.227952],[-73.37446199999999,43.227832],[-73.374364,43.227745],[-73.374065,43.227566],[-73.37388300000001,43.227486],[-73.373638,43.227395],[-73.37330300000001,43.227324],[-73.372744,43.227267],[-73.372602,43.227272],[-73.372589,43.226512],[-73.372601,43.226182],[-73.372649,43.225812],[-73.372709,43.22553],[-73.372823,43.224865],[-73.373012,43.223479],[-73.373287,43.222075],[-73.37352199999999,43.221122],[-73.373681,43.22058],[-73.37374,43.220412],[-73.37402,43.219614],[-73.374156,43.219168],[-73.374278,43.219159],[-73.37444499999999,43.219195],[-73.374624,43.219246],[-73.378952,43.218881],[-73.386044,43.218181],[-73.39418999999999,43.217377],[-73.394294,43.217915],[-73.394768,43.220437],[-73.395357,43.223564],[-73.395717,43.225472],[-73.395966,43.226748],[-73.39874399999999,43.241552],[-73.39908,43.243482],[-73.400057,43.249125],[-73.400226,43.250087],[-73.401449,43.256337],[-73.401786,43.258091],[-73.403544,43.267386],[-73.40394999999999,43.269675],[-73.40439600000001,43.272068],[-73.404819,43.274473],[-73.40512,43.275997],[-73.40544,43.277841],[-73.405534,43.27839],[-73.405922,43.280595],[-73.40629,43.282506],[-73.40638800000001,43.282915],[-73.40710300000001,43.286583],[-73.40745800000001,43.288143],[-73.407702,43.289623],[-73.40933200000001,43.298311],[-73.410025,43.301778],[-73.410285,43.303095]]],"type":"Polygon"}
}