{
  "id": "361190100003",
  "type": "Feature",
  "properties": {
    "area_land":477260,
    "area_water":0,
    "geoid":"361190100003",
    "name":"Block Group 3",
    "state":"ny"
},
  "bbox": [
    -73.795848,
    41.004757,
    -73.781876,
    41.011422
],
  "geometry": {"coordinates":[[[-73.79584800000001,41.010209],[-73.795614,41.010438],[-73.795328,41.010829],[-73.79509400000001,41.01116],[-73.795036,41.011241],[-73.794962,41.011253],[-73.794839,41.011258],[-73.794804,41.011249],[-73.79458200000001,41.011163],[-73.794472,41.011119],[-73.794372,41.011081],[-73.79423800000001,41.011043],[-73.793881,41.010997],[-73.79370400000001,41.011004],[-73.793021,41.011214],[-73.79289799999999,41.011225],[-73.79278499999999,41.011217],[-73.79261,41.011176],[-73.79238599999999,41.011098],[-73.79181800000001,41.010709],[-73.79161000000001,41.010591],[-73.79144100000001,41.010521],[-73.79128300000001,41.010472],[-73.79115400000001,41.010442],[-73.791,41.010427],[-73.79086599999999,41.010442],[-73.79001700000001,41.010748],[-73.789697,41.010865],[-73.78932500000001,41.011048],[-73.789036,41.011226],[-73.78899800000001,41.011237],[-73.78894200000001,41.011243],[-73.78858099999999,41.011219],[-73.788428,41.011234],[-73.788284,41.011279],[-73.78804100000001,41.011373],[-73.787823,41.011417],[-73.78766,41.011422],[-73.787243,41.011398],[-73.786222,41.011296],[-73.78595900000001,41.011257],[-73.785494,41.011187],[-73.78462,41.011073],[-73.783244,41.010905],[-73.781876,41.01009],[-73.782737,41.009009],[-73.78283500000001,41.008863],[-73.78354299999999,41.007678],[-73.78376900000001,41.007194],[-73.783985,41.006666],[-73.78408,41.006394],[-73.78433200000001,41.005679],[-73.784582,41.004997],[-73.78466299999999,41.004757],[-73.785275,41.005035],[-73.786282,41.005485],[-73.78713500000001,41.005854],[-73.787975,41.006212],[-73.78886199999999,41.006581],[-73.79007300000001,41.007083],[-73.79039299999999,41.007223],[-73.79082699999999,41.007413],[-73.79177900000001,41.007802],[-73.792599,41.008142],[-73.792846,41.008259],[-73.793172,41.008418],[-73.793712,41.008655],[-73.794276,41.008931],[-73.794715,41.009072],[-73.79495300000001,41.009173],[-73.795181,41.009282],[-73.795249,41.009323],[-73.795384,41.009406],[-73.795513,41.009512],[-73.795576,41.009577],[-73.795616,41.009619],[-73.79565100000001,41.009655],[-73.795824,41.009841],[-73.795739,41.009955],[-73.795739,41.009998],[-73.79584800000001,41.010209]]],"type":"Polygon"}
}