{
  "id": "360191008002",
  "type": "Feature",
  "properties": {
    "area_land":2500371,
    "area_water":0,
    "geoid":"360191008002",
    "name":"Block Group 2",
    "state":"ny"
},
  "bbox": [
    -73.528249,
    44.713596,
    -73.470707,
    44.721474
],
  "geometry": {"coordinates":[[[-73.52781899999999,44.715112],[-73.527805,44.71516],[-73.527755,44.715394],[-73.527733,44.715612],[-73.527725,44.716187],[-73.52770599999999,44.716271],[-73.527681,44.716322],[-73.52763,44.716399],[-73.527552,44.716465],[-73.527385,44.716553],[-73.525761,44.717178],[-73.52491000000001,44.717529],[-73.524147,44.717861],[-73.52273700000001,44.718526],[-73.52108200000001,44.719356],[-73.52017600000001,44.719807],[-73.52009200000001,44.719844],[-73.51990499999999,44.719913],[-73.51957299999999,44.720002],[-73.518925,44.720124],[-73.518081,44.720253],[-73.51682599999999,44.720416],[-73.51568899999999,44.720531],[-73.513851,44.720654],[-73.51240199999999,44.720736],[-73.508145,44.720973],[-73.505686,44.721101],[-73.499571,44.721432],[-73.498903,44.721471],[-73.49874,44.721474],[-73.498475,44.721463],[-73.4983,44.721438],[-73.49808400000001,44.721364],[-73.497934,44.721291],[-73.496217,44.720308],[-73.49603399999999,44.720216],[-73.49574699999999,44.720088],[-73.495508,44.720017],[-73.495166,44.719959],[-73.494749,44.719939],[-73.494348,44.719947],[-73.491671,44.720051],[-73.488514,44.720188],[-73.48658,44.720274],[-73.485488,44.720354],[-73.484365,44.72043],[-73.483924,44.72044],[-73.483442,44.72043],[-73.483103,44.720404],[-73.48259299999999,44.720328],[-73.482229,44.720265],[-73.48165899999999,44.72018],[-73.48072999999999,44.720045],[-73.480287,44.719981],[-73.47991500000001,44.71993],[-73.479251,44.719843],[-73.47871600000001,44.719773],[-73.478272,44.719705],[-73.47784,44.719636],[-73.47752800000001,44.719549],[-73.477262,44.719436],[-73.47709999999999,44.71935],[-73.477034,44.719419],[-73.476944,44.719494],[-73.476882,44.719511],[-73.476775,44.719506],[-73.47569900000001,44.719341],[-73.474238,44.719141],[-73.47287900000001,44.718998],[-73.472353,44.718943],[-73.47216,44.718923],[-73.471457,44.719208],[-73.47086400000001,44.719269],[-73.470877,44.719185],[-73.470901,44.718799],[-73.47089099999999,44.718505],[-73.470811,44.717902],[-73.470725,44.717315],[-73.470707,44.717144],[-73.47100500000001,44.717206],[-73.47171400000001,44.717315],[-73.472054,44.717344],[-73.472222,44.717359],[-73.472585,44.717373],[-73.473232,44.717373],[-73.473617,44.717352],[-73.474628,44.717258],[-73.476206,44.71709],[-73.476752,44.717036],[-73.47735900000001,44.716967],[-73.478183,44.716874],[-73.479586,44.716737],[-73.480289,44.716652],[-73.48240800000001,44.716429],[-73.48330199999999,44.716323],[-73.48344,44.716342],[-73.48441,44.71619],[-73.486896,44.715799],[-73.48793999999999,44.715658],[-73.488806,44.715574],[-73.489768,44.715508],[-73.49414899999999,44.715292],[-73.49527500000001,44.715215],[-73.495835,44.715167],[-73.501328,44.714589],[-73.504386,44.714274],[-73.505549,44.714189],[-73.506146,44.714163],[-73.52003000000001,44.713721],[-73.523602,44.713609],[-73.524563,44.713596],[-73.525436,44.713633],[-73.525735,44.713657],[-73.526349,44.713724],[-73.52692399999999,44.713808],[-73.52754400000001,44.713929],[-73.528249,44.714101],[-73.52781899999999,44.715112]]],"type":"Polygon"}
}