{
  "id": "360270502031",
  "type": "Feature",
  "properties": {
    "area_land":5065209,
    "area_water":5547,
    "geoid":"360270502031",
    "name":"Block Group 1",
    "state":"ny"
},
  "bbox": [
    -73.850829,
    41.538572,
    -73.82048,
    41.575658
],
  "geometry": {"coordinates":[[[-73.85063100000001,41.541258],[-73.850514,41.542062],[-73.84895299999999,41.548786],[-73.848298,41.548867],[-73.84804200000001,41.548933],[-73.84724199999999,41.549245],[-73.846732,41.549484],[-73.846647,41.549513],[-73.84637499999999,41.549535],[-73.846261,41.549513],[-73.846158,41.549447],[-73.846034,41.549307],[-73.84595899999999,41.549205],[-73.845822,41.549073],[-73.84552100000001,41.548907],[-73.84540800000001,41.548874],[-73.845215,41.548847],[-73.845106,41.548852],[-73.845,41.548885],[-73.844937,41.548944],[-73.84492299999999,41.549021],[-73.84493999999999,41.54911],[-73.845037,41.5493],[-73.84513200000001,41.549447],[-73.84516499999999,41.54955],[-73.845158,41.549634],[-73.84513200000001,41.5497],[-73.84507000000001,41.549748],[-73.844982,41.54977],[-73.84475,41.549803],[-73.844559,41.549818],[-73.844252,41.549803],[-73.844036,41.549755],[-73.843915,41.549696],[-73.843779,41.549594],[-73.84371299999999,41.549514],[-73.843676,41.549487],[-73.843529,41.549462],[-73.84339300000001,41.549462],[-73.84328499999999,41.549528],[-73.84324100000001,41.549608],[-73.843046,41.549887],[-73.84280699999999,41.550093],[-73.84273,41.55017],[-73.842676,41.550273],[-73.84263799999999,41.550379],[-73.842628,41.550448],[-73.84263300000001,41.550539],[-73.84288100000001,41.550411],[-73.842962,41.550422],[-73.843006,41.550462],[-73.84301000000001,41.550684],[-73.843039,41.550844],[-73.84309,41.551016],[-73.843206,41.551284],[-73.843279,41.551398],[-73.843338,41.551442],[-73.843441,41.551486],[-73.843757,41.551537],[-73.84383,41.551581],[-73.84401,41.551768],[-73.84412399999999,41.551849],[-73.844278,41.551941],[-73.844526,41.552128],[-73.844688,41.552293],[-73.84481,41.55238],[-73.844853,41.552421],[-73.84501899999999,41.552582],[-73.845336,41.552778],[-73.845538,41.552891],[-73.84576199999999,41.553038],[-73.845927,41.553266],[-73.84601600000001,41.553365],[-73.84610000000001,41.553412],[-73.84617299999999,41.553431],[-73.846271,41.553441],[-73.84596999999999,41.553645],[-73.845489,41.554036],[-73.845122,41.554389],[-73.844979,41.554562],[-73.844381,41.555348],[-73.84407400000001,41.555772],[-73.842878,41.557382],[-73.842127,41.558336],[-73.838567,41.563041],[-73.838064,41.563702],[-73.83768000000001,41.564149],[-73.837433,41.564397],[-73.837046,41.564756],[-73.83655400000001,41.565156],[-73.83611000000001,41.565495],[-73.835446,41.565939],[-73.835289,41.566044],[-73.83143699999999,41.568648],[-73.830251,41.56942],[-73.828593,41.57054],[-73.828371,41.570694],[-73.828098,41.570884],[-73.82758800000001,41.571227],[-73.825244,41.572801],[-73.82375399999999,41.573788],[-73.822677,41.574526],[-73.82173299999999,41.575142],[-73.82100199999999,41.575658],[-73.820767,41.575648],[-73.820694,41.575612],[-73.82058499999999,41.575533],[-73.820514,41.575457],[-73.82048,41.575398],[-73.820482,41.575253],[-73.82050599999999,41.574811],[-73.820543,41.574548],[-73.82056,41.574448],[-73.820618,41.57418],[-73.820757,41.57386],[-73.820931,41.573503],[-73.821562,41.572208],[-73.821707,41.571912],[-73.82181199999999,41.571648],[-73.821855,41.57147],[-73.821878,41.571209],[-73.821838,41.570884],[-73.82176200000001,41.570614],[-73.821654,41.5704],[-73.821527,41.570116],[-73.821502,41.570036],[-73.821488,41.569934],[-73.82154,41.569226],[-73.821603,41.568685],[-73.821622,41.568563],[-73.821729,41.56825],[-73.821956,41.567762],[-73.822219,41.567316],[-73.82269100000001,41.56656],[-73.822728,41.566458],[-73.82278599999999,41.566234],[-73.82289299999999,41.565585],[-73.822908,41.565421],[-73.822908,41.565289],[-73.82288699999999,41.565184],[-73.822823,41.565004],[-73.82235900000001,41.564268],[-73.822129,41.563915],[-73.821639,41.563148],[-73.82102500000001,41.562188],[-73.820853,41.561864],[-73.820744,41.561555],[-73.820696,41.561135],[-73.820696,41.56098],[-73.820701,41.560807],[-73.820768,41.560476],[-73.820899,41.560172],[-73.82131,41.559573],[-73.821634,41.559187],[-73.82182,41.558984],[-73.82228499999999,41.55851],[-73.822502,41.558303],[-73.82265,41.558137],[-73.822987,41.557798],[-73.823499,41.557266],[-73.823666,41.557037],[-73.823947,41.556557],[-73.824353,41.555819],[-73.824786,41.555121],[-73.824951,41.554811],[-73.825181,41.554444],[-73.825469,41.553904],[-73.82568999999999,41.553563],[-73.825869,41.55334],[-73.82615199999999,41.553082],[-73.826325,41.552948],[-73.826706,41.552592],[-73.826926,41.552317],[-73.827382,41.551816],[-73.82749800000001,41.551671],[-73.827581,41.551534],[-73.82772300000001,41.551149],[-73.827894,41.55049],[-73.82794699999999,41.550193],[-73.827966,41.549933],[-73.828047,41.548863],[-73.82803199999999,41.548264],[-73.828051,41.54764],[-73.828104,41.547304],[-73.82816099999999,41.547072],[-73.82841999999999,41.546317],[-73.828566,41.545798],[-73.82860599999999,41.545491],[-73.82862,41.545239],[-73.828593,41.544736],[-73.82947,41.544481],[-73.830235,41.544235],[-73.830332,41.544205],[-73.83108900000001,41.544001],[-73.831312,41.543943],[-73.831684,41.543821],[-73.832322,41.543587],[-73.83252,41.543504],[-73.83302399999999,41.543265],[-73.83310899999999,41.543224],[-73.83325000000001,41.543138],[-73.83374499999999,41.542815],[-73.834873,41.542007],[-73.835936,41.541224],[-73.836353,41.540921],[-73.83652600000001,41.540791],[-73.83691,41.54053],[-73.837639,41.539994],[-73.838176,41.539655],[-73.83845100000001,41.53951],[-73.83885600000001,41.53934],[-73.839304,41.539161],[-73.839669,41.539059],[-73.840474,41.538861],[-73.84056,41.538842],[-73.84113600000001,41.53873],[-73.841353,41.538688],[-73.84208700000001,41.538604],[-73.842512,41.538578],[-73.84292499999999,41.538572],[-73.84326799999999,41.53858],[-73.843406,41.538585],[-73.844112,41.538665],[-73.844362,41.538704],[-73.845085,41.538877],[-73.845347,41.538945],[-73.8459,41.539095],[-73.84593099999999,41.539103],[-73.84625200000001,41.539185],[-73.84667,41.539297],[-73.847005,41.539392],[-73.84743,41.539501],[-73.847928,41.539644],[-73.850297,41.540285],[-73.850829,41.540421],[-73.85063100000001,41.541258]]],"type":"Polygon"}
}