{
  "id": "361190062003",
  "type": "Feature",
  "properties": {
    "area_land":144122,
    "area_water":0,
    "geoid":"361190062003",
    "name":"Block Group 3",
    "state":"ny"
},
  "bbox": [
    -73.796437,
    40.906921,
    -73.790913,
    40.910859
],
  "geometry": {"coordinates":[[[-73.796437,40.910049],[-73.795558,40.910209],[-73.79468300000001,40.910373],[-73.79307799999999,40.910667],[-73.792922,40.910695],[-73.792029,40.910859],[-73.791633,40.909784],[-73.791282,40.908892],[-73.791105,40.90836],[-73.79108100000001,40.908274],[-73.791045,40.907959],[-73.791005,40.907617],[-73.79095,40.907224],[-73.790913,40.907132],[-73.79172699999999,40.90706],[-73.792846,40.906952],[-73.793164,40.906933],[-73.793555,40.906921],[-73.793841,40.906921],[-73.79425500000001,40.90693],[-73.794529,40.906945],[-73.794533,40.906962],[-73.794591,40.907185],[-73.794652,40.907408],[-73.79486199999999,40.908071],[-73.795751,40.907903],[-73.796136,40.909113],[-73.796437,40.910049]]],"type":"Polygon"}
}