{
  "id": "360050363005",
  "type": "Feature",
  "properties": {
    "area_land":30583,
    "area_water":0,
    "geoid":"360050363005",
    "name":"Block Group 5",
    "state":"ny"
},
  "bbox": [
    -73.885292,
    40.843863,
    -73.882429,
    40.845985
],
  "geometry": {"coordinates":[[[-73.885192,40.845195],[-73.88446500000001,40.845985],[-73.884134,40.845818],[-73.883478,40.845498],[-73.882429,40.844981],[-73.88338299999999,40.843863],[-73.88443100000001,40.844379],[-73.884882,40.8446],[-73.88529200000001,40.844608],[-73.885192,40.845195]]],"type":"Polygon"}
}