{
  "id": "360050221012",
  "type": "Feature",
  "properties": {
    "area_land":25524,
    "area_water":0,
    "geoid":"360050221012",
    "name":"Block Group 2",
    "state":"ny"
},
  "bbox": [
    -73.918592,
    40.838336,
    -73.91594,
    40.840225
],
  "geometry": {"coordinates":[[[-73.918137,40.839607],[-73.917683,40.840225],[-73.916783,40.839881],[-73.91594000000001,40.839552],[-73.91642899999999,40.838948],[-73.916917,40.838336],[-73.918592,40.838982],[-73.918137,40.839607]]],"type":"Polygon"}
}