{
  "id": "360610120001",
  "type": "Feature",
  "properties": {
    "area_land":24805,
    "area_water":0,
    "geoid":"360610120001",
    "name":"Block Group 1",
    "state":"ny"
},
  "bbox": [
    -73.964988,
    40.765911,
    -73.96247,
    40.76786
],
  "geometry": {"coordinates":[[[-73.964755,40.766927],[-73.96453099999999,40.767234],[-73.96429999999999,40.767552],[-73.964077,40.76786],[-73.96325,40.767512],[-73.96247,40.767185],[-73.962929,40.766559],[-73.963401,40.765911],[-73.96498800000001,40.766609],[-73.964755,40.766927]]],"type":"Polygon"}
}