{
  "id": "360010015002",
  "type": "Feature",
  "properties": {
    "area_land":112773,
    "area_water":0,
    "geoid":"360010015002",
    "name":"Block Group 2",
    "state":"ny"
},
  "bbox": [
    -73.783798,
    42.656328,
    -73.77741,
    42.660639
],
  "geometry": {"coordinates":[[[-73.783179,42.6595],[-73.782617,42.660037],[-73.782223,42.660433],[-73.782006,42.660639],[-73.78156799999999,42.660388],[-73.779858,42.659411],[-73.777587,42.65809],[-73.77741,42.657987],[-73.77749900000001,42.6579],[-73.77802200000001,42.657426],[-73.77860699999999,42.656889],[-73.779178,42.656328],[-73.781628,42.657718],[-73.783798,42.658949],[-73.783179,42.6595]]],"type":"Polygon"}
}