{
  "id": "360470264002",
  "type": "Feature",
  "properties": {
    "area_land":42307,
    "area_water":0,
    "geoid":"360470264002",
    "name":"Block Group 2",
    "state":"ny"
},
  "bbox": [
    -73.998374,
    40.613388,
    -73.994797,
    40.615995
],
  "geometry": {"coordinates":[[[-73.998374,40.614832],[-73.99774600000001,40.615436],[-73.99716600000001,40.615995],[-73.99479700000001,40.614562],[-73.99536999999999,40.613996],[-73.995983,40.613388],[-73.996379,40.613627],[-73.998187,40.614719],[-73.998374,40.614832]]],"type":"Polygon"}
}