{
  "id": "360750205002",
  "type": "Feature",
  "properties": {
    "area_land":77581287,
    "area_water":1077647,
    "geoid":"360750205002",
    "name":"Block Group 2",
    "state":"ny"
},
  "bbox": [
    -76.08337,
    43.358403,
    -75.946012,
    43.470688
],
  "geometry": {"coordinates":[[[-76.082919,43.37314],[-76.080873,43.374075],[-76.08030100000001,43.374327],[-76.07932,43.374804],[-76.07898400000001,43.374996],[-76.078323,43.375463],[-76.077997,43.37571],[-76.077567,43.376074],[-76.077343,43.376336],[-76.077168,43.37659],[-76.07701,43.376875],[-76.07678900000001,43.377342],[-76.076589,43.377736],[-76.075973,43.379086],[-76.07524100000001,43.380629],[-76.074783,43.381564],[-76.074589,43.381989],[-76.07393999999999,43.383361],[-76.07347900000001,43.384289],[-76.073199,43.384969],[-76.073094,43.385154],[-76.07295000000001,43.3853],[-76.072823,43.385405],[-76.07239,43.385704],[-76.07194800000001,43.386088],[-76.071719,43.386279],[-76.071607,43.386412],[-76.071461,43.386585],[-76.070949,43.387119],[-76.07039899999999,43.387962],[-76.07038,43.388057],[-76.070373,43.388305],[-76.070335,43.38849],[-76.070217,43.388796],[-76.070025,43.38947],[-76.069543,43.39131],[-76.06943800000001,43.391586],[-76.06940299999999,43.391653],[-76.06931400000001,43.391762],[-76.069377,43.392004],[-76.069372,43.392167],[-76.069147,43.392977],[-76.069035,43.393379],[-76.068612,43.394833],[-76.068381,43.395463],[-76.06829399999999,43.395664],[-76.067735,43.396915],[-76.06728,43.397872],[-76.06706200000001,43.398361],[-76.06659000000001,43.399344],[-76.065929,43.400794],[-76.065757,43.401201],[-76.06706800000001,43.401562],[-76.068476,43.40194],[-76.068506,43.401948],[-76.06858699999999,43.401967],[-76.06796,43.403372],[-76.06752400000001,43.404316],[-76.066891,43.405739],[-76.066457,43.406696],[-76.066035,43.407659],[-76.06591400000001,43.40809],[-76.06588600000001,43.408252],[-76.065883,43.408645],[-76.06598700000001,43.409494],[-76.065997,43.409575],[-76.066148,43.410519],[-76.066221,43.411464],[-76.06619600000001,43.41209],[-76.066124,43.412816],[-76.06598200000001,43.414251],[-76.065907,43.415419],[-76.06584700000001,43.41606],[-76.065787,43.416899],[-76.06575599999999,43.417337],[-76.06566599999999,43.418262],[-76.065585,43.418584],[-76.065223,43.41959],[-76.065141,43.419857],[-76.064851,43.420611],[-76.064724,43.420868],[-76.064695,43.420928],[-76.064407,43.421377],[-76.06413999999999,43.4217],[-76.06361099999999,43.422317],[-76.063121,43.422856],[-76.06208700000001,43.424017],[-76.061768,43.424376],[-76.06049400000001,43.425835],[-76.059697,43.426724],[-76.059416,43.427052],[-76.059174,43.427394],[-76.05897899999999,43.427776],[-76.058465,43.428947],[-76.057289,43.431641],[-76.056647,43.433072],[-76.056462,43.433539],[-76.056077,43.43439],[-76.055514,43.435675],[-76.05497099999999,43.43691],[-76.054284,43.438432],[-76.05365,43.4398],[-76.053499,43.440157],[-76.05143200000001,43.444604],[-76.050713,43.44619],[-76.050236,43.447229],[-76.050121,43.447535],[-76.050054,43.447942],[-76.050054,43.448133],[-76.050078,43.448417],[-76.05013700000001,43.448722],[-76.050269,43.449248],[-76.050279,43.449289],[-76.050377,43.449692],[-76.050414,43.449984],[-76.050421,43.450211],[-76.05041,43.450424],[-76.05037,43.450695],[-76.05028900000001,43.451009],[-76.050183,43.451295],[-76.048852,43.454356],[-76.048446,43.455264],[-76.04757499999999,43.457324],[-76.047436,43.457694],[-76.047245,43.458426],[-76.047175,43.458756],[-76.047133,43.459073],[-76.047151,43.45959],[-76.047236,43.460135],[-76.047346,43.460715],[-76.047483,43.461616],[-76.047639,43.462414],[-76.047764,43.462844],[-76.04786,43.463079],[-76.047923,43.463175],[-76.048042,43.463298],[-76.047967,43.463341],[-76.047875,43.463418],[-76.04769899999999,43.4636],[-76.047273,43.464082],[-76.046862,43.464608],[-76.046424,43.465208],[-76.046266,43.465357],[-76.04608,43.465506],[-76.045962,43.465578],[-76.04583,43.465644],[-76.04563400000001,43.465724],[-76.04498100000001,43.465952],[-76.044877,43.465976],[-76.044574,43.466021],[-76.044428,43.466027],[-76.04412000000001,43.466001],[-76.043925,43.465955],[-76.043836,43.465926],[-76.04363499999999,43.46586],[-76.043128,43.465673],[-76.04284699999999,43.465563],[-76.04238100000001,43.465381],[-76.041014,43.464871],[-76.04083300000001,43.464828],[-76.040496,43.464785],[-76.04029,43.464785],[-76.039939,43.464802],[-76.039177,43.46487],[-76.038915,43.464894],[-76.03851299999999,43.464894],[-76.03793400000001,43.464857],[-76.037661,43.464851],[-76.037374,43.46486],[-76.03712299999999,43.464883],[-76.03669600000001,43.464965],[-76.036154,43.465073],[-76.03568799999999,43.465185],[-76.035197,43.465265],[-76.03348,43.465458],[-76.030703,43.465777],[-76.030615,43.465785],[-76.030186,43.465826],[-76.027957,43.465955],[-76.027672,43.465961],[-76.02616,43.466076],[-76.02550100000001,43.466111],[-76.024186,43.466213],[-76.02287800000001,43.466295],[-76.02183599999999,43.466375],[-76.02152599999999,43.466387],[-76.021258,43.466387],[-76.020968,43.466372],[-76.019271,43.466197],[-76.01877500000001,43.466139],[-76.018215,43.466122],[-76.01775499999999,43.466151],[-76.01547100000001,43.46641],[-76.01504,43.466484],[-76.014471,43.466622],[-76.013312,43.466964],[-76.01236299999999,43.467257],[-76.012156,43.467318],[-76.011731,43.467473],[-76.01106,43.467698],[-76.010499,43.467905],[-76.009765,43.468129],[-76.009513,43.468224],[-76.00885100000001,43.46845],[-76.00779,43.468822],[-76.00639700000001,43.469298],[-76.00403900000001,43.470124],[-76.003606,43.470261],[-76.003248,43.470339],[-76.00288999999999,43.470373],[-76.001549,43.470425],[-75.99952999999999,43.470529],[-75.99885999999999,43.470548],[-75.996858,43.470622],[-75.995929,43.470675],[-75.99547,43.470688],[-75.994838,43.470685],[-75.993893,43.470618],[-75.992114,43.47045],[-75.99113699999999,43.470372],[-75.990655,43.470322],[-75.990233,43.470281],[-75.98949500000001,43.470179],[-75.987352,43.469751],[-75.98686600000001,43.469679],[-75.985893,43.469574],[-75.985162,43.469446],[-75.984613,43.469307],[-75.982721,43.468855],[-75.982151,43.468704],[-75.98174899999999,43.468568],[-75.981538,43.468497],[-75.981182,43.46837],[-75.9807,43.468179],[-75.978759,43.467405],[-75.978171,43.467185],[-75.977727,43.467007],[-75.97617700000001,43.466421],[-75.975487,43.46616],[-75.974358,43.465753],[-75.973404,43.465459],[-75.972014,43.464973],[-75.97116699999999,43.464656],[-75.970783,43.464531],[-75.970024,43.464247],[-75.967305,43.463205],[-75.96639399999999,43.46288],[-75.965673,43.462647],[-75.965056,43.462459],[-75.965498,43.461455],[-75.965721,43.460973],[-75.96591600000001,43.46055],[-75.966307,43.459621],[-75.96670899999999,43.458749],[-75.96699599999999,43.458068],[-75.967224,43.457565],[-75.968277,43.455186],[-75.96965299999999,43.45208],[-75.970055,43.451211],[-75.97055,43.450081],[-75.970968,43.449091],[-75.971248,43.448352],[-75.972652,43.44518],[-75.97272700000001,43.445011],[-75.973223,43.443889],[-75.97375599999999,43.442635],[-75.974312,43.441452],[-75.974524,43.440947],[-75.974728,43.440409],[-75.975244,43.439286],[-75.977585,43.433636],[-75.97808999999999,43.432476],[-75.975796,43.431911],[-75.96698600000001,43.429941],[-75.962768,43.429152],[-75.95940899999999,43.428547],[-75.95868,43.428464],[-75.957516,43.428128],[-75.95302,43.426957],[-75.952371,43.426661],[-75.952129,43.426583],[-75.95190100000001,43.426555],[-75.951424,43.426547],[-75.950166,43.426358],[-75.949077,43.42611],[-75.94855200000001,43.426015],[-75.948218,43.425938],[-75.948133,43.425919],[-75.94753300000001,43.425769],[-75.947182,43.425719],[-75.94681300000001,43.425646],[-75.94635,43.425519],[-75.946112,43.425415],[-75.94604699999999,43.425361],[-75.946012,43.425305],[-75.946196,43.425275],[-75.94635700000001,43.425216],[-75.947711,43.424164],[-75.94854100000001,43.423578],[-75.948977,43.423286],[-75.94930600000001,43.42309],[-75.949566,43.422961],[-75.949815,43.422855],[-75.950018,43.422817],[-75.950329,43.422796],[-75.950853,43.422805],[-75.951459,43.422798],[-75.952184,43.422805],[-75.95262700000001,43.422845],[-75.95301600000001,43.422834],[-75.953464,43.422768],[-75.954961,43.422465],[-75.955133,43.422444],[-75.955322,43.422441],[-75.95571200000001,43.422471],[-75.95597100000001,43.422474],[-75.956461,43.422432],[-75.95684799999999,43.422348],[-75.95720900000001,43.422243],[-75.957352,43.422191],[-75.95757999999999,43.422093],[-75.958046,43.421851],[-75.958782,43.421489],[-75.958975,43.42137],[-75.959087,43.42129],[-75.959171,43.421193],[-75.95939300000001,43.420882],[-75.959474,43.420679],[-75.959647,43.419834],[-75.959732,43.419602],[-75.95979,43.41951],[-75.96013600000001,43.418959],[-75.960427,43.418604],[-75.960813,43.418222],[-75.96113099999999,43.417862],[-75.961303,43.417697],[-75.961636,43.417403],[-75.962369,43.416911],[-75.96271299999999,43.416713],[-75.963504,43.416308],[-75.96397,43.416091],[-75.96522299999999,43.415478],[-75.966076,43.415036],[-75.966219,43.414944],[-75.967742,43.413888],[-75.968249,43.41358],[-75.969374,43.412944],[-75.969829,43.412658],[-75.970366,43.412278],[-75.970715,43.412058],[-75.970928,43.411945],[-75.97111099999999,43.411861],[-75.971569,43.411653],[-75.97234,43.41133],[-75.972796,43.411185],[-75.973007,43.411119],[-75.973679,43.411002],[-75.97418,43.41093],[-75.97479300000001,43.410875],[-75.97523700000001,43.410864],[-75.97599200000001,43.410881],[-75.978647,43.411071],[-75.97944200000001,43.411102],[-75.98018399999999,43.411099],[-75.980863,43.411029],[-75.981354,43.410953],[-75.98330300000001,43.410701],[-75.98360099999999,43.410646],[-75.983968,43.410561],[-75.986436,43.40996],[-75.987385,43.40969],[-75.987765,43.409562],[-75.987804,43.409549],[-75.990011,43.408718],[-75.991298,43.408239],[-75.992043,43.407946],[-75.99256099999999,43.407762],[-75.993155,43.407526],[-75.993771,43.407299],[-75.994884,43.406853],[-75.995028,43.406775],[-75.994922,43.406713],[-75.99463299999999,43.406505],[-75.992654,43.404949],[-75.991936,43.404406],[-75.99099200000001,43.403674],[-75.990461,43.403275],[-75.990433,43.403254],[-75.990016,43.40294],[-75.98908400000001,43.402224],[-75.986237,43.399921],[-75.98434899999999,43.39844],[-75.982592,43.396766],[-75.98247499999999,43.396655],[-75.98234600000001,43.396511],[-75.982167,43.396274],[-75.982051,43.396074],[-75.98200900000001,43.395967],[-75.981979,43.395737],[-75.982705,43.393911],[-75.983993,43.390829],[-75.984302,43.390089],[-75.984459,43.389645],[-75.984559,43.38922],[-75.984601,43.388896],[-75.98457500000001,43.38835],[-75.984512,43.387626],[-75.984505,43.387342],[-75.984516,43.387188],[-75.984577,43.386789],[-75.984588,43.38673],[-75.984874,43.385893],[-75.985311,43.384562],[-75.98515500000001,43.3845],[-75.98496799999999,43.384411],[-75.984652,43.384224],[-75.984526,43.384214],[-75.98372000000001,43.383607],[-75.983563,43.383497],[-75.98358899999999,43.383466],[-75.983609,43.383442],[-75.983836,43.382893],[-75.98427700000001,43.381859],[-75.98440600000001,43.381558],[-75.984587,43.381185],[-75.98467100000001,43.381039],[-75.98472700000001,43.380941],[-75.98487299999999,43.380756],[-75.985131,43.380502],[-75.985255,43.380402],[-75.985547,43.380214],[-75.985826,43.380069],[-75.986238,43.379892],[-75.986418,43.379828],[-75.986716,43.379723],[-75.987954,43.379332],[-75.988544,43.379146],[-75.989126,43.378946],[-75.98937599999999,43.378846],[-75.99113699999999,43.37809],[-75.995243,43.376269],[-75.995904,43.37599],[-75.996123,43.375883],[-75.998413,43.374833],[-76.001395,43.373468],[-76.002056,43.373153],[-76.00285700000001,43.372787],[-76.003536,43.372457],[-76.004391,43.372035],[-76.00514699999999,43.371643],[-76.00591799999999,43.37123],[-76.006593,43.370848],[-76.00664399999999,43.37082],[-76.00738200000001,43.37035],[-76.00805699999999,43.369869],[-76.00834399999999,43.369645],[-76.008852,43.369209],[-76.009041,43.369058],[-76.0093,43.368828],[-76.010188,43.367947],[-76.01048900000001,43.367703],[-76.01101800000001,43.367314],[-76.011499,43.36702],[-76.011933,43.366779],[-76.01242000000001,43.366546],[-76.013048,43.366281],[-76.01413700000001,43.365813],[-76.014325,43.365715],[-76.014844,43.365417],[-76.015192,43.365174],[-76.015972,43.364511],[-76.01860499999999,43.362141],[-76.01913,43.361656],[-76.019687,43.361189],[-76.02016399999999,43.360848],[-76.02037799999999,43.360723],[-76.02199400000001,43.359855],[-76.024084,43.358733],[-76.024745,43.358403],[-76.025066,43.358516],[-76.027287,43.359023],[-76.02766099999999,43.359129],[-76.02787600000001,43.359219],[-76.027967,43.359265],[-76.04317,43.362471],[-76.04698500000001,43.363306],[-76.04708599999999,43.363417],[-76.04717599999999,43.3635],[-76.047282,43.36354],[-76.047529,43.363576],[-76.047833,43.363609],[-76.048107,43.363638],[-76.048413,43.363719],[-76.048788,43.363825],[-76.04909600000001,43.363913],[-76.04928200000001,43.363958],[-76.049814,43.364046],[-76.051709,43.364495],[-76.05194400000001,43.364551],[-76.052513,43.36471],[-76.053819,43.364993],[-76.054506,43.365138],[-76.056077,43.365469],[-76.05781899999999,43.365849],[-76.059635,43.366265],[-76.0625,43.366939],[-76.06354399999999,43.367132],[-76.063874,43.367207],[-76.065995,43.367674],[-76.06778199999999,43.368086],[-76.06857100000001,43.36826],[-76.071719,43.369002],[-76.07367600000001,43.369432],[-76.07481799999999,43.369694],[-76.075051,43.369748],[-76.07564600000001,43.369896],[-76.076228,43.370028],[-76.076521,43.370082],[-76.07679899999999,43.370144],[-76.07744,43.370274],[-76.07937699999999,43.370706],[-76.07983900000001,43.370819],[-76.08168499999999,43.371222],[-76.082019,43.37128],[-76.082138,43.371437],[-76.082679,43.372096],[-76.08337,43.372909],[-76.082919,43.37314]]],"type":"Polygon"}
}