{
  "id": "360894904003",
  "type": "Feature",
  "properties": {
    "area_land":23268118,
    "area_water":15938043,
    "geoid":"360894904003",
    "name":"Block Group 3",
    "state":"ny"
},
  "bbox": [
    -75.015435,
    44.915359,
    -74.911828,
    44.984583
],
  "geometry": {"coordinates":[[[-75.015435,44.952853],[-75.005151,44.958406],[-75.00473100000001,44.958978],[-75.004278,44.959853],[-75.004285,44.960169],[-75.003083,44.962412],[-74.999878,44.965911],[-74.99965400000001,44.965922],[-74.999258,44.966111],[-74.999268,44.968786],[-74.999285,44.96906],[-74.999285,44.97151],[-74.99927,44.971638],[-74.992784,44.977441],[-74.992727,44.977469],[-74.98288100000001,44.980356],[-74.97249100000001,44.983405],[-74.972418,44.983414],[-74.97071699999999,44.983503],[-74.950228,44.984494],[-74.947506,44.984583],[-74.941846,44.984501],[-74.940387,44.984447],[-74.939447,44.984417],[-74.944906,44.978884],[-74.94561299999999,44.978349],[-74.94653599999999,44.977559],[-74.947777,44.975493],[-74.948824,44.972543],[-74.949388,44.970353],[-74.949208,44.968006],[-74.948803,44.965562],[-74.947001,44.963995],[-74.943727,44.962749],[-74.94185899999999,44.962023],[-74.941151,44.961786],[-74.940489,44.961293],[-74.93546000000001,44.955989],[-74.93477300000001,44.955263],[-74.93185,44.952171],[-74.93171700000001,44.952039],[-74.931065,44.95132],[-74.93028,44.950284],[-74.930184,44.950242],[-74.929958,44.950124],[-74.92972899999999,44.949979],[-74.929709,44.949966],[-74.929547,44.949833],[-74.92942499999999,44.94972],[-74.929407,44.949702],[-74.928048,44.948264],[-74.927576,44.947762],[-74.926816,44.946947],[-74.925648,44.9457],[-74.92437099999999,44.94435],[-74.92398900000001,44.943946],[-74.92225500000001,44.942125],[-74.922084,44.941948],[-74.921982,44.941842],[-74.920153,44.939905],[-74.91998700000001,44.939729],[-74.91967,44.939397],[-74.91903600000001,44.938736],[-74.91885000000001,44.938543],[-74.917992,44.937628],[-74.917879,44.937497],[-74.915722,44.935199],[-74.914524,44.933915],[-74.91393600000001,44.933253],[-74.912194,44.931326],[-74.911828,44.930953],[-74.915313,44.929818],[-74.916662,44.929181],[-74.920081,44.926933],[-74.923135,44.924682],[-74.92612099999999,44.922362],[-74.926788,44.922404],[-74.92685400000001,44.922409],[-74.926914,44.922412],[-74.930029,44.92261],[-74.934146,44.922872],[-74.935045,44.922942],[-74.936049,44.923021],[-74.93647199999999,44.923053],[-74.937251,44.923112],[-74.93749800000001,44.923141],[-74.93841,44.923202],[-74.94021100000001,44.923324],[-74.943214,44.923558],[-74.94377,44.92359],[-74.94450000000001,44.923661],[-74.94598499999999,44.92377],[-74.947322,44.923885],[-74.950473,44.924133],[-74.95195099999999,44.924229],[-74.952703,44.924257],[-74.953551,44.924266],[-74.954718,44.924236],[-74.955438,44.924194],[-74.956909,44.924064],[-74.957047,44.924047],[-74.957673,44.923968],[-74.958381,44.92386],[-74.95909899999999,44.923727],[-74.960555,44.923446],[-74.961242,44.92332],[-74.964164,44.922747],[-74.964888,44.922589],[-74.965649,44.922434],[-74.970876,44.92131],[-74.972368,44.920989],[-74.973932,44.920659],[-74.975504,44.92031],[-74.976123,44.92018],[-74.979893,44.919364],[-74.981247,44.919082],[-74.982936,44.918703],[-74.98557099999999,44.918145],[-74.988867,44.917426],[-74.989857,44.917218],[-74.991516,44.916849],[-74.993512,44.91643],[-74.99427,44.916256],[-74.998441,44.915359],[-74.99938899999999,44.91635],[-75.00037,44.917342],[-75.001592,44.918611],[-75.002005,44.919025],[-75.00268199999999,44.919733],[-75.00293600000001,44.919993],[-75.006719,44.923871],[-75.00913300000001,44.92633],[-75.009664,44.926887],[-75.009405,44.927055],[-75.00856400000001,44.927559],[-75.008015,44.927855],[-75.005849,44.929036],[-75.00511,44.929435],[-75.005297,44.929914],[-75.005455,44.930374],[-75.006978,44.934159],[-75.008573,44.937687],[-75.015435,44.952853]]],"type":"Polygon"}
}