{
  "id": "360810478003",
  "type": "Feature",
  "properties": {
    "area_land":132695,
    "area_water":0,
    "geoid":"360810478003",
    "name":"Block Group 3",
    "state":"ny"
},
  "bbox": [
    -73.766641,
    40.716393,
    -73.758327,
    40.721063
],
  "geometry": {"coordinates":[[[-73.76664100000001,40.717647],[-73.765398,40.718356],[-73.765242,40.718446],[-73.76446900000001,40.71889],[-73.763608,40.719282],[-73.762766,40.719639],[-73.76240300000001,40.719809],[-73.761967,40.72],[-73.761138,40.720329],[-73.7603,40.72066],[-73.759772,40.720907],[-73.759441,40.721063],[-73.75832699999999,40.719582],[-73.75877699999999,40.719388],[-73.759216,40.719199],[-73.76003,40.718847],[-73.760845,40.718494],[-73.761662,40.718141],[-73.762479,40.717786],[-73.763355,40.717411],[-73.76437300000001,40.716967],[-73.765714,40.716393],[-73.76664100000001,40.717647]]],"type":"Polygon"}
}