{
  "id": "360550096021",
  "type": "Feature",
  "properties": {
    "area_land":456312,
    "area_water":0,
    "geoid":"360550096021",
    "name":"Block Group 1",
    "state":"ny"
},
  "bbox": [
    -77.643982,
    43.149989,
    -77.626025,
    43.157527
],
  "geometry": {"coordinates":[[[-77.64398199999999,43.157191],[-77.643282,43.157119],[-77.64152900000001,43.156911],[-77.641087,43.156849],[-77.64044800000001,43.156776],[-77.64022799999999,43.156763],[-77.639798,43.156738],[-77.638875,43.156692],[-77.637843,43.156691],[-77.636251,43.156689],[-77.6352,43.156688],[-77.633928,43.156687],[-77.633608,43.156684],[-77.632302,43.156672],[-77.63103599999999,43.156684],[-77.630805,43.156686],[-77.63013599999999,43.156714],[-77.629608,43.156769],[-77.629069,43.156848],[-77.628551,43.156957],[-77.627636,43.157166],[-77.626025,43.157527],[-77.626361,43.157278],[-77.626662,43.157056],[-77.62746300000001,43.156488],[-77.627673,43.156333],[-77.62792399999999,43.156151],[-77.628023,43.15608],[-77.62836799999999,43.155833],[-77.628502,43.155736],[-77.629187,43.155248],[-77.630415,43.15437],[-77.631568,43.153547],[-77.63231500000001,43.153005],[-77.633368,43.152246],[-77.633994,43.151792],[-77.634658,43.151319],[-77.635352,43.150815],[-77.636077,43.150243],[-77.637201,43.149989],[-77.63752599999999,43.149991],[-77.637525,43.150441],[-77.637519,43.151735],[-77.638892,43.151731],[-77.638892,43.152429],[-77.638876,43.153953],[-77.638874,43.154027],[-77.638862,43.155233],[-77.63911299999999,43.155229],[-77.641143,43.155236],[-77.64113999999999,43.156419],[-77.642242,43.156568],[-77.643101,43.156651],[-77.64397200000001,43.156756],[-77.64397700000001,43.157056],[-77.64398199999999,43.157191]]],"type":"Polygon"}
}