{
  "id": "360594081002",
  "type": "Feature",
  "properties": {
    "area_land":550321,
    "area_water":38289,
    "geoid":"360594081002",
    "name":"Block Group 2",
    "state":"ny"
},
  "bbox": [
    -73.553741,
    40.703944,
    -73.54366,
    40.714646
],
  "geometry": {"coordinates":[[[-73.553741,40.709763],[-73.553594,40.709887],[-73.55251800000001,40.71073],[-73.551233,40.711737],[-73.549634,40.713003],[-73.54934,40.713225],[-73.548666,40.71376],[-73.548295,40.714139],[-73.5478,40.714646],[-73.54755299999999,40.714505],[-73.547496,40.714486],[-73.54739499999999,40.714472],[-73.54664099999999,40.714497],[-73.54547100000001,40.714537],[-73.544625,40.714564],[-73.54456,40.714237],[-73.54453599999999,40.714112],[-73.544279,40.712588],[-73.544197,40.712112],[-73.54418200000001,40.712079],[-73.544166,40.711978],[-73.544144,40.711798],[-73.54401,40.711008],[-73.54392300000001,40.710455],[-73.54389500000001,40.710305],[-73.543874,40.710222],[-73.54379400000001,40.709767],[-73.543785,40.709657],[-73.543739,40.709421],[-73.543708,40.70925],[-73.54366,40.708875],[-73.54371999999999,40.708606],[-73.543778,40.708422],[-73.543942,40.708051],[-73.544251,40.707392],[-73.544301,40.707236],[-73.544346,40.707139],[-73.544394,40.706925],[-73.544399,40.706546],[-73.544391,40.706171],[-73.544371,40.705789],[-73.544488,40.705752],[-73.544729,40.705639],[-73.54510500000001,40.705391],[-73.54520599999999,40.705304],[-73.54635,40.704197],[-73.546622,40.703944],[-73.547667,40.704965],[-73.547962,40.70526],[-73.548209,40.705489],[-73.54834200000001,40.705595],[-73.548948,40.706082],[-73.549002,40.706109],[-73.54902800000001,40.706136],[-73.549733,40.706741],[-73.55006400000001,40.70703],[-73.550397,40.707292],[-73.552074,40.708506],[-73.552156,40.708564],[-73.552745,40.708994],[-73.55295599999999,40.709158],[-73.55332300000001,40.70942],[-73.553568,40.70961],[-73.55365399999999,40.709676],[-73.553741,40.709763]]],"type":"Polygon"}
}