{
  "id": "361119538003",
  "type": "Feature",
  "properties": {
    "area_land":1985364,
    "area_water":10971,
    "geoid":"361119538003",
    "name":"Block Group 3",
    "state":"ny"
},
  "bbox": [
    -73.989206,
    41.586817,
    -73.972176,
    41.609231
],
  "geometry": {"coordinates":[[[-73.989206,41.604996],[-73.988917,41.605065],[-73.98875700000001,41.605108],[-73.988517,41.605188],[-73.98817699999999,41.60533],[-73.987948,41.605468],[-73.987787,41.605596],[-73.98757000000001,41.605808],[-73.987213,41.606161],[-73.987087,41.606253],[-73.987005,41.606303],[-73.986869,41.606368],[-73.986659,41.606447],[-73.98636500000001,41.60655],[-73.98603900000001,41.606692],[-73.985838,41.606825],[-73.985758,41.606915],[-73.985632,41.607131],[-73.985473,41.607479],[-73.985401,41.60761],[-73.985218,41.60786],[-73.985176,41.607909],[-73.98497399999999,41.608116],[-73.98464800000001,41.608415],[-73.98442300000001,41.60859],[-73.98429299999999,41.608673],[-73.98418700000001,41.608728],[-73.98401699999999,41.608797],[-73.983814,41.608859],[-73.98303900000001,41.609073],[-73.98270100000001,41.609149],[-73.98246399999999,41.609191],[-73.98213199999999,41.609217],[-73.98173,41.609226],[-73.98087099999999,41.609231],[-73.980525,41.60922],[-73.980441,41.609209],[-73.98030900000001,41.609165],[-73.980186,41.6091],[-73.979707,41.608753],[-73.979088,41.608284],[-73.97892400000001,41.608135],[-73.978556,41.60769],[-73.978381,41.607548],[-73.978308,41.607504],[-73.978239,41.607475],[-73.97811799999999,41.607442],[-73.977447,41.607308],[-73.97692600000001,41.607176],[-73.976562,41.607075],[-73.97633,41.607012],[-73.97581,41.606874],[-73.975362,41.606761],[-73.975047,41.606666],[-73.974433,41.606462],[-73.973601,41.606164],[-73.973405,41.606121],[-73.972781,41.606022],[-73.972584,41.605971],[-73.97246699999999,41.605931],[-73.972404,41.605892],[-73.97231499999999,41.605706],[-73.97229299999999,41.605589],[-73.972284,41.605154],[-73.972278,41.604897],[-73.972247,41.604783],[-73.972176,41.604719],[-73.972258,41.604542],[-73.97228699999999,41.604437],[-73.972317,41.604144],[-73.97237199999999,41.603008],[-73.972424,41.602248],[-73.972469,41.601624],[-73.97251300000001,41.601249],[-73.972604,41.600785],[-73.972672,41.600578],[-73.972807,41.600271],[-73.972877,41.60013],[-73.97302999999999,41.599892],[-73.973608,41.599163],[-73.973789,41.598917],[-73.974598,41.597577],[-73.975178,41.596615],[-73.97536100000001,41.596352],[-73.975703,41.595916],[-73.976027,41.595613],[-73.97618799999999,41.595478],[-73.97706700000001,41.594808],[-73.977428,41.5945],[-73.97770800000001,41.594211],[-73.97799999999999,41.593861],[-73.97826999999999,41.593464],[-73.978459,41.59322],[-73.978951,41.592517],[-73.979101,41.592312],[-73.97926099999999,41.592094],[-73.979418,41.591901],[-73.98085500000001,41.590251],[-73.98151799999999,41.589402],[-73.981602,41.589278],[-73.98181700000001,41.588896],[-73.9824,41.587606],[-73.982626,41.587163],[-73.982658,41.587113],[-73.98617400000001,41.586835],[-73.98635,41.586817],[-73.98643800000001,41.587001],[-73.98654999999999,41.587433],[-73.986653,41.588063],[-73.986682,41.588555],[-73.98667399999999,41.588679],[-73.98665099999999,41.588832],[-73.986572,41.589099],[-73.98642599999999,41.589593],[-73.9862,41.590238],[-73.986158,41.590385],[-73.98609500000001,41.590715],[-73.98604,41.59109],[-73.985967,41.591717],[-73.98593099999999,41.592121],[-73.985872,41.592604],[-73.985828,41.592781],[-73.985705,41.592992],[-73.98563900000001,41.593071],[-73.98557,41.593153],[-73.984937,41.593825],[-73.984685,41.594113],[-73.984492,41.594338],[-73.98440600000001,41.59446],[-73.984098,41.594896],[-73.983959,41.595072],[-73.983245,41.596007],[-73.982939,41.596357],[-73.982589,41.596706],[-73.98250400000001,41.596803],[-73.982388,41.596943],[-73.98223900000001,41.597184],[-73.982175,41.597298],[-73.98195800000001,41.597694],[-73.98155,41.598481],[-73.981393,41.598856],[-73.981313,41.599078],[-73.98126000000001,41.599357],[-73.982023,41.599353],[-73.982679,41.599335],[-73.982947,41.599319],[-73.98305499999999,41.599313],[-73.98326299999999,41.599266],[-73.98335299999999,41.599236],[-73.98347800000001,41.599178],[-73.983656,41.599063],[-73.983901,41.598852],[-73.984101,41.598639],[-73.98459,41.597885],[-73.984677,41.597779],[-73.98475000000001,41.597717],[-73.98491,41.597618],[-73.985078,41.597575],[-73.98538499999999,41.597533],[-73.985777,41.597515],[-73.985995,41.597527],[-73.986183,41.597564],[-73.986378,41.597628],[-73.986912,41.597835],[-73.987071,41.597912],[-73.987257,41.598022],[-73.987284,41.598167],[-73.987426,41.598455],[-73.98786800000001,41.599253],[-73.987995,41.599501],[-73.988083,41.599723],[-73.98827199999999,41.600422],[-73.988298,41.600627],[-73.988287,41.600889],[-73.98823899999999,41.601351],[-73.988214,41.601788],[-73.988225,41.60212],[-73.98826099999999,41.602328],[-73.988304,41.602482],[-73.98853099999999,41.603271],[-73.988674,41.603637],[-73.98906700000001,41.604433],[-73.989144,41.604663],[-73.98916699999999,41.604766],[-73.989206,41.604996]]],"type":"Polygon"}
}