{
  "id": "361031243005",
  "type": "Feature",
  "properties": {
    "area_land":162472,
    "area_water":0,
    "geoid":"361031243005",
    "name":"Block Group 5",
    "state":"ny"
},
  "bbox": [
    -73.34551,
    40.701339,
    -73.339185,
    40.70673
],
  "geometry": {"coordinates":[[[-73.34551,40.705694],[-73.344425,40.706196],[-73.343429,40.706659],[-73.343127,40.70673],[-73.34272900000001,40.706568],[-73.342179,40.706351],[-73.34124199999999,40.706007],[-73.340948,40.705877],[-73.340673,40.705727],[-73.34047700000001,40.705577],[-73.340304,40.705392],[-73.340076,40.705078],[-73.339934,40.70484],[-73.339844,40.704715],[-73.339738,40.704596],[-73.339578,40.704488],[-73.339451,40.704427],[-73.339185,40.704287],[-73.33998699999999,40.70248],[-73.34074200000001,40.701339],[-73.341117,40.701741],[-73.341263,40.701866],[-73.34157,40.702102],[-73.342719,40.702907],[-73.342799,40.702961],[-73.343087,40.703153],[-73.34349899999999,40.70342],[-73.343766,40.7037],[-73.34399500000001,40.704006],[-73.344425,40.704598],[-73.344449,40.70463],[-73.344515,40.704696],[-73.34551,40.705694]]],"type":"Polygon"}
}