{
  "id": "361031120012",
  "type": "Feature",
  "properties": {
    "area_land":1646797,
    "area_water":0,
    "geoid":"361031120012",
    "name":"Block Group 2",
    "state":"ny"
},
  "bbox": [
    -73.412484,
    40.812801,
    -73.394905,
    40.831203
],
  "geometry": {"coordinates":[[[-73.41241100000001,40.825141],[-73.412273,40.825685],[-73.412091,40.826383],[-73.41189300000001,40.827056],[-73.41171900000001,40.827732],[-73.411518,40.828423],[-73.41132500000001,40.828417],[-73.409504,40.828361],[-73.40799800000001,40.828326],[-73.40703499999999,40.828289],[-73.405654,40.828255],[-73.403351,40.828197],[-73.403076,40.828197],[-73.40259500000001,40.828212],[-73.402412,40.828212],[-73.40222300000001,40.828224],[-73.401825,40.82827],[-73.401526,40.828337],[-73.401268,40.828421],[-73.40102400000001,40.828518],[-73.400153,40.828926],[-73.399681,40.829143],[-73.398186,40.829826],[-73.39796200000001,40.829937],[-73.39720800000001,40.830268],[-73.39645299999999,40.830601],[-73.39578899999999,40.830855],[-73.39490499999999,40.831203],[-73.395049,40.830902],[-73.395203,40.830509],[-73.395302,40.830181],[-73.39539499999999,40.829758],[-73.39541699999999,40.829625],[-73.39544600000001,40.829503],[-73.395713,40.82822],[-73.39572,40.827819],[-73.395737,40.827438],[-73.395758,40.827205],[-73.395836,40.826976],[-73.395988,40.826735],[-73.396568,40.826214],[-73.396821,40.826019],[-73.396934,40.825905],[-73.397041,40.825756],[-73.39716300000001,40.825558],[-73.39731500000001,40.825289],[-73.397453,40.824993],[-73.397597,40.82479],[-73.397841,40.82455],[-73.398222,40.824179],[-73.398681,40.82378],[-73.398909,40.823559],[-73.399368,40.823196],[-73.399536,40.823043],[-73.40023100000001,40.822429],[-73.40042,40.822235],[-73.400504,40.822135],[-73.400702,40.821853],[-73.40084,40.821639],[-73.400932,40.821425],[-73.400993,40.821193],[-73.40107,40.82082],[-73.401098,40.820576],[-73.401161,40.819908],[-73.401214,40.819614],[-73.401291,40.819393],[-73.401366,40.819163],[-73.401518,40.818668],[-73.40164900000001,40.818359],[-73.40177199999999,40.818123],[-73.401962,40.817714],[-73.402252,40.817057],[-73.402382,40.816639],[-73.40248099999999,40.816356],[-73.40263299999999,40.816116],[-73.402708,40.816028],[-73.403007,40.815681],[-73.40335899999999,40.815151],[-73.403718,40.814731],[-73.404365,40.814006],[-73.404557,40.813816],[-73.40479999999999,40.813537],[-73.405159,40.813217],[-73.40557800000001,40.812801],[-73.4058,40.812813],[-73.40599899999999,40.812832],[-73.406235,40.812874],[-73.406898,40.813068],[-73.407157,40.813167],[-73.40773799999999,40.813549],[-73.407889,40.813632],[-73.40877500000001,40.814032],[-73.409763,40.814485],[-73.41014,40.814673],[-73.410229,40.815054],[-73.410293,40.815263],[-73.410617,40.816309],[-73.410963,40.81719],[-73.410982,40.817249],[-73.41175200000001,40.819609],[-73.411759,40.819633],[-73.41195399999999,40.820347],[-73.411995,40.820551],[-73.412074,40.820945],[-73.412127,40.821214],[-73.412193,40.821692],[-73.412256,40.822351],[-73.412341,40.823403],[-73.412342,40.824196],[-73.412307,40.824604],[-73.41228700000001,40.824735],[-73.41248400000001,40.824764],[-73.41241100000001,40.825141]]],"type":"Polygon"}
}