{
  "id": "360593032021",
  "type": "Feature",
  "properties": {
    "area_land":253982,
    "area_water":0,
    "geoid":"360593032021",
    "name":"Block Group 1",
    "state":"ny"
},
  "bbox": [
    -73.671506,
    40.737082,
    -73.659859,
    40.745386
],
  "geometry": {"coordinates":[[[-73.67150599999999,40.739393],[-73.670086,40.740083],[-73.6678,40.741188],[-73.66445899999999,40.742805],[-73.66493,40.743385],[-73.665403,40.743971],[-73.66587699999999,40.744555],[-73.66640700000001,40.745213],[-73.666212,40.745386],[-73.66603499999999,40.745275],[-73.664866,40.744599],[-73.663466,40.743789],[-73.663207,40.743648],[-73.66277599999999,40.743441],[-73.661975,40.743057],[-73.66157200000001,40.742894],[-73.661356,40.742827],[-73.661125,40.742772],[-73.66034399999999,40.742646],[-73.659971,40.742589],[-73.659859,40.742572],[-73.65996199999999,40.742515],[-73.660217,40.742394],[-73.660327,40.742342],[-73.66302,40.741024],[-73.665955,40.739616],[-73.666336,40.739432],[-73.666712,40.73925],[-73.667495,40.738871],[-73.66829199999999,40.738482],[-73.668616,40.738325],[-73.669121,40.738081],[-73.669377,40.737955],[-73.669961,40.737674],[-73.67073600000001,40.737297],[-73.671184,40.737082],[-73.671294,40.737866],[-73.671369,40.738414],[-73.671395,40.738638],[-73.671432,40.738995],[-73.67145600000001,40.739105],[-73.67150599999999,40.739393]]],"type":"Polygon"}
}