{
  "id": "361031238022",
  "type": "Feature",
  "properties": {
    "area_land":937327,
    "area_water":455993,
    "geoid":"361031238022",
    "name":"Block Group 2",
    "state":"ny"
},
  "bbox": [
    -73.382341,
    40.6569,
    -73.364465,
    40.672721
],
  "geometry": {"coordinates":[[[-73.382341,40.671305],[-73.381348,40.671531],[-73.380459,40.671736],[-73.379583,40.671924],[-73.379333,40.671973],[-73.378608,40.672134],[-73.37806999999999,40.672274],[-73.3777,40.672391],[-73.377456,40.672483],[-73.376925,40.672721],[-73.37688199999999,40.672627],[-73.37662400000001,40.672065],[-73.376484,40.671912],[-73.37623499999999,40.671704],[-73.375952,40.671539],[-73.375862,40.671492],[-73.375666,40.67134],[-73.375258,40.670739],[-73.374743,40.670083],[-73.374095,40.669378],[-73.373526,40.669185],[-73.373133,40.669052],[-73.372371,40.668505],[-73.37167700000001,40.667478],[-73.37085999999999,40.667403],[-73.37002,40.667325],[-73.369872,40.667413],[-73.36917,40.667643],[-73.367321,40.666265],[-73.366563,40.665701],[-73.36606500000001,40.6645],[-73.364465,40.6605],[-73.376166,40.6569],[-73.378969,40.659601],[-73.378264,40.659863],[-73.37746799999999,40.660161],[-73.381669,40.670998],[-73.382341,40.671305]]],"type":"Polygon"}
}