{
  "id": "360650249002",
  "type": "Feature",
  "properties": {
    "area_land":2406982,
    "area_water":8875,
    "geoid":"360650249002",
    "name":"Block Group 2",
    "state":"ny"
},
  "bbox": [
    -75.554817,
    43.07078,
    -75.520322,
    43.0881
],
  "geometry": {"coordinates":[[[-75.552217,43.081056],[-75.552341,43.081248],[-75.550262,43.081638],[-75.54317,43.082967],[-75.543226,43.083062],[-75.543426,43.083366],[-75.543541,43.083498],[-75.54395700000001,43.084141],[-75.54434999999999,43.084684],[-75.545267,43.08597],[-75.545959,43.086809],[-75.546148,43.087047],[-75.54463199999999,43.08761],[-75.54328599999999,43.0881],[-75.54285400000001,43.087458],[-75.542568,43.08713],[-75.542503,43.087056],[-75.54216700000001,43.087043],[-75.540099,43.08751],[-75.53970700000001,43.087598],[-75.539001,43.086059],[-75.538993,43.086027],[-75.538749,43.086081],[-75.537915,43.086506],[-75.53697699999999,43.086983],[-75.536281,43.087453],[-75.535544,43.086502],[-75.535183,43.086037],[-75.534308,43.084898],[-75.533753,43.084189],[-75.53133800000001,43.084786],[-75.530432,43.084861],[-75.52928199999999,43.083459],[-75.529247,43.083419],[-75.529509,43.083308],[-75.529893,43.083145],[-75.529696,43.082911],[-75.52675000000001,43.079408],[-75.526245,43.078808],[-75.525599,43.07806],[-75.525058,43.077394],[-75.524674,43.076954],[-75.523872,43.076673],[-75.52296800000001,43.076389],[-75.521462,43.075959],[-75.521148,43.075869],[-75.52032199999999,43.075652],[-75.520799,43.074227],[-75.523315,43.074833],[-75.52481400000001,43.075356],[-75.526149,43.075706],[-75.528023,43.075106],[-75.528418,43.073556],[-75.528554,43.073675],[-75.52869800000001,43.073733],[-75.528778,43.073754],[-75.52907999999999,43.073774],[-75.52912600000001,43.073764],[-75.52923,43.07365],[-75.529363,43.073579],[-75.529538,43.073553],[-75.529788,43.073557],[-75.529923,43.0736],[-75.529985,43.073631],[-75.53003699999999,43.073672],[-75.530225,43.073774],[-75.530424,43.073826],[-75.530539,43.073825],[-75.530703,43.073839],[-75.53101599999999,43.073917],[-75.53130400000001,43.074003],[-75.53149000000001,43.074049],[-75.531734,43.07414],[-75.531796,43.074174],[-75.531873,43.074243],[-75.53198999999999,43.074382],[-75.532053,43.074524],[-75.532073,43.074591],[-75.532083,43.074701],[-75.53201900000001,43.074903],[-75.531977,43.074992],[-75.53197900000001,43.07507],[-75.53200099999999,43.075107],[-75.532376,43.075287],[-75.532538,43.075491],[-75.532577,43.075568],[-75.532622,43.075923],[-75.532697,43.076014],[-75.532989,43.076191],[-75.533041,43.076202],[-75.533164,43.076196],[-75.533275,43.076169],[-75.533356,43.076182],[-75.533777,43.075984],[-75.534643,43.07571],[-75.535239,43.075347],[-75.535623,43.075182],[-75.536929,43.074639],[-75.539115,43.073702],[-75.54009600000001,43.073282],[-75.540823,43.07294],[-75.540999,43.072858],[-75.541578,43.072586],[-75.541674,43.072542],[-75.541811,43.072479],[-75.542153,43.072326],[-75.54261700000001,43.071642],[-75.54330299999999,43.071924],[-75.543694,43.071416],[-75.543711,43.071395],[-75.54427800000001,43.07078],[-75.545107,43.071123],[-75.54492,43.071369],[-75.54481199999999,43.071508],[-75.545205,43.071762],[-75.547726,43.073424],[-75.545687,43.074304],[-75.546386,43.07516],[-75.54644999999999,43.075254],[-75.546492,43.07534],[-75.54651,43.07542],[-75.546514,43.075607],[-75.546493,43.07567],[-75.546693,43.075941],[-75.546319,43.076115],[-75.546556,43.076449],[-75.545912,43.076653],[-75.546413,43.077384],[-75.546627,43.077316],[-75.547021,43.077192],[-75.547102,43.077166],[-75.547147,43.077152],[-75.547427,43.077065],[-75.547769,43.077553],[-75.548265,43.0774],[-75.547974,43.076891],[-75.548141,43.076838],[-75.54844199999999,43.077346],[-75.548776,43.077245],[-75.548952,43.077533],[-75.549764,43.07727],[-75.54989500000001,43.077472],[-75.55122,43.077395],[-75.55068900000001,43.076751],[-75.551466,43.076486],[-75.554817,43.080603],[-75.552217,43.081056]]],"type":"Polygon"}
}