{
  "id": "360690511003",
  "type": "Feature",
  "properties": {
    "area_land":2051461,
    "area_water":491348,
    "geoid":"360690511003",
    "name":"Block Group 3",
    "state":"ny"
},
  "bbox": [
    -77.277382,
    42.871394,
    -77.249932,
    42.888282
],
  "geometry": {"coordinates":[[[-77.277321,42.882157],[-77.277258,42.882184],[-77.277107,42.882244],[-77.27628199999999,42.882579],[-77.27600700000001,42.882691],[-77.272755,42.883951],[-77.27207,42.884227],[-77.27198300000001,42.884261],[-77.271694,42.884373],[-77.271252,42.884546],[-77.27099,42.88465],[-77.27088999999999,42.884689],[-77.27059199999999,42.884806],[-77.270493,42.884846],[-77.27040100000001,42.884882],[-77.270124,42.88499],[-77.270033,42.885027],[-77.269199,42.88535],[-77.26669800000001,42.886318],[-77.26586500000001,42.886642],[-77.264967,42.886986],[-77.262585,42.8879],[-77.262275,42.888014],[-77.262208,42.888039],[-77.261661,42.888207],[-77.261352,42.888277],[-77.261325,42.888282],[-77.260144,42.886673],[-77.25867700000001,42.884674],[-77.256602,42.881846],[-77.255645,42.880541],[-77.25542900000001,42.880232],[-77.255263,42.879992],[-77.254766,42.879272],[-77.25460099999999,42.879033],[-77.254329,42.878643],[-77.253642,42.877658],[-77.25351999999999,42.877471],[-77.253379,42.877255],[-77.253257,42.877077],[-77.25300900000001,42.876717],[-77.252983,42.876679],[-77.25294700000001,42.876627],[-77.252267,42.875637],[-77.252037,42.875302],[-77.252016,42.875282],[-77.251803,42.875073],[-77.251786,42.875056],[-77.251484,42.874726],[-77.25122,42.874395],[-77.251034,42.874163],[-77.250991,42.874109],[-77.250862,42.87395],[-77.25082,42.873897],[-77.250803,42.873872],[-77.25075200000001,42.873799],[-77.25073500000001,42.873775],[-77.25062,42.873604],[-77.250564,42.873506],[-77.25009,42.872677],[-77.249932,42.872401],[-77.250039,42.872179],[-77.25076900000001,42.872203],[-77.251014,42.872212],[-77.251279,42.872197],[-77.252183,42.872226],[-77.25304,42.872192],[-77.255613,42.872094],[-77.255701,42.872091],[-77.25646999999999,42.872049],[-77.25645900000001,42.872033],[-77.256428,42.871985],[-77.256418,42.871969],[-77.256686,42.871854],[-77.257493,42.871508],[-77.25761,42.871458],[-77.257762,42.871394],[-77.257896,42.871456],[-77.25795599999999,42.871479],[-77.258033,42.871509],[-77.25852999999999,42.871753],[-77.25872099999999,42.871847],[-77.25906999999999,42.871868],[-77.26145099999999,42.871814],[-77.262705,42.871787],[-77.26863400000001,42.871593],[-77.269644,42.871558],[-77.272375,42.871465],[-77.27238,42.871579],[-77.272384,42.871639],[-77.27239400000001,42.871813],[-77.27239899999999,42.871922],[-77.272406,42.872037],[-77.272413,42.872523],[-77.272437,42.873982],[-77.272445,42.874469],[-77.272445,42.874513],[-77.272446,42.874644],[-77.272447,42.874689],[-77.272448,42.874801],[-77.272457,42.875065],[-77.272464,42.875248],[-77.27251200000001,42.875475],[-77.27257299999999,42.875605],[-77.27275400000001,42.875866],[-77.27291099999999,42.876065],[-77.27293899999999,42.876101],[-77.273167,42.876342],[-77.273183,42.876357],[-77.273231,42.876405],[-77.273248,42.876422],[-77.2734,42.87662],[-77.273667,42.876969],[-77.273748,42.877075],[-77.273853,42.877217],[-77.274002,42.877419],[-77.274237,42.877723],[-77.274615,42.878226],[-77.274653,42.878284],[-77.2747,42.878348],[-77.274975,42.878738],[-77.27578200000001,42.879899],[-77.276062,42.880305],[-77.27624900000001,42.880565],[-77.27672,42.881218],[-77.27681200000001,42.881345],[-77.277001,42.881605],[-77.27707700000001,42.88171],[-77.277305,42.882025],[-77.277382,42.882131],[-77.277321,42.882157]]],"type":"Polygon"}
}