{
  "id": "360259711003",
  "type": "Feature",
  "properties": {
    "area_land":64307017,
    "area_water":49638,
    "geoid":"360259711003",
    "name":"Block Group 3",
    "state":"ny"
},
  "bbox": [
    -74.63803,
    42.262771,
    -74.476274,
    42.404193
],
  "geometry": {"coordinates":[[[-74.638024,42.309701],[-74.637602,42.309982],[-74.63493,42.310898],[-74.633813,42.312032],[-74.63229800000001,42.31282],[-74.63025399999999,42.313358],[-74.62778,42.313387],[-74.62302200000001,42.311926],[-74.62083800000001,42.311888],[-74.61923,42.311522],[-74.618342,42.311697],[-74.61665000000001,42.31265],[-74.615426,42.313706],[-74.614645,42.314177],[-74.613564,42.314527],[-74.611704,42.314888],[-74.611097,42.315106],[-74.609082,42.315819],[-74.607725,42.316773],[-74.606143,42.318749],[-74.605735,42.31998],[-74.605853,42.320133],[-74.606258,42.320964],[-74.60627100000001,42.322195],[-74.606477,42.323806],[-74.607573,42.326401],[-74.608237,42.327369],[-74.608739,42.32824],[-74.608819,42.32923],[-74.60904600000001,42.330849],[-74.609606,42.332807],[-74.609647,42.333121],[-74.60913600000001,42.333498],[-74.606261,42.334673],[-74.60399200000001,42.335979],[-74.60197100000001,42.337431],[-74.601026,42.337927],[-74.600551,42.337926],[-74.59944900000001,42.337657],[-74.597538,42.337234],[-74.596216,42.337536],[-74.59477200000001,42.338458],[-74.59249800000001,42.340287],[-74.58976199999999,42.341857],[-74.58897,42.342153],[-74.588624,42.342176],[-74.587857,42.342085],[-74.586731,42.341789],[-74.58462900000001,42.341239],[-74.582232,42.340628],[-74.580135,42.340405],[-74.577189,42.339527],[-74.57583700000001,42.339587],[-74.57467699999999,42.339857],[-74.573211,42.340739],[-74.57222899999999,42.341806],[-74.571905,42.34319],[-74.57211700000001,42.345236],[-74.572108,42.346435],[-74.571541,42.34711],[-74.569435,42.348102],[-74.56826100000001,42.348879],[-74.56726500000001,42.350422],[-74.56672500000001,42.351789],[-74.56588600000001,42.352672],[-74.565467,42.353653],[-74.56553700000001,42.354434],[-74.56595299999999,42.355321],[-74.565601,42.355972],[-74.564764,42.356541],[-74.564054,42.357424],[-74.563221,42.358943],[-74.56299799999999,42.359861],[-74.563203,42.362207],[-74.56320700000001,42.362254],[-74.564432,42.375081],[-74.565399,42.384206],[-74.56562099999999,42.3863],[-74.56706699999999,42.399903],[-74.567296,42.402054],[-74.56752400000001,42.404193],[-74.567048,42.404005],[-74.56671900000001,42.403875],[-74.566695,42.403869],[-74.563211,42.40249],[-74.553269,42.398568],[-74.55285000000001,42.398403],[-74.55258600000001,42.398299],[-74.546565,42.395924],[-74.543532,42.394727],[-74.543474,42.394704],[-74.543237,42.394611],[-74.54284,42.394453],[-74.538687,42.392816],[-74.538279,42.392655],[-74.537819,42.392474],[-74.53760200000001,42.392388],[-74.53757899999999,42.392379],[-74.534665,42.39123],[-74.52669299999999,42.388085],[-74.519133,42.385103],[-74.51863899999999,42.384908],[-74.518619,42.384901],[-74.518539,42.384869],[-74.517562,42.384484],[-74.512867,42.382632],[-74.504659,42.379394],[-74.503732,42.379028],[-74.499593,42.377396],[-74.498953,42.377146],[-74.498081,42.376806],[-74.49366000000001,42.375081],[-74.476291,42.368185],[-74.476274,42.368178],[-74.476472,42.368012],[-74.47690799999999,42.367668],[-74.477222,42.367454],[-74.477396,42.367351],[-74.47758,42.367253],[-74.47797300000001,42.367056],[-74.47817999999999,42.366963],[-74.478399,42.366878],[-74.478627,42.366804],[-74.478866,42.366742],[-74.479111,42.366684],[-74.479354,42.366649],[-74.47985,42.366594],[-74.48109700000001,42.366489],[-74.481616,42.366433],[-74.48168800000001,42.366424],[-74.48187900000001,42.366399],[-74.482406,42.366307],[-74.48339799999999,42.366065],[-74.48368499999999,42.365994],[-74.483935,42.365923],[-74.484177,42.365848],[-74.484407,42.365759],[-74.484623,42.365656],[-74.484824,42.365535],[-74.48519400000001,42.365276],[-74.485546,42.364998],[-74.48572799999999,42.364864],[-74.485919,42.364734],[-74.48612,42.364618],[-74.486329,42.364511],[-74.486543,42.364417],[-74.48676399999999,42.364328],[-74.48698899999999,42.364253],[-74.487217,42.364191],[-74.48767599999999,42.36408],[-74.487911,42.364041],[-74.488367,42.363944],[-74.48859400000001,42.363891],[-74.489288,42.363752],[-74.48991700000001,42.363606],[-74.489947,42.363599],[-74.491378,42.363291],[-74.49156499999999,42.363246],[-74.49176199999999,42.363203],[-74.491905,42.363172],[-74.492453,42.363052],[-74.492627,42.363021],[-74.492802,42.363],[-74.49315300000001,42.362974],[-74.49332099999999,42.362966],[-74.493477,42.36294],[-74.493619,42.362904],[-74.493745,42.36286],[-74.493769,42.362845],[-74.49385100000001,42.362797],[-74.49386699999999,42.362786],[-74.493934,42.362734],[-74.49400199999999,42.362662],[-74.49405299999999,42.362594],[-74.494124,42.362484],[-74.49414299999999,42.362436],[-74.49420499999999,42.362397],[-74.494276,42.36232],[-74.494336,42.362265],[-74.494389,42.362225],[-74.494451,42.362185],[-74.494528,42.362156],[-74.494727,42.362126],[-74.49484699999999,42.362117],[-74.495316,42.362094],[-74.495594,42.36208],[-74.495947,42.362054],[-74.49655,42.362021],[-74.496696,42.362013],[-74.49725100000001,42.36197],[-74.497438,42.361944],[-74.497613,42.3619],[-74.49778499999999,42.361846],[-74.497952,42.361779],[-74.49811,42.361699],[-74.498255,42.361605],[-74.498535,42.361395],[-74.498665,42.361274],[-74.49878699999999,42.361153],[-74.499011,42.360879],[-74.499106,42.360735],[-74.49918,42.360592],[-74.49926600000001,42.360439],[-74.49938400000001,42.360318],[-74.49950200000001,42.360188],[-74.499652,42.360076],[-74.49981200000001,42.359964],[-74.499939,42.359884],[-74.49998100000001,42.359857],[-74.500151,42.359736],[-74.500535,42.359517],[-74.500743,42.359419],[-74.500945,42.359307],[-74.501153,42.359204],[-74.50136500000001,42.359106],[-74.50157900000001,42.359017],[-74.501795,42.358941],[-74.502633,42.358607],[-74.50274899999999,42.358554],[-74.503449,42.358237],[-74.503646,42.358139],[-74.50383600000001,42.358032],[-74.504214,42.357831],[-74.504408,42.357741],[-74.504616,42.35767],[-74.504839,42.357631],[-74.505064,42.357618],[-74.50551400000001,42.357633],[-74.505965,42.357667],[-74.506423,42.357709],[-74.506888,42.357761],[-74.507356,42.357826],[-74.50829,42.357947],[-74.508368,42.357953],[-74.50851900000001,42.357966],[-74.50875000000001,42.357976],[-74.50895300000001,42.357969],[-74.508982,42.357968],[-74.50921,42.357942],[-74.509677,42.357881],[-74.510648,42.357777],[-74.51084299999999,42.357753],[-74.511144,42.357716],[-74.51164,42.357646],[-74.51265100000001,42.357538],[-74.51290400000001,42.357503],[-74.51315099999999,42.357459],[-74.513383,42.357392],[-74.51361199999999,42.357321],[-74.513829,42.357237],[-74.514036,42.357143],[-74.514628,42.356857],[-74.514822,42.356777],[-74.515022,42.35671],[-74.515235,42.356662],[-74.515452,42.356618],[-74.515677,42.356587],[-74.51591000000001,42.356575],[-74.516148,42.356571],[-74.51663000000001,42.356573],[-74.517133,42.356589],[-74.517387,42.356585],[-74.517642,42.356568],[-74.517893,42.356538],[-74.518135,42.356485],[-74.518368,42.356414],[-74.51858900000001,42.356325],[-74.519565,42.355725],[-74.520663,42.354937],[-74.520832,42.354808],[-74.52099,42.354673],[-74.521722,42.353951],[-74.522059,42.353682],[-74.522249,42.353557],[-74.522453,42.353445],[-74.522885,42.35324],[-74.523112,42.353146],[-74.52334399999999,42.353057],[-74.523535,42.352993],[-74.523583,42.352977],[-74.52380700000001,42.352857],[-74.52404,42.352754],[-74.524269,42.352647],[-74.524497,42.352535],[-74.525581,42.351986],[-74.52600099999999,42.35179],[-74.526183,42.351711],[-74.52643399999999,42.351602],[-74.526656,42.351513],[-74.527109,42.351344],[-74.527575,42.351184],[-74.52827600000001,42.350925],[-74.528744,42.350738],[-74.52920899999999,42.350533],[-74.530151,42.35014],[-74.531103,42.349802],[-74.53157899999999,42.349637],[-74.53205,42.349459],[-74.53250199999999,42.349258],[-74.53271700000001,42.349151],[-74.533148,42.348928],[-74.533817,42.34862],[-74.534043,42.348522],[-74.534499,42.348334],[-74.534733,42.348245],[-74.53497299999999,42.34817],[-74.535219,42.348108],[-74.535471,42.348064],[-74.535971,42.348003],[-74.536213,42.347963],[-74.536446,42.347906],[-74.53667,42.347834],[-74.536891,42.347754],[-74.53727600000001,42.347596],[-74.53792799999999,42.347308],[-74.53845800000001,42.347023],[-74.539075,42.34656],[-74.539784,42.345884],[-74.540387,42.345035],[-74.54048899999999,42.344882],[-74.54095,42.344267],[-74.54120899999999,42.343953],[-74.541461,42.34363],[-74.541579,42.343459],[-74.54252,42.341977],[-74.54263400000001,42.34182],[-74.54275800000001,42.341663],[-74.542894,42.341515],[-74.54303899999999,42.341367],[-74.543344,42.341084],[-74.543662,42.340811],[-74.54413099999999,42.340371],[-74.544421,42.340106],[-74.544774,42.339782],[-74.544934,42.339636],[-74.545226,42.339349],[-74.545361,42.339205],[-74.545984,42.338465],[-74.54639,42.338016],[-74.54679,42.337581],[-74.546927,42.337419],[-74.547054,42.337249],[-74.54715899999999,42.337069],[-74.54724,42.336885],[-74.547481,42.336129],[-74.54768,42.335567],[-74.54781800000001,42.335198],[-74.547856,42.335115],[-74.547899,42.335023],[-74.54799800000001,42.334852],[-74.548117,42.334695],[-74.548249,42.334564],[-74.548581,42.334278],[-74.54872899999999,42.334126],[-74.548867,42.333969],[-74.54899500000001,42.333812],[-74.549111,42.333645],[-74.549334,42.333304],[-74.549496,42.333076],[-74.549573,42.332967],[-74.549699,42.332801],[-74.54996199999999,42.332473],[-74.550776,42.331477],[-74.55144799999999,42.330633],[-74.551564,42.330462],[-74.55162199999999,42.330349],[-74.551744,42.330112],[-74.55195399999999,42.329541],[-74.552104,42.329154],[-74.55234799999999,42.328588],[-74.552493,42.328228],[-74.55255200000001,42.328048],[-74.55259700000001,42.327868],[-74.552632,42.327688],[-74.55268100000001,42.3273],[-74.552702,42.327135],[-74.552728,42.326932],[-74.552763,42.32654],[-74.552784,42.326149],[-74.55276499999999,42.325559],[-74.55274799999999,42.325365],[-74.552678,42.325167],[-74.55263100000001,42.324973],[-74.552578,42.324788],[-74.552407,42.324238],[-74.552397,42.324196],[-74.552362,42.324053],[-74.55229799999999,42.32367],[-74.55222500000001,42.323089],[-74.55220799999999,42.322891],[-74.552038,42.321296],[-74.55187100000001,42.320061],[-74.55175300000001,42.319259],[-74.5517,42.318867],[-74.55168399999999,42.318669],[-74.551676,42.318471],[-74.55168,42.318273],[-74.55169600000001,42.31807],[-74.55173000000001,42.317868],[-74.551787,42.317661],[-74.551866,42.317463],[-74.55195500000001,42.31727],[-74.55204999999999,42.317081],[-74.552317,42.316506],[-74.552543,42.315939],[-74.55302,42.314944],[-74.55303499999999,42.314901],[-74.55306,42.31486],[-74.553133,42.314708],[-74.553482,42.313939],[-74.553534,42.3138],[-74.55357600000001,42.313665],[-74.55360899999999,42.313534],[-74.55365399999999,42.313269],[-74.55368300000001,42.312999],[-74.553698,42.31272],[-74.553698,42.312283],[-74.553713,42.312143],[-74.553697,42.31154],[-74.55361000000001,42.31058],[-74.55358699999999,42.310247],[-74.553577,42.3099],[-74.553589,42.3094],[-74.55360400000001,42.30922],[-74.55362100000001,42.308856],[-74.55372,42.307771],[-74.553854,42.30647],[-74.55404799999999,42.305309],[-74.554464,42.303054],[-74.554503,42.302825],[-74.554576,42.302469],[-74.554591,42.302412],[-74.554621,42.302294],[-74.554676,42.302128],[-74.55474,42.301966],[-74.554812,42.301808],[-74.55489300000001,42.301651],[-74.554985,42.301498],[-74.555047,42.301404],[-74.554936,42.30135],[-74.55488800000001,42.301318],[-74.55477,42.3012],[-74.554711,42.301128],[-74.55459999999999,42.300966],[-74.55444799999999,42.300731],[-74.55439800000001,42.300654],[-74.554361,42.300582],[-74.55433600000001,42.30051],[-74.554322,42.300433],[-74.55432500000001,42.300284],[-74.55434099999999,42.300203],[-74.554421,42.300051],[-74.554535,42.299907],[-74.55497200000001,42.299458],[-74.55512299999999,42.29931],[-74.555195,42.299239],[-74.5553,42.299149],[-74.55545100000001,42.299032],[-74.555527,42.29898],[-74.555573,42.298952],[-74.55560699999999,42.29893],[-74.55561899999999,42.298921],[-74.555638,42.298907],[-74.55577700000001,42.298823],[-74.55579299999999,42.298809],[-74.556093,42.298634],[-74.556183,42.298572],[-74.556583,42.298334],[-74.55662700000001,42.298318],[-74.557222,42.298238],[-74.557242,42.298238],[-74.557393,42.298022],[-74.557508,42.297843],[-74.557619,42.297681],[-74.557761,42.297447],[-74.557818,42.297353],[-74.557903,42.297191],[-74.55797800000001,42.297029],[-74.558109,42.296697],[-74.558179,42.296535],[-74.55895099999999,42.294583],[-74.559005,42.294431],[-74.559048,42.294287],[-74.559079,42.294138],[-74.5591,42.293994],[-74.559116,42.293843],[-74.559124,42.293798],[-74.55912600000001,42.293753],[-74.55915899999999,42.293431],[-74.559202,42.293161],[-74.559237,42.293035],[-74.559287,42.29291],[-74.559348,42.292793],[-74.559765,42.292105],[-74.560073,42.291656],[-74.560425,42.291119],[-74.561099,42.290089],[-74.56129199999999,42.289804],[-74.561375,42.289681],[-74.562004,42.288741],[-74.562157,42.288512],[-74.562237,42.288386],[-74.562354,42.288202],[-74.562855,42.287438],[-74.562901,42.287367],[-74.56305999999999,42.287088],[-74.563171,42.286926],[-74.56322,42.286841],[-74.56332500000001,42.2867],[-74.56339,42.286612],[-74.563463,42.286504],[-74.56367,42.286199],[-74.56382000000001,42.285929],[-74.56388800000001,42.285839],[-74.564002,42.285673],[-74.564044,42.285579],[-74.564091,42.285493],[-74.564211,42.285332],[-74.564442,42.284968],[-74.56450599999999,42.284878],[-74.56456300000001,42.284779],[-74.564663,42.284616],[-74.56488,42.284265],[-74.56497400000001,42.284092],[-74.56505,42.283921],[-74.565091,42.283804],[-74.565169,42.283804],[-74.56519299999999,42.283809],[-74.56531,42.283814],[-74.56556,42.283837],[-74.56566100000001,42.283842],[-74.565991,42.28387],[-74.566108,42.283884],[-74.566345,42.283903],[-74.566699,42.283941],[-74.566813,42.28395],[-74.566873,42.283958],[-74.567033,42.283978],[-74.567224,42.283992],[-74.567339,42.283988],[-74.567429,42.28397],[-74.567515,42.283939],[-74.567598,42.283899],[-74.567764,42.283805],[-74.56792299999999,42.28368],[-74.567998,42.283612],[-74.56829999999999,42.283316],[-74.56995499999999,42.281732],[-74.57126599999999,42.280508],[-74.571564,42.280222],[-74.572183,42.279629],[-74.57263,42.279179],[-74.573069,42.278736],[-74.573662,42.27818],[-74.57403100000001,42.277862],[-74.574652,42.277306],[-74.57593199999999,42.276108],[-74.57645100000001,42.275637],[-74.576838,42.275306],[-74.577206,42.274978],[-74.577443,42.274781],[-74.577566,42.274687],[-74.577693,42.274602],[-74.57795400000001,42.274441],[-74.578087,42.274369],[-74.578361,42.274239],[-74.57902,42.273949],[-74.579228,42.273851],[-74.579351,42.273793],[-74.579453,42.273739],[-74.57965299999999,42.2736],[-74.579757,42.273515],[-74.580466,42.272833],[-74.580602,42.272712],[-74.580894,42.272465],[-74.581209,42.272223],[-74.58153799999999,42.271986],[-74.581706,42.27187],[-74.582037,42.271619],[-74.582083,42.271581],[-74.582194,42.271489],[-74.58234400000001,42.271349],[-74.582626,42.271071],[-74.584155,42.269478],[-74.58438700000001,42.269249],[-74.584508,42.269142],[-74.584636,42.269043],[-74.584716,42.268986],[-74.58476899999999,42.268949],[-74.584906,42.268864],[-74.585049,42.268788],[-74.585211,42.268721],[-74.58528200000001,42.268695],[-74.585353,42.268668],[-74.585511,42.268619],[-74.58567499999999,42.268574],[-74.586009,42.268508],[-74.58635099999999,42.268455],[-74.586523,42.268438],[-74.586867,42.268394],[-74.587039,42.268367],[-74.58756099999999,42.268275],[-74.587738,42.268235],[-74.58788300000001,42.268183],[-74.588818,42.267847],[-74.589,42.267767],[-74.589736,42.267463],[-74.59044900000001,42.267182],[-74.591143,42.266937],[-74.592026,42.266642],[-74.592364,42.266527],[-74.592535,42.266464],[-74.59304,42.26629],[-74.593523,42.26613],[-74.59399000000001,42.265952],[-74.594278,42.265808],[-74.594414,42.265732],[-74.594545,42.265652],[-74.59467100000001,42.265567],[-74.595032,42.265298],[-74.595364,42.265028],[-74.59594,42.264558],[-74.596029,42.264492],[-74.596362,42.264246],[-74.596425,42.264199],[-74.596552,42.264114],[-74.596818,42.263967],[-74.59695600000001,42.263904],[-74.59723099999999,42.263797],[-74.597368,42.263752],[-74.597639,42.263672],[-74.59827199999999,42.263517],[-74.598488,42.26345],[-74.598766,42.263357],[-74.59907800000001,42.263227],[-74.59921799999999,42.26316],[-74.599282,42.263124],[-74.599388,42.263072],[-74.599452,42.263035],[-74.59969700000001,42.262909],[-74.59971299999999,42.2629],[-74.599799,42.262851],[-74.599858,42.262821],[-74.599908,42.262795],[-74.599954,42.262771],[-74.600185,42.26292],[-74.600279,42.26306],[-74.600432,42.263313],[-74.600525,42.263498],[-74.60060900000001,42.26371],[-74.60097500000001,42.264571],[-74.601015,42.264688],[-74.601044,42.264801],[-74.60111499999999,42.265161],[-74.601187,42.265441],[-74.60133,42.265599],[-74.601512,42.26578],[-74.601601,42.265875],[-74.60168299999999,42.265974],[-74.601752,42.266073],[-74.602271,42.267075],[-74.6024,42.26735],[-74.602664,42.267869],[-74.602735,42.267986],[-74.602965,42.268334],[-74.603697,42.269345],[-74.604367,42.270248],[-74.604546,42.270469],[-74.60464,42.270577],[-74.604936,42.270885],[-74.605144,42.271088],[-74.605238,42.271196],[-74.605605,42.271652],[-74.605997,42.272113],[-74.606481,42.2727],[-74.606678,42.272917],[-74.60688500000001,42.273125],[-74.606995,42.273224],[-74.607102,42.273328],[-74.60721599999999,42.273423],[-74.607547,42.273722],[-74.60833100000001,42.274368],[-74.608724,42.274712],[-74.60887,42.274851],[-74.608986,42.274974],[-74.60906,42.275064],[-74.609127,42.275159],[-74.609292,42.275452],[-74.609391,42.275651],[-74.609475,42.275854],[-74.609638,42.276345],[-74.609712,42.276512],[-74.60979,42.276661],[-74.609966,42.276936],[-74.610032,42.277053],[-74.610062,42.277089],[-74.610114,42.277193],[-74.611634,42.279815],[-74.611718,42.279919],[-74.611796,42.280027],[-74.611974,42.280217],[-74.61214200000001,42.280415],[-74.612227,42.280533],[-74.612314,42.280614],[-74.612461,42.280804],[-74.612527,42.280907],[-74.612584,42.281011],[-74.61267700000001,42.281228],[-74.61271499999999,42.281336],[-74.612782,42.281557],[-74.61312,42.282778],[-74.61321599999999,42.283152],[-74.613255,42.283387],[-74.61329000000001,42.283742],[-74.613322,42.28422],[-74.613354,42.28458],[-74.61344099999999,42.285161],[-74.613527,42.285644],[-74.61358799999999,42.285887],[-74.61372799999999,42.28636],[-74.61384200000001,42.286707],[-74.61393200000001,42.286933],[-74.61448,42.288078],[-74.614552,42.288151],[-74.614688,42.288453],[-74.614733,42.288534],[-74.614996,42.289125],[-74.615055,42.289278],[-74.615076,42.289355],[-74.61508499999999,42.289431],[-74.61507899999999,42.289512],[-74.615053,42.289579],[-74.614993,42.289679],[-74.61491700000001,42.289769],[-74.61472999999999,42.289953],[-74.614643,42.290051],[-74.614603,42.290108],[-74.61456800000001,42.290159],[-74.61451599999999,42.290267],[-74.614486,42.290384],[-74.614473,42.290506],[-74.61447,42.290627],[-74.61447800000001,42.290996],[-74.61447099999999,42.291118],[-74.61445500000001,42.29124],[-74.614403,42.291474],[-74.614333,42.291698],[-74.614249,42.291896],[-74.614215,42.291995],[-74.614195,42.292099],[-74.61421,42.292193],[-74.614259,42.292284],[-74.614306,42.292392],[-74.61443199999999,42.292604],[-74.614507,42.292699],[-74.614678,42.292879],[-74.61486499999999,42.293051],[-74.614991,42.293157],[-74.61524900000001,42.293372],[-74.6153,42.293412],[-74.615725,42.293752],[-74.615815,42.293829],[-74.616077,42.294023],[-74.61623899999999,42.294128],[-74.616394,42.294214],[-74.616727,42.294377],[-74.617268,42.294626],[-74.61732000000001,42.294644],[-74.617462,42.294703],[-74.617726,42.294835],[-74.61778,42.294867],[-74.61814099999999,42.295039],[-74.618599,42.295239],[-74.618886,42.295357],[-74.619168,42.295457],[-74.61932899999999,42.295494],[-74.61944699999999,42.295521],[-74.61963,42.295544],[-74.62018,42.295573],[-74.62027,42.295573],[-74.620361,42.295578],[-74.62054500000001,42.295578],[-74.62064100000001,42.295583],[-74.62094999999999,42.295589],[-74.62124900000001,42.295603],[-74.621341,42.295603],[-74.62159200000001,42.295613],[-74.621888,42.295614],[-74.622265,42.295625],[-74.622567,42.295644],[-74.622925,42.295681],[-74.62312,42.295695],[-74.62324700000001,42.295713],[-74.623305,42.295714],[-74.623598,42.29575],[-74.62365200000001,42.29576],[-74.62370900000001,42.295764],[-74.62376999999999,42.295778],[-74.62390499999999,42.295792],[-74.62405,42.29582],[-74.624195,42.295834],[-74.62449100000001,42.295898],[-74.625708,42.296277],[-74.62606599999999,42.296389],[-74.62615599999999,42.296421],[-74.626244,42.296444],[-74.62633,42.296475],[-74.627409,42.296802],[-74.627635,42.296871],[-74.627999,42.29699],[-74.628085,42.297008],[-74.629063,42.29734],[-74.629223,42.297385],[-74.6293,42.297386],[-74.62938,42.297399],[-74.62961,42.297414],[-74.62968100000001,42.297409],[-74.629751,42.29741],[-74.629818,42.297405],[-74.630073,42.297397],[-74.630128,42.297388],[-74.63019,42.297393],[-74.630385,42.297389],[-74.630593,42.297435],[-74.630661,42.297462],[-74.630719,42.297453],[-74.630835,42.297499],[-74.630888,42.29753],[-74.63093600000001,42.297567],[-74.630978,42.297607],[-74.63104800000001,42.297698],[-74.631078,42.297756],[-74.631117,42.297869],[-74.63113800000001,42.298],[-74.63114,42.298067],[-74.63112,42.298351],[-74.63108200000001,42.298765],[-74.631034,42.298967],[-74.63098599999999,42.299057],[-74.63094100000001,42.299165],[-74.630916,42.299197],[-74.63085700000001,42.299318],[-74.63070500000001,42.299608],[-74.63069400000001,42.299778],[-74.63069400000001,42.299898],[-74.630718,42.300075],[-74.63088500000001,42.300459],[-74.631643,42.301809],[-74.631815,42.302044],[-74.632284,42.30262],[-74.632887,42.303317],[-74.633376,42.303841],[-74.633634,42.304108],[-74.63383,42.304166],[-74.63412,42.30426],[-74.63511200000001,42.304491],[-74.634809,42.305171],[-74.634877,42.305748],[-74.634925,42.305961],[-74.636357,42.307516],[-74.63776799999999,42.30875],[-74.63803,42.309323],[-74.638024,42.309701]]],"type":"Polygon"}
}