{
  "id": "360593018001",
  "type": "Feature",
  "properties": {
    "area_land":608968,
    "area_water":0,
    "geoid":"360593018001",
    "name":"Block Group 1",
    "state":"ny"
},
  "bbox": [
    -73.709408,
    40.787798,
    -73.697601,
    40.797829
],
  "geometry": {"coordinates":[[[-73.709408,40.792716],[-73.70917300000001,40.79279],[-73.70900399999999,40.792838],[-73.709023,40.792899],[-73.70904,40.792964],[-73.709039,40.793096],[-73.70901000000001,40.793195],[-73.708952,40.793315],[-73.708755,40.793633],[-73.708693,40.793765],[-73.70865999999999,40.793886],[-73.70863799999999,40.794039],[-73.708641,40.79416],[-73.70872300000001,40.794542],[-73.70872900000001,40.794594],[-73.708769,40.794693],[-73.708837,40.794973],[-73.708072,40.795247],[-73.70786,40.795127],[-73.707731,40.795066],[-73.70762999999999,40.79503],[-73.70755699999999,40.795016],[-73.707269,40.795013],[-73.706864,40.795026],[-73.70628600000001,40.795027],[-73.706228,40.795043],[-73.70616699999999,40.79509],[-73.706219,40.79549],[-73.70625699999999,40.795739],[-73.706377,40.79673],[-73.705765,40.796677],[-73.705496,40.796683],[-73.70531800000001,40.796682],[-73.70496199999999,40.796687],[-73.70448,40.796694],[-73.704352,40.796696],[-73.704487,40.797011],[-73.704504,40.797793],[-73.704202,40.797799],[-73.70360700000001,40.797806],[-73.703514,40.797811],[-73.703305,40.797813],[-73.70269500000001,40.797823],[-73.702561,40.797825],[-73.70179899999999,40.797829],[-73.701769,40.796734],[-73.70086999999999,40.79675],[-73.700232,40.79676],[-73.700001,40.79683],[-73.69951500000001,40.797076],[-73.699474,40.796956],[-73.699415,40.796785],[-73.699048,40.795815],[-73.698955,40.795538],[-73.698927,40.795456],[-73.69887,40.795244],[-73.698699,40.794752],[-73.69857500000001,40.794513],[-73.698337,40.79408],[-73.69772500000001,40.792979],[-73.69760100000001,40.792789],[-73.697751,40.792769],[-73.697834,40.792768],[-73.698402,40.792654],[-73.69869799999999,40.792563],[-73.698807,40.792534],[-73.699158,40.792401],[-73.699487,40.792226],[-73.69984700000001,40.792016],[-73.700374,40.791715],[-73.700834,40.791497],[-73.701109,40.791382],[-73.701217,40.791342],[-73.70196300000001,40.791074],[-73.702248,40.79096],[-73.702479,40.790853],[-73.702567,40.790818],[-73.702838,40.790676],[-73.703287,40.790408],[-73.70363500000001,40.790173],[-73.704402,40.78963],[-73.705309,40.788991],[-73.705473,40.788851],[-73.70557700000001,40.788772],[-73.705675,40.788674],[-73.70573,40.788604],[-73.70581300000001,40.788499],[-73.70583600000001,40.78846],[-73.70593100000001,40.788235],[-73.70599900000001,40.788001],[-73.70603,40.787798],[-73.70611100000001,40.787858],[-73.706418,40.788126],[-73.706641,40.788347],[-73.70692099999999,40.788639],[-73.708133,40.789849],[-73.708478,40.790213],[-73.708945,40.790774],[-73.709034,40.790865],[-73.709182,40.790988],[-73.708687,40.79153],[-73.70877299999999,40.791635],[-73.70928600000001,40.79232],[-73.709408,40.792716]]],"type":"Polygon"}
}