{
  "id": "360595199002",
  "type": "Feature",
  "properties": {
    "area_land":621078,
    "area_water":0,
    "geoid":"360595199002",
    "name":"Block Group 2",
    "state":"ny"
},
  "bbox": [
    -73.490688,
    40.759512,
    -73.480176,
    40.76984
],
  "geometry": {"coordinates":[[[-73.490619,40.767882],[-73.490554,40.767912],[-73.490121,40.768018],[-73.489346,40.768222],[-73.489099,40.768309],[-73.488805,40.768434],[-73.48699499999999,40.769189],[-73.48622,40.769512],[-73.485992,40.769599],[-73.48593,40.769617],[-73.48589800000001,40.769626],[-73.48561100000001,40.769667],[-73.485502,40.769532],[-73.485348,40.7693],[-73.485237,40.769134],[-73.485176,40.76906],[-73.48511499999999,40.76901],[-73.485022,40.768974],[-73.48495,40.768968],[-73.484863,40.768979],[-73.484706,40.769026],[-73.48455199999999,40.769062],[-73.482613,40.769596],[-73.48169799999999,40.76984],[-73.481465,40.769521],[-73.481437,40.769479],[-73.481313,40.769288],[-73.481219,40.769168],[-73.48084299999999,40.768629],[-73.480373,40.76794],[-73.480305,40.767797],[-73.48028100000001,40.767676],[-73.480254,40.766788],[-73.480244,40.766101],[-73.480243,40.766024],[-73.48023499999999,40.76593],[-73.48022,40.765324],[-73.480206,40.764597],[-73.480176,40.763597],[-73.480181,40.763356],[-73.480215,40.763227],[-73.48028100000001,40.763092],[-73.48049899999999,40.762912],[-73.481005,40.762278],[-73.481668,40.761338],[-73.481824,40.761167],[-73.481881,40.761085],[-73.482737,40.760079],[-73.482828,40.759991],[-73.482919,40.759929],[-73.48308900000001,40.759842],[-73.483397,40.759705],[-73.483846,40.759512],[-73.484224,40.760072],[-73.484303,40.760149],[-73.484461,40.760237],[-73.485508,40.760755],[-73.486144,40.761072],[-73.48678099999999,40.761388],[-73.486282,40.761978],[-73.486023,40.762267],[-73.485899,40.76242],[-73.48755199999999,40.763247],[-73.488308,40.763623],[-73.48851000000001,40.763723],[-73.488542,40.763739],[-73.48862099999999,40.763794],[-73.488764,40.764042],[-73.488236,40.764166],[-73.488073,40.764212],[-73.48798600000001,40.764263],[-73.48785599999999,40.764376],[-73.487863,40.764751],[-73.487891,40.764828],[-73.488052,40.765063],[-73.48872,40.766015],[-73.48948799999999,40.767111],[-73.489566,40.767199],[-73.489678,40.767276],[-73.48975,40.767304],[-73.489851,40.767324],[-73.489952,40.767324],[-73.49002400000001,40.767314],[-73.490405,40.76722],[-73.49068800000001,40.767874],[-73.490619,40.767882]]],"type":"Polygon"}
}