{
  "id": "360610140003",
  "type": "Feature",
  "properties": {
    "area_land":25881,
    "area_water":0,
    "geoid":"360610140003",
    "name":"Block Group 3",
    "state":"ny"
},
  "bbox": [
    -73.959857,
    40.772965,
    -73.957294,
    40.77496
],
  "geometry": {"coordinates":[[[-73.959394,40.774278],[-73.958895,40.77496],[-73.957294,40.774283],[-73.95779400000001,40.7736],[-73.95825499999999,40.772965],[-73.959857,40.773643],[-73.959394,40.774278]]],"type":"Polygon"}
}