{
  "id": "360470323001",
  "type": "Feature",
  "properties": {
    "area_land":59456,
    "area_water":0,
    "geoid":"360470323001",
    "name":"Block Group 1",
    "state":"ny"
},
  "bbox": [
    -73.956223,
    40.667333,
    -73.95327,
    40.670125
],
  "geometry": {"coordinates":[[[-73.955907,40.66836],[-73.95559299999999,40.669229],[-73.95534000000001,40.669926],[-73.955269,40.670125],[-73.95327,40.670007],[-73.953289,40.669796],[-73.95335300000001,40.669115],[-73.953439,40.668224],[-73.95352099999999,40.667333],[-73.95622299999999,40.66748],[-73.955907,40.66836]]],"type":"Polygon"}
}