{
  "id": "360593021023",
  "type": "Feature",
  "properties": {
    "area_land":717735,
    "area_water":0,
    "geoid":"360593021023",
    "name":"Block Group 3",
    "state":"ny"
},
  "bbox": [
    -73.640724,
    40.78008,
    -73.630156,
    40.791452
],
  "geometry": {"coordinates":[[[-73.64072400000001,40.791037],[-73.640711,40.791245],[-73.640697,40.791452],[-73.640373,40.791203],[-73.640308,40.791189],[-73.640135,40.79117],[-73.639875,40.791173],[-73.63943399999999,40.791181],[-73.639261,40.791164],[-73.638958,40.791094],[-73.638265,40.7909],[-73.637643,40.790743],[-73.6374,40.790692],[-73.636275,40.790381],[-73.63557299999999,40.790201],[-73.63541600000001,40.790092],[-73.635311,40.79008],[-73.634816,40.79002],[-73.634674,40.79001],[-73.633658,40.789938],[-73.63262400000001,40.789862],[-73.63157099999999,40.789779],[-73.63142499999999,40.789772],[-73.63119500000001,40.789755],[-73.630903,40.789734],[-73.63043,40.789703],[-73.630438,40.789272],[-73.630424,40.789105],[-73.630397,40.788973],[-73.630273,40.788296],[-73.63020899999999,40.787617],[-73.630156,40.786922],[-73.63071100000001,40.786896],[-73.631069,40.786884],[-73.63115500000001,40.786873],[-73.63126,40.786849],[-73.631354,40.786808],[-73.631441,40.786748],[-73.631525,40.786638],[-73.631551,40.78655],[-73.631551,40.786443],[-73.63153,40.786358],[-73.63148,40.786265],[-73.630914,40.785516],[-73.63081699999999,40.785368],[-73.630774,40.785274],[-73.630698,40.785016],[-73.63306900000001,40.784911],[-73.63446,40.784858],[-73.63441,40.784602],[-73.634359,40.784364],[-73.634317,40.784105],[-73.634246,40.783748],[-73.63413199999999,40.783413],[-73.633503,40.781947],[-73.63346199999999,40.781844],[-73.63333,40.78155],[-73.633219,40.781346],[-73.633083,40.781148],[-73.632882,40.780918],[-73.63275299999999,40.780768],[-73.632718,40.780721],[-73.63265199999999,40.780577],[-73.632614,40.780466],[-73.63257,40.78033],[-73.63247200000001,40.78008],[-73.639072,40.780092],[-73.63911400000001,40.780185],[-73.639285,40.780712],[-73.63930999999999,40.780863],[-73.639341,40.781062],[-73.639391,40.781395],[-73.639415,40.781506],[-73.639394,40.781984],[-73.63933400000001,40.782288],[-73.63887800000001,40.783911],[-73.638836,40.784229],[-73.63884299999999,40.784407],[-73.638841,40.78457],[-73.63887200000001,40.784733],[-73.638919,40.784949],[-73.638963,40.785205],[-73.63916,40.785789],[-73.639211,40.785912],[-73.639473,40.786596],[-73.639594,40.786933],[-73.639658,40.787276],[-73.639786,40.787968],[-73.639858,40.788333],[-73.639886,40.788421],[-73.63992500000001,40.788498],[-73.640062,40.788674],[-73.640489,40.789126],[-73.640614,40.789313],[-73.640675,40.789445],[-73.640714,40.789599],[-73.640721,40.789686],[-73.640722,40.790352],[-73.64072400000001,40.791037]]],"type":"Polygon"}
}