{
  "id": "361031580012",
  "type": "Feature",
  "properties": {
    "area_land":1137669,
    "area_water":381335,
    "geoid":"361031580012",
    "name":"Block Group 2",
    "state":"ny"
},
  "bbox": [
    -73.100416,
    40.945526,
    -73.07824,
    40.959522
],
  "geometry": {"coordinates":[[[-73.100416,40.956211],[-73.099391,40.95797],[-73.095647,40.959522],[-73.091807,40.958498],[-73.090495,40.957986],[-73.08368,40.955057],[-73.08158400000001,40.954017],[-73.080896,40.953761],[-73.080512,40.953601],[-73.07823999999999,40.951201],[-73.07966,40.950159],[-73.08015899999999,40.949794],[-73.081064,40.949882],[-73.081354,40.949844],[-73.081262,40.949954],[-73.08175799999999,40.949955],[-73.082155,40.950008],[-73.084802,40.950064],[-73.084963,40.94973],[-73.085458,40.948997],[-73.085703,40.948555],[-73.08587799999999,40.948279],[-73.086161,40.947848],[-73.086153,40.947478],[-73.086169,40.946894],[-73.086169,40.946173],[-73.086153,40.945526],[-73.086794,40.945614],[-73.08810699999999,40.945678],[-73.089118,40.945729],[-73.090103,40.945796],[-73.090361,40.945814],[-73.091173,40.945857],[-73.092012,40.945903],[-73.092035,40.946865],[-73.09206500000001,40.94736],[-73.092067,40.947665],[-73.09208700000001,40.947875],[-73.092074,40.948222],[-73.09216499999999,40.948482],[-73.092218,40.948714],[-73.092316,40.948996],[-73.092415,40.949176],[-73.09253200000001,40.949322],[-73.092951,40.949741],[-73.093317,40.950142],[-73.093569,40.950325],[-73.09429299999999,40.950329],[-73.09459200000001,40.950275],[-73.09489600000001,40.95024],[-73.095201,40.95024],[-73.095524,40.950595],[-73.09892600000001,40.952957],[-73.099715,40.953303],[-73.099745,40.954436],[-73.10002900000001,40.955448],[-73.10003399999999,40.955461],[-73.100416,40.956211]]],"type":"Polygon"}
}