{
  "id": "361031354021",
  "type": "Feature",
  "properties": {
    "area_land":2137995,
    "area_water":0,
    "geoid":"361031354021",
    "name":"Block Group 1",
    "state":"ny"
},
  "bbox": [
    -73.15409,
    40.849656,
    -73.127349,
    40.862137
],
  "geometry": {"coordinates":[[[-73.15409,40.8527],[-73.154006,40.8532],[-73.15330400000001,40.857943],[-73.153693,40.859252],[-73.15379299999999,40.859626],[-73.153654,40.860499],[-73.153654,40.860698],[-73.151892,40.861018],[-73.151719,40.861048],[-73.15070799999999,40.861226],[-73.150142,40.861303],[-73.14955,40.861323],[-73.14784899999999,40.861339],[-73.146421,40.861358],[-73.146118,40.86134],[-73.145045,40.861292],[-73.14392100000001,40.861261],[-73.14331,40.861325],[-73.143097,40.861346],[-73.143039,40.861354],[-73.142985,40.861387],[-73.14225,40.861457],[-73.14075,40.861592],[-73.14034599999999,40.861584],[-73.139448,40.861667],[-73.139053,40.861703],[-73.138822,40.861725],[-73.138524,40.861747],[-73.137259,40.861842],[-73.136746,40.861887],[-73.13597799999999,40.86196],[-73.135409,40.862014],[-73.135206,40.862027],[-73.13514000000001,40.862086],[-73.134574,40.862123],[-73.134508,40.862125],[-73.134277,40.862127],[-73.133944,40.86213],[-73.131936,40.862137],[-73.131317,40.862117],[-73.130927,40.862113],[-73.13032800000001,40.862121],[-73.129597,40.862131],[-73.129583,40.862075],[-73.12858,40.858063],[-73.128255,40.858062],[-73.128193,40.85773],[-73.12802600000001,40.857116],[-73.12787899999999,40.856507],[-73.12754700000001,40.855136],[-73.127352,40.854331],[-73.127349,40.854318],[-73.127397,40.854307],[-73.127454,40.854293],[-73.127859,40.854136],[-73.128438,40.853884],[-73.129003,40.853653],[-73.129411,40.853459],[-73.12949500000001,40.853377],[-73.12961300000001,40.853245],[-73.129948,40.852402],[-73.13036099999999,40.851844],[-73.131606,40.850119],[-73.131929,40.849656],[-73.132148,40.849749],[-73.13387,40.850341],[-73.134477,40.850593],[-73.136036,40.851282],[-73.13656400000001,40.851516],[-73.137581,40.851951],[-73.13876999999999,40.852477],[-73.13913100000001,40.852625],[-73.139517,40.852801],[-73.14129800000001,40.853578],[-73.141648,40.853731],[-73.141981,40.853876],[-73.14351000000001,40.854528],[-73.144515,40.854956],[-73.1452,40.854546],[-73.145642,40.854297],[-73.146106,40.854077],[-73.146641,40.853824],[-73.148494,40.853144],[-73.14871100000001,40.853071],[-73.14999299999999,40.852745],[-73.152179,40.852398],[-73.153059,40.8523],[-73.153999,40.852195],[-73.154028,40.852358],[-73.15409,40.8527]]],"type":"Polygon"}
}