{
  "id": "360290005001",
  "type": "Feature",
  "properties": {
    "area_land":3914932,
    "area_water":2018200,
    "geoid":"360290005001",
    "name":"Block Group 1",
    "state":"ny"
},
  "bbox": [
    -78.894657,
    42.850923,
    -78.842288,
    42.87841
],
  "geometry": {"coordinates":[[[-78.89456,42.87841],[-78.890992,42.878105],[-78.889517,42.878068],[-78.88699099999999,42.878005],[-78.88219100000001,42.877482],[-78.88033,42.876004],[-78.879608,42.87543],[-78.878962,42.874917],[-78.87839700000001,42.874469],[-78.878355,42.874447],[-78.87830700000001,42.874406],[-78.878249,42.874334],[-78.87822199999999,42.8743],[-78.87800799999999,42.87403],[-78.877849,42.873831],[-78.877842,42.873822],[-78.874004,42.87214],[-78.872812,42.871591],[-78.872557,42.871358],[-78.872157,42.871158],[-78.871157,42.870158],[-78.870257,42.868858],[-78.869057,42.866158],[-78.868976,42.86526],[-78.86863099999999,42.865271],[-78.868482,42.865277],[-78.86811,42.865281],[-78.868111,42.865454],[-78.86808499999999,42.865589],[-78.86805,42.865665],[-78.867873,42.865847],[-78.867644,42.866063],[-78.867622,42.866078],[-78.8674,42.866235],[-78.867223,42.866329],[-78.867007,42.866413],[-78.866792,42.866502],[-78.866612,42.866554],[-78.86644200000001,42.866587],[-78.866215,42.866607],[-78.86668,42.865195],[-78.866715,42.865036],[-78.867397,42.862939],[-78.86714000000001,42.863083],[-78.866136,42.863646],[-78.864547,42.864554],[-78.86435,42.864771],[-78.86405499999999,42.864714],[-78.863798,42.864672],[-78.862824,42.864515],[-78.861831,42.864344],[-78.861791,42.864337],[-78.860488,42.864114],[-78.860083,42.86534],[-78.85998600000001,42.86564],[-78.859973,42.865681],[-78.85995800000001,42.865729],[-78.859917,42.865858],[-78.85955199999999,42.866972],[-78.859482,42.867221],[-78.859037,42.868611],[-78.860366,42.868847],[-78.86134300000001,42.869016],[-78.862308,42.869184],[-78.86327900000001,42.869354],[-78.864248,42.869522],[-78.864594,42.869582],[-78.865205,42.869696],[-78.86501,42.870287],[-78.86497,42.870411],[-78.864912,42.870591],[-78.864544,42.871735],[-78.864423,42.871721],[-78.86375099999999,42.871603],[-78.863085,42.871478],[-78.861631,42.871233],[-78.860677,42.871067],[-78.858375,42.870668],[-78.857354,42.870489],[-78.856748,42.870383],[-78.856207,42.870288],[-78.855052,42.870087],[-78.854871,42.870055],[-78.8548,42.870042],[-78.85420499999999,42.869939],[-78.852647,42.869364],[-78.851786,42.869049],[-78.85099599999999,42.86876],[-78.850701,42.868835],[-78.849583,42.869122],[-78.84804200000001,42.86884],[-78.84755,42.868752],[-78.847583,42.868659],[-78.847849,42.867883],[-78.847932,42.867643],[-78.84797399999999,42.867612],[-78.84829999999999,42.867727],[-78.849174,42.866932],[-78.848445,42.866502],[-78.84763599999999,42.866025],[-78.846846,42.865552],[-78.846493,42.86534],[-78.845992,42.865044],[-78.84595400000001,42.865022],[-78.845643,42.864838],[-78.84525499999999,42.864609],[-78.845128,42.864534],[-78.844123,42.863941],[-78.843189,42.863393],[-78.84297100000001,42.863254],[-78.842823,42.863134],[-78.842584,42.862942],[-78.842421,42.862822],[-78.842288,42.862723],[-78.84272,42.862461],[-78.84331,42.862156],[-78.843839,42.861877],[-78.84421,42.861651],[-78.844431,42.861484],[-78.844553,42.861365],[-78.844633,42.861252],[-78.84486099999999,42.861353],[-78.845298,42.861588],[-78.846772,42.862345],[-78.84800799999999,42.860501],[-78.848164,42.860301],[-78.848519,42.859844],[-78.84871,42.859563],[-78.84878399999999,42.859464],[-78.84889200000001,42.85932],[-78.84899900000001,42.859175],[-78.84903199999999,42.859124],[-78.849333,42.858588],[-78.849575,42.858273],[-78.84963399999999,42.858197],[-78.850025,42.857625],[-78.85028200000001,42.857381],[-78.850651,42.856939],[-78.850678,42.856906],[-78.850979,42.856601],[-78.851304,42.856271],[-78.85216800000001,42.855503],[-78.852864,42.855021],[-78.85357500000001,42.854594],[-78.853812,42.854472],[-78.85408700000001,42.854355],[-78.854488,42.85421],[-78.855351,42.85399],[-78.85576,42.853916],[-78.85635600000001,42.853797],[-78.85677200000001,42.853726],[-78.856967,42.853716],[-78.857511,42.853702],[-78.858197,42.853664],[-78.858868,42.853694],[-78.859539,42.853745],[-78.86036300000001,42.853837],[-78.860866,42.853908],[-78.861677,42.854041],[-78.862572,42.854236],[-78.86333399999999,42.854471],[-78.863551,42.854565],[-78.86411699999999,42.85481],[-78.864397,42.854956],[-78.864548,42.855163],[-78.864665,42.855151],[-78.866507,42.855313],[-78.865737,42.854645],[-78.865093,42.854038],[-78.86529400000001,42.85398],[-78.865647,42.853881],[-78.86577200000001,42.853845],[-78.86662800000001,42.853622],[-78.87021,42.85269],[-78.87203100000001,42.852113],[-78.875383,42.850923],[-78.878007,42.854477],[-78.881587,42.860514],[-78.884094,42.864516],[-78.887675,42.867994],[-78.891255,42.871734],[-78.893762,42.874293],[-78.894657,42.876065],[-78.89456,42.87841]]],"type":"Polygon"}
}