{
  "id": "360810148001",
  "type": "Feature",
  "properties": {
    "area_land":157056,
    "area_water":0,
    "geoid":"360810148001",
    "name":"Block Group 1",
    "state":"ny"
},
  "bbox": [
    -73.827972,
    40.692378,
    -73.815709,
    40.696583
],
  "geometry": {"coordinates":[[[-73.827972,40.693992],[-73.826913,40.694223],[-73.82583200000001,40.694448],[-73.82477,40.69472],[-73.823728,40.695022],[-73.82283,40.695282],[-73.82106899999999,40.69578],[-73.820853,40.695346],[-73.81993199999999,40.695606],[-73.81952200000001,40.695708],[-73.819363,40.695716],[-73.819318,40.695716],[-73.81922299999999,40.69573],[-73.81911100000001,40.695756],[-73.818881,40.695818],[-73.817863,40.696104],[-73.81701099999999,40.696347],[-73.816174,40.696583],[-73.815709,40.695638],[-73.816552,40.695399],[-73.817396,40.695155],[-73.81841300000001,40.694863],[-73.81942600000001,40.69458],[-73.820351,40.694317],[-73.82123,40.694068],[-73.82211100000001,40.693819],[-73.82302799999999,40.693557],[-73.82406400000001,40.693266],[-73.825103,40.692968],[-73.826151,40.692672],[-73.827181,40.692378],[-73.82783000000001,40.6937],[-73.827972,40.693992]]],"type":"Polygon"}
}