{
  "id": "360470414012",
  "type": "Feature",
  "properties": {
    "area_land":77626,
    "area_water":0,
    "geoid":"360470414012",
    "name":"Block Group 2",
    "state":"ny"
},
  "bbox": [
    -73.972911,
    40.599315,
    -73.96913,
    40.602122
],
  "geometry": {"coordinates":[[[-73.972565,40.601794],[-73.97143,40.601919],[-73.97050900000001,40.602021],[-73.969576,40.602122],[-73.96913000000001,40.599733],[-73.970056,40.599632],[-73.970984,40.59953],[-73.97191100000001,40.599423],[-73.972911,40.599315],[-73.972565,40.601794]]],"type":"Polygon"}
}