{
  "id": "360810998020",
  "type": "Feature",
  "properties": {
    "area_land":0,
    "area_water":689393,
    "geoid":"360810998020",
    "name":"Block Group 0",
    "state":"ny"
},
  "bbox": [
    -73.763943,
    40.583094,
    -73.75237,
    40.591727
],
  "geometry": {"coordinates":[[[-73.763578,40.589911],[-73.763514,40.59037],[-73.763762,40.59144],[-73.763541,40.591472],[-73.76308400000001,40.591588],[-73.762927,40.591613],[-73.762721,40.591625],[-73.76244,40.591634],[-73.76236400000001,40.591638],[-73.7623,40.591641],[-73.76173199999999,40.59168],[-73.761557,40.591702],[-73.76141200000001,40.591723],[-73.761343,40.591727],[-73.761279,40.591718],[-73.76120899999999,40.591708],[-73.761083,40.591692],[-73.760955,40.591683],[-73.76084400000001,40.591665],[-73.760786,40.591661],[-73.760653,40.591647],[-73.76054999999999,40.591638],[-73.760418,40.591632],[-73.76038200000001,40.59163],[-73.76030900000001,40.591623],[-73.760261,40.591621],[-73.760184,40.591619],[-73.76007,40.591623],[-73.75994799999999,40.591618],[-73.759897,40.591612],[-73.759793,40.591592],[-73.75967199999999,40.591568],[-73.75947499999999,40.591526],[-73.75937999999999,40.591505],[-73.759287,40.591493],[-73.75922799999999,40.59151],[-73.75917,40.591504],[-73.759045,40.591492],[-73.758928,40.591479],[-73.75886,40.591475],[-73.75878899999999,40.591466],[-73.758703,40.591449],[-73.758562,40.591429],[-73.758298,40.59139],[-73.758166,40.591379],[-73.75795599999999,40.59136],[-73.75782599999999,40.591344],[-73.75764599999999,40.591298],[-73.757515,40.591269],[-73.757424,40.591244],[-73.757324,40.59124],[-73.75720099999999,40.5912],[-73.757094,40.591168],[-73.757002,40.591137],[-73.756897,40.591106],[-73.75682500000001,40.591087],[-73.75673399999999,40.591067],[-73.756612,40.591059],[-73.756512,40.591043],[-73.75635800000001,40.591001],[-73.756292,40.590981],[-73.756163,40.590944],[-73.756077,40.590912],[-73.75602000000001,40.590886],[-73.75597399999999,40.590852],[-73.755852,40.590854],[-73.755719,40.590865],[-73.75552999999999,40.590867],[-73.755387,40.590861],[-73.755303,40.590862],[-73.755212,40.590863],[-73.755039,40.590876],[-73.75496699999999,40.590881],[-73.754824,40.590892],[-73.75470199999999,40.590901],[-73.754593,40.590927],[-73.75454000000001,40.590939],[-73.754479,40.590939],[-73.75440399999999,40.590923],[-73.754271,40.590933],[-73.75407199999999,40.590905],[-73.75399299999999,40.590902],[-73.753912,40.590909],[-73.75381299999999,40.590925],[-73.753665,40.590933],[-73.75357,40.590942],[-73.753468,40.590964],[-73.753289,40.591019],[-73.753187,40.59108],[-73.753035,40.591128],[-73.75288399999999,40.591139],[-73.752769,40.591154],[-73.752714,40.591161],[-73.75259800000001,40.59118],[-73.75237,40.591232],[-73.752589,40.590181],[-73.752371,40.587965],[-73.755183,40.585649],[-73.75550200000001,40.585387],[-73.755567,40.583186],[-73.75557000000001,40.583094],[-73.763943,40.585172],[-73.763578,40.589911]]],"type":"Polygon"}
}