{
  "id": "360593028004",
  "type": "Feature",
  "properties": {
    "area_land":273433,
    "area_water":0,
    "geoid":"360593028004",
    "name":"Block Group 4",
    "state":"ny"
},
  "bbox": [
    -73.698337,
    40.744999,
    -73.688153,
    40.749986
],
  "geometry": {"coordinates":[[[-73.698337,40.748609],[-73.697726,40.748818],[-73.697163,40.749009],[-73.69690799999999,40.749108],[-73.696592,40.749222],[-73.695836,40.749544],[-73.69573099999999,40.749579],[-73.695486,40.749617],[-73.69368299999999,40.749818],[-73.693551,40.74914],[-73.69170699999999,40.749348],[-73.691284,40.749396],[-73.691018,40.749427],[-73.69080200000001,40.749476],[-73.690563,40.749557],[-73.690501,40.749595],[-73.69049200000001,40.749634],[-73.690136,40.749721],[-73.688878,40.749986],[-73.688636,40.749324],[-73.688394,40.748667],[-73.688153,40.748006],[-73.689026,40.747821],[-73.68941599999999,40.747727],[-73.689662,40.747666],[-73.690703,40.747358],[-73.690625,40.747161],[-73.690611,40.74709],[-73.690618,40.746958],[-73.690675,40.746741],[-73.690938,40.746583],[-73.691214,40.746488],[-73.692042,40.746205],[-73.692239,40.746131],[-73.692369,40.746089],[-73.692868,40.745926],[-73.69302,40.745867],[-73.693262,40.745785],[-73.693305,40.74576],[-73.693421,40.745733],[-73.69458899999999,40.74533],[-73.69479,40.745272],[-73.69503899999999,40.745138],[-73.695296,40.744999],[-73.69549600000001,40.745152],[-73.696063,40.745674],[-73.696483,40.746084],[-73.69711599999999,40.746753],[-73.697141,40.746787],[-73.697316,40.74695],[-73.697535,40.747259],[-73.69781999999999,40.747714],[-73.698337,40.748609]]],"type":"Polygon"}
}