{
  "id": "360039504003",
  "type": "Feature",
  "properties": {
    "area_land":159225546,
    "area_water":362953,
    "geoid":"360039504003",
    "name":"Block Group 3",
    "state":"ny"
},
  "bbox": [
    -78.309278,
    42.202608,
    -78.139767,
    42.388194
],
  "geometry": {"coordinates":[[[-78.30927800000001,42.32231],[-78.309243,42.323158],[-78.309166,42.326862],[-78.309163,42.327282],[-78.309147,42.329078],[-78.30913,42.33104],[-78.309122,42.331451],[-78.309122,42.33176],[-78.30911999999999,42.333855],[-78.30909,42.335629],[-78.30905199999999,42.341719],[-78.309067,42.342497],[-78.309093,42.342882],[-78.309144,42.343643],[-78.30919,42.343859],[-78.309241,42.344014],[-78.309234,42.344393],[-78.309242,42.34733],[-78.30919,42.347465],[-78.30914199999999,42.347648],[-78.309066,42.348081],[-78.30904200000001,42.34827],[-78.309028,42.348817],[-78.30902500000001,42.348935],[-78.30902399999999,42.348992],[-78.309021,42.349098],[-78.309017,42.349264],[-78.309004,42.34981],[-78.308907,42.356677],[-78.30890599999999,42.356737],[-78.308904,42.356894],[-78.30890100000001,42.357138],[-78.308899,42.357261],[-78.308882,42.35844],[-78.30888400000001,42.358549],[-78.308864,42.358873],[-78.308869,42.359016],[-78.30889000000001,42.35932],[-78.309043,42.361506],[-78.308812,42.370911],[-78.30862500000001,42.375059],[-78.308561,42.388157],[-78.30807900000001,42.388154],[-78.307745,42.38816],[-78.307666,42.388157],[-78.30330600000001,42.388171],[-78.301435,42.388194],[-78.30128000000001,42.387902],[-78.301106,42.387501],[-78.300905,42.387153],[-78.300809,42.38704],[-78.300766,42.386944],[-78.30074,42.386848],[-78.300774,42.385689],[-78.300809,42.385419],[-78.300861,42.385228],[-78.300861,42.385149],[-78.300817,42.385036],[-78.300755,42.384943],[-78.30072,42.384856],[-78.300729,42.384769],[-78.300833,42.384481],[-78.300833,42.384255],[-78.30080700000001,42.384081],[-78.300755,42.383863],[-78.30069399999999,42.383707],[-78.30069399999999,42.383559],[-78.300737,42.38335],[-78.300781,42.383219],[-78.30077199999999,42.383036],[-78.300737,42.382853],[-78.30061499999999,42.382592],[-78.300572,42.382409],[-78.30051899999999,42.38207],[-78.30045800000001,42.381852],[-78.300389,42.381765],[-78.30031,42.381687],[-78.30023199999999,42.381635],[-78.30013599999999,42.381608],[-78.300023,42.3816],[-78.299779,42.3816],[-78.29955200000001,42.381565],[-78.299387,42.381487],[-78.299178,42.38133],[-78.299064,42.381188],[-78.29895399999999,42.381006],[-78.298834,42.380718],[-78.29884800000001,42.380649],[-78.298874,42.380598],[-78.29889900000001,42.380576],[-78.298958,42.380561],[-78.299053,42.380558],[-78.29925,42.380576],[-78.29933,42.380572],[-78.29936600000001,42.380558],[-78.299559,42.380426],[-78.299718,42.380296],[-78.29978199999999,42.38023],[-78.299796,42.380193],[-78.2998,42.380128],[-78.299775,42.379993],[-78.299716,42.379782],[-78.299705,42.379643],[-78.29971999999999,42.379618],[-78.29976000000001,42.379592],[-78.30004099999999,42.37953],[-78.30011399999999,42.379501],[-78.300179,42.379446],[-78.300256,42.379348],[-78.300336,42.379268],[-78.30038,42.379242],[-78.300442,42.379235],[-78.300493,42.379239],[-78.300588,42.379272],[-78.300613,42.379264],[-78.300617,42.379075],[-78.300628,42.379038],[-78.300664,42.379002],[-78.301102,42.378816],[-78.301164,42.37878],[-78.30119999999999,42.378729],[-78.301211,42.378681],[-78.30120700000001,42.378572],[-78.30116,42.37847],[-78.30108300000001,42.378361],[-78.300935,42.378184],[-78.30091899999999,42.378164],[-78.300839,42.378026],[-78.300828,42.377953],[-78.30085699999999,42.377916],[-78.300912,42.377873],[-78.30095900000001,42.377793],[-78.300945,42.377687],[-78.300923,42.377625],[-78.300883,42.377574],[-78.300814,42.377545],[-78.30072199999999,42.377534],[-78.30065,42.377545],[-78.300584,42.377603],[-78.300555,42.377607],[-78.300518,42.377589],[-78.30046400000001,42.377508],[-78.300445,42.377334],[-78.300416,42.377253],[-78.30035599999999,42.377161],[-78.300208,42.376933],[-78.300088,42.376702],[-78.30001900000001,42.376532],[-78.30000099999999,42.37643],[-78.299975,42.376357],[-78.299567,42.375916],[-78.29953,42.375851],[-78.299505,42.375752],[-78.29951199999999,42.375516],[-78.299672,42.375089],[-78.299683,42.375005],[-78.299651,42.374899],[-78.299627,42.374855],[-78.299588,42.374816],[-78.29934299999999,42.37465],[-78.29928,42.374626],[-78.299201,42.374618],[-78.298873,42.37463],[-78.298766,42.374618],[-78.29868,42.374618],[-78.29860100000001,42.374638],[-78.297797,42.375005],[-78.297669,42.375039],[-78.297551,42.375051],[-78.29717599999999,42.375005],[-78.296947,42.37491],[-78.29682099999999,42.37489],[-78.29674900000001,42.374867],[-78.296702,42.374839],[-78.296493,42.374658],[-78.296378,42.374539],[-78.29628,42.374397],[-78.296252,42.37431],[-78.296171,42.37416],[-78.296128,42.374101],[-78.296041,42.374038],[-78.2958,42.374007],[-78.29568500000001,42.373959],[-78.295614,42.373876],[-78.29559999999999,42.37362],[-78.295502,42.373486],[-78.29549799999999,42.373372],[-78.295557,42.373277],[-78.295565,42.373222],[-78.29554899999999,42.373178],[-78.295371,42.373024],[-78.295304,42.372997],[-78.295237,42.372981],[-78.29516599999999,42.372981],[-78.294957,42.37302],[-78.294676,42.37304],[-78.294534,42.37304],[-78.29441799999999,42.373016],[-78.29418099999999,42.372906],[-78.294106,42.372898],[-78.294039,42.372926],[-78.29396,42.372973],[-78.29392,42.372985],[-78.293837,42.372965],[-78.29363600000001,42.372823],[-78.293533,42.372796],[-78.29343900000001,42.372784],[-78.29337099999999,42.372752],[-78.293316,42.372693],[-78.293229,42.37263],[-78.293054,42.372602],[-78.292777,42.372441],[-78.29275699999999,42.372417],[-78.292753,42.372389],[-78.292773,42.372354],[-78.292963,42.372243],[-78.293057,42.372145],[-78.293085,42.372093],[-78.29308899999999,42.372054],[-78.293065,42.372022],[-78.292919,42.371904],[-78.29284199999999,42.371822],[-78.292767,42.37177],[-78.29246999999999,42.371695],[-78.292399,42.371688],[-78.29230099999999,42.371695],[-78.29220599999999,42.371743],[-78.292091,42.371743],[-78.29204799999999,42.371727],[-78.291791,42.371561],[-78.291748,42.371518],[-78.291535,42.371455],[-78.29130600000001,42.371431],[-78.290976,42.371376],[-78.29094000000001,42.371364],[-78.290905,42.371336],[-78.29087699999999,42.371293],[-78.290865,42.371175],[-78.290818,42.371025],[-78.29067999999999,42.370764],[-78.290601,42.370721],[-78.29053399999999,42.370705],[-78.290451,42.370646],[-78.290271,42.370591],[-78.29022399999999,42.370563],[-78.290212,42.370532],[-78.290184,42.370323],[-78.290153,42.370196],[-78.290105,42.370137],[-78.289947,42.370039],[-78.289884,42.370023],[-78.28986,42.370031],[-78.289813,42.370149],[-78.289773,42.370189],[-78.289742,42.370192],[-78.289497,42.370165],[-78.289339,42.37011],[-78.28926,42.370062],[-78.289154,42.369944],[-78.289126,42.369881],[-78.289126,42.369751],[-78.289177,42.36964],[-78.289177,42.369597],[-78.28914,42.369498],[-78.289096,42.369455],[-78.289029,42.369084],[-78.28899,42.369013],[-78.288887,42.368871],[-78.288622,42.368772],[-78.288583,42.368784],[-78.288512,42.368832],[-78.28846799999999,42.368843],[-78.288397,42.368832],[-78.288275,42.368768],[-78.288212,42.36851],[-78.288212,42.36838],[-78.288291,42.368194],[-78.28829899999999,42.368044],[-78.288248,42.367902],[-78.288161,42.367776],[-78.288104,42.367611],[-78.288072,42.367563],[-78.288021,42.367512],[-78.28772499999999,42.367323],[-78.28761799999999,42.367291],[-78.287531,42.367303],[-78.28743799999999,42.367366],[-78.287387,42.36737],[-78.287336,42.367362],[-78.287284,42.367338],[-78.287229,42.367291],[-78.28717,42.36722],[-78.287103,42.367161],[-78.28705100000001,42.367137],[-78.286996,42.367098],[-78.28684199999999,42.366893],[-78.286771,42.366837],[-78.286574,42.366762],[-78.286483,42.366695],[-78.28630099999999,42.366407],[-78.28623,42.366332],[-78.286125,42.36625],[-78.28605,42.366222],[-78.285963,42.366175],[-78.285509,42.365792],[-78.285269,42.365547],[-78.285175,42.365492],[-78.28510300000001,42.365469],[-78.28498,42.365465],[-78.284662,42.365532],[-78.28460699999999,42.365563],[-78.284504,42.365654],[-78.284418,42.365674],[-78.283742,42.365638],[-78.283069,42.365567],[-78.28269,42.365504],[-78.282599,42.365476],[-78.282544,42.365449],[-78.28240599999999,42.365409],[-78.28232300000001,42.36537],[-78.282291,42.365334],[-78.282268,42.365279],[-78.28224,42.365141],[-78.28220399999999,42.36509],[-78.282082,42.365023],[-78.282066,42.364999],[-78.28205800000001,42.36494],[-78.28201900000001,42.364873],[-78.281628,42.364814],[-78.281502,42.364786],[-78.281434,42.364755],[-78.281379,42.364703],[-78.281223,42.36449],[-78.281065,42.364332],[-78.280947,42.364179],[-78.28085,42.364076],[-78.280807,42.364044],[-78.2807,42.364001],[-78.280247,42.363992],[-78.280241,42.360153],[-78.280249,42.359378],[-78.280226,42.356788],[-78.280247,42.356315],[-78.28025,42.354887],[-78.28019999999999,42.353208],[-78.280192,42.351807],[-78.280232,42.349977],[-78.280237,42.349756],[-78.280221,42.348763],[-78.27038400000001,42.348712],[-78.260153,42.348661],[-78.250822,42.348621],[-78.24991300000001,42.348617],[-78.247794,42.348771],[-78.240579,42.348764],[-78.23478299999999,42.348777],[-78.230031,42.348674],[-78.22765,42.348707],[-78.22399,42.348688],[-78.216491,42.348681],[-78.215306,42.348689],[-78.207227,42.348708],[-78.202217,42.348726],[-78.195812,42.348707],[-78.192024,42.348809],[-78.192015,42.3415],[-78.192025,42.340411],[-78.192108,42.335149],[-78.192404,42.329349],[-78.19230399999999,42.329209],[-78.19226,42.329106],[-78.192238,42.32894],[-78.192195,42.328147],[-78.19216299999999,42.327027],[-78.192133,42.326571],[-78.19212400000001,42.326397],[-78.192015,42.324279],[-78.19201200000001,42.323727],[-78.192043,42.322005],[-78.192035,42.321402],[-78.19202799999999,42.321345],[-78.192055,42.309518],[-78.19205599999999,42.309418],[-78.19203,42.304462],[-78.192004,42.301357],[-78.192018,42.300644],[-78.192032,42.299947],[-78.192036,42.299752],[-78.19203899999999,42.299556],[-78.19210200000001,42.296351],[-78.19206800000001,42.288639],[-78.192064,42.287883],[-78.192063,42.287561],[-78.19204499999999,42.285434],[-78.192032,42.280644],[-78.19201099999999,42.276013],[-78.192008,42.27351],[-78.191908,42.267903],[-78.191897,42.266223],[-78.191892,42.263592],[-78.19186999999999,42.260668],[-78.18179000000001,42.260625],[-78.18129500000001,42.260646],[-78.18116499999999,42.260678],[-78.17820399999999,42.260736],[-78.175926,42.260774],[-78.174149,42.260731],[-78.16764000000001,42.260576],[-78.166498,42.260548],[-78.161045,42.260602],[-78.14644800000001,42.260501],[-78.146576,42.26032],[-78.14666699999999,42.260171],[-78.14688700000001,42.259671],[-78.14704399999999,42.25919],[-78.147199,42.258701],[-78.14761900000001,42.257317],[-78.147642,42.257115],[-78.147633,42.256373],[-78.147627,42.255195],[-78.147633,42.253591],[-78.147622,42.251227],[-78.14760699999999,42.250198],[-78.147571,42.249138],[-78.147497,42.245997],[-78.14747300000001,42.245628],[-78.14740999999999,42.245351],[-78.147305,42.245096],[-78.147138,42.244812],[-78.14695,42.244566],[-78.14673500000001,42.244348],[-78.146546,42.2442],[-78.146247,42.243991],[-78.145915,42.243783],[-78.145444,42.24352],[-78.144806,42.243178],[-78.14457,42.243039],[-78.144316,42.242861],[-78.144074,42.242654],[-78.143923,42.242477],[-78.14376900000001,42.242203],[-78.14371199999999,42.242044],[-78.14363,42.241594],[-78.143593,42.241265],[-78.14353699999999,42.239978],[-78.143477,42.23952],[-78.143376,42.238971],[-78.143237,42.238393],[-78.14265899999999,42.236503],[-78.14251899999999,42.236014],[-78.142422,42.235508],[-78.142376,42.235038],[-78.142349,42.234329],[-78.142368,42.23317],[-78.142405,42.232668],[-78.142563,42.231446],[-78.142577,42.231174],[-78.14255,42.230849],[-78.142532,42.230797],[-78.142499,42.230704],[-78.142415,42.230532],[-78.142309,42.230368],[-78.142177,42.230233],[-78.141942,42.230039],[-78.141496,42.229715],[-78.141113,42.229461],[-78.140359,42.229059],[-78.140247,42.22899],[-78.140092,42.228871],[-78.139973,42.22875],[-78.13988000000001,42.228626],[-78.13984499999999,42.228556],[-78.139809,42.228447],[-78.13976700000001,42.22826],[-78.139786,42.2278],[-78.13978899999999,42.227752],[-78.139858,42.227431],[-78.139951,42.227188],[-78.14013300000001,42.226779],[-78.140899,42.225344],[-78.141176,42.224873],[-78.141666,42.223929],[-78.141854,42.22347],[-78.141904,42.223286],[-78.14196099999999,42.222886],[-78.14198399999999,42.221518],[-78.14202400000001,42.221203],[-78.14210199999999,42.220936],[-78.142235,42.220597],[-78.14229,42.220483],[-78.143277,42.218854],[-78.14437,42.217068],[-78.144582,42.216667],[-78.144818,42.216166],[-78.144986,42.215695],[-78.14513700000001,42.215143],[-78.145214,42.214736],[-78.145274,42.214209],[-78.145343,42.213588],[-78.14555799999999,42.211569],[-78.146188,42.211102],[-78.146946,42.210519],[-78.14995399999999,42.20831],[-78.151233,42.207379],[-78.151591,42.207107],[-78.152264,42.206639],[-78.15329300000001,42.205991],[-78.154342,42.205407],[-78.155253,42.204973],[-78.1558,42.204718],[-78.15654000000001,42.20442],[-78.157281,42.204138],[-78.158203,42.203835],[-78.159038,42.203584],[-78.16003499999999,42.203334],[-78.16076700000001,42.203166],[-78.16174599999999,42.20299],[-78.16238199999999,42.202886],[-78.163563,42.202747],[-78.16448200000001,42.202667],[-78.16518499999999,42.202626],[-78.166021,42.202608],[-78.167289,42.202612],[-78.16776,42.20263],[-78.16845000000001,42.202674],[-78.169358,42.202749],[-78.170242,42.202855],[-78.17106699999999,42.202983],[-78.171924,42.203146],[-78.172962,42.203379],[-78.17321699999999,42.203438],[-78.175826,42.204153],[-78.17795099999999,42.204717],[-78.179597,42.205173],[-78.181409,42.205663],[-78.185509,42.20678],[-78.186369,42.207005],[-78.188537,42.207611],[-78.191102,42.208303],[-78.191475,42.208404],[-78.193631,42.208986],[-78.19448,42.209222],[-78.195323,42.209445],[-78.202231,42.211327],[-78.202781,42.211469],[-78.203923,42.211753],[-78.20475999999999,42.211925],[-78.205597,42.212066],[-78.20621,42.212151],[-78.206487,42.212189],[-78.207334,42.212284],[-78.210114,42.212568],[-78.21439599999999,42.213004],[-78.215249,42.213101],[-78.216404,42.213248],[-78.21748100000001,42.213436],[-78.218842,42.213704],[-78.219672,42.213901],[-78.22055400000001,42.214137],[-78.221621,42.214445],[-78.22264300000001,42.214776],[-78.22403799999999,42.215285],[-78.224418,42.215444],[-78.226468,42.216267],[-78.22937400000001,42.217446],[-78.231899,42.218455],[-78.23300500000001,42.218935],[-78.233593,42.219207],[-78.234443,42.219627],[-78.235294,42.220081],[-78.237951,42.221526],[-78.238635,42.221904],[-78.24199,42.223721],[-78.243678,42.224646],[-78.244384,42.225015],[-78.24475200000001,42.225192],[-78.245009,42.225304],[-78.24578,42.225619],[-78.246672,42.225922],[-78.247438,42.226147],[-78.24817299999999,42.226325],[-78.249194,42.226516],[-78.249745,42.226597],[-78.250713,42.226688],[-78.251341,42.226722],[-78.251818,42.226732],[-78.252365,42.226728],[-78.25293499999999,42.226712],[-78.25366200000001,42.226659],[-78.25418500000001,42.226603],[-78.25518,42.226472],[-78.257154,42.226187],[-78.26109599999999,42.225634],[-78.262236,42.225489],[-78.262947,42.225428],[-78.26375899999999,42.225368],[-78.26460400000001,42.22533],[-78.264985,42.225323],[-78.26818299999999,42.225281],[-78.26896600000001,42.22527],[-78.27216,42.225226],[-78.27385099999999,42.225198],[-78.27431799999999,42.225184],[-78.274862,42.225155],[-78.275964,42.225082],[-78.276692,42.225017],[-78.277829,42.224906],[-78.27762800000001,42.225463],[-78.277288,42.226451],[-78.27713799999999,42.226889],[-78.276768,42.228],[-78.27664799999999,42.228408],[-78.276574,42.22874],[-78.27642299999999,42.229728],[-78.276398,42.229957],[-78.27637199999999,42.23019],[-78.276162,42.23205],[-78.275997,42.233339],[-78.27598399999999,42.233472],[-78.27595700000001,42.233721],[-78.275809,42.234884],[-78.275707,42.235633],[-78.27564599999999,42.235922],[-78.275566,42.236254],[-78.275375,42.236823],[-78.274665,42.238374],[-78.27451000000001,42.238706],[-78.274322,42.239107],[-78.27348499999999,42.240907],[-78.273197,42.241569],[-78.272809,42.242502],[-78.272719,42.242713],[-78.27255100000001,42.243122],[-78.272457,42.243342],[-78.270764,42.247395],[-78.270281,42.248533],[-78.270556,42.248562],[-78.270848,42.24857],[-78.271418,42.248559],[-78.272586,42.248571],[-78.2728,42.248589],[-78.272935,42.248614],[-78.27355900000001,42.248769],[-78.273625,42.248788],[-78.27424999999999,42.248964],[-78.275268,42.249265],[-78.275649,42.249422],[-78.275766,42.249484],[-78.275999,42.249644],[-78.276162,42.249786],[-78.276324,42.249953],[-78.276515,42.250186],[-78.276704,42.250452],[-78.276872,42.250742],[-78.276934,42.250929],[-78.276971,42.251224],[-78.276985,42.252166],[-78.27698599999999,42.252438],[-78.27699800000001,42.252798],[-78.277036,42.253014],[-78.27708199999999,42.253122],[-78.277249,42.253377],[-78.27733499999999,42.253484],[-78.277468,42.253618],[-78.27758900000001,42.253723],[-78.277722,42.253818],[-78.27787499999999,42.253905],[-78.278046,42.253978],[-78.278232,42.254033],[-78.27851800000001,42.254091],[-78.278801,42.254135],[-78.279315,42.254179],[-78.279381,42.254179],[-78.279504,42.254179],[-78.279712,42.254164],[-78.280028,42.254106],[-78.280224,42.254052],[-78.28031799999999,42.254024],[-78.28045899999999,42.253969],[-78.280648,42.25388],[-78.281502,42.253477],[-78.282262,42.253124],[-78.282382,42.253081],[-78.28245800000001,42.25306],[-78.28275499999999,42.252987],[-78.282849,42.252972],[-78.283001,42.252947],[-78.283247,42.252939],[-78.2834,42.252947],[-78.28367900000001,42.252982],[-78.283726,42.252991],[-78.283976,42.253042],[-78.284243,42.253109],[-78.28524400000001,42.253388],[-78.285295,42.253403],[-78.28655500000001,42.253763],[-78.286978,42.253882],[-78.28763600000001,42.254106],[-78.287682,42.254125],[-78.28823,42.254375],[-78.28879499999999,42.254678],[-78.28932,42.254944],[-78.28987600000001,42.255162],[-78.290053,42.255223],[-78.290616,42.255415],[-78.29088400000001,42.255523],[-78.29096199999999,42.255561],[-78.29131,42.255772],[-78.29169,42.256029],[-78.29185200000001,42.256164],[-78.29200899999999,42.25633],[-78.292157,42.256547],[-78.29225099999999,42.256774],[-78.292298,42.257038],[-78.292314,42.257811],[-78.292329,42.257978],[-78.292361,42.258124],[-78.29246500000001,42.258466],[-78.292582,42.258736],[-78.292699,42.258911],[-78.29275699999999,42.258973],[-78.292828,42.259027],[-78.292996,42.259103],[-78.293239,42.259167],[-78.294984,42.259409],[-78.29552,42.259474],[-78.29588099999999,42.259551],[-78.29607799999999,42.259609],[-78.29638799999999,42.259722],[-78.296643,42.259828],[-78.29746900000001,42.260228],[-78.297954,42.260432],[-78.298024,42.260455],[-78.29807700000001,42.260473],[-78.298216,42.260498],[-78.29839800000001,42.260516],[-78.29856599999999,42.260516],[-78.298756,42.260502],[-78.299042,42.260451],[-78.299261,42.260374],[-78.299487,42.260236],[-78.299683,42.260059],[-78.29971399999999,42.260028],[-78.29988899999999,42.259802],[-78.299983,42.259636],[-78.30002899999999,42.259507],[-78.30005300000001,42.259391],[-78.30009200000001,42.259026],[-78.300117,42.258629],[-78.30013700000001,42.257926],[-78.30014,42.25681],[-78.300112,42.256584],[-78.300056,42.25639],[-78.29993399999999,42.256206],[-78.29979,42.256044],[-78.299656,42.255927],[-78.299363,42.255664],[-78.299047,42.255381],[-78.29839699999999,42.254757],[-78.298232,42.254587],[-78.298115,42.254445],[-78.29796399999999,42.254214],[-78.297782,42.253884],[-78.29769,42.25365],[-78.297646,42.253492],[-78.297639,42.253469],[-78.29759,42.253206],[-78.29758,42.253136],[-78.297567,42.252808],[-78.297578,42.252651],[-78.297622,42.252385],[-78.29771700000001,42.252057],[-78.29777199999999,42.251926],[-78.297819,42.251813],[-78.29795,42.251567],[-78.298233,42.251165],[-78.298541,42.250786],[-78.29900000000001,42.250305],[-78.29938900000001,42.249956],[-78.29960800000001,42.249763],[-78.30080599999999,42.248755],[-78.30186500000001,42.247917],[-78.302412,42.247516],[-78.302926,42.247174],[-78.304851,42.24576],[-78.305263,42.245439],[-78.30569199999999,42.245132],[-78.305719,42.245116],[-78.306074,42.244915],[-78.306468,42.244726],[-78.30659900000001,42.244668],[-78.307418,42.244306],[-78.307592,42.244214],[-78.308154,42.243891],[-78.308384,42.243731],[-78.30865900000001,42.24352],[-78.308837,42.24336],[-78.30887199999999,42.243325],[-78.309084,42.243112],[-78.309178,42.245875],[-78.30918699999999,42.246086],[-78.309197,42.246426],[-78.309173,42.24984],[-78.30919299999999,42.256761],[-78.30919400000001,42.256983],[-78.30919299999999,42.261126],[-78.309202,42.271799],[-78.309212,42.27365],[-78.309245,42.299057],[-78.309253,42.305048],[-78.309253,42.305177],[-78.309258,42.30745],[-78.30926100000001,42.311633],[-78.30927699999999,42.320979],[-78.30927699999999,42.321522],[-78.30927699999999,42.321554],[-78.30927800000001,42.32231]]],"type":"Polygon"}
}