{
  "id": "360050245011",
  "type": "Feature",
  "properties": {
    "area_land":39070,
    "area_water":0,
    "geoid":"360050245011",
    "name":"Block Group 1",
    "state":"ny"
},
  "bbox": [
    -73.915975,
    40.850494,
    -73.912273,
    40.853811
],
  "geometry": {"coordinates":[[[-73.915975,40.851325],[-73.91389700000001,40.853422],[-73.913848,40.853811],[-73.912273,40.853759],[-73.912488,40.853387],[-73.912797,40.853042],[-73.913231,40.852584],[-73.91377799999999,40.852132],[-73.914337,40.851657],[-73.914873,40.851047],[-73.915452,40.850494],[-73.915639,40.850646],[-73.91581100000001,40.850824],[-73.915936,40.85105],[-73.915975,40.851325]]],"type":"Polygon"}
}