{
  "id": "360039505001",
  "type": "Feature",
  "properties": {
    "area_land":24625178,
    "area_water":1749768,
    "geoid":"360039505001",
    "name":"Block Group 1",
    "state":"ny"
},
  "bbox": [
    -78.309159,
    42.173266,
    -78.248503,
    42.260516
],
  "geometry": {"coordinates":[[[-78.30915899999999,42.22458],[-78.297247,42.224498],[-78.297648,42.239039],[-78.305628,42.23891],[-78.306167,42.238894],[-78.309145,42.238851],[-78.309061,42.242417],[-78.309078,42.242914],[-78.309084,42.243112],[-78.30887199999999,42.243325],[-78.308837,42.24336],[-78.30865900000001,42.24352],[-78.308384,42.243731],[-78.308154,42.243891],[-78.307592,42.244214],[-78.307418,42.244306],[-78.30659900000001,42.244668],[-78.306468,42.244726],[-78.306074,42.244915],[-78.305719,42.245116],[-78.30569199999999,42.245132],[-78.305263,42.245439],[-78.304851,42.24576],[-78.302926,42.247174],[-78.302412,42.247516],[-78.30186500000001,42.247917],[-78.30080599999999,42.248755],[-78.29960800000001,42.249763],[-78.29938900000001,42.249956],[-78.29900000000001,42.250305],[-78.298541,42.250786],[-78.298233,42.251165],[-78.29795,42.251567],[-78.297819,42.251813],[-78.29777199999999,42.251926],[-78.29771700000001,42.252057],[-78.297622,42.252385],[-78.297578,42.252651],[-78.297567,42.252808],[-78.29758,42.253136],[-78.29759,42.253206],[-78.297639,42.253469],[-78.297646,42.253492],[-78.29769,42.25365],[-78.297782,42.253884],[-78.29796399999999,42.254214],[-78.298115,42.254445],[-78.298232,42.254587],[-78.29839699999999,42.254757],[-78.299047,42.255381],[-78.299363,42.255664],[-78.299656,42.255927],[-78.29979,42.256044],[-78.29993399999999,42.256206],[-78.300056,42.25639],[-78.300112,42.256584],[-78.30014,42.25681],[-78.30013700000001,42.257926],[-78.300117,42.258629],[-78.30009200000001,42.259026],[-78.30005300000001,42.259391],[-78.30002899999999,42.259507],[-78.299983,42.259636],[-78.29988899999999,42.259802],[-78.29971399999999,42.260028],[-78.299683,42.260059],[-78.299487,42.260236],[-78.299261,42.260374],[-78.299042,42.260451],[-78.298756,42.260502],[-78.29856599999999,42.260516],[-78.29839800000001,42.260516],[-78.298216,42.260498],[-78.29807700000001,42.260473],[-78.298024,42.260455],[-78.297954,42.260432],[-78.29746900000001,42.260228],[-78.296643,42.259828],[-78.29638799999999,42.259722],[-78.29607799999999,42.259609],[-78.29588099999999,42.259551],[-78.29552,42.259474],[-78.294984,42.259409],[-78.293239,42.259167],[-78.292996,42.259103],[-78.292828,42.259027],[-78.29275699999999,42.258973],[-78.292699,42.258911],[-78.292582,42.258736],[-78.29246500000001,42.258466],[-78.292361,42.258124],[-78.292329,42.257978],[-78.292314,42.257811],[-78.292298,42.257038],[-78.29225099999999,42.256774],[-78.292157,42.256547],[-78.29200899999999,42.25633],[-78.29185200000001,42.256164],[-78.29169,42.256029],[-78.29131,42.255772],[-78.29096199999999,42.255561],[-78.29088400000001,42.255523],[-78.290616,42.255415],[-78.290053,42.255223],[-78.28987600000001,42.255162],[-78.28932,42.254944],[-78.28879499999999,42.254678],[-78.28823,42.254375],[-78.287682,42.254125],[-78.28763600000001,42.254106],[-78.286978,42.253882],[-78.28655500000001,42.253763],[-78.285295,42.253403],[-78.28524400000001,42.253388],[-78.284243,42.253109],[-78.283976,42.253042],[-78.283726,42.252991],[-78.28367900000001,42.252982],[-78.2834,42.252947],[-78.283247,42.252939],[-78.283001,42.252947],[-78.282849,42.252972],[-78.28275499999999,42.252987],[-78.28245800000001,42.25306],[-78.282382,42.253081],[-78.282262,42.253124],[-78.281502,42.253477],[-78.280648,42.25388],[-78.28045899999999,42.253969],[-78.28031799999999,42.254024],[-78.280224,42.254052],[-78.280028,42.254106],[-78.279712,42.254164],[-78.279504,42.254179],[-78.279381,42.254179],[-78.279315,42.254179],[-78.278801,42.254135],[-78.27851800000001,42.254091],[-78.278232,42.254033],[-78.278046,42.253978],[-78.27787499999999,42.253905],[-78.277722,42.253818],[-78.27758900000001,42.253723],[-78.277468,42.253618],[-78.27733499999999,42.253484],[-78.277249,42.253377],[-78.27708199999999,42.253122],[-78.277036,42.253014],[-78.27699800000001,42.252798],[-78.27698599999999,42.252438],[-78.276985,42.252166],[-78.276971,42.251224],[-78.276934,42.250929],[-78.276872,42.250742],[-78.276704,42.250452],[-78.276515,42.250186],[-78.276324,42.249953],[-78.276162,42.249786],[-78.275999,42.249644],[-78.275766,42.249484],[-78.275649,42.249422],[-78.275268,42.249265],[-78.27424999999999,42.248964],[-78.273625,42.248788],[-78.27355900000001,42.248769],[-78.272935,42.248614],[-78.2728,42.248589],[-78.272586,42.248571],[-78.271418,42.248559],[-78.270848,42.24857],[-78.270556,42.248562],[-78.270281,42.248533],[-78.270764,42.247395],[-78.272457,42.243342],[-78.27255100000001,42.243122],[-78.272719,42.242713],[-78.272809,42.242502],[-78.273197,42.241569],[-78.27348499999999,42.240907],[-78.274322,42.239107],[-78.27451000000001,42.238706],[-78.274665,42.238374],[-78.275375,42.236823],[-78.275566,42.236254],[-78.27564599999999,42.235922],[-78.275707,42.235633],[-78.275809,42.234884],[-78.27595700000001,42.233721],[-78.27598399999999,42.233472],[-78.275997,42.233339],[-78.276162,42.23205],[-78.27637199999999,42.23019],[-78.276398,42.229957],[-78.27642299999999,42.229728],[-78.276574,42.22874],[-78.27664799999999,42.228408],[-78.276768,42.228],[-78.27713799999999,42.226889],[-78.277288,42.226451],[-78.27762800000001,42.225463],[-78.277829,42.224906],[-78.27798,42.224375],[-78.278147,42.223802],[-78.278206,42.223553],[-78.278245,42.223103],[-78.27824,42.222844],[-78.2782,42.222464],[-78.278181,42.222336],[-78.27809999999999,42.221926],[-78.278081,42.221861],[-78.277952,42.221524],[-78.277874,42.221333],[-78.27763400000001,42.220816],[-78.277457,42.220459],[-78.27717,42.219963],[-78.276634,42.219037],[-78.276239,42.218354],[-78.27613599999999,42.218186],[-78.27596200000001,42.217902],[-78.27581000000001,42.217656],[-78.275599,42.217272],[-78.275526,42.217116],[-78.275397,42.216754],[-78.275357,42.216574],[-78.27533699999999,42.216364],[-78.275302,42.21554],[-78.27527600000001,42.214615],[-78.27525199999999,42.213816],[-78.275226,42.212881],[-78.27521900000001,42.212661],[-78.27518600000001,42.211643],[-78.27517899999999,42.211401],[-78.275159,42.210634],[-78.27515200000001,42.210369],[-78.27515,42.210265],[-78.275122,42.209409],[-78.275037,42.207703],[-78.274959,42.206671],[-78.27489,42.205733],[-78.274862,42.205058],[-78.274854,42.20459],[-78.27483700000001,42.20363],[-78.274829,42.203231],[-78.274806,42.202486],[-78.274766,42.202189],[-78.274682,42.201813],[-78.274576,42.20151],[-78.274407,42.20112],[-78.274157,42.200705],[-78.27400299999999,42.20049],[-78.27331100000001,42.199611],[-78.27171800000001,42.197594],[-78.271331,42.197124],[-78.271131,42.196918],[-78.271069,42.196867],[-78.27085099999999,42.196711],[-78.270533,42.196513],[-78.270321,42.196404],[-78.268528,42.195658],[-78.26815999999999,42.195475],[-78.26796,42.195348],[-78.267713,42.195153],[-78.26751899999999,42.194961],[-78.26737799999999,42.194772],[-78.26723200000001,42.194514],[-78.26714800000001,42.194298],[-78.267081,42.194045],[-78.267055,42.193763],[-78.267067,42.192992],[-78.26704599999999,42.192559],[-78.26699000000001,42.192305],[-78.266893,42.192028],[-78.266806,42.191836],[-78.26665800000001,42.191593],[-78.26651,42.191394],[-78.266251,42.191102],[-78.265342,42.190172],[-78.264889,42.189732],[-78.259023,42.184417],[-78.258218,42.183693],[-78.257712,42.18322],[-78.25746700000001,42.182969],[-78.257155,42.182596],[-78.256919,42.182246],[-78.256784,42.182023],[-78.256477,42.18146],[-78.25611600000001,42.180754],[-78.25586300000001,42.180164],[-78.25493400000001,42.177808],[-78.254713,42.177396],[-78.25450600000001,42.177082],[-78.254463,42.17702],[-78.25411800000001,42.176615],[-78.25388100000001,42.176384],[-78.253372,42.175973],[-78.253201,42.175858],[-78.25282900000001,42.175635],[-78.25255,42.175486],[-78.250252,42.174352],[-78.249863,42.174152],[-78.24958100000001,42.174015],[-78.248789,42.173622],[-78.248503,42.17348],[-78.249893,42.173621],[-78.250083,42.173614],[-78.25679700000001,42.173325],[-78.263835,42.173553],[-78.27403200000001,42.17341],[-78.274091,42.173444],[-78.274143,42.173474],[-78.278408,42.173405],[-78.29316900000001,42.173389],[-78.30579899999999,42.173374],[-78.30586700000001,42.173266],[-78.30900200000001,42.173388],[-78.309005,42.173605],[-78.309011,42.174275],[-78.308975,42.175773],[-78.308965,42.176451],[-78.308955,42.176701],[-78.308936,42.177222],[-78.308887,42.17756],[-78.308862,42.178696],[-78.308834,42.179144],[-78.308848,42.179335],[-78.308843,42.179425],[-78.308809,42.17962],[-78.30887,42.17984],[-78.30888899999999,42.179926],[-78.30889999999999,42.18002],[-78.30887800000001,42.180793],[-78.308879,42.18204],[-78.308879,42.182393],[-78.308894,42.182758],[-78.308894,42.182848],[-78.308899,42.184542],[-78.30889500000001,42.185312],[-78.30892299999999,42.186079],[-78.308926,42.186281],[-78.308988,42.190143],[-78.308995,42.191303],[-78.30899599999999,42.191532],[-78.309038,42.192472],[-78.30903499999999,42.192875],[-78.308993,42.194262],[-78.308955,42.195108],[-78.308959,42.196432],[-78.308986,42.197428],[-78.308977,42.198001],[-78.309,42.198266],[-78.309,42.198564],[-78.30900800000001,42.200092],[-78.30900800000001,42.200324],[-78.30900800000001,42.200385],[-78.309009,42.200559],[-78.309015,42.203041],[-78.309044,42.213717],[-78.309037,42.214433],[-78.30904200000001,42.214741],[-78.309051,42.215547],[-78.30905,42.215956],[-78.30906,42.216066],[-78.30910799999999,42.216576],[-78.309106,42.216731],[-78.30910299999999,42.217676],[-78.309104,42.218014],[-78.309136,42.221787],[-78.309146,42.223094],[-78.30915899999999,42.22458]]],"type":"Polygon"}
}