{
  "id": "360930206001",
  "type": "Feature",
  "properties": {
    "area_land":1558572,
    "area_water":33378,
    "geoid":"360930206001",
    "name":"Block Group 1",
    "state":"ny"
},
  "bbox": [
    -73.918699,
    42.792522,
    -73.897216,
    42.807383
],
  "geometry": {"coordinates":[[[-73.918699,42.804519],[-73.91417,42.807383],[-73.91274199999999,42.806794],[-73.911396,42.806218],[-73.91287199999999,42.804242],[-73.91293,42.804107],[-73.91297,42.803994],[-73.912972,42.803703],[-73.91293400000001,42.803547],[-73.91284899999999,42.803348],[-73.91271500000001,42.803177],[-73.912543,42.803027],[-73.912351,42.802913],[-73.911168,42.802433],[-73.90906699999999,42.805275],[-73.908979,42.805388],[-73.908357,42.806199],[-73.908091,42.806092],[-73.906893,42.805634],[-73.90608400000001,42.805298],[-73.905368,42.805038],[-73.90506499999999,42.804936],[-73.904318,42.804645],[-73.90323600000001,42.804238],[-73.902756,42.804055],[-73.90204300000001,42.803781],[-73.90089500000001,42.803283],[-73.900694,42.803191],[-73.900137,42.802911],[-73.900064,42.802875],[-73.90094000000001,42.802445],[-73.90079799999999,42.801965],[-73.900442,42.800764],[-73.899299,42.798679],[-73.899137,42.798772],[-73.89887299999999,42.798339],[-73.89849599999999,42.798522],[-73.898123,42.797967],[-73.897801,42.797497],[-73.89813100000001,42.797191],[-73.897829,42.796726],[-73.897216,42.796017],[-73.897407,42.795975],[-73.89881699999999,42.795654],[-73.898901,42.79564],[-73.899083,42.795603],[-73.89934100000001,42.795546],[-73.90042699999999,42.79526],[-73.901493,42.794813],[-73.902351,42.794317],[-73.903265,42.793565],[-73.903341,42.793489],[-73.90441300000001,42.792522],[-73.904623,42.792643],[-73.90506000000001,42.792844],[-73.905309,42.793125],[-73.907011,42.794834],[-73.907583,42.795407],[-73.90763800000001,42.795461],[-73.907723,42.795547],[-73.908843,42.794978],[-73.909465,42.794739],[-73.909649,42.794694],[-73.90980399999999,42.794657],[-73.91027699999999,42.794659],[-73.911231,42.794747],[-73.91196600000001,42.794677],[-73.91426199999999,42.793459],[-73.914419,42.793377],[-73.915043,42.793978],[-73.91553999999999,42.794428],[-73.91496600000001,42.795177],[-73.914979,42.795307],[-73.91502300000001,42.795732],[-73.91446999999999,42.796177],[-73.91413,42.796396],[-73.914002,42.796474],[-73.913669,42.796676],[-73.9139,42.796714],[-73.914271,42.796776],[-73.914501,42.796753],[-73.915767,42.796776],[-73.916217,42.79698],[-73.91673299999999,42.797497],[-73.91660299999999,42.797758],[-73.916706,42.797862],[-73.916346,42.798086],[-73.916292,42.798139],[-73.915824,42.798452],[-73.915009,42.799031],[-73.914215,42.799693],[-73.914439,42.79994],[-73.915037,42.800446],[-73.91513500000001,42.80056],[-73.915153,42.80066],[-73.91504999999999,42.801152],[-73.915049,42.801305],[-73.915121,42.801425],[-73.915696,42.801866],[-73.916702,42.802719],[-73.917688,42.803628],[-73.918699,42.804519]]],"type":"Polygon"}
}