{
  "id": "360470958001",
  "type": "Feature",
  "properties": {
    "area_land":90004,
    "area_water":0,
    "geoid":"360470958001",
    "name":"Block Group 1",
    "state":"ny"
},
  "bbox": [
    -73.915925,
    40.640569,
    -73.910764,
    40.644177
],
  "geometry": {"coordinates":[[[-73.91567000000001,40.64255],[-73.915187,40.642862],[-73.91472400000001,40.643161],[-73.914441,40.643342],[-73.91375499999999,40.643778],[-73.91368799999999,40.643813],[-73.913197,40.64407],[-73.912915,40.644177],[-73.911601,40.642997],[-73.910764,40.642246],[-73.911474,40.641788],[-73.91156700000001,40.641734],[-73.91229,40.64141],[-73.913146,40.641035],[-73.913904,40.640569],[-73.915925,40.642384],[-73.91567000000001,40.64255]]],"type":"Polygon"}
}