{
  "id": "361190021032",
  "type": "Feature",
  "properties": {
    "area_land":378845,
    "area_water":0,
    "geoid":"361190021032",
    "name":"Block Group 2",
    "state":"ny"
},
  "bbox": [
    -73.829791,
    40.956199,
    -73.821727,
    40.966187
],
  "geometry": {"coordinates":[[[-73.829548,40.95896],[-73.829465,40.959426],[-73.829432,40.959548],[-73.828998,40.960545],[-73.828514,40.961398],[-73.828261,40.961865],[-73.82811599999999,40.962133],[-73.827628,40.963109],[-73.827158,40.964263],[-73.827118,40.964326],[-73.82654100000001,40.965055],[-73.825756,40.966],[-73.82557799999999,40.966187],[-73.82543200000001,40.96613],[-73.825382,40.966087],[-73.82516800000001,40.965346],[-73.82489099999999,40.964314],[-73.824619,40.963296],[-73.824327,40.962288],[-73.82422200000001,40.96188],[-73.824065,40.961886],[-73.82384999999999,40.961876],[-73.82374900000001,40.961847],[-73.82363100000001,40.961797],[-73.823559,40.961729],[-73.823329,40.961354],[-73.823128,40.961074],[-73.82280900000001,40.96063],[-73.82261200000001,40.960385],[-73.822579,40.960207],[-73.822552,40.959967],[-73.82252699999999,40.95982],[-73.82249400000001,40.959743],[-73.822332,40.959652],[-73.822261,40.95962],[-73.822183,40.959588],[-73.822086,40.959542],[-73.821799,40.959452],[-73.821727,40.959417],[-73.822371,40.958624],[-73.822796,40.958207],[-73.822873,40.957596],[-73.824174,40.957098],[-73.82447500000001,40.956499],[-73.824776,40.956199],[-73.825459,40.95664],[-73.82554,40.956598],[-73.82623100000001,40.956984],[-73.826459,40.957053],[-73.826582,40.957079],[-73.82672700000001,40.957109],[-73.826842,40.957142],[-73.826521,40.95734],[-73.82644999999999,40.957385],[-73.826453,40.957406],[-73.826421,40.957467],[-73.827257,40.957888],[-73.82748100000001,40.957708],[-73.82772799999999,40.957572],[-73.82799,40.957496],[-73.82827,40.957432],[-73.82858899999999,40.957396],[-73.828891,40.957401],[-73.828985,40.957416],[-73.829228,40.957462],[-73.829537,40.957503],[-73.829791,40.957522],[-73.829548,40.95896]]],"type":"Polygon"}
}