{
  "id": "360290134002",
  "type": "Feature",
  "properties": {
    "area_land":399998,
    "area_water":0,
    "geoid":"360290134002",
    "name":"Block Group 2",
    "state":"ny"
},
  "bbox": [
    -78.83906,
    42.718986,
    -78.825712,
    42.723284
],
  "geometry": {"coordinates":[[[-78.83902999999999,42.721517],[-78.839018,42.722191],[-78.839016,42.72228],[-78.839001,42.723279],[-78.836709,42.723281],[-78.835404,42.723284],[-78.834102,42.723274],[-78.832801,42.723273],[-78.83214,42.723272],[-78.832055,42.723263],[-78.831953,42.723253],[-78.831587,42.723232],[-78.830326,42.723175],[-78.82896700000001,42.723108],[-78.82583200000001,42.72297],[-78.825851,42.722507],[-78.825802,42.722372],[-78.825799,42.722153],[-78.825738,42.722063],[-78.825712,42.721984],[-78.825726,42.721925],[-78.825744,42.721887],[-78.825846,42.721794],[-78.825878,42.721686],[-78.82595499999999,42.721614],[-78.826115,42.721471],[-78.82617,42.721422],[-78.82642300000001,42.721196],[-78.826925,42.720746],[-78.82887599999999,42.718986],[-78.82986200000001,42.719569],[-78.832589,42.719687],[-78.835345,42.719809],[-78.83766,42.719918],[-78.83906,42.719986],[-78.83902999999999,42.721517]]],"type":"Polygon"}
}