{
  "id": "360290077004",
  "type": "Feature",
  "properties": {
    "area_land":326426,
    "area_water":0,
    "geoid":"360290077004",
    "name":"Block Group 4",
    "state":"ny"
},
  "bbox": [
    -78.880148,
    43.006414,
    -78.872695,
    43.013667
],
  "geometry": {"coordinates":[[[-78.880078,43.009976],[-78.880022,43.010269],[-78.879603,43.012591],[-78.877692,43.013023],[-78.876598,43.013262],[-78.875682,43.013458],[-78.874706,43.013667],[-78.874016,43.012024],[-78.873428,43.010624],[-78.87269499999999,43.010636],[-78.872721,43.010574],[-78.872822,43.010207],[-78.872899,43.009958],[-78.873217,43.008918],[-78.87344899999999,43.008174],[-78.87358,43.007755],[-78.873721,43.007282],[-78.873752,43.007176],[-78.873959,43.006486],[-78.873971,43.006447],[-78.875884,43.006464],[-78.876853,43.006448],[-78.877021,43.006444],[-78.878259,43.006414],[-78.878021,43.007758],[-78.87784600000001,43.008721],[-78.877678,43.009644],[-78.87777199999999,43.009643],[-78.878815,43.009621],[-78.88014800000001,43.009595],[-78.880078,43.009976]]],"type":"Polygon"}
}