{
  "id": "360290128003",
  "type": "Feature",
  "properties": {
    "area_land":371672,
    "area_water":0,
    "geoid":"360290128003",
    "name":"Block Group 3",
    "state":"ny"
},
  "bbox": [
    -78.831639,
    42.789137,
    -78.822948,
    42.797334
],
  "geometry": {"coordinates":[[[-78.831639,42.797222],[-78.831345,42.797334],[-78.831327,42.797183],[-78.831242,42.79643],[-78.831155,42.795672],[-78.83107099999999,42.794934],[-78.83098699999999,42.794201],[-78.830826,42.794194],[-78.829773,42.794189],[-78.82911300000001,42.794181],[-78.827562,42.794176],[-78.826897,42.794178],[-78.823858,42.794166],[-78.82386,42.793487],[-78.823857,42.791733],[-78.823857,42.7917],[-78.82317500000001,42.791691],[-78.82295499999999,42.791689],[-78.822948,42.789973],[-78.822948,42.789595],[-78.822962,42.789258],[-78.823852,42.789263],[-78.82443499999999,42.789495],[-78.82493700000001,42.789297],[-78.826757,42.789285],[-78.829072,42.789271],[-78.830409,42.789137],[-78.83151100000001,42.789178],[-78.831518,42.789304],[-78.831531,42.789531],[-78.831524,42.790013],[-78.83152200000001,42.790659],[-78.831512,42.791185],[-78.831507,42.791861],[-78.83149,42.79379],[-78.83147200000001,42.795678],[-78.831481,42.795822],[-78.831639,42.797222]]],"type":"Polygon"}
}