{
  "id": "360210003002",
  "type": "Feature",
  "properties": {
    "area_land":44178460,
    "area_water":100155,
    "geoid":"360210003002",
    "name":"Block Group 2",
    "state":"ny"
},
  "bbox": [
    -73.632945,
    42.417335,
    -73.520343,
    42.492207
],
  "geometry": {"coordinates":[[[-73.63294500000001,42.466428],[-73.632786,42.466547],[-73.632688,42.466634],[-73.632604,42.466737],[-73.632504,42.466906],[-73.632389,42.467198],[-73.632138,42.468018],[-73.631803,42.468924],[-73.631681,42.469463],[-73.631629,42.469813],[-73.631621,42.469959],[-73.631643,42.470283],[-73.63167300000001,42.470489],[-73.631828,42.471541],[-73.63211699999999,42.472992],[-73.632335,42.473988],[-73.632499,42.47486],[-73.63248400000001,42.474944],[-73.63244,42.475069],[-73.63236499999999,42.475173],[-73.632268,42.475248],[-73.632125,42.475318],[-73.631764,42.475409],[-73.63135699999999,42.475502],[-73.630264,42.4757],[-73.630146,42.47573],[-73.62999600000001,42.475779],[-73.629853,42.475838],[-73.629634,42.475945],[-73.629313,42.476124],[-73.627208,42.478333],[-73.6259,42.479706],[-73.625727,42.479894],[-73.625607,42.480024],[-73.625512,42.480135],[-73.62540300000001,42.480262],[-73.624561,42.480363],[-73.624194,42.480398],[-73.616248,42.481165],[-73.614608,42.481333],[-73.61457799999999,42.481336],[-73.608064,42.482006],[-73.607795,42.482034],[-73.60017999999999,42.482816],[-73.59685399999999,42.483134],[-73.596706,42.483148],[-73.59537,42.483276],[-73.594032,42.483428],[-73.59390399999999,42.483442],[-73.590126,42.483871],[-73.584524,42.484352],[-73.58317,42.484494],[-73.58299,42.484513],[-73.580783,42.484712],[-73.580752,42.484716],[-73.57843099999999,42.484993],[-73.578287,42.48501],[-73.577236,42.485138],[-73.573914,42.485542],[-73.573854,42.485549],[-73.572445,42.485722],[-73.56760800000001,42.486412],[-73.56750700000001,42.486426],[-73.559218,42.487521],[-73.559038,42.487545],[-73.55833,42.487639],[-73.55792700000001,42.487692],[-73.55784199999999,42.487703],[-73.55439699999999,42.488163],[-73.552791,42.488377],[-73.552346,42.488428],[-73.54616,42.489143],[-73.54420399999999,42.489369],[-73.541521,42.489703],[-73.53604199999999,42.490386],[-73.53379099999999,42.490652],[-73.53360499999999,42.490674],[-73.531482,42.490925],[-73.531037,42.490978],[-73.529774,42.491128],[-73.528369,42.491341],[-73.528318,42.491346],[-73.52815699999999,42.491363],[-73.528125,42.491366],[-73.527962,42.491383],[-73.527242,42.491458],[-73.52705,42.491478],[-73.52616399999999,42.49157],[-73.523105,42.491938],[-73.522897,42.491972],[-73.52075000000001,42.492201],[-73.52069,42.492207],[-73.520533,42.485619],[-73.520521,42.484589],[-73.520455,42.481999],[-73.52042400000001,42.480175],[-73.520381,42.477147],[-73.520343,42.471245],[-73.52040700000001,42.471216],[-73.5211,42.470979],[-73.521297,42.470928],[-73.521468,42.470895],[-73.521767,42.470881],[-73.52215700000001,42.470899],[-73.523055,42.470914],[-73.523751,42.470881],[-73.525789,42.470826],[-73.52592799999999,42.47083],[-73.52615,42.470884],[-73.526656,42.47033],[-73.52693499999999,42.47009],[-73.527081,42.469985],[-73.52737399999999,42.46982],[-73.527597,42.469723],[-73.527958,42.469612],[-73.528164,42.469565],[-73.528335,42.469536],[-73.52861,42.46951],[-73.528818,42.469508],[-73.52908499999999,42.469525],[-73.529203,42.469533],[-73.529499,42.469577],[-73.52989599999999,42.46968],[-73.53045400000001,42.469857],[-73.530906,42.46997],[-73.531216,42.470011],[-73.531491,42.47002],[-73.531896,42.469999],[-73.532212,42.469952],[-73.53246799999999,42.469885],[-73.532718,42.469795],[-73.533068,42.469635],[-73.533294,42.469504],[-73.53341899999999,42.469418],[-73.533672,42.469201],[-73.534249,42.46863],[-73.534599,42.468284],[-73.535274,42.467624],[-73.53616100000001,42.466734],[-73.536894,42.465987],[-73.537317,42.465556],[-73.537532,42.465301],[-73.537919,42.4647],[-73.53809,42.464456],[-73.53818099999999,42.464346],[-73.538369,42.464157],[-73.53847399999999,42.464079],[-73.53942600000001,42.463448],[-73.539548,42.46335],[-73.53958799999999,42.463313],[-73.540042,42.462891],[-73.540672,42.462244],[-73.5411,42.461812],[-73.54141,42.461524],[-73.541701,42.4613],[-73.541865,42.461196],[-73.54225,42.460991],[-73.54328599999999,42.460539],[-73.544358,42.460102],[-73.544723,42.459985],[-73.544905,42.459945],[-73.545233,42.459894],[-73.54565599999999,42.459868],[-73.54593300000001,42.459872],[-73.546903,42.459941],[-73.547158,42.459941],[-73.547523,42.459916],[-73.547777,42.459871],[-73.547895,42.459846],[-73.548259,42.45973],[-73.548467,42.459639],[-73.548765,42.459485],[-73.548886,42.459398],[-73.549072,42.459253],[-73.54919599999999,42.459125],[-73.54939299999999,42.458896],[-73.549561,42.458604],[-73.54962999999999,42.458447],[-73.55000200000001,42.457169],[-73.550133,42.456844],[-73.55030499999999,42.456546],[-73.55040700000001,42.456407],[-73.55049099999999,42.456312],[-73.550629,42.456181],[-73.551041,42.455864],[-73.551289,42.455722],[-73.551618,42.455581],[-73.55274199999999,42.455204],[-73.55313599999999,42.455033],[-73.55343000000001,42.454879],[-73.553512,42.454832],[-73.553811,42.454632],[-73.554157,42.454337],[-73.55426900000001,42.454225],[-73.554283,42.454211],[-73.554745,42.453747],[-73.554923,42.453569],[-73.555025,42.453465],[-73.555204,42.453282],[-73.555302,42.453182],[-73.555848,42.452532],[-73.55595700000001,42.452381],[-73.55613,42.452079],[-73.556248,42.451805],[-73.55632300000001,42.45159],[-73.55643999999999,42.451178],[-73.55646,42.451055],[-73.556505,42.450606],[-73.556498,42.45014],[-73.55643600000001,42.44936],[-73.556432,42.449098],[-73.556483,42.44811],[-73.556534,42.44768],[-73.556596,42.447287],[-73.556612,42.447238],[-73.556684,42.44701],[-73.55681199999999,42.446769],[-73.556997,42.446511],[-73.557114,42.44638],[-73.55729700000001,42.446208],[-73.557399,42.446125],[-73.557613,42.445983],[-73.557855,42.445848],[-73.558858,42.445333],[-73.559124,42.445184],[-73.55942400000001,42.444994],[-73.5596,42.44486],[-73.559893,42.444635],[-73.55997499999999,42.444571],[-73.560103,42.444471],[-73.560228,42.444374],[-73.56034,42.444286],[-73.560804,42.443912],[-73.56101700000001,42.443697],[-73.56121,42.443449],[-73.56133800000001,42.443231],[-73.561487,42.442919],[-73.561499,42.44289],[-73.561604,42.442633],[-73.561972,42.441624],[-73.562223,42.440778],[-73.56259300000001,42.440846],[-73.562687,42.440873],[-73.562837,42.440579],[-73.56319999999999,42.440261],[-73.563506,42.440102],[-73.563542,42.440087],[-73.563829,42.439999],[-73.563866,42.439988],[-73.56423100000001,42.439865],[-73.564483,42.439742],[-73.564539,42.439716],[-73.56456799999999,42.439703],[-73.564683,42.43965],[-73.565259,42.439344],[-73.565398,42.439285],[-73.565522,42.439249],[-73.565646,42.439227],[-73.56583500000001,42.439212],[-73.565988,42.439217],[-73.566149,42.439223],[-73.566378,42.439242],[-73.566976,42.439242],[-73.567702,42.439198],[-73.568099,42.439151],[-73.568455,42.43908],[-73.568783,42.438982],[-73.568943,42.438907],[-73.569061,42.438836],[-73.570296,42.437896],[-73.570683,42.437594],[-73.570832,42.437437],[-73.570931,42.437313],[-73.571212,42.436925],[-73.571416,42.436617],[-73.571485,42.436545],[-73.571573,42.436475],[-73.57181300000001,42.436344],[-73.571941,42.436297],[-73.572108,42.436257],[-73.572254,42.436235],[-73.572845,42.436184],[-73.573173,42.436135],[-73.57334400000001,42.436089],[-73.57350700000001,42.436029],[-73.573661,42.435951],[-73.573928,42.435761],[-73.57405,42.435647],[-73.57416499999999,42.435485],[-73.574209,42.435401],[-73.57424899999999,42.435273],[-73.574281,42.435117],[-73.574394,42.434107],[-73.574445,42.433838],[-73.574533,42.433616],[-73.574591,42.433525],[-73.574664,42.433444],[-73.57477,42.433364],[-73.574901,42.433288],[-73.575204,42.433135],[-73.57546000000001,42.433026],[-73.57553900000001,42.432993],[-73.576035,42.432843],[-73.57620300000001,42.432807],[-73.576888,42.432723],[-73.57716499999999,42.432599],[-73.57731200000001,42.432501],[-73.57749800000001,42.432293],[-73.577611,42.432125],[-73.578278,42.431221],[-73.578453,42.431007],[-73.579088,42.430289],[-73.57928099999999,42.430096],[-73.579398,42.429954],[-73.579584,42.42968],[-73.57974400000001,42.429473],[-73.57995200000001,42.429254],[-73.580236,42.428996],[-73.580652,42.428701],[-73.58137000000001,42.428282],[-73.581598,42.428131],[-73.581689,42.428069],[-73.581726,42.428043],[-73.582059,42.427797],[-73.582252,42.427666],[-73.582365,42.4276],[-73.58264699999999,42.427464],[-73.58269,42.427444],[-73.58305799999999,42.427305],[-73.584192,42.427007],[-73.584644,42.426865],[-73.58497,42.426735],[-73.58562499999999,42.426475],[-73.585931,42.426373],[-73.586624,42.426195],[-73.587109,42.426093],[-73.58729099999999,42.426064],[-73.587557,42.426053],[-73.587695,42.426066],[-73.587998,42.426122],[-73.588753,42.426342],[-73.588953,42.426403],[-73.59014999999999,42.426767],[-73.5907,42.426949],[-73.590824,42.427004],[-73.591397,42.427303],[-73.591504,42.427342],[-73.59161899999999,42.427372],[-73.591866,42.427413],[-73.591925,42.427423],[-73.59217,42.427445],[-73.59272,42.42747],[-73.593245,42.42747],[-73.593475,42.427459],[-73.593683,42.427434],[-73.59385,42.427394],[-73.59442300000001,42.427212],[-73.595247,42.426917],[-73.595564,42.426785],[-73.59581900000001,42.426636],[-73.596064,42.426454],[-73.596574,42.426002],[-73.596692,42.425913],[-73.59683,42.425844],[-73.597053,42.42576],[-73.597195,42.425724],[-73.597403,42.425688],[-73.59783299999999,42.42564],[-73.59799,42.425615],[-73.598125,42.425582],[-73.598311,42.425509],[-73.59847499999999,42.425422],[-73.59862099999999,42.425327],[-73.59881799999999,42.425163],[-73.598964,42.425014],[-73.599514,42.424296],[-73.599795,42.423903],[-73.60023200000001,42.423189],[-73.60053499999999,42.422759],[-73.600892,42.422281],[-73.60114400000001,42.421972],[-73.601337,42.421801],[-73.601658,42.4216],[-73.603182,42.420872],[-73.603408,42.420751],[-73.60379399999999,42.420507],[-73.603933,42.4204],[-73.603988,42.420358],[-73.605355,42.419145],[-73.605915,42.418632],[-73.60670399999999,42.417921],[-73.606872,42.417793],[-73.607105,42.417633],[-73.607382,42.417498],[-73.607692,42.417396],[-73.607823,42.417371],[-73.608169,42.417335],[-73.608436,42.41736],[-73.608577,42.417384],[-73.611091,42.417944],[-73.61266999999999,42.418298],[-73.612863,42.418313],[-73.61294700000001,42.418309],[-73.61402699999999,42.418222],[-73.614385,42.418346],[-73.61476,42.418536],[-73.61511299999999,42.418713],[-73.61521999999999,42.418786],[-73.615315,42.418864],[-73.615398,42.41894],[-73.615433,42.418981],[-73.615537,42.419083],[-73.615634,42.419185],[-73.615656,42.419208],[-73.615786,42.419396],[-73.615858,42.419529],[-73.616319,42.420706],[-73.61726299999999,42.423284],[-73.617445,42.423757],[-73.617774,42.424565],[-73.618031,42.425283],[-73.61851,42.426536],[-73.61924500000001,42.429034],[-73.619759,42.430799],[-73.62012900000001,42.43213],[-73.620257,42.432546],[-73.62095100000001,42.434411],[-73.622023,42.437586],[-73.622231,42.438202],[-73.622658,42.439427],[-73.62293200000001,42.440031],[-73.623485,42.44113],[-73.62399600000001,42.442118],[-73.624669,42.443281],[-73.62526800000001,42.444324],[-73.62578999999999,42.445173],[-73.62664599999999,42.44662],[-73.62688799999999,42.447001],[-73.62697199999999,42.447134],[-73.62730500000001,42.447577],[-73.628283,42.448759],[-73.628511,42.449013],[-73.628674,42.449193],[-73.629167,42.449779],[-73.62933200000001,42.45003],[-73.629617,42.450603],[-73.62991700000001,42.451332],[-73.630081,42.451839],[-73.630267,42.452661],[-73.630352,42.453036],[-73.630471,42.453405],[-73.63056,42.453634],[-73.630743,42.453998],[-73.63118299999999,42.454827],[-73.631252,42.455063],[-73.631277,42.45524],[-73.631277,42.45621],[-73.631297,42.457116],[-73.631339,42.45747],[-73.631429,42.457792],[-73.63155399999999,42.458104],[-73.631799,42.458569],[-73.631863,42.458689],[-73.632288,42.459492],[-73.632402,42.459795],[-73.63244,42.459971],[-73.632463,42.460141],[-73.632471,42.460351],[-73.632497,42.461029],[-73.632504,42.461182],[-73.632498,42.461758],[-73.63249399999999,42.462149],[-73.632504,42.463085],[-73.63255100000001,42.464044],[-73.632588,42.464374],[-73.632857,42.466186],[-73.63294500000001,42.466428]]],"type":"Polygon"}
}