{
  "id": "360594062012",
  "type": "Feature",
  "properties": {
    "area_land":280145,
    "area_water":0,
    "geoid":"360594062012",
    "name":"Block Group 2",
    "state":"ny"
},
  "bbox": [
    -73.651486,
    40.685412,
    -73.643882,
    40.694303
],
  "geometry": {"coordinates":[[[-73.65148600000001,40.68685],[-73.650746,40.688023],[-73.65047800000001,40.688415],[-73.649451,40.689922],[-73.648966,40.690694],[-73.648353,40.691638],[-73.647474,40.69295],[-73.647333,40.693211],[-73.64702699999999,40.693631],[-73.64659899999999,40.694303],[-73.64651000000001,40.694244],[-73.64727600000001,40.693075],[-73.648314,40.691492],[-73.64581099999999,40.690999],[-73.644845,40.690808],[-73.64480399999999,40.690785],[-73.644747,40.690735],[-73.64470900000001,40.69048],[-73.644716,40.690439],[-73.644785,40.690305],[-73.64441600000001,40.689694],[-73.644718,40.68877],[-73.64426899999999,40.687761],[-73.643985,40.687504],[-73.643882,40.685874],[-73.644526,40.685946],[-73.644508,40.685721],[-73.64395,40.685412],[-73.644167,40.685448],[-73.644606,40.685488],[-73.644751,40.685491],[-73.64515400000001,40.68553],[-73.645239,40.685541],[-73.64543500000001,40.685551],[-73.64801900000001,40.685813],[-73.647903,40.686491],[-73.650615,40.686818],[-73.65118200000001,40.68688],[-73.65148600000001,40.68685]]],"type":"Polygon"}
}