{
  "id": "360594062024",
  "type": "Feature",
  "properties": {
    "area_land":288156,
    "area_water":0,
    "geoid":"360594062024",
    "name":"Block Group 4",
    "state":"ny"
},
  "bbox": [
    -73.661431,
    40.671096,
    -73.652767,
    40.675863
],
  "geometry": {"coordinates":[[[-73.660584,40.674039],[-73.659583,40.674283],[-73.658981,40.674431],[-73.65866,40.674481],[-73.658753,40.675251],[-73.658776,40.675429],[-73.658396,40.675476],[-73.657849,40.675543],[-73.65698,40.675649],[-73.656102,40.675755],[-73.655235,40.675863],[-73.65515600000001,40.675493],[-73.652919,40.675478],[-73.652874,40.675112],[-73.652773,40.674399],[-73.652767,40.674256],[-73.65279,40.673916],[-73.652862,40.673334],[-73.65285900000001,40.67318],[-73.65288700000001,40.672958],[-73.65294400000001,40.672599],[-73.653004,40.672253],[-73.653081,40.672023],[-73.653127,40.671922],[-73.653257,40.671595],[-73.65342,40.671249],[-73.656042,40.671385],[-73.658314,40.671505],[-73.66014,40.671096],[-73.660478,40.67181],[-73.66143099999999,40.673831],[-73.660584,40.674039]]],"type":"Polygon"}
}