{
  "id": "361190024051",
  "type": "Feature",
  "properties": {
    "area_land":211298,
    "area_water":0,
    "geoid":"361190024051",
    "name":"Block Group 1",
    "state":"ny"
},
  "bbox": [
    -73.862117,
    40.924772,
    -73.856432,
    40.932688
],
  "geometry": {"coordinates":[[[-73.862117,40.931093],[-73.86165,40.931764],[-73.861582,40.931878],[-73.861307,40.93224],[-73.86114000000001,40.932485],[-73.861071,40.932579],[-73.861037,40.932626],[-73.860992,40.932688],[-73.860817,40.932624],[-73.86040199999999,40.932507],[-73.860356,40.932494],[-73.85959099999999,40.932279],[-73.859475,40.932247],[-73.858818,40.93209],[-73.858344,40.931965],[-73.857326,40.93173],[-73.856989,40.931638],[-73.856807,40.931588],[-73.856719,40.931565],[-73.856634,40.931541],[-73.856432,40.931486],[-73.856453,40.931366],[-73.856461,40.931323],[-73.85649600000001,40.931132],[-73.85650699999999,40.931076],[-73.856531,40.930955],[-73.85688399999999,40.929165],[-73.856919,40.928916],[-73.856937,40.928807],[-73.85701,40.928318],[-73.85705900000001,40.928014],[-73.857184,40.927238],[-73.857193,40.927051],[-73.857235,40.926823],[-73.85726099999999,40.926681],[-73.857316,40.926495],[-73.85741299999999,40.926174],[-73.85742500000001,40.926135],[-73.857473,40.925975],[-73.85765600000001,40.925504],[-73.857778,40.925275],[-73.858012,40.924923],[-73.85811200000001,40.924772],[-73.858121,40.924801],[-73.858307,40.9252],[-73.858402,40.925403],[-73.85858899999999,40.925805],[-73.858949,40.926574],[-73.859041,40.926771],[-73.859588,40.927697],[-73.85975000000001,40.927993],[-73.860084,40.928635],[-73.86016100000001,40.928758],[-73.86034600000001,40.929057],[-73.86057599999999,40.929337],[-73.86099400000001,40.929724],[-73.861327,40.930038],[-73.861446,40.930174],[-73.86154000000001,40.930361],[-73.86156099999999,40.930411],[-73.861751,40.930694],[-73.862117,40.931093]]],"type":"Polygon"}
}