{
  "id": "360070127024",
  "type": "Feature",
  "properties": {
    "area_land":41754669,
    "area_water":189004,
    "geoid":"360070127024",
    "name":"Block Group 4",
    "state":"ny"
},
  "bbox": [
    -75.959176,
    41.998606,
    -75.870677,
    42.065966
],
  "geometry": {"coordinates":[[[-75.959172,42.008516],[-75.959138,42.008699],[-75.959073,42.008864],[-75.959,42.008989],[-75.958877,42.009127],[-75.958793,42.009194],[-75.956272,42.00932],[-75.956346,42.011195],[-75.95687100000001,42.022277],[-75.958153,42.049611],[-75.95816499999999,42.049839],[-75.958235,42.050368],[-75.958327,42.051488],[-75.958393,42.052207],[-75.95741200000001,42.052325],[-75.95714,42.052351],[-75.955811,42.052549],[-75.955067,42.05264],[-75.954769,42.052668],[-75.954018,42.052764],[-75.953768,42.052824],[-75.952384,42.053298],[-75.952212,42.053374],[-75.952057,42.053464],[-75.95190100000001,42.053598],[-75.951471,42.054028],[-75.951336,42.054171],[-75.951167,42.054382],[-75.950793,42.054881],[-75.95063500000001,42.055035],[-75.95047700000001,42.055167],[-75.949893,42.055575],[-75.949432,42.055875],[-75.94903600000001,42.056124],[-75.948896,42.056212],[-75.9479,42.056721],[-75.94735300000001,42.057018],[-75.946641,42.057343],[-75.945798,42.05771],[-75.944636,42.058315],[-75.943417,42.058909],[-75.94246,42.059351],[-75.94213999999999,42.059487],[-75.941889,42.05963],[-75.94174,42.059746],[-75.941565,42.059958],[-75.941489,42.060088],[-75.94139800000001,42.060358],[-75.94121,42.060993],[-75.940921,42.061722],[-75.94087500000001,42.061897],[-75.940862,42.062052],[-75.940882,42.062279],[-75.94092499999999,42.062397],[-75.941062,42.062617],[-75.941317,42.062973],[-75.941721,42.063413],[-75.941883,42.063625],[-75.942154,42.064058],[-75.942426,42.064405],[-75.94283,42.06486],[-75.943076,42.06516],[-75.94311,42.065236],[-75.94313200000001,42.065324],[-75.943127,42.065463],[-75.94307999999999,42.065574],[-75.943,42.065662],[-75.94289000000001,42.065742],[-75.942758,42.065816],[-75.942605,42.065871],[-75.942409,42.065914],[-75.94187599999999,42.065966],[-75.941669,42.065963],[-75.94126900000001,42.065941],[-75.94100899999999,42.065912],[-75.940575,42.065824],[-75.94040099999999,42.065767],[-75.940265,42.065711],[-75.93937099999999,42.065288],[-75.93841500000001,42.064869],[-75.93815600000001,42.064772],[-75.937692,42.064637],[-75.936999,42.064458],[-75.93661899999999,42.064308],[-75.936283,42.064152],[-75.936105,42.064045],[-75.935984,42.063941],[-75.93562900000001,42.063393],[-75.935531,42.063239],[-75.935112,42.063353],[-75.93474500000001,42.063512],[-75.93457600000001,42.063612],[-75.934353,42.063773],[-75.933837,42.064241],[-75.933645,42.06439],[-75.933362,42.064568],[-75.933184,42.064664],[-75.93304500000001,42.064725],[-75.932624,42.064888],[-75.931568,42.065185],[-75.930666,42.065485],[-75.930063,42.065723],[-75.929954,42.065513],[-75.929918,42.065347],[-75.929918,42.065247],[-75.929969,42.064898],[-75.930133,42.064062],[-75.930172,42.063432],[-75.93025799999999,42.062778],[-75.93029900000001,42.062433],[-75.93032599999999,42.062003],[-75.930386,42.061739],[-75.930598,42.061138],[-75.930643,42.060877],[-75.930643,42.060144],[-75.93066899999999,42.059653],[-75.93065199999999,42.059526],[-75.93059700000001,42.059435],[-75.930513,42.059347],[-75.93033800000001,42.059221],[-75.930149,42.059119],[-75.930009,42.059059],[-75.92983,42.058997],[-75.929219,42.058845],[-75.928394,42.058675],[-75.927984,42.058572],[-75.927751,42.05848],[-75.927572,42.058387],[-75.926975,42.058006],[-75.926441,42.057718],[-75.92558099999999,42.057283],[-75.925121,42.057081],[-75.92417,42.056766],[-75.924003,42.056682],[-75.923711,42.056505],[-75.923221,42.056169],[-75.922822,42.055918],[-75.922465,42.055742],[-75.922094,42.055601],[-75.921256,42.055378],[-75.920681,42.055243],[-75.920293,42.05518],[-75.918589,42.054947],[-75.917547,42.054782],[-75.91736,42.054738],[-75.91739699999999,42.054636],[-75.917435,42.054347],[-75.917416,42.054157],[-75.91741,42.054102],[-75.91734099999999,42.053865],[-75.917224,42.053649],[-75.91701999999999,42.053396],[-75.91618200000001,42.052463],[-75.91549500000001,42.051716],[-75.91519599999999,42.051344],[-75.91507799999999,42.051366],[-75.913951,42.051509],[-75.91312000000001,42.051628],[-75.912476,42.051692],[-75.912038,42.051718],[-75.91175,42.051695],[-75.911613,42.051668],[-75.911509,42.051635],[-75.911332,42.051539],[-75.91126300000001,42.051481],[-75.91088999999999,42.051096],[-75.91018200000001,42.050427],[-75.910037,42.050327],[-75.909813,42.050191],[-75.909449,42.050008],[-75.908677,42.049675],[-75.908461,42.049536],[-75.90792999999999,42.049132],[-75.907636,42.048899],[-75.907529,42.048833],[-75.907369,42.048795],[-75.907132,42.048785],[-75.906305,42.048775],[-75.905901,42.048782],[-75.90519500000001,42.048811],[-75.904166,42.048897],[-75.90311800000001,42.048948],[-75.90213199999999,42.04902],[-75.899333,42.04916],[-75.89863099999999,42.049215],[-75.89655500000001,42.049351],[-75.89430400000001,42.049537],[-75.894142,42.049545],[-75.89373999999999,42.049537],[-75.893039,42.049487],[-75.89276599999999,42.049479],[-75.89077399999999,42.049565],[-75.887821,42.049735],[-75.886436,42.049803],[-75.88555599999999,42.049863],[-75.88476300000001,42.049912],[-75.883185,42.05005],[-75.880416,42.050222],[-75.878716,42.050336],[-75.878541,42.04831],[-75.878091,42.043106],[-75.8772,42.029496],[-75.87672499999999,42.022642],[-75.876499,42.017592],[-75.871589,42.017532],[-75.871484,42.012158],[-75.871269,42.006857],[-75.871236,42.006427],[-75.871098,42.004781],[-75.871015,42.003782],[-75.870677,41.998828],[-75.888502,41.998892],[-75.89049199999999,41.998606],[-75.890619,41.998606],[-75.891423,41.998609],[-75.899151,41.998636],[-75.91053100000001,41.998698],[-75.910631,41.998698],[-75.934136,41.998747],[-75.936019,41.998746],[-75.949871,41.998974],[-75.953709,41.998987],[-75.953727,41.998987],[-75.95840699999999,41.998987],[-75.958432,41.999383],[-75.958473,41.999468],[-75.95854,41.999703],[-75.958574,42.000003],[-75.958586,42.000801],[-75.95854199999999,42.001429],[-75.958552,42.001776],[-75.958628,42.00265],[-75.95899900000001,42.006197],[-75.959176,42.008112],[-75.959172,42.008516]]],"type":"Polygon"}
}