{
  "id": "360710106003",
  "type": "Feature",
  "properties": {
    "area_land":6933236,
    "area_water":185895,
    "geoid":"360710106003",
    "name":"Block Group 3",
    "state":"ny"
},
  "bbox": [
    -74.167692,
    41.525953,
    -74.122798,
    41.558895
],
  "geometry": {"coordinates":[[[-74.167692,41.547042],[-74.166799,41.54865],[-74.165572,41.550439],[-74.163363,41.553716],[-74.16204,41.555668],[-74.16115499999999,41.55722],[-74.16031700000001,41.558895],[-74.159795,41.558817],[-74.159299,41.558767],[-74.158472,41.558694],[-74.158356,41.558679],[-74.15826199999999,41.55866],[-74.158072,41.558622],[-74.157605,41.55852],[-74.157023,41.558383],[-74.154956,41.557863],[-74.153683,41.557533],[-74.153333,41.557414],[-74.153069,41.557302],[-74.152832,41.557186],[-74.15165399999999,41.556592],[-74.15075400000001,41.556138],[-74.15043900000001,41.55599],[-74.15017,41.555866],[-74.14974100000001,41.555712],[-74.149505,41.555648],[-74.14849100000001,41.555414],[-74.147749,41.555279],[-74.14758500000001,41.555253],[-74.14567599999999,41.555001],[-74.14437100000001,41.554825],[-74.14418999999999,41.5548],[-74.143767,41.554729],[-74.143315,41.554654],[-74.141525,41.554307],[-74.140637,41.554132],[-74.14016700000001,41.554041],[-74.13990800000001,41.554003],[-74.139022,41.553896],[-74.13803900000001,41.55378],[-74.137733,41.553746],[-74.136886,41.553648],[-74.13629,41.553571],[-74.135864,41.553469],[-74.13548900000001,41.553329],[-74.135335,41.553253],[-74.135171,41.55316],[-74.135071,41.553103],[-74.135057,41.553095],[-74.135025,41.553077],[-74.13468,41.55281],[-74.134524,41.552646],[-74.134336,41.552401],[-74.13392,41.55176],[-74.132625,41.549796],[-74.13248900000001,41.549579],[-74.132267,41.549311],[-74.132029,41.549079],[-74.130426,41.547608],[-74.130349,41.547516],[-74.130188,41.547346],[-74.130082,41.547192],[-74.129831,41.546727],[-74.12939299999999,41.545832],[-74.129238,41.545531],[-74.129186,41.545432],[-74.12911699999999,41.545298],[-74.12901100000001,41.545121],[-74.128703,41.544734],[-74.12786,41.543779],[-74.1271,41.542909],[-74.12682100000001,41.542615],[-74.12656699999999,41.542385],[-74.12638699999999,41.542249],[-74.126216,41.542134],[-74.125912,41.541962],[-74.125761,41.541886],[-74.12524000000001,41.541672],[-74.125,41.541602],[-74.12465,41.541519],[-74.12438299999999,41.54148],[-74.12327399999999,41.541393],[-74.122798,41.541355],[-74.122917,41.54104],[-74.122957,41.54096],[-74.12446300000001,41.5378],[-74.124426,41.537661],[-74.124404,41.537585],[-74.124588,41.536677],[-74.126807,41.531138],[-74.12699499999999,41.530665],[-74.12729899999999,41.530145],[-74.128001,41.528661],[-74.128365,41.527688],[-74.12878499999999,41.52625],[-74.128951,41.526249],[-74.130923,41.5262],[-74.131288,41.526197],[-74.131474,41.526193],[-74.133584,41.526145],[-74.13397500000001,41.526136],[-74.134355,41.526127],[-74.13682799999999,41.526066],[-74.137514,41.526054],[-74.13974,41.526],[-74.14182,41.525955],[-74.142769,41.525953],[-74.145261,41.525992],[-74.145597,41.525983],[-74.14597500000001,41.525973],[-74.14590099999999,41.526299],[-74.145292,41.527925],[-74.145105,41.528426],[-74.144801,41.529195],[-74.144722,41.529546],[-74.14458999999999,41.530381],[-74.14443300000001,41.531431],[-74.144285,41.53237],[-74.14418999999999,41.533154],[-74.144103,41.533939],[-74.144035,41.534724],[-74.144043,41.535047],[-74.144079,41.53523],[-74.144244,41.535803],[-74.144283,41.53608],[-74.144274,41.536216],[-74.14403900000001,41.536824],[-74.143833,41.537337],[-74.14333000000001,41.538533],[-74.14325100000001,41.538732],[-74.142797,41.53984],[-74.14236699999999,41.540849],[-74.142307,41.540989],[-74.142135,41.541406],[-74.143376,41.542127],[-74.143624,41.542256],[-74.14422,41.542533],[-74.14429199999999,41.542569],[-74.144531,41.542689],[-74.14484899999999,41.542881],[-74.145526,41.543372],[-74.145633,41.543444],[-74.146086,41.543705],[-74.146845,41.544152],[-74.14717,41.544306],[-74.14752799999999,41.544451],[-74.148565,41.544842],[-74.149045,41.545007],[-74.14960000000001,41.545206],[-74.149838,41.545022],[-74.149867,41.544975],[-74.149867,41.544888],[-74.149699,41.544618],[-74.149624,41.544531],[-74.14958799999999,41.544439],[-74.149591,41.544243],[-74.149613,41.544152],[-74.149817,41.543904],[-74.14984699999999,41.543802],[-74.149883,41.543722],[-74.150076,41.543474],[-74.150344,41.543204],[-74.15049399999999,41.543004],[-74.15055599999999,41.542891],[-74.150755,41.54237],[-74.150842,41.542243],[-74.150893,41.542214],[-74.15101300000001,41.54217],[-74.151571,41.542053],[-74.151799,41.542013],[-74.15221099999999,41.541984],[-74.15246999999999,41.541893],[-74.152601,41.541868],[-74.152816,41.541857],[-74.15338300000001,41.541616],[-74.153496,41.541529],[-74.15367500000001,41.541368],[-74.153784,41.541194],[-74.15389,41.540968],[-74.154145,41.540585],[-74.154273,41.54037],[-74.15430600000001,41.540261],[-74.154313,41.540141],[-74.154335,41.540035],[-74.15440099999999,41.539886],[-74.154492,41.53974],[-74.154659,41.539554],[-74.154973,41.539292],[-74.155091,41.539117],[-74.155151,41.538958],[-74.15662,41.539465],[-74.157664,41.539749],[-74.157719,41.539686],[-74.157804,41.539639],[-74.157905,41.539645],[-74.158013,41.539662],[-74.158106,41.539668],[-74.158176,41.539645],[-74.158238,41.539587],[-74.158416,41.53914],[-74.158502,41.539042],[-74.158579,41.538931],[-74.158672,41.53885],[-74.158812,41.538705],[-74.159184,41.53838],[-74.159378,41.538224],[-74.15959599999999,41.53806],[-74.15960200000001,41.538031],[-74.15962399999999,41.538003],[-74.15975,41.537875],[-74.16003600000001,41.537585],[-74.160146,41.537483],[-74.160498,41.537909],[-74.16115499999999,41.538736],[-74.161238,41.538847],[-74.16135300000001,41.539031],[-74.161444,41.5392],[-74.161513,41.539328],[-74.161826,41.540033],[-74.16192100000001,41.540188],[-74.16201100000001,41.540334],[-74.162153,41.540509],[-74.162379,41.540752],[-74.16285999999999,41.541219],[-74.163113,41.541498],[-74.16328900000001,41.541743],[-74.16342899999999,41.541996],[-74.163589,41.542394],[-74.163752,41.54288],[-74.163842,41.543109],[-74.16402100000001,41.543478],[-74.16409899999999,41.543597],[-74.164249,41.543775],[-74.16460600000001,41.544114],[-74.164705,41.5442],[-74.16561400000001,41.544998],[-74.16610900000001,41.545468],[-74.16671599999999,41.546077],[-74.16757,41.546932],[-74.167692,41.547042]]],"type":"Polygon"}
}