{
  "id": "360810061003",
  "type": "Feature",
  "properties": {
    "area_land":48648,
    "area_water":0,
    "geoid":"360810061003",
    "name":"Block Group 3",
    "state":"ny"
},
  "bbox": [
    -73.922996,
    40.7601,
    -73.919484,
    40.763199
],
  "geometry": {"coordinates":[[[-73.922996,40.760849],[-73.921081,40.763199],[-73.920283,40.762823],[-73.920197,40.762783],[-73.919484,40.762449],[-73.921396,40.7601],[-73.922195,40.760475],[-73.922996,40.760849]]],"type":"Polygon"}
}