{
  "id": "360471004001",
  "type": "Feature",
  "properties": {
    "area_land":132054,
    "area_water":0,
    "geoid":"360471004001",
    "name":"Block Group 1",
    "state":"ny"
},
  "bbox": [
    -73.907351,
    40.628599,
    -73.900513,
    40.632952
],
  "geometry": {"coordinates":[[[-73.90735100000001,40.630831],[-73.907032,40.631093],[-73.90631999999999,40.63155],[-73.905602,40.632012],[-73.90489100000001,40.632473],[-73.904149,40.632952],[-73.90233000000001,40.63132],[-73.900513,40.629688],[-73.90125500000001,40.629206],[-73.901965,40.628745],[-73.902388,40.628599],[-73.903222,40.62897],[-73.904038,40.629337],[-73.904481,40.629539],[-73.904854,40.629709],[-73.90571,40.630091],[-73.90652,40.630458],[-73.907026,40.630684],[-73.907188,40.630758],[-73.90735100000001,40.630831]]],"type":"Polygon"}
}