{
  "id": "360050096002",
  "type": "Feature",
  "properties": {
    "area_land":529145,
    "area_water":15353,
    "geoid":"360050096002",
    "name":"Block Group 2",
    "state":"ny"
},
  "bbox": [
    -73.849559,
    40.828447,
    -73.839323,
    40.840882
],
  "geometry": {"coordinates":[[[-73.84870100000001,40.835103],[-73.848063,40.835636],[-73.84731600000001,40.836264],[-73.846678,40.836794],[-73.846251,40.837146],[-73.84580800000001,40.837513],[-73.845558,40.837719],[-73.84458100000001,40.838536],[-73.843918,40.839087],[-73.843611,40.839348],[-73.84331,40.839603],[-73.843062,40.839797],[-73.842613,40.840167],[-73.842401,40.840349],[-73.84204099999999,40.840646],[-73.841865,40.840614],[-73.841695,40.840598],[-73.84151300000001,40.840596],[-73.84132,40.840611],[-73.841247,40.840621],[-73.84045999999999,40.840729],[-73.839855,40.840849],[-73.83958199999999,40.840882],[-73.839364,40.840878],[-73.839567,40.840547],[-73.83960399999999,40.838275],[-73.83932299999999,40.835768],[-73.839332,40.833554],[-73.842279,40.831267],[-73.841915,40.83081],[-73.842028,40.830508],[-73.842189,40.83031],[-73.842331,40.829941],[-73.84236799999999,40.829431],[-73.842311,40.829079],[-73.842314,40.828923],[-73.842308,40.828799],[-73.84234600000001,40.828795],[-73.842387,40.82879],[-73.842839,40.828722],[-73.842812,40.828637],[-73.842915,40.828622],[-73.843142,40.828579],[-73.843917,40.828447],[-73.843932,40.828512],[-73.843986,40.828742],[-73.84401200000001,40.828853],[-73.84408000000001,40.829159],[-73.844247,40.829874],[-73.844415,40.830599],[-73.844577,40.831302],[-73.844753,40.832035],[-73.84491800000001,40.832754],[-73.84508599999999,40.833475],[-73.84524999999999,40.834189],[-73.845427,40.834937],[-73.84848599999999,40.834525],[-73.849559,40.834409],[-73.84870100000001,40.835103]]],"type":"Polygon"}
}