{
  "id": "360290038001",
  "type": "Feature",
  "properties": {
    "area_land":226878,
    "area_water":0,
    "geoid":"360290038001",
    "name":"Block Group 1",
    "state":"ny"
},
  "bbox": [
    -78.805904,
    42.919003,
    -78.799147,
    42.922788
],
  "geometry": {"coordinates":[[[-78.80589999999999,42.920267],[-78.80588299999999,42.922729],[-78.805756,42.92273],[-78.804936,42.922737],[-78.804598,42.92274],[-78.803378,42.922747],[-78.802212,42.922756],[-78.802173,42.922756],[-78.80119000000001,42.922763],[-78.80101000000001,42.922764],[-78.800161,42.922769],[-78.799857,42.922772],[-78.799147,42.922788],[-78.79915800000001,42.922336],[-78.799165,42.922111],[-78.79916299999999,42.921677],[-78.799147,42.919003],[-78.79962999999999,42.919007],[-78.80015899999999,42.919012],[-78.801191,42.919025],[-78.80223100000001,42.91904],[-78.80339600000001,42.91905],[-78.80397000000001,42.919066],[-78.80493,42.91907],[-78.80497099999999,42.91907],[-78.805904,42.91908],[-78.80589999999999,42.920267]]],"type":"Polygon"}
}