{
  "id": "360775909001",
  "type": "Feature",
  "properties": {
    "area_land":1009448,
    "area_water":0,
    "geoid":"360775909001",
    "name":"Block Group 1",
    "state":"ny"
},
  "bbox": [
    -75.056644,
    42.456875,
    -75.038235,
    42.472899
],
  "geometry": {"coordinates":[[[-75.05664400000001,42.459321],[-75.056493,42.45955],[-75.056296,42.459804],[-75.056133,42.459984],[-75.055975,42.460345],[-75.05589999999999,42.460609],[-75.05582099999999,42.460807],[-75.055758,42.46094],[-75.055514,42.461282],[-75.055375,42.461464],[-75.05522999999999,42.461728],[-75.054999,42.462365],[-75.05493199999999,42.462521],[-75.05485,42.462659],[-75.05478100000001,42.462939],[-75.054759,42.463161],[-75.054749,42.46342],[-75.054689,42.463714],[-75.05461,42.463963],[-75.054553,42.464232],[-75.054514,42.464409],[-75.05447700000001,42.464532],[-75.054412,42.464685],[-75.054361,42.464999],[-75.054368,42.465454],[-75.054328,42.465622],[-75.054186,42.466095],[-75.05418899999999,42.466157],[-75.05421800000001,42.466256],[-75.054339,42.466558],[-75.054346,42.466711],[-75.05433499999999,42.466827],[-75.054025,42.467549],[-75.054017,42.46756],[-75.053887,42.467742],[-75.053681,42.467936],[-75.05352499999999,42.468082],[-75.053364,42.468168],[-75.053122,42.468179],[-75.053011,42.468207],[-75.05299100000001,42.468265],[-75.053,42.46835],[-75.05303499999999,42.468466],[-75.05314,42.468654],[-75.053282,42.468804],[-75.053443,42.468965],[-75.053481,42.469022],[-75.053622,42.469234],[-75.053821,42.469582],[-75.053836,42.469647],[-75.053821,42.46972],[-75.053781,42.469789],[-75.05368199999999,42.469884],[-75.053456,42.470048],[-75.05320500000001,42.470314],[-75.05316500000001,42.470376],[-75.05315400000001,42.47046],[-75.05316500000001,42.470521],[-75.053209,42.470598],[-75.05332900000001,42.470729],[-75.053358,42.470802],[-75.053358,42.470948],[-75.053347,42.471013],[-75.05329999999999,42.471082],[-75.053219,42.471141],[-75.05318699999999,42.471184],[-75.05315,42.471308],[-75.05306299999999,42.471713],[-75.05303000000001,42.471764],[-75.052972,42.471797],[-75.052891,42.471822],[-75.05268,42.471848],[-75.05259599999999,42.471873],[-75.052494,42.471946],[-75.05242800000001,42.472022],[-75.052368,42.472148],[-75.052325,42.472205],[-75.05226999999999,42.472258],[-75.05213999999999,42.472329],[-75.052089,42.472382],[-75.052043,42.472454],[-75.052004,42.472551],[-75.05154899999999,42.472636],[-75.050862,42.472775],[-75.050579,42.472847],[-75.050346,42.472899],[-75.048756,42.460417],[-75.048743,42.460318],[-75.04861,42.460327],[-75.04861699999999,42.460389],[-75.040711,42.460923],[-75.039968,42.460972],[-75.038933,42.461042],[-75.038859,42.461043],[-75.038235,42.456914],[-75.038371,42.456908],[-75.038512,42.456903],[-75.038878,42.456903],[-75.04016900000001,42.456885],[-75.040852,42.45688],[-75.041434,42.456875],[-75.04180100000001,42.456877],[-75.042237,42.45688],[-75.04274700000001,42.456885],[-75.042996,42.456891],[-75.043885,42.456922],[-75.045295,42.456978],[-75.045874,42.457009],[-75.046104,42.457031],[-75.046324,42.457065],[-75.046618,42.457109],[-75.046834,42.457158],[-75.04705,42.457216],[-75.04723199999999,42.457285],[-75.04741,42.457358],[-75.048367,42.457785],[-75.05033299999999,42.458462],[-75.050414,42.458484],[-75.050573,42.458517],[-75.05078,42.458547],[-75.05098099999999,42.458565],[-75.051301,42.458573],[-75.05161699999999,42.458573],[-75.051773,42.458561],[-75.051905,42.458543],[-75.052206,42.458497],[-75.052796,42.458384],[-75.053331,42.458269],[-75.053754,42.458163],[-75.05416,42.458057],[-75.05451600000001,42.457963],[-75.05502799999999,42.457816],[-75.055442,42.457714],[-75.055984,42.457567],[-75.056538,42.458753],[-75.056594,42.458911],[-75.05663199999999,42.459102],[-75.05664400000001,42.459321]]],"type":"Polygon"}
}