{
  "id": "360050211003",
  "type": "Feature",
  "properties": {
    "area_land":42251,
    "area_water":0,
    "geoid":"360050211003",
    "name":"Block Group 3",
    "state":"ny"
},
  "bbox": [
    -73.926191,
    40.838202,
    -73.922559,
    40.840176
],
  "geometry": {"coordinates":[[[-73.92578,40.839233],[-73.925268,40.840176],[-73.92478199999999,40.840104],[-73.924466,40.840042],[-73.924182,40.839954],[-73.92391000000001,40.839831],[-73.92255900000001,40.839271],[-73.922977,40.838685],[-73.923185,40.838488],[-73.92370699999999,40.838202],[-73.924924,40.83835],[-73.926191,40.838512],[-73.92578,40.839233]]],"type":"Polygon"}
}