{
  "id": "360050267026",
  "type": "Feature",
  "properties": {
    "area_land":28214,
    "area_water":0,
    "geoid":"360050267026",
    "name":"Block Group 6",
    "state":"ny"
},
  "bbox": [
    -73.900606,
    40.870041,
    -73.897714,
    40.872136
],
  "geometry": {"coordinates":[[[-73.90003900000001,40.872136],[-73.899086,40.871969],[-73.8978,40.871682],[-73.89771399999999,40.871341],[-73.89772000000001,40.871118],[-73.89779,40.870857],[-73.898284,40.871054],[-73.899303,40.871244],[-73.899686,40.870041],[-73.900606,40.870233],[-73.90003900000001,40.872136]]],"type":"Polygon"}
}