{
  "id": "360290051001",
  "type": "Feature",
  "properties": {
    "area_land":553550,
    "area_water":0,
    "geoid":"360290051001",
    "name":"Block Group 1",
    "state":"ny"
},
  "bbox": [
    -78.858903,
    42.954437,
    -78.843807,
    42.958653
],
  "geometry": {"coordinates":[[[-78.858903,42.95464],[-78.85890000000001,42.954991],[-78.858898,42.955386],[-78.858897,42.955572],[-78.85890000000001,42.955756],[-78.858891,42.956171],[-78.858875,42.957031],[-78.858874,42.957876],[-78.858643,42.958653],[-78.855942,42.958644],[-78.85579199999999,42.958643],[-78.855006,42.958641],[-78.854291,42.958638],[-78.854067,42.958638],[-78.85359800000001,42.958633],[-78.85325899999999,42.958628],[-78.853132,42.958626],[-78.852197,42.958613],[-78.852024,42.958611],[-78.85126,42.958599],[-78.85090700000001,42.958593],[-78.850328,42.958584],[-78.84978700000001,42.958575],[-78.848615,42.958556],[-78.84795,42.958547],[-78.847458,42.958539],[-78.846943,42.958531],[-78.84611700000001,42.958519],[-78.845964,42.958517],[-78.845005,42.958503],[-78.84497500000001,42.958503],[-78.843807,42.958488],[-78.843846,42.955965],[-78.843846,42.955934],[-78.843853,42.955503],[-78.843862,42.955043],[-78.843873,42.954437],[-78.845074,42.954452],[-78.846177,42.954463],[-78.84728200000001,42.954474],[-78.848373,42.954486],[-78.84943,42.954496],[-78.84947699999999,42.954497],[-78.851299,42.95452],[-78.853077,42.954561],[-78.85435,42.954569],[-78.855757,42.954579],[-78.85731199999999,42.954592],[-78.858152,42.954597],[-78.858901,42.954597],[-78.858903,42.95464]]],"type":"Polygon"}
}