{
  "id": "360593013001",
  "type": "Feature",
  "properties": {
    "area_land":557468,
    "area_water":0,
    "geoid":"360593013001",
    "name":"Block Group 1",
    "state":"ny"
},
  "bbox": [
    -73.697807,
    40.836548,
    -73.687615,
    40.846305
],
  "geometry": {"coordinates":[[[-73.697698,40.837076],[-73.697378,40.837646],[-73.697301,40.837843],[-73.697271,40.837986],[-73.697256,40.838206],[-73.69727,40.838337],[-73.697362,40.838678],[-73.697484,40.838979],[-73.697424,40.839142],[-73.69728499999999,40.839308],[-73.696789,40.839972],[-73.696389,40.840487],[-73.695633,40.841363],[-73.69551300000001,40.841486],[-73.695412,40.841541],[-73.69542,40.842203],[-73.69543,40.842312],[-73.695448,40.842405],[-73.695483,40.842576],[-73.695564,40.843114],[-73.695663,40.843477],[-73.695739,40.843632],[-73.69576000000001,40.843697],[-73.69587799999999,40.843916],[-73.696,40.844099],[-73.695877,40.844169],[-73.695739,40.84427],[-73.695594,40.844347],[-73.694508,40.84475],[-73.694757,40.845575],[-73.69437600000001,40.845648],[-73.6939,40.845728],[-73.690487,40.846305],[-73.690386,40.845467],[-73.690279,40.844565],[-73.690139,40.843343],[-73.690113,40.843164],[-73.690068,40.842858],[-73.689787,40.841471],[-73.689717,40.841205],[-73.689639,40.840985],[-73.689521,40.840724],[-73.68942,40.840545],[-73.689277,40.840312],[-73.689072,40.840042],[-73.68876299999999,40.839695],[-73.687882,40.838782],[-73.68771700000001,40.838586],[-73.68761499999999,40.838444],[-73.68814,40.838268],[-73.688597,40.838172],[-73.689335,40.837998],[-73.689494,40.837949],[-73.68982200000001,40.837826],[-73.69032199999999,40.837629],[-73.690595,40.837513],[-73.691073,40.837248],[-73.69123999999999,40.837167],[-73.69149,40.837046],[-73.691653,40.83698],[-73.692289,40.836779],[-73.69256900000001,40.836707],[-73.692876,40.836646],[-73.69329500000001,40.836622],[-73.69403200000001,40.836548],[-73.69433100000001,40.836554],[-73.69482000000001,40.836572],[-73.695063,40.836595],[-73.695795,40.836659],[-73.696388,40.836674],[-73.696663,40.836694],[-73.697486,40.836806],[-73.697807,40.836841],[-73.697698,40.837076]]],"type":"Polygon"}
}