{
  "id": "360470300001",
  "type": "Feature",
  "properties": {
    "area_land":76478,
    "area_water":0,
    "geoid":"360470300001",
    "name":"Block Group 1",
    "state":"ny"
},
  "bbox": [
    -73.993363,
    40.597104,
    -73.988658,
    40.600581
],
  "geometry": {"coordinates":[[[-73.993363,40.598889],[-73.99159899999999,40.600581],[-73.990864,40.600134],[-73.99015,40.599705],[-73.989395,40.599255],[-73.988658,40.5988],[-73.990421,40.597104],[-73.991163,40.597554],[-73.991906,40.598004],[-73.99262,40.598435],[-73.993363,40.598889]]],"type":"Polygon"}
}