{
  "id": "360470736002",
  "type": "Feature",
  "properties": {
    "area_land":52202,
    "area_water":0,
    "geoid":"360470736002",
    "name":"Block Group 2",
    "state":"ny"
},
  "bbox": [
    -73.936637,
    40.621216,
    -73.9331,
    40.624432
],
  "geometry": {"coordinates":[[[-73.936637,40.622401],[-73.93610200000001,40.622717],[-73.935963,40.622839],[-73.935875,40.623014],[-73.93561099999999,40.623571],[-73.935464,40.623874],[-73.93486,40.624432],[-73.933522,40.623183],[-73.933122,40.622822],[-73.9331,40.622694],[-73.93376000000001,40.622275],[-73.93400699999999,40.622114],[-73.93454300000001,40.621758],[-73.93537999999999,40.621216],[-73.936128,40.621922],[-73.936637,40.622401]]],"type":"Polygon"}
}