{
  "id": "360610025000",
  "type": "Feature",
  "properties": {
    "area_land":0,
    "area_water":94115,
    "geoid":"360610025000",
    "name":"Block Group 0",
    "state":"ny"
},
  "bbox": [
    -73.999177,
    40.704318,
    -73.993693,
    40.708895
],
  "geometry": {"coordinates":[[[-73.99818399999999,40.708483],[-73.997643,40.708641],[-73.996005,40.708895],[-73.993866,40.70468],[-73.99369299999999,40.704476],[-73.993775,40.704449],[-73.993807,40.70454],[-73.993861,40.704556],[-73.99434100000001,40.704429],[-73.99449799999999,40.704318],[-73.99457,40.704376],[-73.999177,40.708022],[-73.99818399999999,40.708483]]],"type":"Polygon"}
}