{
  "id": "360470202001",
  "type": "Feature",
  "properties": {
    "area_land":58007,
    "area_water":0,
    "geoid":"360470202001",
    "name":"Block Group 1",
    "state":"ny"
},
  "bbox": [
    -74.011832,
    40.621634,
    -74.007839,
    40.624686
],
  "geometry": {"coordinates":[[[-74.011206,40.623566],[-74.01062400000001,40.624126],[-74.010042,40.624686],[-74.007839,40.623355],[-74.008422,40.622796],[-74.009002,40.622235],[-74.00963,40.621634],[-74.011832,40.622965],[-74.011206,40.623566]]],"type":"Polygon"}
}