{
  "id": "360910614011",
  "type": "Feature",
  "properties": {
    "area_land":38824473,
    "area_water":27971,
    "geoid":"360910614011",
    "name":"Block Group 1",
    "state":"ny"
},
  "bbox": [
    -73.964797,
    43.020541,
    -73.846574,
    43.089075
],
  "geometry": {"coordinates":[[[-73.964797,43.079126],[-73.96063100000001,43.079386],[-73.95983,43.079438],[-73.949696,43.080409],[-73.94487700000001,43.08084],[-73.943921,43.080926],[-73.93831900000001,43.081374],[-73.937974,43.081439],[-73.937203,43.081517],[-73.93673,43.081565],[-73.936041,43.081603],[-73.935446,43.081634],[-73.934039,43.081754],[-73.930036,43.082174],[-73.929007,43.082246],[-73.92796800000001,43.082304],[-73.926844,43.082383],[-73.926665,43.082414],[-73.923703,43.082571],[-73.922766,43.082616],[-73.913746,43.083497],[-73.897642,43.084818],[-73.897216,43.084842],[-73.889225,43.085529],[-73.88588,43.085825],[-73.87917899999999,43.086428],[-73.874769,43.087015],[-73.87393299999999,43.087127],[-73.87329200000001,43.087193],[-73.872945,43.087212],[-73.872773,43.087182],[-73.87238000000001,43.087174],[-73.871364,43.087202],[-73.869265,43.087353],[-73.867119,43.087492],[-73.866062,43.087589],[-73.86582900000001,43.08763],[-73.86211299999999,43.08783],[-73.860732,43.087942],[-73.852051,43.088796],[-73.84881300000001,43.089075],[-73.848215,43.086227],[-73.847865,43.083969],[-73.847498,43.081747],[-73.847211,43.07981],[-73.846976,43.07822],[-73.846627,43.076044],[-73.846574,43.075499],[-73.84698400000001,43.075499],[-73.847027,43.075499],[-73.847284,43.075499],[-73.847517,43.075499],[-73.847803,43.075493],[-73.84944900000001,43.075452],[-73.851007,43.075433],[-73.851519,43.075436],[-73.853026,43.075396],[-73.855306,43.075373],[-73.855952,43.075333],[-73.85758300000001,43.075268],[-73.85926000000001,43.075171],[-73.861425,43.07502],[-73.862419,43.074933],[-73.86450000000001,43.074776],[-73.86594100000001,43.07464],[-73.866381,43.074596],[-73.86662800000001,43.074552],[-73.867131,43.074422],[-73.86751599999999,43.074308],[-73.8681,43.074106],[-73.870053,43.073387],[-73.870526,43.073237],[-73.870822,43.073162],[-73.871171,43.073099],[-73.871622,43.07304],[-73.872822,43.072944],[-73.874606,43.072832],[-73.875581,43.072731],[-73.875918,43.072669],[-73.876122,43.072619],[-73.876678,43.072383],[-73.877426,43.07191],[-73.877888,43.071597],[-73.878759,43.071001],[-73.879148,43.070746],[-73.87965699999999,43.070451],[-73.87990600000001,43.070337],[-73.880476,43.070119],[-73.88105899999999,43.069969],[-73.88256199999999,43.069726],[-73.883931,43.069528],[-73.885004,43.069432],[-73.887642,43.069236],[-73.889064,43.069103],[-73.890652,43.068898],[-73.89094299999999,43.068877],[-73.890861,43.068737],[-73.890777,43.068551],[-73.890472,43.06765],[-73.89028,43.067013],[-73.890221,43.066675],[-73.890215,43.066078],[-73.89022799999999,43.065908],[-73.890241,43.065745],[-73.890438,43.064668],[-73.890733,43.063134],[-73.89079599999999,43.062656],[-73.890883,43.061774],[-73.89095500000001,43.060538],[-73.89103799999999,43.059132],[-73.891189,43.057504],[-73.891344,43.056558],[-73.89140399999999,43.05629],[-73.891451,43.056003],[-73.891485,43.055618],[-73.891481,43.0554],[-73.89146100000001,43.055201],[-73.891322,43.054378],[-73.891115,43.053421],[-73.89085,43.052365],[-73.89047100000001,43.050907],[-73.890298,43.050425],[-73.889985,43.049392],[-73.88961999999999,43.048016],[-73.889432,43.047405],[-73.889231,43.046706],[-73.889005,43.0458],[-73.888944,43.04517],[-73.88892,43.044073],[-73.88893299999999,43.043969],[-73.88897299999999,43.043622],[-73.889034,43.04333],[-73.889093,43.043047],[-73.889194,43.042686],[-73.889222,43.042558],[-73.88951400000001,43.041243],[-73.889532,43.041067],[-73.88953100000001,43.040966],[-73.890916,43.040844],[-73.891533,43.0408],[-73.89255199999999,43.040696],[-73.89351000000001,43.040626],[-73.89491599999999,43.0405],[-73.895629,43.040456],[-73.899812,43.040072],[-73.901669,43.039911],[-73.901742,43.039867],[-73.901864,43.039728],[-73.903251,43.038318],[-73.903305,43.038234],[-73.903356,43.038129],[-73.90339,43.038018],[-73.903398,43.037987],[-73.903431,43.037943],[-73.90351099999999,43.037853],[-73.90370299999999,43.037725],[-73.903903,43.03762],[-73.90412000000001,43.037537],[-73.905055,43.037055],[-73.90619599999999,43.036392],[-73.906459,43.03622],[-73.906893,43.035899],[-73.906992,43.03584],[-73.907042,43.035819],[-73.907134,43.035778],[-73.907275,43.03575],[-73.907432,43.035736],[-73.907821,43.03568],[-73.90818400000001,43.035657],[-73.909133,43.035619],[-73.909665,43.035616],[-73.910235,43.035624],[-73.910735,43.035616],[-73.91234300000001,43.035522],[-73.91323800000001,43.035436],[-73.91479200000001,43.035294],[-73.91518499999999,43.035231],[-73.916141,43.034976],[-73.916253,43.034948],[-73.916459,43.034889],[-73.916828,43.034756],[-73.917399,43.034518],[-73.917553,43.034486],[-73.91785900000001,43.034439],[-73.918164,43.034414],[-73.918976,43.034361],[-73.91988499999999,43.034268],[-73.920638,43.034161],[-73.92109499999999,43.034059],[-73.921283,43.033995],[-73.921561,43.033878],[-73.92178699999999,43.033741],[-73.922439,43.033305],[-73.922994,43.032909],[-73.923451,43.032605],[-73.923773,43.03242],[-73.924396,43.032218],[-73.92495,43.032041],[-73.92531099999999,43.03195],[-73.925843,43.031848],[-73.926626,43.031732],[-73.927167,43.031651],[-73.927581,43.031591],[-73.927521,43.030982],[-73.927509,43.030755],[-73.927503,43.030484],[-73.927547,43.030257],[-73.927685,43.029923],[-73.927746,43.029743],[-73.92776600000001,43.029641],[-73.92775,43.029506],[-73.927677,43.029375],[-73.92715800000001,43.028646],[-73.927126,43.028531],[-73.927052,43.028161],[-73.92718600000001,43.027945],[-73.92747300000001,43.027555],[-73.92763100000001,43.02741],[-73.927792,43.027301],[-73.927908,43.027218],[-73.927993,43.027165],[-73.92837,43.026933],[-73.928521,43.026839],[-73.928787,43.026683],[-73.929312,43.026373],[-73.93064699999999,43.025589],[-73.933767,43.023824],[-73.93478899999999,43.023235],[-73.936266,43.022424],[-73.937099,43.021956],[-73.93741799999999,43.02179],[-73.93762,43.021705],[-73.938104,43.021492],[-73.938962,43.021166],[-73.939532,43.021079],[-73.941384,43.02089],[-73.942342,43.020781],[-73.94487599999999,43.020541],[-73.945403,43.020545],[-73.946693,43.020639],[-73.94739300000001,43.020699],[-73.950478,43.020823],[-73.95088199999999,43.020832],[-73.951876,43.020875],[-73.95215,43.020878],[-73.952406,43.020888],[-73.953084,43.020913],[-73.95390999999999,43.020958],[-73.95444000000001,43.02097],[-73.954643,43.020974],[-73.955387,43.020965],[-73.95556500000001,43.020956],[-73.95581,43.02273],[-73.95583600000001,43.022915],[-73.955939,43.023542],[-73.95779,43.035167],[-73.958603,43.040275],[-73.959248,43.044757],[-73.961046,43.054251],[-73.961955,43.060337],[-73.96302,43.06684],[-73.963196,43.067931],[-73.963869,43.072817],[-73.96424500000001,43.074942],[-73.964304,43.075725],[-73.964797,43.079126]]],"type":"Polygon"}
}