{
  "id": "361031583101",
  "type": "Feature",
  "properties": {
    "area_land":1716728,
    "area_water":17016,
    "geoid":"361031583101",
    "name":"Block Group 1",
    "state":"ny"
},
  "bbox": [
    -72.977042,
    40.87619,
    -72.963378,
    40.89809
],
  "geometry": {"coordinates":[[[-72.977042,40.8941],[-72.976995,40.894344],[-72.976906,40.894458],[-72.976821,40.894546],[-72.976707,40.894652],[-72.97655399999999,40.894821],[-72.976394,40.895229],[-72.97631800000001,40.895439],[-72.976218,40.895588],[-72.97606500000001,40.895884],[-72.975852,40.896133],[-72.975753,40.89629],[-72.975494,40.896557],[-72.975318,40.89682],[-72.97512,40.896868],[-72.97502799999999,40.896885],[-72.974701,40.89693],[-72.974537,40.896949],[-72.97423499999999,40.896984],[-72.97385300000001,40.897034],[-72.973761,40.897133],[-72.97354799999999,40.897293],[-72.973144,40.897644],[-72.97296900000001,40.897766],[-72.97286200000001,40.897849],[-72.972686,40.89796],[-72.972549,40.89809],[-72.97235000000001,40.898052],[-72.972205,40.898014],[-72.97209100000001,40.897995],[-72.971969,40.897964],[-72.97187700000001,40.897934],[-72.971801,40.897902],[-72.97157900000001,40.897823],[-72.971412,40.897761],[-72.97129,40.89772],[-72.970878,40.897559],[-72.970733,40.897514],[-72.970206,40.897316],[-72.970001,40.897228],[-72.969832,40.897098],[-72.969695,40.896976],[-72.969634,40.896713],[-72.96955699999999,40.896453],[-72.969497,40.896217],[-72.969329,40.896236],[-72.96897,40.89629],[-72.96887,40.89595],[-72.968818,40.895634],[-72.968695,40.895191],[-72.968643,40.894958],[-72.968603,40.894821],[-72.96833599999999,40.89352],[-72.96823000000001,40.893103],[-72.96816200000001,40.892811],[-72.96803199999999,40.892181],[-72.968009,40.892086],[-72.967979,40.892013],[-72.96792499999999,40.8918],[-72.967856,40.891394],[-72.96781799999999,40.891227],[-72.967764,40.890854],[-72.967735,40.890522],[-72.96768899999999,40.89027],[-72.967688,40.890166],[-72.967651,40.889995],[-72.967613,40.889683],[-72.967536,40.889693],[-72.967445,40.889709],[-72.96735200000001,40.889721],[-72.967162,40.889636],[-72.967102,40.889614],[-72.96704,40.889586],[-72.966956,40.889522],[-72.966866,40.889441],[-72.966797,40.889396],[-72.96646800000001,40.889118],[-72.966353,40.889029],[-72.966323,40.88882],[-72.966292,40.888709],[-72.96631600000001,40.888629],[-72.96631499999999,40.888534],[-72.966346,40.888336],[-72.96636100000001,40.888186],[-72.96636700000001,40.888058],[-72.96638400000001,40.887962],[-72.966345,40.887844],[-72.966285,40.887722],[-72.966261,40.887661],[-72.966216,40.88758],[-72.965964,40.887424],[-72.965872,40.887375],[-72.965789,40.88734],[-72.96565200000001,40.887294],[-72.965446,40.887195],[-72.96530799999999,40.887114],[-72.96527,40.886982],[-72.965232,40.886711],[-72.965186,40.8866],[-72.965171,40.886439],[-72.96509500000001,40.886153],[-72.965047,40.885956],[-72.96502700000001,40.885814],[-72.96495,40.88549],[-72.964935,40.885361],[-72.964865,40.885096],[-72.964843,40.884994],[-72.964828,40.884917],[-72.96475100000001,40.884617],[-72.964232,40.881907],[-72.96337800000001,40.878227],[-72.965227,40.87814],[-72.965362,40.878125],[-72.965806,40.878062],[-72.96633199999999,40.877955],[-72.966396,40.877913],[-72.96708599999999,40.877785],[-72.967322,40.877726],[-72.967552,40.877682],[-72.96892800000001,40.877359],[-72.97,40.877112],[-72.971018,40.876849],[-72.971204,40.876808],[-72.97139199999999,40.876751],[-72.971796,40.876635],[-72.97214200000001,40.876517],[-72.97233,40.876461],[-72.972562,40.876391],[-72.97284399999999,40.876299],[-72.973021,40.876237],[-72.973179,40.87619],[-72.97325600000001,40.876288],[-72.973377,40.876879],[-72.973556,40.877551],[-72.973624,40.877868],[-72.97364,40.877998],[-72.973677,40.878138],[-72.973732,40.878405],[-72.97378500000001,40.878737],[-72.973831,40.878921],[-72.97389099999999,40.879291],[-72.97393099999999,40.879494],[-72.974075,40.880253],[-72.97422,40.880919],[-72.97427399999999,40.881199],[-72.974571,40.882526],[-72.974681,40.883032],[-72.975066,40.884781],[-72.975199,40.885514],[-72.975275,40.885948],[-72.97544000000001,40.886867],[-72.97579899999999,40.888312],[-72.976074,40.889404],[-72.97627900000001,40.890419],[-72.97638600000001,40.890877],[-72.976662,40.892177],[-72.97669,40.892321],[-72.97674499999999,40.892592],[-72.976859,40.893103],[-72.97689,40.893265],[-72.97692000000001,40.893393],[-72.97698200000001,40.893608],[-72.977012,40.893756],[-72.977042,40.893989],[-72.977042,40.8941]]],"type":"Polygon"}
}