{
  "id": "360510306002",
  "type": "Feature",
  "properties": {
    "area_land":8365506,
    "area_water":0,
    "geoid":"360510306002",
    "name":"Block Group 2",
    "state":"ny"
},
  "bbox": [
    -77.624548,
    42.876563,
    -77.599025,
    42.934566
],
  "geometry": {"coordinates":[[[-77.624517,42.877941],[-77.624517,42.878111],[-77.624517,42.879833],[-77.62445099999999,42.882509],[-77.624444,42.882833],[-77.62442799999999,42.883976],[-77.624425,42.884134],[-77.624424,42.88425],[-77.62441699999999,42.884608],[-77.624414,42.884767],[-77.62441,42.88482],[-77.624399,42.884981],[-77.624396,42.885035],[-77.62437199999999,42.885228],[-77.624334,42.885554],[-77.62429,42.885805],[-77.624279,42.885874],[-77.624242,42.885993],[-77.62391,42.887091],[-77.623824,42.887378],[-77.62380899999999,42.887501],[-77.623805,42.887689],[-77.623828,42.88822],[-77.62391700000001,42.889322],[-77.624003,42.890513],[-77.62408600000001,42.891658],[-77.62299899999999,42.891681],[-77.62281,42.891704],[-77.622731,42.891729],[-77.622697,42.891741],[-77.62259299999999,42.891812],[-77.622541,42.891858],[-77.62221,42.892283],[-77.62176700000001,42.892906],[-77.62140100000001,42.89339],[-77.62106199999999,42.89388],[-77.620997,42.894027],[-77.620957,42.894192],[-77.62094500000001,42.894445],[-77.620959,42.895205],[-77.620963,42.895359],[-77.620983,42.896566],[-77.620988,42.896917],[-77.62098899999999,42.896976],[-77.620993,42.897207],[-77.62101,42.897926],[-77.621009,42.898205],[-77.621008,42.898616],[-77.622057,42.89866],[-77.622184,42.898666],[-77.622406,42.898656],[-77.622427,42.902623],[-77.62252599999999,42.902643],[-77.622542,42.902728],[-77.62257099999999,42.902726],[-77.62266,42.902721],[-77.62269000000001,42.90272],[-77.622736,42.902969],[-77.622748,42.903084],[-77.62274600000001,42.903203],[-77.622725,42.90467],[-77.622719,42.905159],[-77.622715,42.905482],[-77.622705,42.906451],[-77.622703,42.906775],[-77.62269499999999,42.907055],[-77.62267300000001,42.907898],[-77.622666,42.908179],[-77.622663,42.90879],[-77.62263299999999,42.909629],[-77.622632,42.909688],[-77.622614,42.910956],[-77.622507,42.914215],[-77.622467,42.915469],[-77.62246500000001,42.915725],[-77.622463,42.916793],[-77.622463,42.917358],[-77.622428,42.91925],[-77.622424,42.919997],[-77.622424,42.920206],[-77.622407,42.921065],[-77.622398,42.92143],[-77.62237399999999,42.922527],[-77.622367,42.922893],[-77.62220499999999,42.922909],[-77.62193499999999,42.92292],[-77.62102,42.92289],[-77.619564,42.922843],[-77.618162,42.922826],[-77.616978,42.922801],[-77.616784,42.922797],[-77.61563099999999,42.922789],[-77.614829,42.922779],[-77.61440899999999,42.922774],[-77.612424,42.922731],[-77.61162299999999,42.922715],[-77.61163500000001,42.923561],[-77.61167399999999,42.9261],[-77.611687,42.926928],[-77.611687,42.926947],[-77.611716,42.928468],[-77.611717,42.928517],[-77.61174,42.93039],[-77.61176,42.930885],[-77.61178099999999,42.933031],[-77.611797,42.934553],[-77.611717,42.934562],[-77.61152800000001,42.934566],[-77.61084700000001,42.934554],[-77.61081299999999,42.934553],[-77.609303,42.934548],[-77.60884900000001,42.934533],[-77.607941,42.93447],[-77.607865,42.934461],[-77.606888,42.934348],[-77.606909,42.934314],[-77.60701,42.934206],[-77.607125,42.934117],[-77.60727300000001,42.934107],[-77.607372,42.934133],[-77.607455,42.934133],[-77.60754,42.93411],[-77.60758300000001,42.93409],[-77.607923,42.933866],[-77.60800500000001,42.933797],[-77.608048,42.933738],[-77.608068,42.933662],[-77.608081,42.933487],[-77.608101,42.933398],[-77.60813400000001,42.933333],[-77.608223,42.933267],[-77.608295,42.933267],[-77.608375,42.933286],[-77.60844400000001,42.933319],[-77.60853299999999,42.933398],[-77.608648,42.933543],[-77.608688,42.933563],[-77.608737,42.933566],[-77.60878,42.933557],[-77.608909,42.933487],[-77.608988,42.933412],[-77.609014,42.933369],[-77.609021,42.933316],[-77.609014,42.93324],[-77.608991,42.933184],[-77.60880299999999,42.933013],[-77.60879,42.93297],[-77.6088,42.932908],[-77.608833,42.932874],[-77.608879,42.932848],[-77.60906,42.932851],[-77.60932099999999,42.932914],[-77.609397,42.932921],[-77.60947299999999,42.932914],[-77.609515,42.932888],[-77.609542,42.932851],[-77.609585,42.932618],[-77.609621,42.932535],[-77.609657,42.932509],[-77.609746,42.932486],[-77.609904,42.93243],[-77.609937,42.932407],[-77.60995699999999,42.932374],[-77.609961,42.932153],[-77.60994100000001,42.932077],[-77.609888,42.931998],[-77.609753,42.931939],[-77.609595,42.931912],[-77.60955199999999,42.931886],[-77.609544,42.931875],[-77.609515,42.931833],[-77.609509,42.931688],[-77.60946300000001,42.931626],[-77.609354,42.931573],[-77.609229,42.931527],[-77.609139,42.931514],[-77.609014,42.931497],[-77.608681,42.931491],[-77.608576,42.931471],[-77.608329,42.931382],[-77.6082,42.931313],[-77.608081,42.931194],[-77.608045,42.931036],[-77.608045,42.93097],[-77.60806100000001,42.930927],[-77.608091,42.930888],[-77.60824599999999,42.930795],[-77.608328,42.930772],[-77.60896200000001,42.930779],[-77.60903399999999,42.930762],[-77.60910699999999,42.930733],[-77.60917600000001,42.930693],[-77.609222,42.93064],[-77.609258,42.930538],[-77.609258,42.930489],[-77.609222,42.930403],[-77.609182,42.930354],[-77.60892200000001,42.930173],[-77.608418,42.930014],[-77.60815700000001,42.929899],[-77.60807800000001,42.929843],[-77.607989,42.929764],[-77.607857,42.929586],[-77.60784,42.92954],[-77.607867,42.929401],[-77.60789699999999,42.929349],[-77.60794300000001,42.929299],[-77.608019,42.929243],[-77.60834199999999,42.929098],[-77.60845399999999,42.929019],[-77.608553,42.928861],[-77.608655,42.928726],[-77.60870799999999,42.928693],[-77.60895499999999,42.928594],[-77.60914,42.928548],[-77.60918599999999,42.928512],[-77.609205,42.928479],[-77.60919199999999,42.9284],[-77.60915900000001,42.928353],[-77.60908999999999,42.928291],[-77.608315,42.927863],[-77.60801499999999,42.927678],[-77.607761,42.927467],[-77.607685,42.927381],[-77.607563,42.92718],[-77.60754,42.927121],[-77.607303,42.926745],[-77.607145,42.926465],[-77.606644,42.925424],[-77.60606,42.924488],[-77.605493,42.923539],[-77.605279,42.923239],[-77.605058,42.922989],[-77.60498200000001,42.922847],[-77.604817,42.922468],[-77.604725,42.922314],[-77.604682,42.922241],[-77.60464899999999,42.922138],[-77.604643,42.92199],[-77.60467199999999,42.921545],[-77.604659,42.921364],[-77.604643,42.921305],[-77.60461599999999,42.921255],[-77.60455,42.921189],[-77.604511,42.921107],[-77.604488,42.920932],[-77.60445799999999,42.920857],[-77.604382,42.920768],[-77.603987,42.920613],[-77.603894,42.920563],[-77.603779,42.920484],[-77.60377099999999,42.920474],[-77.60371600000001,42.920399],[-77.60359099999999,42.920188],[-77.603551,42.920082],[-77.603555,42.919805],[-77.603578,42.919693],[-77.603624,42.919627],[-77.603706,42.919548],[-77.60395,42.919351],[-77.604043,42.919209],[-77.60405299999999,42.919156],[-77.604049,42.919054],[-77.60403599999999,42.918998],[-77.603983,42.918935],[-77.603842,42.918856],[-77.603703,42.918751],[-77.603578,42.918589],[-77.603551,42.918514],[-77.603555,42.918431],[-77.603578,42.918329],[-77.603611,42.918276],[-77.603657,42.918227],[-77.603763,42.918158],[-77.603832,42.918141],[-77.60405900000001,42.918155],[-77.60434600000001,42.918253],[-77.604412,42.918286],[-77.604494,42.918296],[-77.60455399999999,42.918276],[-77.604587,42.918247],[-77.604606,42.918204],[-77.60461599999999,42.918089],[-77.60459299999999,42.917937],[-77.60455,42.917799],[-77.604494,42.917703],[-77.60444200000001,42.917657],[-77.604372,42.917621],[-77.604119,42.917593],[-77.603937,42.9176],[-77.60378300000001,42.91753],[-77.603762,42.917453],[-77.603713,42.917079],[-77.603683,42.917026],[-77.603675,42.917012],[-77.603617,42.916911],[-77.60351,42.916723],[-77.603314,42.91645],[-77.60306300000001,42.916125],[-77.60300599999999,42.916051],[-77.602901,42.915551],[-77.602887,42.915432],[-77.60283099999999,42.915305],[-77.602761,42.915146],[-77.602614,42.915118],[-77.602537,42.915055],[-77.602536,42.914994],[-77.60255100000001,42.914929],[-77.602642,42.914796],[-77.602789,42.914614],[-77.60284,42.914506],[-77.60287099999999,42.914412],[-77.602873,42.914356],[-77.60284900000001,42.914274],[-77.60280299999999,42.914223],[-77.60263500000001,42.914097],[-77.602479,42.913912],[-77.60244,42.913818],[-77.60242100000001,42.913658],[-77.602389,42.913522],[-77.60238200000001,42.913436],[-77.602349,42.913296],[-77.602334,42.913117],[-77.60225800000001,42.912883],[-77.602223,42.912688],[-77.602244,42.912492],[-77.602363,42.912317],[-77.602418,42.912185],[-77.60244,42.912058],[-77.60234199999999,42.911586],[-77.602076,42.911132],[-77.602013,42.910719],[-77.60197100000001,42.910607],[-77.60185799999999,42.910486],[-77.601789,42.910411],[-77.60153,42.910104],[-77.601522,42.910023],[-77.601544,42.909943],[-77.601663,42.909782],[-77.601831,42.909607],[-77.601964,42.909436],[-77.602012,42.90935],[-77.602048,42.909212],[-77.60202099999999,42.909076],[-77.60197100000001,42.90897],[-77.601859,42.908842],[-77.601383,42.908554],[-77.601268,42.908475],[-77.60113800000001,42.908387],[-77.600956,42.908212],[-77.600881,42.908119],[-77.60083899999999,42.90801],[-77.60081599999999,42.907897],[-77.60083,42.907828],[-77.600865,42.907772],[-77.60132900000001,42.907494],[-77.60139599999999,42.907416],[-77.601446,42.9073],[-77.601446,42.907097],[-77.60142500000001,42.906901],[-77.601257,42.906684],[-77.601145,42.906586],[-77.6011,42.906508],[-77.601089,42.906418],[-77.6011,42.906312],[-77.601131,42.906195],[-77.601257,42.906027],[-77.601337,42.905962],[-77.601432,42.905887],[-77.60167,42.905775],[-77.601806,42.9056],[-77.601967,42.90551],[-77.60218999999999,42.905456],[-77.601698,42.905058],[-77.60146,42.904918],[-77.601376,42.904814],[-77.601096,42.904604],[-77.600949,42.904534],[-77.600863,42.904452],[-77.60079500000001,42.904387],[-77.600746,42.904289],[-77.600739,42.904195],[-77.60082300000001,42.904055],[-77.601026,42.903803],[-77.601152,42.903523],[-77.60116600000001,42.903314],[-77.601096,42.903125],[-77.600998,42.90274],[-77.600956,42.90246],[-77.60101899999999,42.902244],[-77.601404,42.90174],[-77.60142500000001,42.901534],[-77.601313,42.901394],[-77.60124999999999,42.901296],[-77.601257,42.90117],[-77.601313,42.900932],[-77.601418,42.900758],[-77.601985,42.900356],[-77.60208,42.900171],[-77.60209,42.900153],[-77.60209,42.899978],[-77.60195,42.899824],[-77.601831,42.899719],[-77.60174000000001,42.899565],[-77.601705,42.899418],[-77.601705,42.899265],[-77.601782,42.89909],[-77.60199900000001,42.898971],[-77.602155,42.898864],[-77.60209500000001,42.898726],[-77.601647,42.898169],[-77.60157700000001,42.89805],[-77.601528,42.897902],[-77.601522,42.897841],[-77.601465,42.89719],[-77.601426,42.897048],[-77.601389,42.896956],[-77.600926,42.896284],[-77.60061,42.896035],[-77.60050200000001,42.895917],[-77.600435,42.895812],[-77.60038,42.895658],[-77.600216,42.894923],[-77.600196,42.894808],[-77.60018599999999,42.89463],[-77.600176,42.894585],[-77.600166,42.894534],[-77.600123,42.894425],[-77.59991599999999,42.894201],[-77.59972399999999,42.894093],[-77.59960599999999,42.893994],[-77.599546,42.893908],[-77.599493,42.893806],[-77.59947,42.89371],[-77.599469,42.893658],[-77.599453,42.893392],[-77.599424,42.893318],[-77.599091,42.89291],[-77.599025,42.892794],[-77.599025,42.892752],[-77.59903,42.892738],[-77.59911099999999,42.892537],[-77.599113,42.892489],[-77.599502,42.89234],[-77.599726,42.892242],[-77.59992699999999,42.892038],[-77.600069,42.891801],[-77.600244,42.891352],[-77.600357,42.891187],[-77.600522,42.891042],[-77.600748,42.890955],[-77.600871,42.89088],[-77.601015,42.890737],[-77.60107499999999,42.890679],[-77.601156,42.890553],[-77.601167,42.890287],[-77.601214,42.890233],[-77.601282,42.890211],[-77.60177,42.890211],[-77.60277000000001,42.890182],[-77.603295,42.890032],[-77.603618,42.889855],[-77.60386200000001,42.889675],[-77.603995,42.889445],[-77.604133,42.889061],[-77.60438000000001,42.888759],[-77.605114,42.888322],[-77.605429,42.888182],[-77.60600599999999,42.887944],[-77.60627599999999,42.887854],[-77.60688500000001,42.887609],[-77.607074,42.887441],[-77.60717200000001,42.887266],[-77.607349,42.886836],[-77.607381,42.886797],[-77.607528,42.886626],[-77.607956,42.886298],[-77.608152,42.886016],[-77.608215,42.885759],[-77.60814499999999,42.885438],[-77.60797700000001,42.885256],[-77.607816,42.885046],[-77.60777899999999,42.884883],[-77.607788,42.884654],[-77.60784200000001,42.884564],[-77.607927,42.884423],[-77.608159,42.884217],[-77.608333,42.884007],[-77.60852800000001,42.88373],[-77.60854999999999,42.8837],[-77.608683,42.88342],[-77.608774,42.882941],[-77.608991,42.882396],[-77.609117,42.882263],[-77.609334,42.882151],[-77.60955800000001,42.88205],[-77.610146,42.881997],[-77.610405,42.881941],[-77.61065000000001,42.881794],[-77.61066599999999,42.881776],[-77.611035,42.881382],[-77.611245,42.881228],[-77.61152,42.881149],[-77.61165800000001,42.880221],[-77.611777,42.879429],[-77.611823,42.879119],[-77.61187700000001,42.878842],[-77.612032,42.878154],[-77.612137,42.877791],[-77.612225,42.877467],[-77.612475,42.876563],[-77.612922,42.876579],[-77.614053,42.876594],[-77.61515900000001,42.876609],[-77.61680699999999,42.876619],[-77.618408,42.876609],[-77.61879,42.876612],[-77.620369,42.876625],[-77.62120400000001,42.876638],[-77.62151900000001,42.876644],[-77.622839,42.876652],[-77.623712,42.876648],[-77.624548,42.876645],[-77.624517,42.877941]]],"type":"Polygon"}
}