{
  "id": "360594146004",
  "type": "Feature",
  "properties": {
    "area_land":197768,
    "area_water":0,
    "geoid":"360594146004",
    "name":"Block Group 4",
    "state":"ny"
},
  "bbox": [
    -73.57011,
    40.677612,
    -73.566593,
    40.684941
],
  "geometry": {"coordinates":[[[-73.570105,40.684418],[-73.570075,40.684662],[-73.57002900000001,40.684815],[-73.569908,40.684804],[-73.569821,40.684807],[-73.56774799999999,40.684941],[-73.56771500000001,40.684343],[-73.567713,40.682974],[-73.567701,40.682326],[-73.566621,40.682331],[-73.566609,40.680341],[-73.56660599999999,40.679811],[-73.56660100000001,40.678944],[-73.566593,40.677612],[-73.56665,40.677622],[-73.567626,40.677782],[-73.568164,40.677876],[-73.569064,40.678026],[-73.569756,40.678142],[-73.56984300000001,40.678148],[-73.569936,40.67817],[-73.56996100000001,40.67828],[-73.56997,40.678508],[-73.569988,40.679642],[-73.570001,40.679953],[-73.570014,40.680322],[-73.570033,40.680575],[-73.57004000000001,40.68108],[-73.570054,40.681102],[-73.570041,40.681135],[-73.570043,40.681818],[-73.570047,40.68225],[-73.570037,40.682321],[-73.570047,40.682507],[-73.57006699999999,40.683194],[-73.570093,40.683883],[-73.57011,40.684221],[-73.570105,40.684418]]],"type":"Polygon"}
}