{
  "id": "360810123011",
  "type": "Feature",
  "properties": {
    "area_land":205686,
    "area_water":0,
    "geoid":"360810123011",
    "name":"Block Group 1",
    "state":"ny"
},
  "bbox": [
    -73.905955,
    40.774169,
    -73.89637,
    40.780728
],
  "geometry": {"coordinates":[[[-73.90595500000001,40.776188],[-73.905017,40.776955],[-73.90379299999999,40.777957],[-73.903436,40.777705],[-73.903093,40.777462],[-73.90087200000001,40.77928],[-73.900167,40.778779],[-73.89779,40.780728],[-73.897114,40.780181],[-73.89637,40.779668],[-73.89870500000001,40.777758],[-73.90093299999999,40.775938],[-73.90233000000001,40.774797],[-73.90309600000001,40.774169],[-73.903824,40.774684],[-73.90455300000001,40.775196],[-73.905253,40.775692],[-73.90595500000001,40.776188]]],"type":"Polygon"}
}