{
  "id": "360470810001",
  "type": "Feature",
  "properties": {
    "area_land":53237,
    "area_water":0,
    "geoid":"360470810001",
    "name":"Block Group 1",
    "state":"ny"
},
  "bbox": [
    -73.947676,
    40.659586,
    -73.939734,
    40.660785
],
  "geometry": {"coordinates":[[[-73.947676,40.660297],[-73.947256,40.660328],[-73.946645,40.660362],[-73.946088,40.660396],[-73.945413,40.660437],[-73.94525400000001,40.660446],[-73.942611,40.66061],[-73.939813,40.660785],[-73.939734,40.660074],[-73.94255,40.659892],[-73.945336,40.659718],[-73.94760100000001,40.659586],[-73.947653,40.660083],[-73.947676,40.660297]]],"type":"Polygon"}
}