{
  "id": "360810058003",
  "type": "Feature",
  "properties": {
    "area_land":172689,
    "area_water":0,
    "geoid":"360810058003",
    "name":"Block Group 3",
    "state":"ny"
},
  "bbox": [
    -73.852838,
    40.67063,
    -73.845739,
    40.675984
],
  "geometry": {"coordinates":[[[-73.851851,40.672492],[-73.852253,40.674027],[-73.85248199999999,40.675287],[-73.85246600000001,40.675584],[-73.85158800000001,40.675715],[-73.85064800000001,40.675851],[-73.84973599999999,40.675984],[-73.849413,40.674469],[-73.848388,40.67411],[-73.84779399999999,40.673879],[-73.846391,40.673322],[-73.84573899999999,40.673075],[-73.846165,40.672457],[-73.847714,40.673065],[-73.847926,40.673065],[-73.847994,40.672372],[-73.847962,40.67222],[-73.847821,40.671557],[-73.846999,40.671239],[-73.847414,40.67063],[-73.84787,40.67078],[-73.848478,40.670917],[-73.850965,40.67172],[-73.851635,40.67193],[-73.85283800000001,40.672279],[-73.851851,40.672492]]],"type":"Polygon"}
}