{
  "id": "360610101001",
  "type": "Feature",
  "properties": {
    "area_land":175520,
    "area_water":0,
    "geoid":"360610101001",
    "name":"Block Group 1",
    "state":"ny"
},
  "bbox": [
    -73.995299,
    40.747277,
    -73.98778,
    40.75219
],
  "geometry": {"coordinates":[[[-73.994844,40.750293],[-73.99432899999999,40.750999],[-73.993948,40.751522],[-73.993464,40.75219],[-73.990623,40.750992],[-73.987937,40.749855],[-73.98778,40.749772],[-73.987973,40.749491],[-73.98827,40.749148],[-73.988714,40.748513],[-73.989166,40.747895],[-73.989617,40.747277],[-73.992463,40.748469],[-73.995299,40.749671],[-73.994844,40.750293]]],"type":"Polygon"}
}