{
  "id": "360810482001",
  "type": "Feature",
  "properties": {
    "area_land":228378,
    "area_water":0,
    "geoid":"360810482001",
    "name":"Block Group 1",
    "state":"ny"
},
  "bbox": [
    -73.771921,
    40.711977,
    -73.764019,
    40.717647
],
  "geometry": {"coordinates":[[[-73.77192100000001,40.715685],[-73.77110399999999,40.715975],[-73.77007999999999,40.716327],[-73.769139,40.716657],[-73.768685,40.716815],[-73.768179,40.716993],[-73.767332,40.71729],[-73.76664100000001,40.717647],[-73.765714,40.716393],[-73.765173,40.715674],[-73.764636,40.714957],[-73.76438899999999,40.714375],[-73.764032,40.713475],[-73.764019,40.713318],[-73.76482799999999,40.713277],[-73.766051,40.713282],[-73.767038,40.713185],[-73.767422,40.713088],[-73.767999,40.712865],[-73.76857699999999,40.712554],[-73.768747,40.712459],[-73.76944,40.711977],[-73.77039499999999,40.7134],[-73.771134,40.714502],[-73.77192100000001,40.715685]]],"type":"Polygon"}
}