{
  "id": "360594158022",
  "type": "Feature",
  "properties": {
    "area_land":666917,
    "area_water":0,
    "geoid":"360594158022",
    "name":"Block Group 2",
    "state":"ny"
},
  "bbox": [
    -73.510235,
    40.672873,
    -73.493787,
    40.680476
],
  "geometry": {"coordinates":[[[-73.510215,40.673003],[-73.51013,40.673632],[-73.509917,40.675433],[-73.509826,40.676221],[-73.509781,40.676621],[-73.50976,40.676969],[-73.509727,40.677879],[-73.508396,40.67789],[-73.506894,40.677907],[-73.503703,40.677942],[-73.503327,40.677954],[-73.502983,40.677965],[-73.50281099999999,40.677964],[-73.502729,40.677964],[-73.503001,40.67853],[-73.50249599999999,40.678602],[-73.501583,40.678653],[-73.500606,40.678786],[-73.500595,40.678651],[-73.499684,40.678552],[-73.499706,40.678863],[-73.499759,40.679546],[-73.496234,40.67966],[-73.496273,40.68036],[-73.495734,40.680416],[-73.495261,40.680476],[-73.495042,40.679354],[-73.49466099999999,40.677846],[-73.494511,40.6774],[-73.494024,40.675958],[-73.493787,40.675257],[-73.494023,40.675232],[-73.494716,40.675155],[-73.495818,40.675031],[-73.498677,40.674671],[-73.502059,40.674124],[-73.502657,40.674013],[-73.5072,40.673344],[-73.507501,40.673302],[-73.51023499999999,40.672873],[-73.510215,40.673003]]],"type":"Polygon"}
}