{
  "id": "360830523042",
  "type": "Feature",
  "properties": {
    "area_land":1063268,
    "area_water":0,
    "geoid":"360830523042",
    "name":"Block Group 2",
    "state":"ny"
},
  "bbox": [
    -73.659455,
    42.689831,
    -73.634621,
    42.698595
],
  "geometry": {"coordinates":[[[-73.65945499999999,42.69741],[-73.652759,42.698401],[-73.652361,42.698478],[-73.650941,42.698595],[-73.65087800000001,42.698558],[-73.650544,42.698331],[-73.65029199999999,42.698194],[-73.65003299999999,42.698072],[-73.64955,42.697901],[-73.649306,42.697828],[-73.648974,42.697748],[-73.647651,42.697484],[-73.64644800000001,42.697226],[-73.645475,42.697028],[-73.64461,42.696847],[-73.643655,42.696648],[-73.642196,42.696351],[-73.64184899999999,42.696263],[-73.64162,42.696209],[-73.640995,42.696038],[-73.639877,42.69573],[-73.63771,42.695129],[-73.636921,42.694894],[-73.636707,42.694804],[-73.636461,42.69469],[-73.63634399999999,42.694618],[-73.635516,42.694056],[-73.634747,42.693504],[-73.63511099999999,42.69313],[-73.635268,42.692969],[-73.635476,42.69277],[-73.635535,42.692702],[-73.635775,42.692269],[-73.634861,42.691696],[-73.634621,42.69152],[-73.63502200000001,42.69122],[-73.635543,42.690807],[-73.63592800000001,42.690502],[-73.636774,42.689831],[-73.637337,42.690391],[-73.63774600000001,42.690474],[-73.638058,42.690253],[-73.638347,42.690138],[-73.638481,42.690104],[-73.638637,42.690093],[-73.638777,42.69009],[-73.639358,42.690133],[-73.64014299999999,42.690206],[-73.64053199999999,42.690255],[-73.640906,42.69033],[-73.64195599999999,42.690567],[-73.64245699999999,42.690673],[-73.642928,42.69079],[-73.64320499999999,42.690881],[-73.64341899999999,42.690969],[-73.64360600000001,42.691045],[-73.64411200000001,42.691306],[-73.644441,42.690702],[-73.644486,42.690645],[-73.644531,42.690619],[-73.644696,42.690497],[-73.64483300000001,42.69042],[-73.64504700000001,42.69041],[-73.64542899999999,42.690447],[-73.645465,42.690427],[-73.64554099999999,42.690419],[-73.64629499999999,42.690421],[-73.646457,42.690431],[-73.646382,42.690747],[-73.646171,42.691353],[-73.64636,42.6916],[-73.64639699999999,42.691669],[-73.64641899999999,42.691768],[-73.646514,42.69177],[-73.64658799999999,42.691771],[-73.64838899999999,42.691797],[-73.648794,42.691814],[-73.64897999999999,42.691836],[-73.64922799999999,42.691879],[-73.649619,42.692006],[-73.649974,42.692123],[-73.650402,42.692266],[-73.65173299999999,42.692681],[-73.653476,42.693214],[-73.65420399999999,42.693436],[-73.654574,42.693471],[-73.654886,42.693452],[-73.655021,42.693662],[-73.65509400000001,42.693696],[-73.655208,42.693742],[-73.655452,42.693852],[-73.655664,42.693967],[-73.65607900000001,42.69423],[-73.656209,42.694382],[-73.656256,42.694523],[-73.656297,42.69468],[-73.656308,42.694912],[-73.656305,42.695112],[-73.65631500000001,42.69536],[-73.656367,42.695505],[-73.656468,42.695661],[-73.65702400000001,42.696495],[-73.657128,42.696596],[-73.657222,42.696661],[-73.657365,42.696734],[-73.65754200000001,42.696799],[-73.658242,42.6969],[-73.658485,42.696944],[-73.658539,42.69696],[-73.658733,42.697017],[-73.65897,42.697127],[-73.65945499999999,42.69741]]],"type":"Polygon"}
}