{
  "id": "360110410004",
  "type": "Feature",
  "properties": {
    "area_land":62422432,
    "area_water":82192,
    "geoid":"360110410004",
    "name":"Block Group 4",
    "state":"ny"
},
  "bbox": [
    -76.587151,
    42.623408,
    -76.458858,
    42.68481
],
  "geometry": {"coordinates":[[[-76.58715100000001,42.677242],[-76.587142,42.677324],[-76.58711700000001,42.677399],[-76.587041,42.677576],[-76.58699,42.677668],[-76.58684700000001,42.677876],[-76.586102,42.678815],[-76.585128,42.680013],[-76.584926,42.680274],[-76.584833,42.680462],[-76.58480299999999,42.680538],[-76.584625,42.680562],[-76.58439799999999,42.680563],[-76.58429599999999,42.680567],[-76.58410499999999,42.680582],[-76.584014,42.680588],[-76.583787,42.680607],[-76.58358200000001,42.680604],[-76.582567,42.680642],[-76.582403,42.680642],[-76.581214,42.680682],[-76.580313,42.680725],[-76.580156,42.680726],[-76.57834800000001,42.680798],[-76.577146,42.680843],[-76.576438,42.680866],[-76.576075,42.680883],[-76.57561699999999,42.680896],[-76.574927,42.680923],[-76.574522,42.680936],[-76.572734,42.680992],[-76.571585,42.681033],[-76.5711,42.681041],[-76.57099100000001,42.68105],[-76.57073,42.681061],[-76.570256,42.681073],[-76.569168,42.681116],[-76.56843000000001,42.681145],[-76.5668,42.681222],[-76.56328600000001,42.681346],[-76.56227800000001,42.681377],[-76.56206400000001,42.681384],[-76.561638,42.681393],[-76.561584,42.681395],[-76.559861,42.681474],[-76.559049,42.6815],[-76.558007,42.681542],[-76.556209,42.681606],[-76.554633,42.681667],[-76.553861,42.681694],[-76.553377,42.681716],[-76.552311,42.68175],[-76.551799,42.681771],[-76.551575,42.681774],[-76.551321,42.681783],[-76.550538,42.681823],[-76.54941100000001,42.681857],[-76.54898900000001,42.681862],[-76.53873900000001,42.682383],[-76.53709600000001,42.682344],[-76.537057,42.682346],[-76.528492,42.68262],[-76.52699,42.682671],[-76.514892,42.683143],[-76.513773,42.683193],[-76.512636,42.683101],[-76.51104599999999,42.683189],[-76.51099000000001,42.683204],[-76.51084299999999,42.683228],[-76.51067399999999,42.683239],[-76.509778,42.683262],[-76.508712,42.683299],[-76.508011,42.683312],[-76.507789,42.683323],[-76.507402,42.683336],[-76.50606500000001,42.683379],[-76.505374,42.683418],[-76.504372,42.683447],[-76.504311,42.683449],[-76.503433,42.683468],[-76.503237,42.683478],[-76.50291199999999,42.683484],[-76.502567,42.683497],[-76.501763,42.683537],[-76.501307,42.683547],[-76.501137,42.683556],[-76.499661,42.68366],[-76.499661,42.683541],[-76.491033,42.683842],[-76.486773,42.684059],[-76.48673100000001,42.684046],[-76.48668000000001,42.684039],[-76.48652199999999,42.684032],[-76.485393,42.684061],[-76.48483899999999,42.684065],[-76.484588,42.684073],[-76.484324,42.684089],[-76.48274499999999,42.684142],[-76.482309,42.684153],[-76.481247,42.684179],[-76.479916,42.684224],[-76.47908200000001,42.684248],[-76.47863700000001,42.684257],[-76.47784,42.684286],[-76.47722400000001,42.684313],[-76.477001,42.684315],[-76.47633399999999,42.684337],[-76.476179,42.68434],[-76.475758,42.684349],[-76.475525,42.684352],[-76.474448,42.684388],[-76.47364899999999,42.684422],[-76.472449,42.68446],[-76.47128600000001,42.684495],[-76.471163,42.684501],[-76.470203,42.68454],[-76.46826900000001,42.6846],[-76.467686,42.684624],[-76.466708,42.684659],[-76.466251,42.684671],[-76.46541000000001,42.684706],[-76.465341,42.684708],[-76.46516,42.684711],[-76.46337200000001,42.684774],[-76.46240299999999,42.684797],[-76.46219000000001,42.68481],[-76.46211599999999,42.6835],[-76.462086,42.682854],[-76.461963,42.680588],[-76.461851,42.678541],[-76.461832,42.678338],[-76.461777,42.677516],[-76.461619,42.674766],[-76.46159400000001,42.674228],[-76.461485,42.672374],[-76.46146299999999,42.67184],[-76.461409,42.670813],[-76.461376,42.670398],[-76.461369,42.67019],[-76.461353,42.670033],[-76.46128400000001,42.669008],[-76.461099,42.666014],[-76.46104200000001,42.665027],[-76.460961,42.66395],[-76.460945,42.66364],[-76.460875,42.662432],[-76.460868,42.662231],[-76.460848,42.661882],[-76.460774,42.66062],[-76.46075399999999,42.660167],[-76.460714,42.65949],[-76.460695,42.659306],[-76.460683,42.659108],[-76.46059,42.657537],[-76.460538,42.656486],[-76.4605,42.656015],[-76.46047,42.655754],[-76.460436,42.655554],[-76.460399,42.65547],[-76.460435,42.649594],[-76.460424,42.649368],[-76.46030399999999,42.648008],[-76.46028800000001,42.647697],[-76.459867,42.639791],[-76.45968999999999,42.63639],[-76.459514,42.632988],[-76.458862,42.627493],[-76.45885800000001,42.627416],[-76.458929,42.627413],[-76.45902,42.62741],[-76.459177,42.627406],[-76.460658,42.627365],[-76.46067499999999,42.627365],[-76.460703,42.627364],[-76.460774,42.627362],[-76.46235299999999,42.627318],[-76.46258400000001,42.627311],[-76.463078,42.627296],[-76.463975,42.627269],[-76.464336,42.627258],[-76.46498699999999,42.627238],[-76.46503,42.627237],[-76.465198,42.627232],[-76.465243,42.62723],[-76.465276,42.627229],[-76.466086,42.627202],[-76.4661,42.627202],[-76.468445,42.627123],[-76.468683,42.627118],[-76.46872999999999,42.627117],[-76.468751,42.627116],[-76.468841,42.627114],[-76.468895,42.627114],[-76.47065000000001,42.627073],[-76.473022,42.627009],[-76.476513,42.626916],[-76.477035,42.626893],[-76.478572,42.626827],[-76.47867100000001,42.626812],[-76.478729,42.626793],[-76.478849,42.626789],[-76.478865,42.626788],[-76.490616,42.626416],[-76.491168,42.626398],[-76.492124,42.626368],[-76.492137,42.626368],[-76.49574200000001,42.626258],[-76.497839,42.626194],[-76.503996,42.62602],[-76.50414499999999,42.626016],[-76.504363,42.626004],[-76.507941,42.625894],[-76.508499,42.625879],[-76.508579,42.625877],[-76.50865400000001,42.625871],[-76.508717,42.62587],[-76.50873,42.62587],[-76.508745,42.62587],[-76.50887400000001,42.625859],[-76.508934,42.625848],[-76.509001,42.625835],[-76.509023,42.625829],[-76.51057299999999,42.625691],[-76.513063,42.625618],[-76.515553,42.625545],[-76.516231,42.625527],[-76.516779,42.625509],[-76.517259,42.625495],[-76.51741199999999,42.625491],[-76.518687,42.625452],[-76.518801,42.62545],[-76.520366,42.625405],[-76.520664,42.625396],[-76.520962,42.625388],[-76.522036,42.625359],[-76.522051,42.625359],[-76.522363,42.625348],[-76.522381,42.625347],[-76.522671,42.625337],[-76.522712,42.625336],[-76.53184299999999,42.625071],[-76.536047,42.62491],[-76.536106,42.624908],[-76.537114,42.624869],[-76.53805800000001,42.624833],[-76.53990899999999,42.624762],[-76.540009,42.624758],[-76.54010599999999,42.624754],[-76.540195,42.624762],[-76.540285,42.62477],[-76.54046,42.62478],[-76.540621,42.624787],[-76.54063600000001,42.624788],[-76.540783,42.624737],[-76.540949,42.624694],[-76.54101300000001,42.624682],[-76.541032,42.624679],[-76.54121600000001,42.624672],[-76.542153,42.624653],[-76.542179,42.624652],[-76.542328,42.624649],[-76.54237500000001,42.624638],[-76.542494,42.624634],[-76.543318,42.624605],[-76.54459799999999,42.62456],[-76.546503,42.624493],[-76.55022700000001,42.624349],[-76.550425,42.624341],[-76.55324400000001,42.624244],[-76.55381300000001,42.624211],[-76.554379,42.624179],[-76.555807,42.624056],[-76.555847,42.624137],[-76.555854,42.62415],[-76.56501,42.623796],[-76.566874,42.623728],[-76.569422,42.623634],[-76.571493,42.623558],[-76.572141,42.62353],[-76.57216699999999,42.623529],[-76.57222400000001,42.623526],[-76.572847,42.6235],[-76.574742,42.623419],[-76.574893,42.623408],[-76.57490799999999,42.623563],[-76.574927,42.624],[-76.574968,42.624603],[-76.574996,42.625128],[-76.57503,42.62557],[-76.575052,42.626158],[-76.575152,42.627479],[-76.57521199999999,42.628348],[-76.575216,42.628552],[-76.575287,42.629714],[-76.575318,42.630315],[-76.575399,42.631536],[-76.575428,42.632068],[-76.575461,42.632889],[-76.57550500000001,42.633428],[-76.57554399999999,42.634093],[-76.57558299999999,42.634557],[-76.57562799999999,42.635222],[-76.575655,42.63564],[-76.57566300000001,42.635764],[-76.57566300000001,42.635856],[-76.575746,42.637189],[-76.57576899999999,42.637736],[-76.575807,42.638163],[-76.575829,42.638529],[-76.57595499999999,42.640259],[-76.575975,42.640648],[-76.576002,42.641188],[-76.576025,42.641671],[-76.576052,42.642424],[-76.57612,42.644017],[-76.576161,42.644421],[-76.576224,42.644852],[-76.576295,42.645231],[-76.576345,42.64545],[-76.576402,42.645646],[-76.576483,42.645875],[-76.57653000000001,42.645984],[-76.576639,42.646193],[-76.57690599999999,42.646673],[-76.577021,42.646904],[-76.577234,42.647422],[-76.57735,42.647748],[-76.577596,42.648601],[-76.577771,42.64914],[-76.578315,42.650644],[-76.578391,42.650822],[-76.578642,42.65148],[-76.57888800000001,42.652111],[-76.57910699999999,42.652656],[-76.5793,42.653088],[-76.579444,42.653384],[-76.57960799999999,42.653697],[-76.580195,42.654784],[-76.580804,42.655957],[-76.581323,42.656917],[-76.58146000000001,42.657162],[-76.581728,42.657621],[-76.582162,42.658337],[-76.582759,42.659288],[-76.58320999999999,42.659986],[-76.583669,42.660711],[-76.583778,42.660893],[-76.583855,42.66104],[-76.583916,42.66117],[-76.58395899999999,42.661278],[-76.58400399999999,42.661425],[-76.584047,42.661666],[-76.584068,42.66189],[-76.58407200000001,42.661934],[-76.584135,42.663112],[-76.584236,42.664714],[-76.58428600000001,42.665792],[-76.58432000000001,42.666208],[-76.58431299999999,42.666245],[-76.58431,42.666416],[-76.58432999999999,42.667156],[-76.584349,42.667437],[-76.58439799999999,42.667742],[-76.584434,42.667905],[-76.58450999999999,42.668199],[-76.584838,42.669147],[-76.584963,42.669547],[-76.58506199999999,42.669919],[-76.585196,42.67036],[-76.58527100000001,42.670583],[-76.585396,42.671021],[-76.585616,42.67175],[-76.585671,42.671929],[-76.58587900000001,42.672605],[-76.585919,42.672759],[-76.586018,42.673088],[-76.58606,42.67326],[-76.586169,42.673639],[-76.586219,42.673788],[-76.586359,42.674244],[-76.586488,42.67463],[-76.586714,42.675407],[-76.58689200000001,42.67599],[-76.58694300000001,42.676176],[-76.58699300000001,42.676336],[-76.58709500000001,42.676753],[-76.587114,42.676855],[-76.587131,42.676919],[-76.587149,42.677045],[-76.58715100000001,42.677242]]],"type":"Polygon"}
}