{
  "id": "360930325041",
  "type": "Feature",
  "properties": {
    "area_land":41605953,
    "area_water":1128404,
    "geoid":"360930325041",
    "name":"Block Group 1",
    "state":"ny"
},
  "bbox": [
    -74.09298,
    42.864063,
    -74.011558,
    42.955868
],
  "geometry": {"coordinates":[[[-74.09298,42.955868],[-74.088052,42.955333],[-74.087349,42.955289],[-74.08247299999999,42.954985],[-74.08066700000001,42.954872],[-74.079909,42.954824],[-74.06761899999999,42.954045],[-74.057743,42.953447],[-74.05674,42.953388],[-74.056533,42.953376],[-74.055605,42.953289],[-74.055458,42.953276],[-74.051388,42.951755],[-74.05085800000001,42.951557],[-74.046109,42.949784],[-74.04499800000001,42.949369],[-74.043656,42.948868],[-74.04350599999999,42.948812],[-74.042624,42.948483],[-74.042269,42.94835],[-74.036928,42.944982],[-74.0331,42.943222],[-74.032911,42.943135],[-74.032483,42.942996],[-74.03197,42.94283],[-74.03194000000001,42.94282],[-74.02851099999999,42.941778],[-74.02535,42.94084],[-74.02283199999999,42.940121],[-74.020656,42.939389],[-74.02006299999999,42.939034],[-74.019747,42.93882],[-74.019447,42.938548],[-74.019147,42.938179],[-74.01885299999999,42.93764],[-74.01869499999999,42.937351],[-74.01822,42.936481],[-74.01819999999999,42.936434],[-74.01756,42.934882],[-74.01736099999999,42.934537],[-74.01622500000001,42.932877],[-74.014156,42.929848],[-74.013379,42.928615],[-74.016634,42.926757],[-74.01534100000001,42.92265],[-74.015355,42.922283],[-74.015663,42.921542],[-74.015672,42.921399],[-74.015618,42.921293],[-74.015457,42.921227],[-74.01380899999999,42.920853],[-74.01311200000001,42.920469],[-74.01297,42.920284],[-74.012953,42.920047],[-74.014307,42.918284],[-74.01437900000001,42.918127],[-74.01438,42.917995],[-74.014274,42.917731],[-74.012012,42.914874],[-74.011691,42.914468],[-74.01161999999999,42.914283],[-74.01155799999999,42.913549],[-74.012052,42.913418],[-74.01267900000001,42.913191],[-74.01321799999999,42.912995],[-74.013981,42.912634],[-74.01443,42.912339],[-74.01497000000001,42.911814],[-74.015421,42.911224],[-74.01555399999999,42.911093],[-74.015914,42.910896],[-74.01618499999999,42.910667],[-74.01645499999999,42.910338],[-74.016589,42.910075],[-74.016724,42.909878],[-74.01694999999999,42.909714],[-74.017443,42.909485],[-74.017713,42.909289],[-74.017892,42.909059],[-74.01794,42.908829],[-74.01750699999999,42.905866],[-74.01741800000001,42.905635],[-74.017107,42.905239],[-74.017062,42.905041],[-74.01702,42.904712],[-74.017111,42.904515],[-74.017335,42.904286],[-74.01945000000001,42.902251],[-74.019944,42.901726],[-74.02025999999999,42.901201],[-74.020622,42.900248],[-74.020714,42.899885],[-74.02058599999999,42.898602],[-74.020545,42.897911],[-74.020591,42.897582],[-74.02158799999999,42.895216],[-74.02222,42.894065],[-74.022582,42.89354],[-74.022632,42.893301],[-74.02285500000001,42.892225],[-74.022863,42.891789],[-74.02203299999999,42.890241],[-74.02201599999999,42.890047],[-74.02265300000001,42.888903],[-74.02291099999999,42.888612],[-74.023026,42.888367],[-74.023224,42.887282],[-74.022881,42.884913],[-74.022792,42.884058],[-74.02260099999999,42.88241],[-74.022633,42.882207],[-74.022819,42.881779],[-74.022975,42.88135],[-74.022972,42.875836],[-74.02291200000001,42.875564],[-74.02230400000001,42.874207],[-74.022305,42.874093],[-74.02318099999999,42.870661],[-74.023572,42.869776],[-74.023747,42.869557],[-74.023792,42.869501],[-74.024097,42.869246],[-74.02440199999999,42.869007],[-74.02457699999999,42.868704],[-74.024664,42.868513],[-74.024427,42.868363],[-74.024534,42.868109],[-74.024536,42.868011],[-74.02449900000001,42.867897],[-74.024534,42.867795],[-74.024518,42.86773],[-74.024558,42.867661],[-74.02457099999999,42.867614],[-74.024548,42.867559],[-74.024576,42.867484],[-74.02465100000001,42.867385],[-74.024697,42.867284],[-74.02472,42.867203],[-74.02470599999999,42.867028],[-74.02468500000001,42.866938],[-74.02464999999999,42.86671],[-74.02466200000001,42.866661],[-74.024789,42.866552],[-74.024914,42.866455],[-74.02502,42.866412],[-74.025229,42.866335],[-74.02545499999999,42.866232],[-74.025633,42.86614],[-74.025712,42.86608],[-74.025751,42.866035],[-74.025763,42.86599],[-74.02578099999999,42.865873],[-74.02580399999999,42.865808],[-74.02584400000001,42.865767],[-74.025916,42.865715],[-74.02598399999999,42.86565],[-74.026068,42.865598],[-74.02632699999999,42.8656],[-74.02632699999999,42.86554],[-74.026308,42.865462],[-74.026308,42.865409],[-74.026363,42.865407],[-74.026414,42.865348],[-74.02645699999999,42.865324],[-74.026523,42.865302],[-74.026578,42.865268],[-74.02662100000001,42.865217],[-74.026661,42.865189],[-74.02663,42.865148],[-74.02645800000001,42.865173],[-74.02643,42.865142],[-74.026439,42.865087],[-74.026422,42.864953],[-74.026436,42.864914],[-74.026462,42.864868],[-74.02649700000001,42.864837],[-74.026554,42.864806],[-74.026657,42.864773],[-74.02676200000001,42.864754],[-74.026798,42.864717],[-74.026788,42.864671],[-74.026704,42.864619],[-74.026616,42.864529],[-74.026465,42.864415],[-74.026428,42.864374],[-74.027248,42.864063],[-74.027412,42.864141],[-74.02970999999999,42.865457],[-74.030649,42.86623],[-74.03091000000001,42.8665],[-74.03122,42.867272],[-74.03163499999999,42.869371],[-74.031873,42.870574],[-74.03487199999999,42.874175],[-74.037024,42.875842],[-74.038704,42.876581],[-74.03953300000001,42.876771],[-74.040161,42.87692],[-74.040296,42.87696],[-74.040989,42.87717],[-74.04177900000001,42.877488],[-74.041893,42.877534],[-74.04236299999999,42.877813],[-74.04276900000001,42.877451],[-74.042867,42.877507],[-74.042976,42.877588],[-74.043098,42.877713],[-74.04330899999999,42.877883],[-74.043436,42.878009],[-74.043818,42.878425],[-74.04405800000001,42.878613],[-74.04424400000001,42.878772],[-74.044465,42.878924],[-74.04448600000001,42.878939],[-74.04468199999999,42.879068],[-74.044899,42.879187],[-74.045047,42.879287],[-74.045401,42.87948],[-74.045648,42.879643],[-74.046105,42.879924],[-74.046288,42.880017],[-74.046736,42.88027],[-74.046874,42.880362],[-74.047022,42.880433],[-74.047338,42.880574],[-74.047417,42.88063],[-74.04751899999999,42.880726],[-74.047622,42.88084],[-74.047828,42.881046],[-74.04788600000001,42.881116],[-74.048207,42.881557],[-74.048276,42.881635],[-74.048354,42.881705],[-74.048512,42.881798],[-74.048548,42.881837],[-74.04857,42.881886],[-74.04858400000001,42.881941],[-74.048726,42.882084],[-74.04900600000001,42.882295],[-74.04916799999999,42.88245],[-74.04931999999999,42.882587],[-74.04953999999999,42.882815],[-74.04972600000001,42.883025],[-74.049927,42.883195],[-74.050364,42.883516],[-74.050561,42.883653],[-74.050719,42.883753],[-74.050911,42.883864],[-74.051074,42.883939],[-74.051458,42.884147],[-74.051818,42.884336],[-74.05204000000001,42.88444],[-74.05276600000001,42.884739],[-74.052978,42.884804],[-74.053009,42.884814],[-74.05342400000001,42.884978],[-74.05387399999999,42.885121],[-74.054106,42.885174],[-74.054305,42.885201],[-74.054474,42.885213],[-74.054633,42.885211],[-74.054917,42.885181],[-74.05510599999999,42.88512],[-74.055436,42.885042],[-74.05587,42.884911],[-74.056065,42.884839],[-74.05620500000001,42.884804],[-74.05632,42.884768],[-74.05646400000001,42.88474],[-74.05664899999999,42.884672],[-74.056804,42.884593],[-74.057211,42.88434],[-74.05738599999999,42.884251],[-74.057576,42.884146],[-74.057953,42.883926],[-74.058086,42.883828],[-74.058229,42.883749],[-74.058846,42.883374],[-74.059101,42.883241],[-74.059331,42.883155],[-74.059431,42.883098],[-74.059541,42.883058],[-74.059696,42.883016],[-74.059881,42.882973],[-74.06001500000001,42.882934],[-74.060146,42.882886],[-74.060553,42.882862],[-74.060678,42.882841],[-74.06085299999999,42.88278],[-74.060987,42.882778],[-74.061082,42.882764],[-74.06119700000001,42.882666],[-74.06128200000001,42.882534],[-74.061284,42.882445],[-74.061261,42.882322],[-74.06133,42.882297],[-74.06141599999999,42.882384],[-74.06147199999999,42.882539],[-74.061536,42.882621],[-74.06158000000001,42.882662],[-74.061649,42.882703],[-74.061719,42.882725],[-74.061798,42.882737],[-74.062235,42.88277],[-74.062443,42.882804],[-74.063041,42.883054],[-74.063194,42.883099],[-74.063332,42.88317],[-74.06346000000001,42.883226],[-74.063653,42.883286],[-74.06386000000001,42.883393],[-74.064167,42.883495],[-74.06427499999999,42.883569],[-74.064572,42.883692],[-74.065206,42.884004],[-74.06538399999999,42.884079],[-74.064896,42.8847],[-74.06508599999999,42.88481],[-74.06770899999999,42.886878],[-74.069372,42.888777],[-74.070425,42.889956],[-74.071348,42.890472],[-74.07172199999999,42.890681],[-74.07355200000001,42.891623],[-74.073576,42.891635],[-74.076674,42.893084],[-74.076836,42.89312],[-74.078109,42.893399],[-74.079688,42.893767],[-74.08152699999999,42.894438],[-74.08366100000001,42.895673],[-74.084819,42.896844],[-74.084844,42.896869],[-74.083883,42.897354],[-74.08395400000001,42.897783],[-74.083979,42.897951],[-74.083989,42.898023],[-74.084013,42.898185],[-74.08404,42.898399],[-74.08409,42.898843],[-74.08413899999999,42.899286],[-74.08429700000001,42.900434],[-74.084868,42.904424],[-74.084909,42.90466],[-74.085148,42.906226],[-74.08558600000001,42.908796],[-74.08631699999999,42.912921],[-74.086547,42.914516],[-74.08659400000001,42.915107],[-74.08653099999999,42.915121],[-74.08645799999999,42.915137],[-74.08660399999999,42.915776],[-74.086842,42.916617],[-74.08696500000001,42.917183],[-74.08708799999999,42.917922],[-74.08721199999999,42.918574],[-74.08754,42.920696],[-74.087729,42.921947],[-74.08804000000001,42.923577],[-74.088114,42.924007],[-74.088139,42.924754],[-74.088213,42.925394],[-74.088303,42.925775],[-74.088257,42.927313],[-74.089079,42.932218],[-74.089366,42.934318],[-74.089572,42.935619],[-74.090462,42.941243],[-74.091392,42.947112],[-74.092241,42.952178],[-74.092359,42.952881],[-74.09237299999999,42.953316],[-74.09298,42.955868]]],"type":"Polygon"}
}