{
  "id": "360610223010",
  "type": "Feature",
  "properties": {
    "area_land":0,
    "area_water":131253,
    "geoid":"360610223010",
    "name":"Block Group 0",
    "state":"ny"
},
  "bbox": [
    -73.965092,
    40.82162,
    -73.958008,
    40.826298
],
  "geometry": {"coordinates":[[[-73.963657,40.826298],[-73.959192,40.824342],[-73.959648,40.823677],[-73.958207,40.823056],[-73.958319,40.822832],[-73.95800800000001,40.822795],[-73.958218,40.82235],[-73.958743,40.82162],[-73.96122800000001,40.822769],[-73.965092,40.824483],[-73.963657,40.826298]]],"type":"Polygon"}
}