{
  "id": "360010138017",
  "type": "Feature",
  "properties": {
    "area_land":10856559,
    "area_water":967,
    "geoid":"360010138017",
    "name":"Block Group 7",
    "state":"ny"
},
  "bbox": [
    -73.933755,
    42.71538,
    -73.848358,
    42.763432
],
  "geometry": {"coordinates":[[[-73.933755,42.7607],[-73.93235,42.760855],[-73.931912,42.760906],[-73.93113099999999,42.761003],[-73.930745,42.761047],[-73.92999399999999,42.761135],[-73.916949,42.762368],[-73.91174700000001,42.763096],[-73.911688,42.763104],[-73.90928,42.763116],[-73.906785,42.763432],[-73.906536,42.76321],[-73.90552700000001,42.762378],[-73.90130000000001,42.758828],[-73.900564,42.758197],[-73.89791700000001,42.755993],[-73.89632899999999,42.754639],[-73.89595799999999,42.754358],[-73.894453,42.75307],[-73.8914,42.750504],[-73.89048099999999,42.749724],[-73.889723,42.749995],[-73.889656,42.750011],[-73.88912999999999,42.750116],[-73.88837700000001,42.750233],[-73.88756100000001,42.750325],[-73.886956,42.75039],[-73.88657499999999,42.75041],[-73.886306,42.750393],[-73.886206,42.750378],[-73.885977,42.75031],[-73.885611,42.750187],[-73.885465,42.750147],[-73.883754,42.749952],[-73.882193,42.749783],[-73.88066000000001,42.749586],[-73.880225,42.749546],[-73.87974800000001,42.749557],[-73.87939,42.749588],[-73.878698,42.749757],[-73.878546,42.749816],[-73.87833000000001,42.749942],[-73.87803099999999,42.75018],[-73.87765899999999,42.750372],[-73.876598,42.750858],[-73.87636999999999,42.750923],[-73.876289,42.75096],[-73.876259,42.751001],[-73.876071,42.750951],[-73.875193,42.750816],[-73.87504199999999,42.750802],[-73.874714,42.750731],[-73.874486,42.750653],[-73.87412999999999,42.750471],[-73.874027,42.750414],[-73.87383800000001,42.750276],[-73.873563,42.750019],[-73.873234,42.749656],[-73.873133,42.74955],[-73.872801,42.749174],[-73.87255,42.748827],[-73.87245799999999,42.748674],[-73.87232400000001,42.748452],[-73.87200900000001,42.74793],[-73.87178,42.747565],[-73.871486,42.747163],[-73.87120400000001,42.746787],[-73.870857,42.746451],[-73.87029099999999,42.745945],[-73.870142,42.745822],[-73.869855,42.74548],[-73.869727,42.745291],[-73.869722,42.745254],[-73.869598,42.744834],[-73.86951000000001,42.744527],[-73.86944800000001,42.744223],[-73.869367,42.742386],[-73.869247,42.741513],[-73.86920000000001,42.741301],[-73.869128,42.741058],[-73.86906399999999,42.740889],[-73.868954,42.740642],[-73.868695,42.740186],[-73.867654,42.738752],[-73.86683499999999,42.737711],[-73.866652,42.737488],[-73.866347,42.737115],[-73.86545,42.736143],[-73.865189,42.735837],[-73.86489899999999,42.73544],[-73.864711,42.735087],[-73.86414499999999,42.733662],[-73.863815,42.732762],[-73.863457,42.731926],[-73.86335200000001,42.731725],[-73.86321100000001,42.73155],[-73.863021,42.731344],[-73.862796,42.731159],[-73.86238299999999,42.730875],[-73.861451,42.730234],[-73.861227,42.730093],[-73.86106700000001,42.729999],[-73.860613,42.729807],[-73.859492,42.729364],[-73.859092,42.729197],[-73.85802099999999,42.728758],[-73.8573,42.7285],[-73.85704699999999,42.728434],[-73.856899,42.728408],[-73.85640600000001,42.728336],[-73.85576399999999,42.728253],[-73.85434600000001,42.728088],[-73.85404200000001,42.728063],[-73.85339999999999,42.727947],[-73.85317499999999,42.727889],[-73.85299500000001,42.727815],[-73.85269099999999,42.727658],[-73.85261199999999,42.727625],[-73.852487,42.727608],[-73.852395,42.727618],[-73.85209500000001,42.727744],[-73.85205499999999,42.72776],[-73.85162200000001,42.727929],[-73.848358,42.72506],[-73.848652,42.724863],[-73.85038,42.723595],[-73.849341,42.722561],[-73.850025,42.722099],[-73.850555,42.721736],[-73.848598,42.719883],[-73.852153,42.717475],[-73.855369,42.71538],[-73.864583,42.720749],[-73.864729,42.720718],[-73.86486600000001,42.72078],[-73.86813600000001,42.722692],[-73.870648,42.724112],[-73.874644,42.726323],[-73.882447,42.730705],[-73.884244,42.731811],[-73.88542099999999,42.732535],[-73.88846700000001,42.734177],[-73.89322799999999,42.736934],[-73.89338100000001,42.737062],[-73.893737,42.737301],[-73.895158,42.738123],[-73.895393,42.73826],[-73.89719700000001,42.73931],[-73.89772499999999,42.739613],[-73.899147,42.740462],[-73.900431,42.741196],[-73.90172099999999,42.742041],[-73.902732,42.742623],[-73.90305600000001,42.742804],[-73.903183,42.742894],[-73.903266,42.742969],[-73.90812099999999,42.745679],[-73.90944,42.746438],[-73.912161,42.747995],[-73.91242,42.748139],[-73.915622,42.749915],[-73.91879400000001,42.751827],[-73.920576,42.752879],[-73.921329,42.753304],[-73.92214800000001,42.753776],[-73.922775,42.754181],[-73.923072,42.754403],[-73.924254,42.755127],[-73.92504599999999,42.755572],[-73.927656,42.757077],[-73.93009600000001,42.758513],[-73.930346,42.758679],[-73.930566,42.758876],[-73.930824,42.759074],[-73.93095,42.759168],[-73.931335,42.759413],[-73.93172,42.75963],[-73.93229599999999,42.75993],[-73.932382,42.759976],[-73.932463,42.760018],[-73.93252099999999,42.760048],[-73.93306800000001,42.760374],[-73.933403,42.760557],[-73.933755,42.7607]]],"type":"Polygon"}
}