{
  "id": "360830402001",
  "type": "Feature",
  "properties": {
    "area_land":193571,
    "area_water":98106,
    "geoid":"360830402001",
    "name":"Block Group 1",
    "state":"ny"
},
  "bbox": [
    -73.681807,
    42.771303,
    -73.669784,
    42.778877
],
  "geometry": {"coordinates":[[[-73.68131099999999,42.772759],[-73.678462,42.778877],[-73.67714100000001,42.778649],[-73.676723,42.778531],[-73.675605,42.778271],[-73.67443799999999,42.777996],[-73.67328999999999,42.777728],[-73.673095,42.777679],[-73.672085,42.777455],[-73.67091499999999,42.777156],[-73.670346,42.777008],[-73.66978400000001,42.776864],[-73.66988499999999,42.776653],[-73.670304,42.775669],[-73.67089199999999,42.774494],[-73.672027,42.77477],[-73.673216,42.775077],[-73.674351,42.775327],[-73.675539,42.775617],[-73.676688,42.775921],[-73.67779899999999,42.7762],[-73.67793,42.775916],[-73.678292,42.775229],[-73.678403,42.774974],[-73.678928,42.77376],[-73.679149,42.773321],[-73.67950999999999,42.772516],[-73.68003899999999,42.771303],[-73.68038199999999,42.771375],[-73.68180700000001,42.771695],[-73.68131099999999,42.772759]]],"type":"Polygon"}
}