{
  "id": "360470379001",
  "type": "Feature",
  "properties": {
    "area_land":38180,
    "area_water":0,
    "geoid":"360470379001",
    "name":"Block Group 1",
    "state":"ny"
},
  "bbox": [
    -73.922545,
    40.681211,
    -73.916977,
    40.682568
],
  "geometry": {"coordinates":[[[-73.922545,40.681936],[-73.919866,40.682254],[-73.91752099999999,40.682523],[-73.91712200000001,40.682568],[-73.916977,40.681834],[-73.917355,40.681792],[-73.91972,40.681519],[-73.922427,40.681211],[-73.922545,40.681936]]],"type":"Polygon"}
}