{
  "id": "360957407004",
  "type": "Feature",
  "properties": {
    "area_land":36421808,
    "area_water":0,
    "geoid":"360957407004",
    "name":"Block Group 4",
    "state":"ny"
},
  "bbox": [
    -74.378685,
    42.545281,
    -74.236954,
    42.599646
],
  "geometry": {"coordinates":[[[-74.37813,42.577544],[-74.375913,42.580254],[-74.37529499999999,42.580251],[-74.375173,42.580286],[-74.375001,42.580545],[-74.37457499999999,42.581027],[-74.374358,42.581158],[-74.37417000000001,42.581233],[-74.37374699999999,42.581459],[-74.37322899999999,42.581647],[-74.373031,42.581704],[-74.37279599999999,42.581751],[-74.372344,42.581816],[-74.37159200000001,42.581873],[-74.371272,42.581882],[-74.370688,42.581854],[-74.370406,42.581816],[-74.370114,42.581732],[-74.369973,42.581666],[-74.369747,42.581544],[-74.369418,42.581299],[-74.36922,42.581186],[-74.368985,42.581092],[-74.368731,42.581008],[-74.368533,42.580961],[-74.36806900000001,42.580871],[-74.367593,42.580812],[-74.36732000000001,42.580817],[-74.367144,42.580849],[-74.367058,42.580887],[-74.366962,42.580913],[-74.36690299999999,42.580913],[-74.366609,42.580812],[-74.366422,42.580721],[-74.366122,42.580545],[-74.365577,42.58016],[-74.365454,42.580058],[-74.365227,42.579829],[-74.36508000000001,42.579626],[-74.36482100000001,42.579214],[-74.364704,42.578932],[-74.36444,42.578385],[-74.364397,42.578231],[-74.364155,42.577547],[-74.364013,42.577424],[-74.36386,42.577314],[-74.363738,42.577242],[-74.363246,42.577025],[-74.362239,42.576719],[-74.361954,42.576653],[-74.361276,42.576566],[-74.35975500000001,42.57635],[-74.35936100000001,42.576306],[-74.358836,42.576263],[-74.357653,42.576263],[-74.35713199999999,42.57633],[-74.35680000000001,42.576372],[-74.356471,42.576481],[-74.35618599999999,42.576656],[-74.35598899999999,42.576853],[-74.35579199999999,42.577116],[-74.355464,42.577597],[-74.355311,42.577859],[-74.35520099999999,42.578122],[-74.355136,42.578341],[-74.35500399999999,42.578647],[-74.354873,42.578909],[-74.35472,42.579106],[-74.354522,42.579325],[-74.35421599999999,42.579588],[-74.353909,42.579828],[-74.35340600000001,42.580108],[-74.352749,42.580463],[-74.351822,42.580887],[-74.351625,42.580953],[-74.35145,42.580997],[-74.351231,42.580997],[-74.351012,42.580975],[-74.350509,42.580909],[-74.350246,42.580866],[-74.349852,42.580778],[-74.348862,42.580419],[-74.348662,42.580373],[-74.34824,42.580373],[-74.348101,42.580403],[-74.34797,42.580472],[-74.34787,42.580549],[-74.347792,42.580628],[-74.34767100000001,42.580818],[-74.34758600000001,42.581041],[-74.347356,42.582331],[-74.347356,42.582812],[-74.34737800000001,42.583075],[-74.347465,42.583294],[-74.347553,42.583447],[-74.347728,42.583644],[-74.348341,42.584037],[-74.348906,42.584285],[-74.349081,42.584372],[-74.34921300000001,42.58446],[-74.3493,42.584569],[-74.349322,42.5847],[-74.3493,42.584853],[-74.3493,42.584963],[-74.34923499999999,42.585094],[-74.349125,42.585203],[-74.34884,42.585444],[-74.348731,42.58551],[-74.348512,42.585575],[-74.348271,42.585619],[-74.347965,42.585663],[-74.347549,42.585663],[-74.346211,42.585717],[-74.344943,42.585794],[-74.34382600000001,42.586013],[-74.34352,42.586188],[-74.343389,42.586297],[-74.34325699999999,42.586472],[-74.343148,42.586647],[-74.34305999999999,42.586866],[-74.34295299999999,42.587313],[-74.342885,42.587544],[-74.342885,42.587741],[-74.342907,42.587982],[-74.342973,42.588157],[-74.34321300000001,42.58855],[-74.343301,42.588682],[-74.34341000000001,42.588791],[-74.343542,42.588944],[-74.343695,42.589097],[-74.34384799999999,42.589382],[-74.34384799999999,42.589557],[-74.343805,42.589841],[-74.34370800000001,42.589985],[-74.34378700000001,42.590048],[-74.34392099999999,42.590122],[-74.34402799999999,42.590215],[-74.34403500000001,42.590309],[-74.34402799999999,42.590349],[-74.34403500000001,42.590382],[-74.34420799999999,42.590449],[-74.34456900000001,42.590669],[-74.34460900000001,42.590709],[-74.344669,42.590863],[-74.344702,42.590903],[-74.344843,42.590956],[-74.34493000000001,42.590976],[-74.345023,42.590983],[-74.345197,42.590969],[-74.345304,42.590969],[-74.345724,42.591063],[-74.346165,42.59129],[-74.34635,42.591423],[-74.346949,42.591894],[-74.347003,42.591948],[-74.34705599999999,42.591981],[-74.34737699999999,42.592088],[-74.347904,42.592308],[-74.348212,42.592475],[-74.348258,42.592515],[-74.348359,42.592651],[-74.348163,42.592847],[-74.347532,42.593483],[-74.34727100000001,42.593729],[-74.34662299999999,42.594299],[-74.346311,42.594554],[-74.34569,42.595028],[-74.345029,42.595493],[-74.344441,42.595868],[-74.344092,42.596085],[-74.340772,42.59812],[-74.34024599999999,42.598442],[-74.338775,42.599354],[-74.338584,42.599474],[-74.338373,42.599585],[-74.33829799999999,42.599616],[-74.338182,42.599643],[-74.338044,42.599646],[-74.337301,42.599558],[-74.337204,42.599546],[-74.336946,42.599514],[-74.33679600000001,42.599495],[-74.33641900000001,42.599446],[-74.336294,42.599402],[-74.336127,42.5993],[-74.335336,42.598744],[-74.33502900000001,42.598526],[-74.334856,42.598402],[-74.334492,42.598141],[-74.334255,42.597971],[-74.33386299999999,42.597698],[-74.333721,42.597608],[-74.33341900000001,42.597463],[-74.332708,42.597133],[-74.332604,42.597085],[-74.33143,42.596529],[-74.330523,42.596058],[-74.330253,42.595918],[-74.329609,42.59555],[-74.329007,42.595191],[-74.328135,42.594655],[-74.326928,42.593912],[-74.324759,42.592581],[-74.323438,42.591776],[-74.323241,42.591632],[-74.323075,42.591471],[-74.322281,42.590524],[-74.321731,42.589853],[-74.321564,42.58965],[-74.321386,42.589757],[-74.321321,42.589783],[-74.321152,42.589828],[-74.32105900000001,42.589842],[-74.32097899999999,42.58984],[-74.32089499999999,42.589827],[-74.320841,42.589809],[-74.320734,42.589753],[-74.320654,42.589696],[-74.32043,42.589496],[-74.32030399999999,42.589351],[-74.32024,42.589231],[-74.320171,42.58904],[-74.320094,42.588848],[-74.320018,42.588734],[-74.31992200000001,42.588637],[-74.319806,42.588551],[-74.319631,42.588459],[-74.319337,42.588349],[-74.318798,42.588161],[-74.318585,42.588078],[-74.31838,42.588006],[-74.318179,42.587936],[-74.317317,42.587689],[-74.316976,42.587573],[-74.316503,42.587378],[-74.31635,42.587308],[-74.316159,42.587203],[-74.31563300000001,42.58685],[-74.315129,42.586461],[-74.313839,42.585347],[-74.313669,42.585231],[-74.313464,42.585125],[-74.31318,42.585029],[-74.313063,42.584986],[-74.31270499999999,42.584854],[-74.311896,42.584502],[-74.31031400000001,42.583907],[-74.309219,42.583451],[-74.30880500000001,42.583264],[-74.308128,42.582885],[-74.308061,42.582859],[-74.307686,42.582714],[-74.30757199999999,42.582686],[-74.30702100000001,42.582549],[-74.30619299999999,42.582378],[-74.305716,42.582266],[-74.305502,42.582229],[-74.305058,42.582186],[-74.30439699999999,42.582151],[-74.304104,42.582145],[-74.303853,42.58216],[-74.303606,42.582202],[-74.303054,42.582367],[-74.302628,42.582524],[-74.30182600000001,42.582769],[-74.30063,42.583031],[-74.300324,42.58308],[-74.300067,42.583105],[-74.29918000000001,42.583101],[-74.29893199999999,42.583111],[-74.298664,42.583166],[-74.298405,42.583253],[-74.298191,42.583347],[-74.29809299999999,42.583408],[-74.297763,42.583647],[-74.297535,42.583783],[-74.297292,42.583881],[-74.297009,42.583966],[-74.295937,42.584215],[-74.294518,42.58457],[-74.29424899999999,42.584623],[-74.293727,42.584708],[-74.292891,42.584798],[-74.29167700000001,42.584875],[-74.29138500000001,42.584882],[-74.291178,42.584877],[-74.290701,42.584875],[-74.290436,42.584892],[-74.28997099999999,42.584941],[-74.289776,42.584981],[-74.288927,42.585209],[-74.28854800000001,42.585291],[-74.288357,42.585311],[-74.288206,42.585315],[-74.287963,42.585303],[-74.28761900000001,42.585258],[-74.28649299999999,42.585026],[-74.285983,42.584936],[-74.285718,42.5849],[-74.284764,42.584745],[-74.283143,42.584535],[-74.28082499999999,42.584293],[-74.280432,42.584224],[-74.280299,42.584191],[-74.279324,42.583884],[-74.279212,42.583851],[-74.27862500000001,42.583714],[-74.278289,42.583615],[-74.278083,42.583535],[-74.277967,42.583475],[-74.277567,42.583268],[-74.277111,42.583073],[-74.275767,42.582617],[-74.275245,42.582478],[-74.275153,42.582443],[-74.274868,42.582455],[-74.27469000000001,42.58248],[-74.274592,42.582504],[-74.274474,42.582553],[-74.27413199999999,42.582733],[-74.273948,42.58281],[-74.273797,42.582842],[-74.273573,42.582863],[-74.27254600000001,42.582838],[-74.272154,42.582871],[-74.271807,42.582936],[-74.27166099999999,42.582944],[-74.27151000000001,42.582936],[-74.271135,42.582895],[-74.270931,42.582891],[-74.27079999999999,42.582904],[-74.27069400000001,42.582932],[-74.270262,42.583103],[-74.26983799999999,42.583238],[-74.269521,42.583318],[-74.269263,42.583372],[-74.269096,42.583392],[-74.268945,42.583392],[-74.268852,42.583384],[-74.26854899999999,42.58336],[-74.268407,42.583364],[-74.268264,42.583384],[-74.268129,42.583425],[-74.26767700000001,42.583608],[-74.26746900000001,42.58371],[-74.26742400000001,42.583747],[-74.26713700000001,42.584082],[-74.266914,42.584342],[-74.266633,42.584614],[-74.266192,42.585025],[-74.265911,42.585287],[-74.265781,42.585441],[-74.265715,42.585564],[-74.265666,42.58569],[-74.265483,42.586333],[-74.265418,42.586472],[-74.265291,42.586696],[-74.265002,42.587128],[-74.26464300000001,42.587608],[-74.26449599999999,42.587858],[-74.264396,42.587996],[-74.26427700000001,42.588121],[-74.26416999999999,42.588209],[-74.264039,42.58829],[-74.26322399999999,42.588741],[-74.262861,42.588916],[-74.26257099999999,42.589083],[-74.26234700000001,42.589262],[-74.26171100000001,42.589828],[-74.26119300000001,42.590252],[-74.260937,42.590497],[-74.260863,42.590562],[-74.260643,42.590704],[-74.260504,42.590778],[-74.26008400000001,42.591014],[-74.259852,42.591169],[-74.259688,42.591307],[-74.259608,42.591385],[-74.259501,42.59149],[-74.259317,42.591702],[-74.259012,42.592118],[-74.258832,42.592415],[-74.258392,42.593116],[-74.257801,42.593983],[-74.25774800000001,42.594097],[-74.25771899999999,42.594199],[-74.257662,42.594603],[-74.257564,42.595047],[-74.257468,42.595288],[-74.257364,42.595487],[-74.256153,42.597397],[-74.25546,42.598615],[-74.254914,42.599365],[-74.254828,42.599442],[-74.254718,42.599499],[-74.2546,42.599515],[-74.254514,42.599507],[-74.254392,42.599475],[-74.252725,42.598929],[-74.252289,42.598795],[-74.25179900000001,42.598606],[-74.251153,42.598312],[-74.250812,42.598141],[-74.25062800000001,42.598049],[-74.25051000000001,42.597971],[-74.250367,42.597861],[-74.250219,42.597713],[-74.249522,42.597178],[-74.24942799999999,42.597088],[-74.249336,42.596982],[-74.24916899999999,42.596728],[-74.248957,42.596452],[-74.248802,42.596307],[-74.24837599999999,42.596008],[-74.247991,42.595792],[-74.24778499999999,42.595694],[-74.247265,42.595493],[-74.245762,42.595036],[-74.24567999999999,42.595024],[-74.245622,42.595016],[-74.24552799999999,42.595018],[-74.245436,42.59503],[-74.245238,42.59511],[-74.244608,42.59546],[-74.244392,42.595562],[-74.24428,42.595603],[-74.24416600000001,42.595625],[-74.244078,42.595629],[-74.24380499999999,42.595617],[-74.243036,42.595564],[-74.242547,42.595574],[-74.242262,42.595592],[-74.241585,42.595654],[-74.240315,42.595724],[-74.238623,42.595831],[-74.238677,42.595754],[-74.238743,42.595617],[-74.238882,42.595234],[-74.239086,42.594611],[-74.239436,42.59375],[-74.239817,42.592653],[-74.24009,42.591681],[-74.24027,42.590797],[-74.240303,42.590704],[-74.24030999999999,42.590376],[-74.240432,42.58976],[-74.240522,42.589137],[-74.24062000000001,42.588176],[-74.240628,42.587891],[-74.240612,42.587394],[-74.240551,42.586648],[-74.240477,42.586265],[-74.240122,42.585019],[-74.23964100000001,42.583076],[-74.239368,42.582159],[-74.239054,42.58121],[-74.238748,42.580228],[-74.23867,42.579896],[-74.238642,42.57974],[-74.238557,42.578868],[-74.238455,42.578322],[-74.23839,42.578087],[-74.238283,42.577764],[-74.238247,42.577463],[-74.23826200000001,42.576184],[-74.238275,42.575397],[-74.238243,42.574408],[-74.23811499999999,42.573816],[-74.238108,42.573503],[-74.238145,42.573092],[-74.238435,42.571412],[-74.238473,42.571221],[-74.238557,42.570892],[-74.238609,42.570766],[-74.238736,42.57057],[-74.238923,42.570379],[-74.23924599999999,42.570151],[-74.23940899999999,42.570008],[-74.23961300000001,42.569739],[-74.240049,42.569043],[-74.24020400000001,42.56886],[-74.24006199999999,42.56877],[-74.23999000000001,42.568718],[-74.23988,42.56861],[-74.239785,42.568467],[-74.23957,42.56802],[-74.238927,42.566533],[-74.238721,42.566155],[-74.238612,42.566028],[-74.23839,42.565844],[-74.238114,42.56565],[-74.23786699999999,42.565487],[-74.237345,42.565165],[-74.23723699999999,42.565107],[-74.236954,42.564971],[-74.23701800000001,42.564811],[-74.237081,42.564629],[-74.237241,42.564666],[-74.237449,42.56467],[-74.237675,42.564637],[-74.23784499999999,42.56465],[-74.23801400000001,42.564676],[-74.238153,42.564724],[-74.23827300000001,42.564789],[-74.238508,42.564457],[-74.249752,42.563444],[-74.261205,42.562576],[-74.263285,42.562411],[-74.280084,42.561094],[-74.28877300000001,42.560482],[-74.288943,42.560473],[-74.289114,42.560458],[-74.30164000000001,42.559551],[-74.30180300000001,42.559562],[-74.302329,42.559524],[-74.30259,42.559505],[-74.303578,42.559436],[-74.303696,42.559428],[-74.304344,42.559382],[-74.30446999999999,42.559372],[-74.304512,42.55937],[-74.30473600000001,42.559352],[-74.304998,42.559332],[-74.305373,42.559303],[-74.305446,42.559298],[-74.306051,42.559251],[-74.30674999999999,42.559198],[-74.306837,42.559191],[-74.306983,42.55918],[-74.308317,42.559077],[-74.308454,42.559062],[-74.308555,42.559059],[-74.309245,42.559006],[-74.30938500000001,42.55899],[-74.30967699999999,42.558968],[-74.30998700000001,42.558949],[-74.317257,42.558393],[-74.31732700000001,42.558383],[-74.317409,42.558381],[-74.31822,42.558319],[-74.318487,42.558295],[-74.337543,42.556854],[-74.339403,42.556772],[-74.340295,42.555708],[-74.34753499999999,42.54621],[-74.348224,42.545281],[-74.350593,42.546516],[-74.35121700000001,42.546841],[-74.37126499999999,42.557265],[-74.371624,42.557486],[-74.37302,42.558211],[-74.37313899999999,42.558273],[-74.37388199999999,42.558659],[-74.37406300000001,42.559538],[-74.37460799999999,42.562177],[-74.375378,42.564937],[-74.378685,42.576836],[-74.37813,42.577544]]],"type":"Polygon"}
}