{
  "id": "360290087004",
  "type": "Feature",
  "properties": {
    "area_land":183617,
    "area_water":0,
    "geoid":"360290087004",
    "name":"Block Group 4",
    "state":"ny"
},
  "bbox": [
    -78.878745,
    42.963569,
    -78.870136,
    42.966014
],
  "geometry": {"coordinates":[[[-78.878743,42.96449],[-78.878739,42.965027],[-78.878739,42.965235],[-78.878737,42.965827],[-78.878737,42.965965],[-78.876386,42.96598],[-78.873814,42.965998],[-78.870428,42.966014],[-78.870345,42.965307],[-78.87034199999999,42.965289],[-78.87025199999999,42.964528],[-78.87017,42.963907],[-78.870136,42.96362],[-78.87026,42.963621],[-78.87370300000001,42.963599],[-78.87628599999999,42.963589],[-78.87633599999999,42.963588],[-78.87873999999999,42.963569],[-78.878745,42.964229],[-78.878743,42.96449]]],"type":"Polygon"}
}