{
  "id": "360550121001",
  "type": "Feature",
  "properties": {
    "area_land":228514,
    "area_water":0,
    "geoid":"360550121001",
    "name":"Block Group 1",
    "state":"ny"
},
  "bbox": [
    -77.500469,
    43.112051,
    -77.490528,
    43.116781
],
  "geometry": {"coordinates":[[[-77.500085,43.114443],[-77.499692,43.115199],[-77.49887200000001,43.116781],[-77.498504,43.116658],[-77.498462,43.116644],[-77.496585,43.116116],[-77.494277,43.115481],[-77.490528,43.114419],[-77.49068800000001,43.114274],[-77.490808,43.114164],[-77.491394,43.113817],[-77.49242,43.113213],[-77.493469,43.112615],[-77.494483,43.112051],[-77.49584299999999,43.112421],[-77.49815599999999,43.113059],[-77.500469,43.113701],[-77.500085,43.114443]]],"type":"Polygon"}
}