{
  "id": "361090022003",
  "type": "Feature",
  "properties": {
    "area_land":30035684,
    "area_water":43582,
    "geoid":"361090022003",
    "name":"Block Group 3",
    "state":"ny"
},
  "bbox": [
    -76.402293,
    42.532699,
    -76.321548,
    42.62052
],
  "geometry": {"coordinates":[[[-76.402293,42.620059],[-76.40145200000001,42.620062],[-76.400419,42.620091],[-76.40026400000001,42.620096],[-76.40022999999999,42.620096],[-76.387038,42.620508],[-76.38658599999999,42.620519],[-76.38657000000001,42.62052],[-76.386527,42.620457],[-76.384131,42.61801],[-76.38408699999999,42.617964],[-76.384045,42.617922],[-76.38391900000001,42.617792],[-76.38352,42.617333],[-76.383342,42.617071],[-76.383219,42.616891],[-76.381773,42.614297],[-76.381502,42.613836],[-76.381079,42.61326],[-76.379829,42.611783],[-76.379147,42.610967],[-76.378889,42.610622],[-76.37884699999999,42.610563],[-76.378393,42.610011],[-76.377122,42.608373],[-76.376653,42.607778],[-76.37585799999999,42.60674],[-76.37572900000001,42.606558],[-76.375539,42.606321],[-76.374684,42.60535],[-76.37342200000001,42.604004],[-76.373335,42.603912],[-76.37268,42.603254],[-76.372495,42.603066],[-76.371796,42.602422],[-76.371458,42.60203],[-76.371195,42.601636],[-76.37097900000001,42.601202],[-76.370926,42.601027],[-76.370648,42.60013],[-76.370577,42.599883],[-76.370553,42.599798],[-76.37033599999999,42.599215],[-76.369893,42.598194],[-76.369761,42.597813],[-76.369736,42.597714],[-76.369722,42.597642],[-76.36970100000001,42.597534],[-76.369675,42.597225],[-76.36967,42.59717],[-76.369708,42.596529],[-76.36971200000001,42.596458],[-76.36972299999999,42.596317],[-76.369736,42.596138],[-76.369715,42.595989],[-76.36968400000001,42.595846],[-76.369636,42.595712],[-76.36957200000001,42.595591],[-76.3695,42.595457],[-76.369124,42.594952],[-76.368979,42.594769],[-76.368831,42.594622],[-76.368664,42.594489],[-76.367609,42.593741],[-76.367031,42.593379],[-76.366816,42.593255],[-76.366721,42.593189],[-76.366635,42.593118],[-76.36656000000001,42.593038],[-76.366495,42.592953],[-76.366444,42.592863],[-76.366406,42.592769],[-76.366381,42.592675],[-76.36636900000001,42.592576],[-76.366371,42.592482],[-76.366387,42.592382],[-76.366417,42.592287],[-76.36646,42.592197],[-76.36651500000001,42.592111],[-76.366609,42.592001],[-76.366805,42.591824],[-76.366945,42.591718],[-76.367019,42.591668],[-76.367149,42.591581],[-76.36724599999999,42.591521],[-76.36744400000001,42.59142],[-76.36766,42.591296],[-76.367778,42.5912],[-76.367825,42.591145],[-76.367864,42.591086],[-76.367896,42.591027],[-76.367918,42.590964],[-76.367931,42.590901],[-76.367936,42.590837],[-76.367935,42.590774],[-76.367935,42.590711],[-76.36769099999999,42.590115],[-76.367087,42.588682],[-76.366711,42.587768],[-76.366671,42.58766],[-76.366574,42.587432],[-76.366152,42.586414],[-76.366013,42.586092],[-76.36573799999999,42.585411],[-76.365619,42.585061],[-76.365619,42.585021],[-76.36562600000001,42.584998],[-76.36565899999999,42.584953],[-76.365514,42.584476],[-76.36528300000001,42.583719],[-76.36494999999999,42.58262],[-76.36471400000001,42.581843],[-76.36468000000001,42.581763],[-76.36442700000001,42.581158],[-76.36415100000001,42.580526],[-76.363844,42.57985],[-76.363608,42.579344],[-76.36353800000001,42.579228],[-76.363508,42.579188],[-76.36345300000001,42.579121],[-76.363353,42.579018],[-76.363238,42.578925],[-76.363111,42.578841],[-76.363017,42.578788],[-76.361761,42.578182],[-76.36168600000001,42.578142],[-76.36107800000001,42.577843],[-76.360707,42.577649],[-76.360321,42.577402],[-76.359821,42.577043],[-76.359593,42.576848],[-76.359458,42.576733],[-76.359208,42.576519],[-76.35888,42.576221],[-76.357834,42.575194],[-76.357404,42.57478],[-76.357148,42.574558],[-76.35686800000001,42.574363],[-76.35659800000001,42.574209],[-76.356315,42.574063],[-76.35624,42.574028],[-76.355408,42.573592],[-76.355097,42.573434],[-76.35325,42.572524],[-76.352615,42.572256],[-76.35154900000001,42.571864],[-76.350499,42.571426],[-76.349543,42.570986],[-76.349086,42.570776],[-76.349028,42.570745],[-76.347883,42.570196],[-76.347728,42.570126],[-76.347528,42.570042],[-76.347319,42.569973],[-76.34710099999999,42.569926],[-76.34687700000001,42.569893],[-76.34660100000001,42.569873],[-76.345921,42.569863],[-76.345196,42.569876],[-76.342702,42.569946],[-76.342675,42.56874],[-76.34262099999999,42.56725],[-76.342546,42.565445],[-76.342508,42.564288],[-76.342476,42.563303],[-76.336663,42.563393],[-76.334339,42.563434],[-76.331688,42.563487],[-76.328822,42.563551],[-76.32326500000001,42.563675],[-76.323251,42.563499],[-76.323189,42.56042],[-76.323123,42.558796],[-76.32311300000001,42.558505],[-76.32310699999999,42.558318],[-76.323088,42.556544],[-76.32279,42.549069],[-76.32329900000001,42.549063],[-76.32328699999999,42.548861],[-76.323215,42.54675],[-76.32298299999999,42.540647],[-76.322953,42.540021],[-76.32293900000001,42.539094],[-76.322891,42.538306],[-76.322891,42.538198],[-76.322861,42.538018],[-76.322802,42.537839],[-76.322744,42.53775],[-76.322684,42.537669],[-76.32252099999999,42.537513],[-76.32228499999999,42.537332],[-76.322112,42.537212],[-76.321963,42.537097],[-76.32186,42.537026],[-76.321696,42.536879],[-76.32164899999999,42.536821],[-76.321617,42.536763],[-76.321586,42.536682],[-76.321563,42.536597],[-76.321552,42.536431],[-76.32154800000001,42.536286],[-76.321561,42.536003],[-76.32158699999999,42.53571],[-76.321602,42.535363],[-76.321617,42.535209],[-76.321635,42.535128],[-76.321675,42.535065],[-76.321748,42.535023],[-76.32182299999999,42.535009],[-76.32189,42.535022],[-76.321952,42.535039],[-76.322143,42.535109],[-76.322371,42.535183],[-76.322564,42.535257],[-76.32270699999999,42.535305],[-76.322875,42.535348],[-76.323218,42.535416],[-76.323393,42.535441],[-76.32356,42.535457],[-76.323702,42.535465],[-76.323806,42.535459],[-76.323971,42.535434],[-76.324022,42.53542],[-76.32413200000001,42.535374],[-76.32419299999999,42.535333],[-76.32430600000001,42.535209],[-76.324347,42.535151],[-76.32454,42.534843],[-76.32493100000001,42.53432],[-76.325018,42.534211],[-76.325101,42.534116],[-76.32529599999999,42.533839],[-76.325406,42.533693],[-76.325485,42.533544],[-76.325515,42.533453],[-76.32553900000001,42.533332],[-76.32558400000001,42.533412],[-76.325631,42.533457],[-76.325678,42.533492],[-76.32576400000001,42.533514],[-76.32603,42.533519],[-76.329308,42.533504],[-76.33049,42.533454],[-76.331091,42.533434],[-76.331656,42.533423],[-76.332212,42.533403],[-76.333872,42.533374],[-76.334489,42.533367],[-76.33533300000001,42.533335],[-76.336201,42.533316],[-76.34319000000001,42.533215],[-76.349271,42.533038],[-76.35373300000001,42.532907],[-76.354947,42.532872],[-76.359938,42.532699],[-76.359939,42.534092],[-76.360038,42.534787],[-76.36027900000001,42.535685],[-76.36106599999999,42.538483],[-76.361322,42.539488],[-76.361372,42.539929],[-76.361385,42.540703],[-76.361445,42.542176],[-76.361498,42.543303],[-76.361582,42.545377],[-76.36162,42.546856],[-76.36164599999999,42.547465],[-76.36165800000001,42.548042],[-76.361666,42.548208],[-76.36166799999999,42.549131],[-76.361672,42.549235],[-76.36375099999999,42.549481],[-76.363817,42.549488],[-76.364498,42.549566],[-76.36468600000001,42.549595],[-76.364936,42.549655],[-76.366587,42.550153],[-76.366891,42.550222],[-76.367204,42.550268],[-76.36796699999999,42.550335],[-76.368279,42.550345],[-76.36879500000001,42.550348],[-76.36897399999999,42.550368],[-76.369147,42.550402],[-76.369263,42.550437],[-76.369316,42.55045],[-76.36948,42.550511],[-76.37105099999999,42.551167],[-76.371353,42.551249],[-76.37136099999999,42.55169],[-76.371481,42.553458],[-76.371494,42.553571],[-76.37153000000001,42.55371],[-76.371585,42.553849],[-76.37166000000001,42.553979],[-76.371753,42.554104],[-76.372793,42.55519],[-76.37349399999999,42.555911],[-76.374618,42.557095],[-76.37497399999999,42.557442],[-76.377078,42.559628],[-76.378192,42.560758],[-76.379448,42.561913],[-76.37985,42.562251],[-76.37991700000001,42.562291],[-76.380005,42.562357],[-76.38032200000001,42.562412],[-76.38041,42.56242],[-76.38049700000001,42.562414],[-76.381096,42.562407],[-76.391847,42.56213],[-76.394019,42.562075],[-76.394256,42.562068],[-76.396857,42.561991],[-76.397323,42.561985],[-76.39738,42.563592],[-76.39737700000001,42.563817],[-76.39718999999999,42.564944],[-76.397113,42.56541],[-76.39709499999999,42.565559],[-76.39709499999999,42.565793],[-76.397108,42.565964],[-76.39717899999999,42.566305],[-76.39730400000001,42.566641],[-76.397874,42.567796],[-76.398445,42.568838],[-76.39882,42.569423],[-76.399063,42.569743],[-76.399612,42.570472],[-76.399736,42.570659],[-76.399871,42.570923],[-76.399968,42.571201],[-76.400025,42.57148],[-76.400046,42.571795],[-76.400161,42.575094],[-76.40018999999999,42.5763],[-76.40038,42.579594],[-76.400901,42.590768],[-76.40093400000001,42.59147],[-76.40105,42.594692],[-76.40104700000001,42.594746],[-76.40119300000001,42.597928],[-76.401347,42.601047],[-76.401447,42.603229],[-76.401534,42.605353],[-76.401545,42.605618],[-76.401884,42.613868],[-76.402052,42.617585],[-76.40209299999999,42.618708],[-76.402136,42.619908],[-76.402147,42.619953],[-76.40218,42.619997],[-76.40223,42.620037],[-76.402293,42.620059]]],"type":"Polygon"}
}