{
  "id": "360750209023",
  "type": "Feature",
  "properties": {
    "area_land":61309868,
    "area_water":713558,
    "geoid":"360750209023",
    "name":"Block Group 3",
    "state":"ny"
},
  "bbox": [
    -76.339765,
    43.204772,
    -76.210816,
    43.325761
],
  "geometry": {"coordinates":[[[-76.339676,43.289232],[-76.339518,43.289516],[-76.33945,43.289659],[-76.339113,43.2904],[-76.33877699999999,43.291199],[-76.33847799999999,43.291823],[-76.33838,43.29198],[-76.33588,43.298093],[-76.335623,43.298714],[-76.33522499999999,43.299505],[-76.335098,43.299967],[-76.33501699999999,43.300148],[-76.334686,43.300926],[-76.333037,43.304802],[-76.332668,43.30564],[-76.33186499999999,43.307562],[-76.33040099999999,43.310952],[-76.33026700000001,43.311266],[-76.330045,43.311788],[-76.32934,43.313445],[-76.329143,43.313922],[-76.328931,43.31438],[-76.328733,43.314841],[-76.328433,43.315536],[-76.327684,43.317291],[-76.327032,43.318736],[-76.327003,43.318815],[-76.32486299999999,43.323945],[-76.324045,43.325761],[-76.321275,43.325138],[-76.321175,43.325115],[-76.32087300000001,43.325047],[-76.317176,43.324215],[-76.314712,43.323661],[-76.31454600000001,43.323622],[-76.31151800000001,43.322894],[-76.306757,43.321824],[-76.301045,43.320457],[-76.290164,43.318099],[-76.28976900000001,43.318016],[-76.276036,43.31495],[-76.268348,43.313216],[-76.261714,43.311729],[-76.26097300000001,43.311562],[-76.250288,43.309169],[-76.249652,43.309028],[-76.240746,43.306942],[-76.240099,43.306793],[-76.234784,43.305566],[-76.226069,43.303556],[-76.221784,43.302485],[-76.21976100000001,43.301972],[-76.21633300000001,43.301254],[-76.21112100000001,43.299856],[-76.210857,43.299793],[-76.210857,43.299767],[-76.21085600000001,43.299247],[-76.210832,43.297368],[-76.210835,43.288624],[-76.21083400000001,43.286751],[-76.210832,43.284571],[-76.210831,43.283485],[-76.21082199999999,43.281099],[-76.21082199999999,43.28043],[-76.210823,43.280075],[-76.210823,43.279842],[-76.210824,43.279591],[-76.21082800000001,43.278042],[-76.210819,43.27688],[-76.21081599999999,43.276076],[-76.210841,43.275424],[-76.210943,43.27212],[-76.21081700000001,43.270427],[-76.210925,43.270311],[-76.211214,43.269936],[-76.211545,43.269388],[-76.21185699999999,43.268896],[-76.212202,43.268285],[-76.212998,43.266962],[-76.213261,43.266526],[-76.213605,43.265982],[-76.21372,43.265836],[-76.214416,43.266023],[-76.214979,43.266154],[-76.21646200000001,43.266516],[-76.217119,43.266671],[-76.21817,43.266933],[-76.222146,43.267884],[-76.22249600000001,43.267971],[-76.22284000000001,43.268056],[-76.22318799999999,43.26812],[-76.22348100000001,43.268153],[-76.223676,43.268153],[-76.224557,43.268091],[-76.225033,43.268054],[-76.225167,43.268044],[-76.22671200000001,43.26793],[-76.22742700000001,43.2679],[-76.227791,43.267897],[-76.22825400000001,43.267906],[-76.22833900000001,43.26791],[-76.22902999999999,43.267943],[-76.230313,43.268032],[-76.231262,43.268096],[-76.232743,43.268204],[-76.23308900000001,43.268239],[-76.23341600000001,43.268287],[-76.23386499999999,43.268375],[-76.23435000000001,43.26847],[-76.238908,43.269517],[-76.23921799999999,43.269575],[-76.239304,43.269603],[-76.23944299999999,43.269691],[-76.240139,43.270266],[-76.240461,43.270495],[-76.24083899999999,43.270785],[-76.242306,43.272057],[-76.24275400000001,43.272462],[-76.243202,43.272851],[-76.24377,43.27338],[-76.24564700000001,43.274978],[-76.246272,43.275554],[-76.24668800000001,43.275937],[-76.24784099999999,43.276953],[-76.24811,43.277222],[-76.248452,43.277492],[-76.248598,43.27759],[-76.248695,43.277655],[-76.24881600000001,43.277711],[-76.249285,43.277857],[-76.24979,43.277972],[-76.251228,43.278314],[-76.252196,43.278538],[-76.252982,43.278709],[-76.25506799999999,43.279164],[-76.255769,43.279321],[-76.262766,43.280893],[-76.263188,43.280959],[-76.26378699999999,43.281014],[-76.263778,43.280629],[-76.263746,43.28043],[-76.263302,43.279312],[-76.263143,43.278673],[-76.26307199999999,43.278464],[-76.26299400000001,43.27833],[-76.262548,43.277697],[-76.26239,43.277496],[-76.262112,43.277128],[-76.26186800000001,43.276763],[-76.26176,43.276518],[-76.26142,43.275321],[-76.260744,43.272741],[-76.260603,43.272372],[-76.260452,43.272142],[-76.26026899999999,43.271936],[-76.26011200000001,43.271779],[-76.257541,43.269338],[-76.25706599999999,43.268859],[-76.256626,43.268384],[-76.256424,43.268122],[-76.255996,43.267418],[-76.25563,43.266741],[-76.255458,43.266425],[-76.255425,43.266326],[-76.25542,43.266162],[-76.255447,43.266035],[-76.255523,43.26582],[-76.255686,43.265358],[-76.25634100000001,43.263803],[-76.257611,43.260691],[-76.25824299999999,43.259176],[-76.258481,43.258651],[-76.25858599999999,43.258474],[-76.25879500000001,43.258166],[-76.259345,43.257472],[-76.259573,43.257232],[-76.259747,43.257071],[-76.25999299999999,43.256875],[-76.261391,43.255883],[-76.26283100000001,43.254921],[-76.26315099999999,43.254693],[-76.263307,43.254594],[-76.263445,43.254516],[-76.26358999999999,43.254465],[-76.263582,43.254393],[-76.263558,43.253922],[-76.263577,43.253042],[-76.26358500000001,43.252687],[-76.263616,43.252106],[-76.26363499999999,43.251986],[-76.263696,43.251611],[-76.263999,43.250527],[-76.26419,43.249994],[-76.264503,43.249166],[-76.265518,43.246623],[-76.26607799999999,43.245304],[-76.26687800000001,43.24333],[-76.2671,43.242807],[-76.267338,43.242134],[-76.267503,43.241694],[-76.26761500000001,43.241349],[-76.26779399999999,43.240856],[-76.268052,43.24026],[-76.26792,43.240235],[-76.267337,43.240094],[-76.26688900000001,43.239937],[-76.266582,43.239803],[-76.26616,43.239574],[-76.266212,43.239523],[-76.26617400000001,43.239502],[-76.266176,43.239464],[-76.266096,43.239315],[-76.266032,43.239245],[-76.265882,43.239138],[-76.26570599999999,43.238983],[-76.26519999999999,43.238504],[-76.264927,43.238291],[-76.26482,43.238221],[-76.264708,43.238104],[-76.264548,43.237842],[-76.264473,43.237746],[-76.264104,43.237329],[-76.26390600000001,43.237148],[-76.26371399999999,43.237046],[-76.26349500000001,43.236945],[-76.263307,43.236822],[-76.26318499999999,43.236699],[-76.263104,43.236651],[-76.262874,43.236619],[-76.26257,43.236619],[-76.262024,43.23672],[-76.261736,43.236752],[-76.261517,43.236795],[-76.261084,43.23696],[-76.26095599999999,43.236992],[-76.26085500000001,43.237035],[-76.26063000000001,43.237104],[-76.260406,43.237206],[-76.260304,43.237243],[-76.25993,43.237435],[-76.2597,43.237596],[-76.25904800000001,43.237841],[-76.25877,43.23789],[-76.258257,43.23789],[-76.257946,43.237847],[-76.25756199999999,43.237729],[-76.257465,43.237692],[-76.25734199999999,43.237617],[-76.257187,43.237494],[-76.25707,43.237425],[-76.25696499999999,43.237316],[-76.256804,43.23708],[-76.25676199999999,43.236958],[-76.256687,43.236824],[-76.256516,43.236664],[-76.256505,43.236562],[-76.256612,43.236354],[-76.256665,43.236285],[-76.256703,43.236215],[-76.256713,43.236167],[-76.256681,43.235772],[-76.256687,43.235462],[-76.256698,43.235422],[-76.256816,43.235299],[-76.25703,43.235176],[-76.257137,43.235128],[-76.257238,43.235069],[-76.25729200000001,43.235016],[-76.257329,43.234946],[-76.257356,43.234733],[-76.257356,43.234653],[-76.25734,43.234578],[-76.257313,43.234514],[-76.257249,43.234439],[-76.257244,43.234188],[-76.25723000000001,43.234153],[-76.257164,43.233985],[-76.256902,43.233584],[-76.256629,43.2332],[-76.256365,43.232864],[-76.25614,43.232538],[-76.255622,43.231876],[-76.255563,43.231764],[-76.25537,43.231427],[-76.255172,43.231197],[-76.255017,43.231048],[-76.254969,43.230989],[-76.254814,43.230743],[-76.254625,43.230536],[-76.254492,43.230429],[-76.25412300000001,43.229985],[-76.254048,43.229873],[-76.253936,43.229734],[-76.253882,43.229692],[-76.253642,43.229537],[-76.253316,43.229168],[-76.253091,43.22888],[-76.252797,43.228538],[-76.251795,43.227555],[-76.251394,43.227123],[-76.251116,43.226856],[-76.250891,43.226695],[-76.250619,43.226546],[-76.249848,43.225951],[-76.24975499999999,43.226009],[-76.249394,43.225707],[-76.249374,43.225687],[-76.249047,43.225369],[-76.248867,43.225175],[-76.248364,43.224504],[-76.248216,43.224283],[-76.24805600000001,43.223892],[-76.24796000000001,43.223614],[-76.24759299999999,43.222398],[-76.247473,43.222053],[-76.247085,43.221003],[-76.246818,43.220374],[-76.246509,43.219837],[-76.245987,43.219095],[-76.245639,43.218645],[-76.245244,43.218093],[-76.24510600000001,43.217901],[-76.245144,43.217886],[-76.245195,43.217888],[-76.245279,43.217926],[-76.245474,43.218055],[-76.24542700000001,43.217838],[-76.245311,43.217522],[-76.244934,43.216768],[-76.244795,43.216541],[-76.24466200000001,43.216403],[-76.24446399999999,43.216286],[-76.243135,43.215623],[-76.242096,43.215189],[-76.241902,43.215135],[-76.24138499999999,43.215051],[-76.24127900000001,43.215018],[-76.24120600000001,43.214982],[-76.241111,43.21492],[-76.240922,43.214818],[-76.240816,43.214778],[-76.240335,43.214705],[-76.240112,43.214647],[-76.23970799999999,43.214555],[-76.239383,43.214526],[-76.238986,43.214468],[-76.238891,43.214464],[-76.23879599999999,43.214483],[-76.238694,43.214574],[-76.238643,43.214588],[-76.238581,43.214588],[-76.238497,43.214559],[-76.23838000000001,43.214406],[-76.238242,43.214308],[-76.238027,43.214209],[-76.23643,43.213845],[-76.23522699999999,43.213495],[-76.235063,43.213481],[-76.23492,43.213484],[-76.23477800000001,43.213499],[-76.23436599999999,43.213484],[-76.234162,43.213444],[-76.233929,43.213346],[-76.23299900000001,43.212854],[-76.23276799999999,43.212709],[-76.232146,43.212213],[-76.232088,43.21214],[-76.232044,43.212064],[-76.232,43.211951],[-76.231978,43.211794],[-76.231934,43.211262],[-76.23191300000001,43.211135],[-76.231876,43.211065],[-76.231814,43.210993],[-76.231373,43.210599],[-76.231165,43.210395],[-76.230844,43.209885],[-76.23071299999999,43.209656],[-76.230542,43.209178],[-76.230407,43.208923],[-76.230327,43.208829],[-76.230206,43.20865],[-76.22994,43.20834],[-76.229838,43.208238],[-76.229721,43.208144],[-76.229488,43.208031],[-76.22924399999999,43.207885],[-76.228639,43.20755],[-76.22776,43.20708],[-76.22765099999999,43.207044],[-76.227158,43.206912],[-76.22673500000001,43.206763],[-76.22560900000001,43.206289],[-76.224985,43.20594],[-76.22422299999999,43.205561],[-76.223771,43.20535],[-76.22360399999999,43.205295],[-76.223265,43.20524],[-76.222949,43.205204],[-76.22285599999999,43.205204],[-76.222812,43.205213],[-76.222791,43.205248],[-76.222798,43.205286],[-76.222831,43.205304],[-76.22331,43.20535],[-76.22338999999999,43.205375],[-76.223412,43.205401],[-76.223412,43.205441],[-76.223383,43.205459],[-76.22268699999999,43.205441],[-76.222318,43.205475],[-76.222184,43.205526],[-76.22208500000001,43.205545],[-76.221874,43.205545],[-76.221615,43.205453],[-76.221513,43.205432],[-76.221356,43.205417],[-76.22099900000001,43.205406],[-76.220608,43.205428],[-76.220485,43.205446],[-76.22004,43.205486],[-76.21912500000001,43.205523],[-76.218603,43.205526],[-76.218501,43.205512],[-76.218374,43.205475],[-76.218031,43.20534],[-76.217823,43.205289],[-76.21763900000001,43.205297],[-76.217645,43.204963],[-76.217646,43.204834],[-76.217646,43.204821],[-76.217873,43.204772],[-76.22212,43.204899],[-76.22223099999999,43.204902],[-76.22444900000001,43.204968],[-76.23004899999999,43.207868],[-76.23384900000001,43.212368],[-76.24015,43.214168],[-76.24464999999999,43.214568],[-76.24645,43.218168],[-76.247826,43.220196],[-76.248592,43.222262],[-76.249075,43.223565],[-76.249961,43.22512],[-76.250001,43.225191],[-76.250238,43.225433],[-76.25135,43.226568],[-76.25285,43.227768],[-76.254834,43.230244],[-76.25655,43.232068],[-76.25775,43.234068],[-76.25795100000001,43.234868],[-76.257851,43.235468],[-76.25745000000001,43.236868],[-76.25805099999999,43.237368],[-76.258951,43.237468],[-76.26055100000001,43.236868],[-76.26265100000001,43.236268],[-76.263751,43.236368],[-76.26565100000001,43.238468],[-76.267551,43.239668],[-76.26828999999999,43.239579],[-76.270051,43.239368],[-76.27125100000001,43.239568],[-76.272851,43.240168],[-76.274051,43.240168],[-76.27515099999999,43.239568],[-76.27555099999999,43.238768],[-76.273551,43.236268],[-76.27215099999999,43.234868],[-76.27035100000001,43.234168],[-76.268351,43.233368],[-76.267751,43.232768],[-76.26745099999999,43.231768],[-76.26745099999999,43.229568],[-76.266851,43.227468],[-76.26615099999999,43.227068],[-76.264551,43.226668],[-76.26355100000001,43.226168],[-76.262851,43.225168],[-76.262151,43.223568],[-76.262451,43.222568],[-76.262951,43.220868],[-76.262051,43.218468],[-76.262355,43.218004],[-76.264351,43.214968],[-76.26445099999999,43.213468],[-76.266352,43.211319],[-76.266363,43.211306],[-76.26652199999999,43.211127],[-76.26688300000001,43.211567],[-76.267512,43.212308],[-76.26799699999999,43.212918],[-76.26837500000001,43.213458],[-76.268601,43.213828],[-76.268899,43.214356],[-76.269144,43.214894],[-76.269299,43.215312],[-76.269839,43.216973],[-76.27089700000001,43.220282],[-76.271134,43.220968],[-76.271333,43.221459],[-76.271587,43.222021],[-76.271908,43.222692],[-76.27242,43.22359],[-76.27248899999999,43.223713],[-76.272667,43.223986],[-76.272971,43.224472],[-76.273171,43.22479],[-76.27346199999999,43.225209],[-76.273999,43.225908],[-76.275096,43.227226],[-76.279512,43.232421],[-76.281441,43.234702],[-76.28227699999999,43.235678],[-76.282918,43.236367],[-76.283084,43.236528],[-76.283297,43.23673],[-76.283479,43.236894],[-76.284026,43.237381],[-76.28451200000001,43.237783],[-76.284869,43.238054],[-76.285847,43.238742],[-76.286661,43.239269],[-76.29074,43.241893],[-76.29143500000001,43.242358],[-76.29186799999999,43.242666],[-76.292292,43.242986],[-76.293087,43.243635],[-76.29470000000001,43.245003],[-76.297489,43.247374],[-76.29805,43.247834],[-76.29841,43.248102],[-76.29867400000001,43.248282],[-76.298946,43.248453],[-76.299541,43.248792],[-76.299948,43.248995],[-76.30068900000001,43.249327],[-76.30102100000001,43.249451],[-76.301395,43.24959],[-76.30221,43.249894],[-76.30355,43.250379],[-76.30385099999999,43.250491],[-76.304519,43.250735],[-76.305753,43.251181],[-76.305784,43.251192],[-76.30838199999999,43.252133],[-76.308767,43.25227],[-76.30972300000001,43.252649],[-76.31039800000001,43.252963],[-76.310975,43.253286],[-76.311295,43.253474],[-76.31186,43.253849],[-76.312263,43.254162],[-76.312686,43.254529],[-76.31316,43.254998],[-76.31344300000001,43.255311],[-76.31373600000001,43.255682],[-76.31386500000001,43.255862],[-76.314313,43.256604],[-76.315929,43.259635],[-76.316582,43.260875],[-76.317117,43.261858],[-76.317156,43.261932],[-76.319183,43.265759],[-76.320156,43.267584],[-76.32043,43.268061],[-76.320718,43.268546],[-76.321021,43.269027],[-76.32166100000001,43.269995],[-76.322052,43.270546],[-76.323077,43.271873],[-76.323492,43.27237],[-76.32392,43.272863],[-76.325408,43.274484],[-76.325756,43.274855],[-76.327894,43.277155],[-76.32919200000001,43.278559],[-76.33235500000001,43.28199],[-76.33448300000001,43.284281],[-76.335037,43.284822],[-76.33618199999999,43.285836],[-76.338999,43.288263],[-76.339675,43.288848],[-76.339765,43.288925],[-76.339676,43.289232]]],"type":"Polygon"}
}