{
  "id": "361190148113",
  "type": "Feature",
  "properties": {
    "area_land":1384162,
    "area_water":74741,
    "geoid":"361190148113",
    "name":"Block Group 3",
    "state":"ny"
},
  "bbox": [
    -73.793113,
    41.299875,
    -73.780216,
    41.316904
],
  "geometry": {"coordinates":[[[-73.79311300000001,41.300326],[-73.793103,41.300555],[-73.79311300000001,41.300854],[-73.7931,41.300997],[-73.793043,41.301341],[-73.79290399999999,41.301659],[-73.792579,41.302245],[-73.792461,41.302502],[-73.792295,41.302868],[-73.792216,41.303136],[-73.79204799999999,41.303979],[-73.791977,41.30436],[-73.791618,41.306583],[-73.791498,41.307041],[-73.79145800000001,41.30724],[-73.791448,41.307578],[-73.791518,41.30846],[-73.79154699999999,41.308666],[-73.791687,41.309633],[-73.791757,41.310119],[-73.79180700000001,41.31046],[-73.791926,41.311484],[-73.79200299999999,41.312501],[-73.792097,41.313072],[-73.79215600000001,41.313599],[-73.792191,41.313915],[-73.792216,41.314147],[-73.792254,41.314487],[-73.79226800000001,41.31477],[-73.79225599999999,41.315217],[-73.79208,41.31625],[-73.791983,41.316239],[-73.791735,41.316239],[-73.791561,41.316252],[-73.791332,41.316302],[-73.79077100000001,41.31648],[-73.789852,41.316752],[-73.78969600000001,41.316792],[-73.78942499999999,41.316848],[-73.789113,41.316881],[-73.788797,41.316902],[-73.788584,41.316904],[-73.788336,41.316879],[-73.788056,41.316826],[-73.78787699999999,41.316764],[-73.787544,41.316617],[-73.787431,41.316562],[-73.787226,41.31644],[-73.787029,41.316304],[-73.786839,41.316135],[-73.786599,41.31592],[-73.786536,41.315843],[-73.786328,41.315592],[-73.78618400000001,41.315377],[-73.786055,41.315072],[-73.786001,41.314836],[-73.78594200000001,41.31439],[-73.78587400000001,41.313981],[-73.785804,41.313693],[-73.785732,41.313506],[-73.78560299999999,41.313301],[-73.785517,41.313205],[-73.785366,41.31309],[-73.78502899999999,41.312908],[-73.78466299999999,41.312782],[-73.784311,41.312733],[-73.78407900000001,41.312732],[-73.78333600000001,41.312718],[-73.783046,41.31271],[-73.782158,41.312708],[-73.781502,41.312678],[-73.781494,41.312426],[-73.78145499999999,41.312287],[-73.781375,41.312181],[-73.78124800000001,41.311952],[-73.78121899999999,41.311784],[-73.780861,41.311063],[-73.78073999999999,41.310733],[-73.780787,41.310446],[-73.780514,41.31001],[-73.780484,41.309816],[-73.78044,41.309098],[-73.780261,41.308106],[-73.780216,41.307768],[-73.780339,41.307402],[-73.780461,41.307239],[-73.780691,41.307158],[-73.780708,41.307072],[-73.780812,41.306563],[-73.780738,41.306397],[-73.780525,41.30596],[-73.78060499999999,41.305933],[-73.780716,41.305777],[-73.780828,41.305541],[-73.78103900000001,41.305096],[-73.78142800000001,41.30431],[-73.78174799999999,41.303586],[-73.78193,41.303105],[-73.78203000000001,41.302822],[-73.78204599999999,41.302741],[-73.78206900000001,41.30262],[-73.782104,41.302441],[-73.782143,41.302073],[-73.782143,41.301491],[-73.782112,41.301232],[-73.782083,41.301088],[-73.78254,41.300985],[-73.78307100000001,41.300927],[-73.783276,41.300905],[-73.784859,41.30074],[-73.785382,41.300689],[-73.787786,41.300448],[-73.788438,41.300381],[-73.79149700000001,41.300067],[-73.791853,41.300021],[-73.792405,41.299951],[-73.793105,41.299875],[-73.79311300000001,41.300326]]],"type":"Polygon"}
}