{
  "id": "360470555001",
  "type": "Feature",
  "properties": {
    "area_land":261667,
    "area_water":0,
    "geoid":"360470555001",
    "name":"Block Group 1",
    "state":"ny"
},
  "bbox": [
    -73.967578,
    40.715106,
    -73.959009,
    40.721571
],
  "geometry": {"coordinates":[[[-73.966836,40.717564],[-73.96667100000001,40.717743],[-73.966613,40.717806],[-73.966511,40.717917],[-73.966477,40.717955],[-73.966249,40.718205],[-73.96613000000001,40.718331],[-73.965704,40.718779],[-73.96557199999999,40.71895],[-73.96520599999999,40.719425],[-73.965086,40.719581],[-73.964676,40.72011],[-73.964038,40.720939],[-73.96373,40.721339],[-73.96355,40.721571],[-73.961823,40.720414],[-73.96172,40.72032],[-73.96043400000001,40.719521],[-73.95900899999999,40.718636],[-73.95960599999999,40.71808],[-73.960196,40.717528],[-73.960791,40.716973],[-73.961423,40.716384],[-73.961912,40.71593],[-73.962289,40.71558],[-73.962777,40.715106],[-73.964472,40.715733],[-73.966099,40.716206],[-73.966639,40.716365],[-73.967578,40.716496],[-73.966836,40.717564]]],"type":"Polygon"}
}