{
  "id": "360470512004",
  "type": "Feature",
  "properties": {
    "area_land":43580,
    "area_water":0,
    "geoid":"360470512004",
    "name":"Block Group 4",
    "state":"ny"
},
  "bbox": [
    -73.965468,
    40.644302,
    -73.963125,
    40.646904
],
  "geometry": {"coordinates":[[[-73.965468,40.64672],[-73.964535,40.646819],[-73.964305,40.646821],[-73.964156,40.646835],[-73.963945,40.64686],[-73.96356900000001,40.646904],[-73.96312500000001,40.644512],[-73.96408700000001,40.644407],[-73.964623,40.644342],[-73.965012,40.644302],[-73.965468,40.64672]]],"type":"Polygon"}
}