{
  "id": "360470170001",
  "type": "Feature",
  "properties": {
    "area_land":58427,
    "area_water":0,
    "geoid":"360470170001",
    "name":"Block Group 1",
    "state":"ny"
},
  "bbox": [
    -74.012022,
    40.609706,
    -74.008304,
    40.613897
],
  "geometry": {"coordinates":[[[-74.012022,40.610156],[-74.010251,40.611853],[-74.01097,40.612288],[-74.011712,40.612735],[-74.01108600000001,40.613339],[-74.010504,40.613897],[-74.008304,40.612568],[-74.00888399999999,40.612007],[-74.009511,40.611406],[-74.011278,40.609706],[-74.012022,40.610156]]],"type":"Polygon"}
}