{
  "id": "360470181003",
  "type": "Feature",
  "properties": {
    "area_land":38459,
    "area_water":0,
    "geoid":"360470181003",
    "name":"Block Group 3",
    "state":"ny"
},
  "bbox": [
    -73.975106,
    40.685513,
    -73.973119,
    40.689698
],
  "geometry": {"coordinates":[[[-73.975106,40.689698],[-73.974109,40.689663],[-73.973648,40.687303],[-73.97337400000001,40.685885],[-73.973119,40.685781],[-73.97324999999999,40.685653],[-73.973322,40.685621],[-73.974281,40.685513],[-73.97444,40.686309],[-73.974616,40.687191],[-73.975106,40.689698]]],"type":"Polygon"}
}