{
  "id": "360910611001",
  "type": "Feature",
  "properties": {
    "area_land":905177,
    "area_water":0,
    "geoid":"360910611001",
    "name":"Block Group 1",
    "state":"ny"
},
  "bbox": [
    -73.781474,
    43.083359,
    -73.761948,
    43.09214
],
  "geometry": {"coordinates":[[[-73.781474,43.087543],[-73.78063899999999,43.088044],[-73.780362,43.08821],[-73.77928799999999,43.088862],[-73.779071,43.088992],[-73.778283,43.089464],[-73.777596,43.089854],[-73.77668,43.090339],[-73.775493,43.090881],[-73.77499,43.091095],[-73.774669,43.09123],[-73.77319,43.09174],[-73.772913,43.091825],[-73.772634,43.091892],[-73.772059,43.092006],[-73.771514,43.092104],[-73.771096,43.09214],[-73.771083,43.092098],[-73.771064,43.092032],[-73.770955,43.09167],[-73.770517,43.090393],[-73.770104,43.090457],[-73.769541,43.090504],[-73.76891500000001,43.090512],[-73.768744,43.090507],[-73.76825700000001,43.090512],[-73.76740100000001,43.090535],[-73.766603,43.090521],[-73.765484,43.090543],[-73.764368,43.090543],[-73.763638,43.090571],[-73.76329200000001,43.090578],[-73.763356,43.089428],[-73.763356,43.089069],[-73.763334,43.088837],[-73.763282,43.088633],[-73.763217,43.088523],[-73.763071,43.088367],[-73.76292100000001,43.088279],[-73.762404,43.088055],[-73.76212700000001,43.08788],[-73.762007,43.087745],[-73.761957,43.087631],[-73.761948,43.087508],[-73.761962,43.087362],[-73.762033,43.087227],[-73.762106,43.087139],[-73.762238,43.087008],[-73.76226800000001,43.086773],[-73.762483,43.08679],[-73.762619,43.086791],[-73.762754,43.086802],[-73.76298300000001,43.086649],[-73.76305600000001,43.08656],[-73.763087,43.086481],[-73.76298800000001,43.085824],[-73.762829,43.084897],[-73.762839,43.084837],[-73.76288,43.084726],[-73.763214,43.084732],[-73.76416999999999,43.08473],[-73.76525599999999,43.084653],[-73.76566699999999,43.084618],[-73.766311,43.084546],[-73.766886,43.084496],[-73.767212,43.084465],[-73.76774,43.084416],[-73.767912,43.084406],[-73.76833999999999,43.08437],[-73.769108,43.084305],[-73.770149,43.084205],[-73.770675,43.08416],[-73.77152100000001,43.084087],[-73.771815,43.084051],[-73.77224699999999,43.083995],[-73.77475699999999,43.083602],[-73.776454,43.083359],[-73.776765,43.084093],[-73.777089,43.084821],[-73.777496,43.085752],[-73.777522,43.085812],[-73.77777500000001,43.086348],[-73.778049,43.08687],[-73.778245,43.087269],[-73.778434,43.087656],[-73.77808400000001,43.087762],[-73.777807,43.087857],[-73.777261,43.088079],[-73.776583,43.088389],[-73.77639000000001,43.088496],[-73.77617100000001,43.088652],[-73.776014,43.088806],[-73.775729,43.08912],[-73.775514,43.089298],[-73.775767,43.089195],[-73.77616,43.089086],[-73.777002,43.088895],[-73.77792700000001,43.088656],[-73.77832100000001,43.088532],[-73.778994,43.088347],[-73.77923,43.088251],[-73.779462,43.088157],[-73.77967099999999,43.088052],[-73.77985700000001,43.087933],[-73.78005400000001,43.08777],[-73.78033000000001,43.087471],[-73.78060499999999,43.08714],[-73.78103900000001,43.08736],[-73.781334,43.087483],[-73.781474,43.087543]]],"type":"Polygon"}
}