{
  "id": "360810202001",
  "type": "Feature",
  "properties": {
    "area_land":153117,
    "area_water":0,
    "geoid":"360810202001",
    "name":"Block Group 1",
    "state":"ny"
},
  "bbox": [
    -73.810749,
    40.68706,
    -73.80415,
    40.692564
],
  "geometry": {"coordinates":[[[-73.810535,40.691974],[-73.81026799999999,40.692046],[-73.80971,40.692199],[-73.808902,40.692564],[-73.808036,40.691983],[-73.80723999999999,40.691432],[-73.806425,40.690874],[-73.807044,40.690348],[-73.806359,40.689881],[-73.80568700000001,40.689421],[-73.805046,40.688982],[-73.80446999999999,40.688584],[-73.80415000000001,40.688388],[-73.80468500000001,40.688373],[-73.80483599999999,40.688225],[-73.80511,40.688072],[-73.80528700000001,40.687982],[-73.805722,40.687827],[-73.806656,40.687508],[-73.807473,40.68723],[-73.807773,40.687136],[-73.80801700000001,40.68706],[-73.808752,40.688329],[-73.809088,40.688929],[-73.809158,40.689058],[-73.809819,40.690256],[-73.810749,40.691917],[-73.810535,40.691974]]],"type":"Polygon"}
}