{
  "id": "361031458082",
  "type": "Feature",
  "properties": {
    "area_land":1205435,
    "area_water":0,
    "geoid":"361031458082",
    "name":"Block Group 2",
    "state":"ny"
},
  "bbox": [
    -73.139474,
    40.803957,
    -73.119189,
    40.812763
],
  "geometry": {"coordinates":[[[-73.139374,40.811507],[-73.139275,40.811785],[-73.138474,40.811871],[-73.137359,40.811971],[-73.13596200000001,40.812085],[-73.134407,40.812183],[-73.133616,40.812217],[-73.132458,40.812269],[-73.131338,40.812301],[-73.129625,40.812342],[-73.125525,40.812446],[-73.125047,40.81247],[-73.12451799999999,40.812481],[-73.12335,40.812538],[-73.121695,40.812629],[-73.119978,40.812723],[-73.11918900000001,40.812763],[-73.119241,40.812491],[-73.119333,40.812017],[-73.11933999999999,40.811983],[-73.119488,40.811479],[-73.119494,40.811447],[-73.11958,40.811091],[-73.119612,40.810958],[-73.119635,40.810895],[-73.11976,40.810559],[-73.119818,40.810408],[-73.119856,40.810268],[-73.119978,40.809973],[-73.120029,40.809862],[-73.12009999999999,40.809707],[-73.120107,40.809535],[-73.12014499999999,40.809382],[-73.12016199999999,40.809005],[-73.120161,40.808826],[-73.12015599999999,40.808787],[-73.120131,40.80859],[-73.120107,40.808306],[-73.12013,40.808146],[-73.12008,40.807637],[-73.12002099999999,40.806921],[-73.12021300000001,40.806879],[-73.120845,40.806824],[-73.121863,40.806733],[-73.12249,40.806681],[-73.122995,40.806635],[-73.123604,40.806569],[-73.124149,40.806493],[-73.12483899999999,40.806383],[-73.12581299999999,40.806201],[-73.12753499999999,40.805831],[-73.12900500000001,40.805535],[-73.131317,40.805097],[-73.13156600000001,40.80505],[-73.131823,40.805005],[-73.13597900000001,40.804198],[-73.137137,40.803957],[-73.137536,40.804995],[-73.138217,40.806668],[-73.139183,40.809066],[-73.139292,40.809306],[-73.13947400000001,40.811142],[-73.139374,40.811507]]],"type":"Polygon"}
}