{
  "id": "360050147012",
  "type": "Feature",
  "properties": {
    "area_land":68225,
    "area_water":0,
    "geoid":"360050147012",
    "name":"Block Group 2",
    "state":"ny"
},
  "bbox": [
    -73.905915,
    40.832216,
    -73.901856,
    40.835336
],
  "geometry": {"coordinates":[[[-73.90591499999999,40.833055],[-73.904634,40.835336],[-73.903521,40.83501],[-73.901856,40.834622],[-73.903435,40.832216],[-73.905051,40.832708],[-73.90591499999999,40.833055]]],"type":"Polygon"}
}