{
  "id": "360610189004",
  "type": "Feature",
  "properties": {
    "area_land":22437,
    "area_water":0,
    "geoid":"360610189004",
    "name":"Block Group 4",
    "state":"ny"
},
  "bbox": [
    -73.963845,
    40.797338,
    -73.961478,
    40.79924
],
  "geometry": {"coordinates":[[[-73.96336100000001,40.798564],[-73.962869,40.79924],[-73.961478,40.798654],[-73.96198099999999,40.797988],[-73.962436,40.797338],[-73.96384500000001,40.797917],[-73.96336100000001,40.798564]]],"type":"Polygon"}
}