{
  "id": "361059506003",
  "type": "Feature",
  "properties": {
    "area_land":12043723,
    "area_water":566581,
    "geoid":"361059506003",
    "name":"Block Group 3",
    "state":"ny"
},
  "bbox": [
    -74.807962,
    41.7435,
    -74.738649,
    41.78103
],
  "geometry": {"coordinates":[[[-74.807946,41.753786],[-74.80785,41.753931],[-74.80777,41.754063],[-74.80770099999999,41.754177],[-74.807277,41.754981],[-74.806859,41.755999],[-74.806516,41.756712],[-74.80612499999999,41.757428],[-74.805755,41.75805],[-74.805379,41.758535],[-74.804948,41.75924],[-74.80479099999999,41.759496],[-74.804524,41.759327],[-74.804333,41.759229],[-74.80426799999999,41.759314],[-74.80393100000001,41.759152],[-74.803833,41.759146],[-74.803721,41.759097],[-74.803572,41.759087],[-74.803512,41.759121],[-74.80346,41.759223],[-74.803361,41.759253],[-74.803209,41.759253],[-74.80295700000001,41.75931],[-74.802869,41.759367],[-74.802483,41.759493],[-74.80234900000001,41.759519],[-74.80218499999999,41.759576],[-74.80215,41.759607],[-74.802115,41.759694],[-74.80192700000001,41.75975],[-74.80181,41.759803],[-74.80174599999999,41.759816],[-74.801676,41.759877],[-74.801641,41.759934],[-74.80160600000001,41.760047],[-74.801559,41.760086],[-74.801333,41.760181],[-74.80130800000001,41.760209],[-74.801114,41.760313],[-74.801081,41.760362],[-74.800799,41.760483],[-74.800359,41.760611],[-74.80000099999999,41.760669],[-74.799858,41.7607],[-74.799616,41.760784],[-74.798799,41.760811],[-74.798304,41.760789],[-74.797815,41.7607],[-74.796947,41.760584],[-74.796148,41.760429],[-74.795952,41.760398],[-74.79580300000001,41.760414],[-74.795391,41.760531],[-74.795317,41.760579],[-74.79521200000001,41.760623],[-74.79506000000001,41.760767],[-74.79498,41.760825],[-74.794826,41.760863],[-74.79477300000001,41.760902],[-74.794738,41.76099],[-74.794656,41.761046],[-74.794473,41.76106],[-74.79437799999999,41.7611],[-74.794242,41.761103],[-74.79416000000001,41.76112],[-74.793938,41.761129],[-74.793706,41.761167],[-74.793605,41.761173],[-74.79353399999999,41.761186],[-74.793353,41.761186],[-74.792866,41.761136],[-74.792705,41.761065],[-74.79261,41.760936],[-74.792449,41.760661],[-74.79239800000001,41.760661],[-74.79233600000001,41.760686],[-74.792174,41.760729],[-74.792154,41.760679],[-74.791787,41.760764],[-74.791675,41.760814],[-74.791585,41.760883],[-74.79152000000001,41.760972],[-74.791473,41.761074],[-74.79145,41.761217],[-74.79145,41.761461],[-74.791483,41.761692],[-74.791493,41.761875],[-74.791462,41.762285],[-74.791408,41.762587],[-74.791202,41.763197],[-74.791106,41.763482],[-74.790907,41.763966],[-74.790756,41.764228],[-74.79047,41.764723],[-74.790442,41.764773],[-74.79026500000001,41.765063],[-74.79011,41.765285],[-74.790014,41.765398],[-74.789931,41.765477],[-74.78974100000001,41.765628],[-74.789271,41.765969],[-74.788917,41.766262],[-74.788591,41.766532],[-74.788032,41.766963],[-74.78755099999999,41.76737],[-74.786587,41.76814],[-74.786306,41.768359],[-74.785139,41.769312],[-74.782571,41.771386],[-74.7825,41.771444],[-74.78132100000001,41.772384],[-74.780828,41.772797],[-74.78060600000001,41.772971],[-74.77975499999999,41.773641],[-74.778977,41.77426],[-74.778273,41.774841],[-74.777418,41.775533],[-74.77712099999999,41.775759],[-74.77623199999999,41.776499],[-74.775904,41.77676],[-74.77558999999999,41.777033],[-74.773995,41.778521],[-74.77322599999999,41.779262],[-74.7724,41.780083],[-74.771721,41.780723],[-74.77136900000001,41.78103],[-74.771073,41.780764],[-74.770876,41.780612],[-74.769974,41.780013],[-74.769823,41.779927],[-74.769475,41.77977],[-74.769177,41.779669],[-74.76841400000001,41.779436],[-74.76805299999999,41.779342],[-74.766873,41.779069],[-74.765372,41.778761],[-74.765146,41.778723],[-74.764135,41.778628],[-74.76287000000001,41.778574],[-74.762134,41.778566],[-74.760148,41.778562],[-74.758579,41.778537],[-74.757532,41.778496],[-74.756767,41.778445],[-74.755877,41.778366],[-74.753911,41.778172],[-74.752983,41.778065],[-74.751294,41.777936],[-74.75106,41.777918],[-74.750737,41.777909],[-74.750607,41.77791],[-74.750131,41.777914],[-74.749679,41.777909],[-74.749303,41.777904],[-74.74876,41.777887],[-74.748254,41.777844],[-74.74733500000001,41.777702],[-74.746481,41.777572],[-74.74609100000001,41.777539],[-74.74504899999999,41.777517],[-74.744714,41.777481],[-74.74446,41.777438],[-74.743968,41.777326],[-74.743171,41.777094],[-74.742451,41.77686],[-74.74181400000001,41.776699],[-74.741445,41.776625],[-74.741259,41.776574],[-74.74109900000001,41.776514],[-74.740751,41.776357],[-74.740549,41.776238],[-74.740399,41.776115],[-74.74001,41.77571],[-74.73951700000001,41.775096],[-74.73899400000001,41.774323],[-74.738827,41.773965],[-74.738806,41.773939],[-74.738744,41.773896],[-74.738649,41.773871],[-74.738756,41.773843],[-74.739261,41.77365],[-74.739452,41.773557],[-74.739575,41.773483],[-74.739921,41.773262],[-74.74020400000001,41.773001],[-74.74028300000001,41.772905],[-74.740859,41.772206],[-74.740999,41.772065],[-74.741165,41.771919],[-74.741282,41.771842],[-74.741496,41.77172],[-74.741758,41.771607],[-74.741918,41.771552],[-74.74230300000001,41.771448],[-74.74243,41.771381],[-74.743444,41.770922],[-74.74422199999999,41.770595],[-74.745169,41.770216],[-74.745323,41.770132],[-74.745527,41.769959],[-74.745586,41.769885],[-74.745723,41.769654],[-74.74594999999999,41.769094],[-74.74599000000001,41.76888],[-74.74599000000001,41.768686],[-74.74590000000001,41.767955],[-74.745902,41.767568],[-74.74589400000001,41.767441],[-74.745831,41.767076],[-74.74571899999999,41.766757],[-74.74560200000001,41.766345],[-74.74557299999999,41.766121],[-74.745575,41.765967],[-74.745638,41.765683],[-74.74568600000001,41.765579],[-74.74635000000001,41.764596],[-74.74681200000001,41.763923],[-74.747113,41.763539],[-74.74768400000001,41.762884],[-74.74804,41.762524],[-74.748366,41.762225],[-74.748633,41.761944],[-74.749634,41.760806],[-74.750001,41.760415],[-74.750529,41.759884],[-74.750764,41.759626],[-74.751711,41.758624],[-74.751873,41.758432],[-74.752167,41.758036],[-74.75246,41.757576],[-74.752616,41.757268],[-74.752768,41.75691],[-74.752864,41.756628],[-74.752949,41.756271],[-74.753122,41.755361],[-74.753153,41.755117],[-74.753276,41.754146],[-74.753671,41.751715],[-74.753918,41.75],[-74.75403900000001,41.748707],[-74.754136,41.747212],[-74.75416199999999,41.746745],[-74.754254,41.745709],[-74.754271,41.745294],[-74.754288,41.74486],[-74.754403,41.7435],[-74.75901500000001,41.744319],[-74.762102,41.744819],[-74.76317400000001,41.745083],[-74.764261,41.745397],[-74.777204,41.747891],[-74.78247399999999,41.749056],[-74.782899,41.749146],[-74.78315600000001,41.749201],[-74.78349300000001,41.749233],[-74.783997,41.749295],[-74.785355,41.749531],[-74.785888,41.749623],[-74.806912,41.753514],[-74.807962,41.753744],[-74.807946,41.753786]]],"type":"Polygon"}
}