{
  "id": "360810981000",
  "type": "Feature",
  "properties": {
    "area_land":0,
    "area_water":922899,
    "geoid":"360810981000",
    "name":"Block Group 0",
    "state":"ny"
},
  "bbox": [
    -73.827583,
    40.797058,
    -73.810145,
    40.80579
],
  "geometry": {"coordinates":[[[-73.827583,40.803936],[-73.823438,40.80481],[-73.817418,40.80579],[-73.81129900000001,40.805397],[-73.81014500000001,40.797147],[-73.81058,40.797226],[-73.810643,40.79723],[-73.8108,40.797249],[-73.81090500000001,40.797261],[-73.811038,40.79728],[-73.811144,40.797288],[-73.811234,40.79729],[-73.811423,40.797334],[-73.811497,40.797344],[-73.81159599999999,40.797369],[-73.811609,40.797372],[-73.811637,40.797413],[-73.811705,40.797566],[-73.811751,40.797689],[-73.811757,40.797739],[-73.811759,40.79781],[-73.81176600000001,40.79791],[-73.811772,40.797987],[-73.811786,40.798032],[-73.811852,40.798049],[-73.81198000000001,40.798076],[-73.81208599999999,40.798097],[-73.812146,40.798099],[-73.812226,40.798123],[-73.81228,40.798127],[-73.81233899999999,40.798123],[-73.81240200000001,40.798105],[-73.812504,40.798082],[-73.81254,40.798059],[-73.812552,40.798035],[-73.81258099999999,40.797974],[-73.81259799999999,40.797918],[-73.81264,40.797852],[-73.812659,40.797778],[-73.812673,40.797753],[-73.81269899999999,40.79768],[-73.812715,40.797616],[-73.812725,40.797554],[-73.812738,40.797498],[-73.812753,40.797437],[-73.812766,40.797378],[-73.812792,40.797321],[-73.81281300000001,40.797282],[-73.812856,40.797287],[-73.81287,40.797198],[-73.812887,40.797153],[-73.812929,40.797167],[-73.81304299999999,40.797178],[-73.812934,40.797426],[-73.813052,40.797468],[-73.81316,40.797198],[-73.81324600000001,40.797212],[-73.813277,40.797106],[-73.81337000000001,40.797075],[-73.81349400000001,40.797058],[-73.813378,40.797314],[-73.813486,40.797346],[-73.81335,40.797672],[-73.81342100000001,40.797693],[-73.8137,40.797079],[-73.813717,40.797102],[-73.81374599999999,40.797143],[-73.81373000000001,40.797188],[-73.81369599999999,40.79726],[-73.81366800000001,40.797328],[-73.813635,40.797403],[-73.813632,40.797494],[-73.813667,40.797538],[-73.81374599999999,40.797566],[-73.813796,40.797583],[-73.81388200000001,40.797629],[-73.813993,40.797686],[-73.814065,40.79772],[-73.81415,40.79776],[-73.814215,40.797781],[-73.81429199999999,40.797791],[-73.814367,40.797818],[-73.814442,40.797844],[-73.81453500000001,40.797895],[-73.81462500000001,40.797925],[-73.814717,40.797992],[-73.814826,40.798027],[-73.814954,40.798082],[-73.815043,40.798125],[-73.815133,40.798167],[-73.815313,40.798258],[-73.81541,40.798279],[-73.81551399999999,40.798322],[-73.81562599999999,40.798371],[-73.815702,40.798402],[-73.81581799999999,40.798452],[-73.81593599999999,40.798492],[-73.81605399999999,40.79855],[-73.81609899999999,40.798604],[-73.816143,40.798661],[-73.81619000000001,40.798714],[-73.816244,40.798776],[-73.816295,40.798827],[-73.816365,40.798868],[-73.816407,40.798906],[-73.816452,40.798961],[-73.81651599999999,40.799025],[-73.816597,40.799052],[-73.816745,40.799088],[-73.816889,40.79912],[-73.81705100000001,40.799164],[-73.81725299999999,40.799228],[-73.817386,40.799289],[-73.81752299999999,40.799379],[-73.817627,40.799454],[-73.81768,40.799492],[-73.81777099999999,40.799541],[-73.817881,40.799639],[-73.817971,40.799698],[-73.818088,40.799774],[-73.818236,40.799871],[-73.818381,40.799968],[-73.818454,40.800023],[-73.818532,40.800081],[-73.81860500000001,40.800144],[-73.818703,40.800223],[-73.818777,40.800266],[-73.818853,40.80031],[-73.818927,40.80038],[-73.81904299999999,40.80048],[-73.819126,40.800549],[-73.819213,40.800621],[-73.819321,40.800698],[-73.819407,40.800746],[-73.81946000000001,40.800791],[-73.819501,40.800824],[-73.819562,40.800855],[-73.819616,40.800868],[-73.819722,40.800888],[-73.819776,40.800924],[-73.819804,40.800973],[-73.81984,40.800995],[-73.819883,40.800978],[-73.819908,40.800979],[-73.819906,40.800944],[-73.81990999999999,40.800886],[-73.819931,40.800866],[-73.820007,40.800835],[-73.820069,40.80081],[-73.820162,40.800748],[-73.82020799999999,40.80073],[-73.820262,40.800709],[-73.82034,40.800672],[-73.82040499999999,40.80064],[-73.820499,40.801011],[-73.820528,40.801006],[-73.820432,40.800628],[-73.820469,40.800619],[-73.82057399999999,40.800598],[-73.82062500000001,40.800591],[-73.82071500000001,40.800577],[-73.820786,40.80056],[-73.82085499999999,40.800538],[-73.82092,40.800511],[-73.821037,40.800441],[-73.821146,40.800344],[-73.821303,40.800211],[-73.821404,40.800135],[-73.82150900000001,40.800062],[-73.821618,40.799992],[-73.821699,40.799925],[-73.821776,40.799855],[-73.821849,40.799783],[-73.821901,40.799728],[-73.82204900000001,40.799544],[-73.822129,40.799424],[-73.822213,40.799309],[-73.822266,40.799222],[-73.822388,40.799113],[-73.822658,40.799489],[-73.82271299999999,40.799491],[-73.82240899999999,40.799055],[-73.822523,40.798981],[-73.822757,40.799348],[-73.82280799999999,40.799345],[-73.82253900000001,40.798925],[-73.82259500000001,40.798906],[-73.82266799999999,40.798861],[-73.822743,40.798817],[-73.82280299999999,40.798768],[-73.822896,40.798694],[-73.82297699999999,40.798652],[-73.82302199999999,40.798612],[-73.823285,40.79897],[-73.823328,40.798972],[-73.82306800000001,40.798591],[-73.823162,40.79857],[-73.823212,40.798511],[-73.82327100000001,40.798459],[-73.823335,40.798447],[-73.823409,40.798418],[-73.82371999999999,40.798897],[-73.823762,40.798883],[-73.82344999999999,40.798402],[-73.82349499999999,40.79839],[-73.823528,40.798338],[-73.823643,40.798242],[-73.82373800000001,40.798198],[-73.82384999999999,40.798143],[-73.82391699999999,40.798236],[-73.823948,40.798227],[-73.824214,40.798698],[-73.824279,40.798709],[-73.823984,40.798216],[-73.824033,40.798198],[-73.824022,40.798167],[-73.824012,40.798128],[-73.82403100000001,40.798093],[-73.824065,40.798066],[-73.824088,40.798048],[-73.827583,40.803936]]],"type":"Polygon"}
}