{
  "id": "360450603001",
  "type": "Feature",
  "properties": {
    "area_land":79742777,
    "area_water":4272734,
    "geoid":"360450603001",
    "name":"Block Group 1",
    "state":"ny"
},
  "bbox": [
    -76.309181,
    43.960002,
    -76.167818,
    44.149918
],
  "geometry": {"coordinates":[[[-76.309181,44.026556],[-76.308364,44.027303],[-76.306687,44.028074],[-76.305143,44.02875],[-76.30319799999999,44.030196],[-76.301721,44.031209],[-76.300916,44.032415],[-76.300983,44.033621],[-76.301118,44.035116],[-76.301721,44.035936],[-76.30152,44.036707],[-76.30138599999999,44.037382],[-76.30152,44.038395],[-76.30138599999999,44.039504],[-76.300648,44.040951],[-76.299373,44.041868],[-76.296958,44.043073],[-76.296018,44.044472],[-76.29554899999999,44.045629],[-76.295807,44.046057],[-76.295087,44.04664],[-76.294804,44.046863],[-76.29482299999999,44.046874],[-76.29495,44.047079],[-76.29500400000001,44.047097],[-76.295058,44.047103],[-76.29510000000001,44.047127],[-76.29516599999999,44.047215],[-76.295132,44.047415],[-76.295135,44.047799],[-76.29518899999999,44.048011],[-76.29527,44.048188],[-76.295393,44.04838],[-76.295671,44.048765],[-76.29583599999999,44.048965],[-76.296283,44.049418],[-76.296858,44.049867],[-76.297297,44.050167],[-76.297663,44.05034],[-76.297961,44.050445],[-76.29810000000001,44.050472],[-76.298165,44.050468],[-76.298412,44.050372],[-76.298508,44.050365],[-76.29859399999999,44.050386],[-76.29821699999999,44.050753],[-76.297489,44.051421],[-76.296583,44.052292],[-76.29612,44.052725],[-76.29498100000001,44.053731],[-76.29432300000001,44.054261],[-76.293181,44.055126],[-76.293099,44.05516],[-76.29300499999999,44.055179],[-76.29285,44.055181],[-76.292726,44.055152],[-76.292226,44.054941],[-76.29211599999999,44.054914],[-76.292002,44.054912],[-76.29186300000001,44.054941],[-76.291729,44.05499],[-76.291374,44.055163],[-76.290586,44.05557],[-76.28925,44.056289],[-76.28793899999999,44.056944],[-76.28757,44.05715],[-76.287265,44.057158],[-76.287115,44.057199],[-76.28669600000001,44.057427],[-76.28681,44.057552],[-76.284727,44.059002],[-76.28136000000001,44.06136],[-76.27975000000001,44.0625],[-76.278384,44.063537],[-76.277181,44.064472],[-76.276588,44.064904],[-76.275451,44.065691],[-76.274326,44.066466],[-76.271726,44.068207],[-76.27100900000001,44.068705],[-76.270011,44.069381],[-76.268978,44.070053],[-76.26890400000001,44.070101],[-76.268237,44.070518],[-76.26236,44.074225],[-76.262286,44.074272],[-76.25978600000001,44.075861],[-76.25703300000001,44.077624],[-76.256522,44.077931],[-76.25591799999999,44.078331],[-76.25557499999999,44.078554],[-76.25560900000001,44.078601],[-76.25564799999999,44.078658],[-76.258516,44.082773],[-76.26034,44.085367],[-76.26067,44.085804],[-76.26092199999999,44.086083],[-76.26105699999999,44.086206],[-76.261312,44.086419],[-76.261561,44.086595],[-76.262047,44.086874],[-76.266465,44.089068],[-76.267938,44.08979],[-76.27015,44.090897],[-76.273011,44.092308],[-76.27289399999999,44.092422],[-76.272571,44.092675],[-76.272379,44.092789],[-76.267764,44.095207],[-76.26646100000001,44.095907],[-76.264399,44.097079],[-76.26102899999999,44.099011],[-76.259315,44.099956],[-76.257581,44.100902],[-76.255386,44.102019],[-76.250232,44.104611],[-76.249534,44.104949],[-76.249336,44.10505],[-76.24910300000001,44.105154],[-76.247384,44.10603],[-76.24647400000001,44.106476],[-76.242752,44.108355],[-76.23998899999999,44.109762],[-76.23801,44.11077],[-76.236847,44.111342],[-76.235179,44.112198],[-76.23231199999999,44.113643],[-76.230797,44.114424],[-76.24230799999999,44.120121],[-76.243183,44.120473],[-76.243081,44.12053],[-76.242981,44.120585],[-76.24236399999999,44.120942],[-76.241647,44.121361],[-76.24125100000001,44.121584],[-76.240388,44.122014],[-76.238398,44.123094],[-76.237779,44.123439],[-76.236926,44.123895],[-76.23514,44.124881],[-76.234557,44.125194],[-76.23405099999999,44.125473],[-76.228111,44.128725],[-76.227254,44.129185],[-76.225224,44.130237],[-76.224518,44.130614],[-76.223713,44.131067],[-76.222826,44.131624],[-76.222561,44.131662],[-76.222323,44.131685],[-76.222167,44.131714],[-76.222003,44.131766],[-76.221096,44.131997],[-76.220873,44.132041],[-76.219832,44.132554],[-76.21957399999999,44.132701],[-76.219736,44.132847],[-76.21995200000001,44.133075],[-76.22012100000001,44.133379],[-76.21710899999999,44.135333],[-76.216235,44.135911],[-76.214944,44.136744],[-76.211422,44.138975],[-76.21075500000001,44.139407],[-76.210341,44.139663],[-76.209919,44.139953],[-76.209772,44.140071],[-76.20954399999999,44.14028],[-76.20926,44.140591],[-76.208642,44.141389],[-76.206469,44.144285],[-76.204654,44.146678],[-76.20430399999999,44.147091],[-76.204105,44.147327],[-76.20371799999999,44.147754],[-76.203372,44.148155],[-76.20213200000001,44.149537],[-76.201792,44.149918],[-76.201723,44.149762],[-76.201487,44.14922],[-76.201019,44.148054],[-76.200407,44.146588],[-76.20004400000001,44.145688],[-76.19948100000001,44.144062],[-76.199219,44.143317],[-76.19877099999999,44.141967],[-76.198525,44.141291],[-76.198241,44.140654],[-76.198049,44.140285],[-76.197671,44.139657],[-76.197154,44.138794],[-76.196871,44.138302],[-76.195521,44.136031],[-76.195306,44.135729],[-76.195092,44.135516],[-76.194681,44.135232],[-76.194247,44.135002],[-76.19328899999999,44.134578],[-76.191317,44.133658],[-76.190505,44.133296],[-76.18911199999999,44.132645],[-76.18901200000001,44.132597],[-76.18878100000001,44.132487],[-76.188604,44.132401],[-76.18845399999999,44.132328],[-76.18751,44.131833],[-76.185694,44.130922],[-76.185264,44.130687],[-76.184825,44.130427],[-76.183857,44.129808],[-76.18369800000001,44.129686],[-76.18342800000001,44.12943],[-76.18328,44.129246],[-76.18321400000001,44.129128],[-76.183092,44.128786],[-76.182891,44.127835],[-76.182834,44.127339],[-76.182846,44.127176],[-76.18288099999999,44.127026],[-76.183091,44.126409],[-76.183273,44.125947],[-76.18349000000001,44.125325],[-76.183567,44.125],[-76.18358000000001,44.124893],[-76.183576,44.124787],[-76.183549,44.124535],[-76.18347,44.12436],[-76.183131,44.123898],[-76.182833,44.123491],[-76.182625,44.123225],[-76.182334,44.122817],[-76.18194,44.122312],[-76.18085499999999,44.120852],[-76.180499,44.120396],[-76.179918,44.119622],[-76.177941,44.116972],[-76.176337,44.114838],[-76.17631,44.114803],[-76.174284,44.112086],[-76.17289100000001,44.110156],[-76.17218,44.109186],[-76.171857,44.108721],[-76.170238,44.106454],[-76.170214,44.106421],[-76.169405,44.10529],[-76.16873200000001,44.104371],[-76.167818,44.103051],[-76.16917100000001,44.10206],[-76.169432,44.101896],[-76.16949099999999,44.10186],[-76.169618,44.101721],[-76.16964900000001,44.101671],[-76.16964900000001,44.101571],[-76.169246,44.101069],[-76.169139,44.100911],[-76.16909200000001,44.100788],[-76.16908599999999,44.100452],[-76.169102,44.10034],[-76.169121,44.100317],[-76.169206,44.100283],[-76.16931,44.100286],[-76.169479,44.100459],[-76.16956,44.10051],[-76.169714,44.100556],[-76.16980599999999,44.10056],[-76.169856,44.100544],[-76.169895,44.100513],[-76.169933,44.100444],[-76.170018,44.100344],[-76.170157,44.10024],[-76.170226,44.100171],[-76.17025700000001,44.100125],[-76.17026300000001,44.100069],[-76.170239,44.100004],[-76.170197,44.099946],[-76.17013900000001,44.099923],[-76.17007,44.099923],[-76.170016,44.099904],[-76.170016,44.099873],[-76.170047,44.099831],[-76.170209,44.099704],[-76.17028999999999,44.099669],[-76.17037000000001,44.099654],[-76.17049400000001,44.099692],[-76.17062799999999,44.099719],[-76.17070099999999,44.099746],[-76.17076299999999,44.099754],[-76.170821,44.09975],[-76.170844,44.099727],[-76.17087100000001,44.099615],[-76.170925,44.099473],[-76.170948,44.099446],[-76.170948,44.099411],[-76.170913,44.099369],[-76.17084800000001,44.099319],[-76.17079,44.099292],[-76.170678,44.099277],[-76.170655,44.099246],[-76.170659,44.099207],[-76.17068999999999,44.099188],[-76.17076299999999,44.099165],[-76.170959,44.099131],[-76.171086,44.099134],[-76.171244,44.099157],[-76.17129199999999,44.099152],[-76.17135399999999,44.099113],[-76.171412,44.099044],[-76.171419,44.098971],[-76.171392,44.098921],[-76.171381,44.098859],[-76.171389,44.098817],[-76.171442,44.09874],[-76.171516,44.098667],[-76.17152299999999,44.098613],[-76.171508,44.098559],[-76.17140000000001,44.098379],[-76.171404,44.098267],[-76.171429,44.098234],[-76.171544,44.098173],[-76.17168700000001,44.098131],[-76.171775,44.098119],[-76.171826,44.0981],[-76.17185600000001,44.098061],[-76.171864,44.098007],[-76.171818,44.097942],[-76.171564,44.097873],[-76.171502,44.097823],[-76.17148299999999,44.097773],[-76.171494,44.097731],[-76.171525,44.097692],[-76.17161,44.097661],[-76.171818,44.097604],[-76.17185600000001,44.09758],[-76.171876,44.097534],[-76.171876,44.097454],[-76.171854,44.097305],[-76.1718,44.097209],[-76.17170400000001,44.097125],[-76.171677,44.097086],[-76.17168100000001,44.097032],[-76.171708,44.09699],[-76.171935,44.096878],[-76.171947,44.096836],[-76.171903,44.096756],[-76.171881,44.096725],[-76.171885,44.096694],[-76.171904,44.096671],[-76.17196199999999,44.096655],[-76.17246799999999,44.096403],[-76.172561,44.096346],[-76.17267200000001,44.096311],[-76.17278399999999,44.096315],[-76.172853,44.096346],[-76.17294200000001,44.096407],[-76.173019,44.096446],[-76.173115,44.096457],[-76.173215,44.096423],[-76.173258,44.096388],[-76.173311,44.096307],[-76.17338100000001,44.096019],[-76.173404,44.095973],[-76.17346499999999,44.095961],[-76.173542,44.095969],[-76.173743,44.096065],[-76.17381,44.096078],[-76.173895,44.096071],[-76.174503,44.095859],[-76.17476499999999,44.095802],[-76.17483799999999,44.095763],[-76.175011,44.095544],[-76.175132,44.095419],[-76.175175,44.095346],[-76.175175,44.0953],[-76.17514799999999,44.095246],[-76.175102,44.095215],[-76.175005,44.095176],[-76.174705,44.095126],[-76.174605,44.095076],[-76.17457400000001,44.095042],[-76.17458600000001,44.09495],[-76.17464699999999,44.094896],[-76.174744,44.094853],[-76.17504,44.094765],[-76.175094,44.094742],[-76.175156,44.094611],[-76.175229,44.094557],[-76.175338,44.094505],[-76.175488,44.094486],[-76.175635,44.094505],[-76.17577300000001,44.094505],[-76.176174,44.094455],[-76.17621200000001,44.094444],[-76.17625099999999,44.094399],[-76.176286,44.094334],[-76.176345,44.094287],[-76.17641500000001,44.094263],[-76.17650399999999,44.094263],[-76.17674,44.094363],[-76.176828,44.094434],[-76.176875,44.094499],[-76.176958,44.094752],[-76.176987,44.094781],[-76.177076,44.094817],[-76.177241,44.094811],[-76.177323,44.094793],[-76.17737,44.094752],[-76.177423,44.094681],[-76.177553,44.094416],[-76.177618,44.09434],[-76.177712,44.094292],[-76.177818,44.094288],[-76.17831,44.094301],[-76.178387,44.094286],[-76.17858699999999,44.094213],[-76.17876800000001,44.09419],[-76.178938,44.094224],[-76.17899199999999,44.094217],[-76.17901500000001,44.094151],[-76.179022,44.094001],[-76.179053,44.093901],[-76.179188,44.09364],[-76.179292,44.093494],[-76.179344,44.093453],[-76.179436,44.093453],[-76.17945899999999,44.093465],[-76.179571,44.093595],[-76.179648,44.093634],[-76.179783,44.093638],[-76.179833,44.093615],[-76.179948,44.093453],[-76.179968,44.093384],[-76.179964,44.093338],[-76.179925,44.093295],[-76.179829,44.093249],[-76.17971300000001,44.093211],[-76.179571,44.093199],[-76.179559,44.09318],[-76.179563,44.093145],[-76.179648,44.093099],[-76.179889,44.093036],[-76.180125,44.093015],[-76.180449,44.093026],[-76.180564,44.093015],[-76.180618,44.092969],[-76.180633,44.092919],[-76.18062999999999,44.092884],[-76.180603,44.092822],[-76.18054100000001,44.092757],[-76.18045600000001,44.092703],[-76.180179,44.092595],[-76.180148,44.092561],[-76.18014100000001,44.092511],[-76.180156,44.092349],[-76.180179,44.092303],[-76.180218,44.092269],[-76.180362,44.092205],[-76.18038900000001,44.092124],[-76.180412,44.09209],[-76.180458,44.092059],[-76.180558,44.092047],[-76.180639,44.092055],[-76.180789,44.092159],[-76.18086599999999,44.092201],[-76.180966,44.092205],[-76.18098999999999,44.092144],[-76.18100099999999,44.092032],[-76.18097,44.091809],[-76.180986,44.091717],[-76.180978,44.091667],[-76.180943,44.091628],[-76.180863,44.091578],[-76.18074300000001,44.09152],[-76.180716,44.091486],[-76.180724,44.091409],[-76.18077,44.091367],[-76.180824,44.091355],[-76.180893,44.091359],[-76.18098999999999,44.091386],[-76.18109,44.091451],[-76.181197,44.091597],[-76.181286,44.091636],[-76.181332,44.091636],[-76.18149,44.091559],[-76.18155400000001,44.091488],[-76.181577,44.091403],[-76.181577,44.091295],[-76.181631,44.091149],[-76.181669,44.09093],[-76.181696,44.090884],[-76.181764,44.090848],[-76.181815,44.090784],[-76.181819,44.090669],[-76.181804,44.090607],[-76.18177300000001,44.090561],[-76.181719,44.090534],[-76.181625,44.090513],[-76.181544,44.090513],[-76.181394,44.090493],[-76.181336,44.090463],[-76.181286,44.090416],[-76.181286,44.090324],[-76.181313,44.090278],[-76.181421,44.090182],[-76.181667,44.09002],[-76.181679,44.089982],[-76.18167099999999,44.089924],[-76.181679,44.089847],[-76.181729,44.08982],[-76.18189099999999,44.089786],[-76.182056,44.089801],[-76.18216,44.089801],[-76.18231,44.08977],[-76.182485,44.089661],[-76.182782,44.08943],[-76.18286999999999,44.089376],[-76.182939,44.089361],[-76.183013,44.089365],[-76.18309000000001,44.089388],[-76.183132,44.089422],[-76.183155,44.089457],[-76.18314700000001,44.089615],[-76.183155,44.089822],[-76.183278,44.089972],[-76.183505,44.090065],[-76.18368599999999,44.090122],[-76.18380999999999,44.090126],[-76.183871,44.090103],[-76.183925,44.090053],[-76.183971,44.08998],[-76.184029,44.089707],[-76.18406400000001,44.089645],[-76.18420399999999,44.089493],[-76.184308,44.089405],[-76.184489,44.089336],[-76.18476200000001,44.089217],[-76.184889,44.089143],[-76.18497000000001,44.08907],[-76.185013,44.088993],[-76.185174,44.088828],[-76.185282,44.08874],[-76.18571,44.088436],[-76.185771,44.088359],[-76.185787,44.088313],[-76.185787,44.08812],[-76.185813,44.088078],[-76.186061,44.087843],[-76.186381,44.0876],[-76.18651199999999,44.087568],[-76.186578,44.087561],[-76.18675500000001,44.087561],[-76.186813,44.087549],[-76.187121,44.087349],[-76.187309,44.087253],[-76.187715,44.086934],[-76.188044,44.086728],[-76.188365,44.086471],[-76.188593,44.08631],[-76.18876400000001,44.08615],[-76.18894400000001,44.085934],[-76.18916,44.085616],[-76.18933199999999,44.085424],[-76.18959099999999,44.085276],[-76.18964200000001,44.085247],[-76.189784,44.08521],[-76.189971,44.085202],[-76.190161,44.085213],[-76.19027699999999,44.085206],[-76.1904,44.085158],[-76.190747,44.084799],[-76.190786,44.084772],[-76.190901,44.084691],[-76.191013,44.084579],[-76.191121,44.084394],[-76.19127,44.084025],[-76.191464,44.083723],[-76.191547,44.083547],[-76.19161,44.083467],[-76.191692,44.083415],[-76.19206200000001,44.083277],[-76.19221899999999,44.083187],[-76.19246200000001,44.082945],[-76.192604,44.082755],[-76.192689,44.082721],[-76.19289499999999,44.0827],[-76.193037,44.082674],[-76.193186,44.082607],[-76.193406,44.08245],[-76.19367200000001,44.082305],[-76.193922,44.082077],[-76.194163,44.081745],[-76.194243,44.081635],[-76.19433600000001,44.081542],[-76.194419,44.081486],[-76.19454899999999,44.081445],[-76.194911,44.081352],[-76.19508999999999,44.08124],[-76.195212,44.08116],[-76.19556300000001,44.080984],[-76.195734,44.08079],[-76.195888,44.080619],[-76.19647500000001,44.080785],[-76.196844,44.080719],[-76.19763,44.080326],[-76.19940099999999,44.079146],[-76.200671,44.078146],[-76.201093,44.077592],[-76.202474,44.077845],[-76.203541,44.07679],[-76.204009,44.076167],[-76.204634,44.075243],[-76.206678,44.074058],[-76.20981399999999,44.072236],[-76.211816,44.070989],[-76.212884,44.070797],[-76.213618,44.070845],[-76.21435200000001,44.07166],[-76.215553,44.071612],[-76.216487,44.071277],[-76.21668699999999,44.071037],[-76.216487,44.070318],[-76.21675399999999,44.069455],[-76.218022,44.068544],[-76.21902300000001,44.066962],[-76.220558,44.066099],[-76.221492,44.065907],[-76.222826,44.065907],[-76.224228,44.065715],[-76.225295,44.065236],[-76.22623,44.0649],[-76.227431,44.065188],[-76.22776399999999,44.065332],[-76.229766,44.065667],[-76.23056699999999,44.064996],[-76.231701,44.064325],[-76.23330300000001,44.064085],[-76.23563799999999,44.063702],[-76.23724,44.063174],[-76.238775,44.062647],[-76.240443,44.062263],[-76.240977,44.06164],[-76.241844,44.061352],[-76.24344600000001,44.061304],[-76.24438000000001,44.0614],[-76.245181,44.062024],[-76.244981,44.062599],[-76.24491399999999,44.063462],[-76.245581,44.063845],[-76.24624900000001,44.063893],[-76.24825,44.062599],[-76.25152,44.060489],[-76.251587,44.059818],[-76.255858,44.057181],[-76.256325,44.056606],[-76.256592,44.055935],[-76.2654,44.051476],[-76.26526699999999,44.050421],[-76.264466,44.050229],[-76.264065,44.04951],[-76.263999,44.048311],[-76.265563,44.046039],[-76.266673,44.044955],[-76.268338,44.044043],[-76.2704,44.042332],[-76.271748,44.040736],[-76.272541,44.03874],[-76.274761,44.036517],[-76.276347,44.03532],[-76.27595100000001,44.034065],[-76.276347,44.032469],[-76.27722,44.031214],[-76.278251,44.029903],[-76.278171,44.027508],[-76.279599,44.026083],[-76.28039200000001,44.024429],[-76.279599,44.023346],[-76.27951899999999,44.022149],[-76.280709,44.021066],[-76.281819,44.020438],[-76.282612,44.01907],[-76.280947,44.0185],[-76.28039200000001,44.017416],[-76.280788,44.016048],[-76.280788,44.014851],[-76.28134300000001,44.013482],[-76.28166,44.012627],[-76.279836,44.012456],[-76.278964,44.013368],[-76.277854,44.014395],[-76.27666499999999,44.015706],[-76.275237,44.016276],[-76.271114,44.017702],[-76.26865599999999,44.018842],[-76.267308,44.019469],[-76.265246,44.019583],[-76.26334300000001,44.019583],[-76.261836,44.019982],[-76.259061,44.020381],[-76.256682,44.020894],[-76.254699,44.021579],[-76.253193,44.022719],[-76.25081400000001,44.023802],[-76.248831,44.024087],[-76.247642,44.024144],[-76.246135,44.024715],[-76.244311,44.024601],[-76.242329,44.025114],[-76.24082199999999,44.026083],[-76.23915700000001,44.026995],[-76.237571,44.027565],[-76.235747,44.028193],[-76.233844,44.028307],[-76.23186200000001,44.029048],[-76.230197,44.029675],[-76.228611,44.029618],[-76.22638999999999,44.030188],[-76.224487,44.029789],[-76.222426,44.02996],[-76.22115700000001,44.029903],[-76.220285,44.029903],[-76.219095,44.02939],[-76.21663700000001,44.03053],[-76.21560599999999,44.031499],[-76.21394100000001,44.031442],[-76.211879,44.031499],[-76.211562,44.030701],[-76.211483,44.030017],[-76.209897,44.030131],[-76.207756,44.029789],[-76.205932,44.029789],[-76.204187,44.029504],[-76.202918,44.028706],[-76.200777,44.028021],[-76.200143,44.026995],[-76.199905,44.025627],[-76.199747,44.024543],[-76.199905,44.023802],[-76.20054,44.022434],[-76.201729,44.020951],[-76.20220500000001,44.020039],[-76.202918,44.019127],[-76.20402900000001,44.018044],[-76.205456,44.017531],[-76.206249,44.016675],[-76.207359,44.015307],[-76.208152,44.014053],[-76.210055,44.012627],[-76.21283099999999,44.00989],[-76.21521,44.007382],[-76.21663700000001,44.006241],[-76.218064,44.004816],[-76.219492,44.003562],[-76.220364,44.002592],[-76.219729,44.001566],[-76.21941200000001,44.000597],[-76.219655,44.000098],[-76.21934,43.999001],[-76.21934,43.99672],[-76.219815,43.994725],[-76.220687,43.993242],[-76.222826,43.991418],[-76.225362,43.989365],[-76.226868,43.987598],[-76.229325,43.985944],[-76.23000399999999,43.985092],[-76.23170500000001,43.983436],[-76.233448,43.981155],[-76.234478,43.979159],[-76.23669700000001,43.977164],[-76.23883600000001,43.975567],[-76.241134,43.9738],[-76.244463,43.971462],[-76.247315,43.970151],[-76.248345,43.969182],[-76.25000900000001,43.968155],[-76.2531,43.966673],[-76.254605,43.965989],[-76.257141,43.966103],[-76.26086599999999,43.966103],[-76.263322,43.965476],[-76.265699,43.964848],[-76.267363,43.964107],[-76.267522,43.963366],[-76.268552,43.962283],[-76.26997799999999,43.96137],[-76.271642,43.960629],[-76.27497099999999,43.960344],[-76.279487,43.960002],[-76.281627,43.960116],[-76.282736,43.960686],[-76.282895,43.961598],[-76.282815,43.96234],[-76.282815,43.962682],[-76.283925,43.963138],[-76.28440000000001,43.963936],[-76.28432100000001,43.965419],[-76.284876,43.965761],[-76.28527200000001,43.96673],[-76.283053,43.969638],[-76.28131,43.971291],[-76.279884,43.973173],[-76.278853,43.973515],[-76.277902,43.973743],[-76.277506,43.974085],[-76.277269,43.974997],[-76.276555,43.975738],[-76.274891,43.977848],[-76.27401999999999,43.979901],[-76.27302299999999,43.981099],[-76.272983,43.981784],[-76.273943,43.982124],[-76.273864,43.982979],[-76.273309,43.984405],[-76.27172400000001,43.985032],[-76.27077199999999,43.985488],[-76.269346,43.987084],[-76.268632,43.988681],[-76.26807700000001,43.990277],[-76.26791900000001,43.991532],[-76.267681,43.992387],[-76.26704700000001,43.993926],[-76.26696699999999,43.995067],[-76.267205,43.99672],[-76.268394,43.99883],[-76.26974199999999,44.000198],[-76.270931,44.001053],[-76.27180300000001,44.001509],[-76.27275400000001,44.001224],[-76.274023,44.001167],[-76.27544899999999,44.001738],[-76.276163,44.003277],[-76.276718,44.004189],[-76.276718,44.004987],[-76.27743100000001,44.005957],[-76.27830299999999,44.006584],[-76.280523,44.007097],[-76.28123600000001,44.007781],[-76.28187,44.008636],[-76.283614,44.009264],[-76.285438,44.010176],[-76.286389,44.010632],[-76.288053,44.01029],[-76.28948,44.010119],[-76.291859,44.008979],[-76.295743,44.008009],[-76.29716999999999,44.008294],[-76.298834,44.008808],[-76.300499,44.008808],[-76.30192599999999,44.009777],[-76.30256,44.011088],[-76.303194,44.012228],[-76.30311500000001,44.013768],[-76.302402,44.015364],[-76.301767,44.016448],[-76.301371,44.017816],[-76.30145,44.018899],[-76.302164,44.020154],[-76.303274,44.02118],[-76.30493800000001,44.022776],[-76.306444,44.023803],[-76.30771300000001,44.024487],[-76.308902,44.025285],[-76.309181,44.026556]]],"type":"Polygon"}
}