{
  "id": "361231505003",
  "type": "Feature",
  "properties": {
    "area_land":24333254,
    "area_water":15535,
    "geoid":"361231505003",
    "name":"Block Group 3",
    "state":"ny"
},
  "bbox": [
    -77.062128,
    42.614564,
    -76.994642,
    42.667014
],
  "geometry": {"coordinates":[[[-77.06212600000001,42.646917],[-77.06211999999999,42.647228],[-77.062118,42.647364],[-77.062077,42.647575],[-77.06195200000001,42.647866],[-77.061859,42.64819],[-77.061835,42.648299],[-77.061812,42.648438],[-77.06174300000001,42.648855],[-77.06171999999999,42.648994],[-77.06170299999999,42.649094],[-77.061652,42.649394],[-77.06163599999999,42.649495],[-77.06162399999999,42.649555],[-77.061595,42.649736],[-77.06158600000001,42.649798],[-77.06157399999999,42.649866],[-77.061539,42.650073],[-77.061528,42.650142],[-77.06150100000001,42.650301],[-77.061457,42.650566],[-77.06142800000001,42.650673],[-77.06139400000001,42.650774],[-77.06134400000001,42.650928],[-77.061109,42.650987],[-77.060981,42.651005],[-77.06084300000001,42.651025],[-77.059878,42.651143],[-77.05951,42.651189],[-77.05945699999999,42.651195],[-77.059297,42.651213],[-77.059245,42.65122],[-77.059211,42.651223],[-77.05911,42.651234],[-77.059077,42.651239],[-77.058666,42.651297],[-77.058432,42.651331],[-77.058136,42.651397],[-77.05767,42.651555],[-77.05747599999999,42.651638],[-77.057112,42.651836],[-77.056605,42.652126],[-77.05658,42.652139],[-77.05497099999999,42.653023],[-77.054675,42.653188],[-77.054434,42.653315],[-77.054177,42.653464],[-77.05364400000001,42.653774],[-77.05340099999999,42.653901],[-77.053139,42.654042],[-77.052674,42.654286],[-77.052297,42.654485],[-77.05127299999999,42.655009],[-77.05080700000001,42.655249],[-77.050534,42.655389],[-77.050375,42.655476],[-77.04978800000001,42.655801],[-77.04908,42.656158],[-77.04864499999999,42.65638],[-77.048513,42.65645],[-77.048135,42.656651],[-77.04811599999999,42.656658],[-77.04798,42.656717],[-77.047871,42.656813],[-77.047832,42.656859],[-77.047595,42.657146],[-77.047556,42.657206],[-77.047496,42.657367],[-77.047443,42.657567],[-77.047408,42.6577],[-77.047392,42.657767],[-77.047327,42.658107],[-77.047302,42.658243],[-77.047254,42.658537],[-77.047248,42.658595],[-77.047177,42.659351],[-77.047161,42.659661],[-77.047149,42.659915],[-77.04710799999999,42.660009],[-77.047246,42.660148],[-77.047456,42.660359],[-77.047652,42.660573],[-77.047785,42.660718],[-77.047736,42.66076],[-77.047667,42.660795],[-77.047459,42.660852],[-77.047349,42.660862],[-77.04732799999999,42.660864],[-77.046876,42.660883],[-77.046755,42.660879],[-77.04656300000001,42.660848],[-77.046205,42.660752],[-77.045974,42.660674],[-77.04593199999999,42.66066],[-77.045731,42.660579],[-77.045616,42.660545],[-77.04553799999999,42.660509],[-77.04545400000001,42.660472],[-77.044794,42.660101],[-77.044679,42.660047],[-77.044588,42.660041],[-77.044403,42.660061],[-77.044219,42.660118],[-77.044113,42.660169],[-77.044026,42.660211],[-77.04395700000001,42.660257],[-77.04391099999999,42.660303],[-77.043853,42.660407],[-77.04381600000001,42.660561],[-77.043784,42.660699],[-77.043626,42.660853],[-77.043468,42.661053],[-77.04346,42.661153],[-77.04350599999999,42.661241],[-77.04359100000001,42.661338],[-77.043695,42.661434],[-77.04372600000001,42.661476],[-77.043741,42.661564],[-77.04373,42.661653],[-77.043626,42.661809],[-77.043522,42.661917],[-77.04339899999999,42.662067],[-77.04326,42.662205],[-77.043133,42.662275],[-77.042956,42.662348],[-77.042852,42.662367],[-77.042659,42.662379],[-77.04239800000001,42.662375],[-77.042182,42.66234],[-77.04201999999999,42.662298],[-77.041855,42.66224],[-77.041674,42.662113],[-77.041589,42.662017],[-77.041535,42.661944],[-77.041404,42.661813],[-77.041371,42.66179],[-77.04133899999999,42.661767],[-77.041096,42.661636],[-77.040873,42.661548],[-77.040819,42.661536],[-77.040735,42.661536],[-77.04065799999999,42.661559],[-77.04043,42.661575],[-77.04024800000001,42.661539],[-77.040071,42.66147],[-77.039894,42.661421],[-77.03972,42.661385],[-77.039616,42.661381],[-77.039524,42.661343],[-77.039243,42.661208],[-77.039152,42.661153],[-77.039051,42.661093],[-77.038679,42.660902],[-77.038529,42.660805],[-77.038298,42.660602],[-77.038252,42.660525],[-77.038256,42.660382],[-77.038348,42.660248],[-77.038443,42.660142],[-77.03849599999999,42.660054],[-77.0385,42.659973],[-77.038477,42.659907],[-77.038439,42.659873],[-77.03839600000001,42.65985],[-77.038223,42.659796],[-77.03799600000001,42.659738],[-77.037931,42.659729],[-77.03750700000001,42.659684],[-77.037136,42.659684],[-77.037086,42.659684],[-77.036866,42.659619],[-77.036828,42.6596],[-77.03675699999999,42.659532],[-77.03671199999999,42.659488],[-77.03663899999999,42.659388],[-77.036512,42.659265],[-77.03637000000001,42.659192],[-77.03622900000001,42.659106],[-77.036095,42.658964],[-77.036045,42.658852],[-77.036018,42.658721],[-77.036013,42.658609],[-77.03601,42.658506],[-77.03594099999999,42.658406],[-77.03579499999999,42.65828],[-77.035721,42.658214],[-77.035644,42.658091],[-77.035613,42.65801],[-77.035561,42.657947],[-77.03549700000001,42.657889],[-77.035295,42.657802],[-77.035223,42.657789],[-77.03513,42.657796],[-77.034955,42.65788],[-77.034674,42.658038],[-77.034312,42.658245],[-77.034243,42.658311],[-77.03415800000001,42.658434],[-77.03412400000001,42.658503],[-77.03402199999999,42.658774],[-77.03393800000001,42.658896],[-77.033852,42.658955],[-77.033608,42.659074],[-77.03344,42.659114],[-77.033355,42.659118],[-77.03325700000001,42.659097],[-77.033143,42.659054],[-77.032991,42.659027],[-77.032856,42.659023],[-77.03277199999999,42.65903],[-77.032276,42.659135],[-77.031598,42.659337],[-77.031446,42.659421],[-77.031318,42.659529],[-77.031255,42.659566],[-77.03117,42.659592],[-77.031136,42.659592],[-77.03108899999999,42.659574],[-77.030743,42.659446],[-77.030539,42.65938],[-77.03046999999999,42.659369],[-77.0304,42.659376],[-77.03035800000001,42.659396],[-77.030316,42.65943],[-77.03023899999999,42.659565],[-77.03018899999999,42.659676],[-77.030119,42.659692],[-77.030062,42.659699],[-77.029985,42.659769],[-77.029956,42.659829],[-77.029946,42.659888],[-77.02995799999999,42.660157],[-77.029973,42.660242],[-77.029973,42.660426],[-77.02993499999999,42.660511],[-77.029888,42.660557],[-77.029629,42.660699],[-77.029425,42.660776],[-77.029405,42.660779],[-77.028901,42.660895],[-77.028499,42.660955],[-77.028164,42.660958],[-77.02801700000001,42.660935],[-77.027644,42.660831],[-77.027417,42.660747],[-77.026943,42.660531],[-77.026715,42.660462],[-77.026484,42.66033],[-77.02647899999999,42.660303],[-77.026504,42.660237],[-77.02659199999999,42.660165],[-77.02673,42.660101],[-77.026836,42.660091],[-77.026951,42.660106],[-77.02703,42.660098],[-77.027098,42.660071],[-77.027151,42.660021],[-77.027243,42.659938],[-77.027259,42.659873],[-77.02723400000001,42.659818],[-77.027146,42.659727],[-77.026949,42.659645],[-77.02680100000001,42.659609],[-77.026462,42.659596],[-77.026257,42.659555],[-77.026089,42.659531],[-77.025684,42.659474],[-77.025588,42.659455],[-77.025537,42.659446],[-77.025425,42.659416],[-77.025358,42.659398],[-77.025047,42.659332],[-77.02483599999999,42.659304],[-77.024671,42.659263],[-77.024517,42.659194],[-77.02436899999999,42.659151],[-77.024123,42.65908],[-77.023757,42.659002],[-77.02356899999999,42.659002],[-77.023422,42.659025],[-77.02336699999999,42.659048],[-77.022813,42.659428],[-77.022667,42.659538],[-77.022543,42.659611],[-77.022295,42.659716],[-77.02194299999999,42.65984],[-77.02140199999999,42.660064],[-77.021383,42.660075],[-77.021238,42.660163],[-77.02059800000001,42.660483],[-77.020399,42.66054],[-77.02030600000001,42.660556],[-77.02005200000001,42.660552],[-77.01975299999999,42.660484],[-77.01874100000001,42.660146],[-77.01779399999999,42.659961],[-77.01754800000001,42.659946],[-77.017478,42.659952],[-77.017234,42.659975],[-77.01712999999999,42.659998],[-77.017003,42.66004],[-77.016425,42.660259],[-77.016125,42.66034],[-77.015917,42.660363],[-77.015625,42.660356],[-77.015438,42.660298],[-77.01539,42.660265],[-77.014912,42.660011],[-77.014323,42.659765],[-77.013149,42.659315],[-77.01307199999999,42.659304],[-77.012933,42.659292],[-77.012542,42.659343],[-77.012404,42.659374],[-77.012246,42.659436],[-77.012146,42.65949],[-77.011965,42.659624],[-77.011853,42.65969],[-77.01168,42.65982],[-77.01157600000001,42.65989],[-77.01128,42.660016],[-77.011133,42.660047],[-77.011079,42.660047],[-77.01090600000001,42.660036],[-77.010698,42.659936],[-77.01061799999999,42.659913],[-77.01038699999999,42.659943],[-77.009894,42.660132],[-77.009503,42.660257],[-77.00942999999999,42.660268],[-77.00930700000001,42.660268],[-77.00914899999999,42.660176],[-77.00909900000001,42.660161],[-77.009046,42.66015],[-77.008995,42.660141],[-77.008934,42.660153],[-77.008853,42.660188],[-77.008549,42.660411],[-77.00844499999999,42.660415],[-77.008312,42.660378],[-77.00813100000001,42.660282],[-77.00761900000001,42.659974],[-77.007446,42.659851],[-77.007176,42.65962],[-77.007018,42.659451],[-77.006922,42.659328],[-77.006764,42.659213],[-77.006558,42.659115],[-77.00643700000001,42.659124],[-77.00617699999999,42.659201],[-77.0061,42.659232],[-77.00606399999999,42.659259],[-77.00600900000001,42.659305],[-77.005961,42.659369],[-77.005915,42.659486],[-77.005852,42.659679],[-77.005775,42.659781],[-77.005683,42.65987],[-77.00561999999999,42.659904],[-77.005487,42.659914],[-77.00529899999999,42.659903],[-77.005151,42.659914],[-77.005003,42.659964],[-77.00489399999999,42.660028],[-77.00463999999999,42.66018],[-77.00445000000001,42.6603],[-77.004418,42.66032],[-77.004355,42.660375],[-77.004234,42.660483],[-77.00410100000001,42.660632],[-77.00402200000001,42.660723],[-77.003867,42.660892],[-77.003474,42.661225],[-77.003401,42.661288],[-77.002972,42.661601],[-77.002813,42.661684],[-77.002578,42.661765],[-77.00237799999999,42.661857],[-77.002228,42.661984],[-77.002078,42.662134],[-77.00184299999999,42.662419],[-77.001801,42.662515],[-77.001791,42.662586],[-77.001766,42.662772],[-77.00177499999999,42.662968],[-77.001841,42.663122],[-77.001874,42.663312],[-77.00191,42.663472],[-77.001976,42.663645],[-77.002045,42.663764],[-77.002268,42.664018],[-77.002291,42.664053],[-77.002307,42.664106],[-77.00231100000001,42.664226],[-77.002257,42.664341],[-77.002078,42.664536],[-77.00196200000001,42.664625],[-77.00193299999999,42.66464],[-77.001546,42.664867],[-77.001412,42.664917],[-77.00125800000001,42.664952],[-77.000773,42.66496],[-77.000576,42.664972],[-77.000441,42.664992],[-77.000379,42.665015],[-77.00027900000001,42.665072],[-77.000125,42.665192],[-76.99995199999999,42.665351],[-76.999724,42.665478],[-76.99955799999999,42.66556],[-76.999353,42.665645],[-76.999183,42.665701],[-76.998937,42.665742],[-76.998715,42.66575],[-76.998537,42.665737],[-76.998408,42.665705],[-76.998327,42.665693],[-76.998186,42.665709],[-76.998109,42.665737],[-76.99798800000001,42.66581],[-76.99791999999999,42.665871],[-76.99785900000001,42.665947],[-76.997843,42.666044],[-76.997863,42.666121],[-76.99794799999999,42.666231],[-76.99800399999999,42.666277],[-76.99804899999999,42.666312],[-76.998239,42.666376],[-76.998424,42.666481],[-76.998542,42.666599],[-76.998546,42.666644],[-76.99852199999999,42.666704],[-76.99844899999999,42.666777],[-76.998332,42.666833],[-76.998175,42.666881],[-76.99771,42.666944],[-76.997433,42.666962],[-76.99712700000001,42.666953],[-76.997069,42.666944],[-76.99690099999999,42.666921],[-76.996703,42.666873],[-76.996566,42.666825],[-76.996166,42.666643],[-76.996089,42.666631],[-76.996033,42.666635],[-76.99577499999999,42.666687],[-76.995621,42.666748],[-76.995266,42.666942],[-76.995238,42.666958],[-76.995105,42.66701],[-76.99493099999999,42.667014],[-76.994642,42.66697],[-76.994772,42.666829],[-76.99508899999999,42.666481],[-76.995147,42.666419],[-76.995738,42.665742],[-76.995986,42.66549],[-76.99603999999999,42.665442],[-76.996216,42.665295],[-76.99641699999999,42.665161],[-76.996573,42.665083],[-76.996734,42.665018],[-76.99724399999999,42.664849],[-76.99760999999999,42.664739],[-76.998003,42.664625],[-76.998345,42.664503],[-76.998564,42.664406],[-76.998778,42.664271],[-76.999122,42.663993],[-76.999589,42.663589],[-76.999796,42.663382],[-77.00013800000001,42.662963],[-77.00051499999999,42.66244],[-77.000923,42.661875],[-77.001091,42.661562],[-77.001165,42.66136],[-77.001195,42.661202],[-77.001204,42.660986],[-77.00121,42.660843],[-77.00115099999999,42.659856],[-77.00113,42.659481],[-77.00107,42.658732],[-77.00098699999999,42.657274],[-77.000916,42.656251],[-77.000756,42.65349],[-77.00057099999999,42.650653],[-77.000514,42.649753],[-77.000441,42.648446],[-77.000438,42.648395],[-77.00042999999999,42.648244],[-77.000428,42.648195],[-77.000411,42.647915],[-77.00036,42.647081],[-77.000344,42.646803],[-77.000342,42.646765],[-77.00033500000001,42.646656],[-77.000314,42.64633],[-77.00030700000001,42.646222],[-77.00021099999999,42.644709],[-77.000167,42.643979],[-77.00015999999999,42.643889],[-76.999962,42.641147],[-76.999709,42.636891],[-76.999685,42.636486],[-76.999562,42.63456],[-76.999555,42.634453],[-76.999534,42.634135],[-76.999528,42.634029],[-76.999509,42.633752],[-76.999458,42.632997],[-76.999453,42.63292],[-76.99943500000001,42.632645],[-76.999341,42.631164],[-76.99933799999999,42.631104],[-76.999149,42.628945],[-76.99899499999999,42.626733],[-76.998985,42.62658],[-76.99888199999999,42.625256],[-76.99883199999999,42.624756],[-76.998783,42.624256],[-76.998695,42.623259],[-76.99865200000001,42.62276],[-76.998554,42.621347],[-76.998514,42.620752],[-76.99843799999999,42.6193],[-76.998306,42.617107],[-76.998221,42.615696],[-76.998875,42.615688],[-76.999037,42.615683],[-77.000221,42.615652],[-77.001486,42.615632],[-77.002303,42.615621],[-77.00248999999999,42.615617],[-77.00305299999999,42.615609],[-77.003242,42.615607],[-77.00377400000001,42.615597],[-77.005371,42.61557],[-77.005904,42.615561],[-77.006872,42.615544],[-77.008145,42.615523],[-77.009777,42.615489],[-77.010746,42.615469],[-77.01176100000001,42.615448],[-77.01480599999999,42.615385],[-77.015821,42.615364],[-77.01810399999999,42.615314],[-77.019198,42.615292],[-77.022509,42.615248],[-77.024953,42.615195],[-77.027237,42.615147],[-77.02949099999999,42.615097],[-77.034437,42.61499],[-77.03594099999999,42.614946],[-77.03626,42.614934],[-77.038515,42.614854],[-77.038945,42.61483],[-77.040458,42.6148],[-77.04307300000001,42.614714],[-77.044111,42.61468],[-77.049526,42.614564],[-77.049908,42.614581],[-77.05077900000001,42.614689],[-77.05647,42.615507],[-77.056685,42.615539],[-77.057632,42.615682],[-77.058359,42.615762],[-77.05883,42.615786],[-77.05949699999999,42.615785],[-77.061037,42.615731],[-77.061228,42.615707],[-77.06134,42.616903],[-77.06139400000001,42.617831],[-77.061449,42.619008],[-77.061538,42.6209],[-77.06151199999999,42.621241],[-77.06143899999999,42.621561],[-77.06101,42.623158],[-77.060941,42.623393],[-77.060124,42.625609],[-77.0598,42.626564],[-77.059341,42.62801],[-77.059243,42.6284],[-77.059218,42.628575],[-77.059212,42.628621],[-77.059217,42.628858],[-77.059219,42.628918],[-77.059493,42.630846],[-77.05965,42.631853],[-77.05965399999999,42.63188],[-77.05966600000001,42.631961],[-77.05967099999999,42.631988],[-77.059715,42.632273],[-77.059849,42.633134],[-77.059894,42.633422],[-77.060107,42.634709],[-77.060423,42.636616],[-77.06073600000001,42.638574],[-77.06094299999999,42.639863],[-77.060957,42.639951],[-77.06119099999999,42.641353],[-77.061244,42.641671],[-77.06167000000001,42.643909],[-77.061772,42.64453],[-77.061989,42.64585],[-77.06209200000001,42.646476],[-77.062128,42.646818],[-77.06212600000001,42.646917]]],"type":"Polygon"}
}