{
  "id": "360594053025",
  "type": "Feature",
  "properties": {
    "area_land":208503,
    "area_water":0,
    "geoid":"360594053025",
    "name":"Block Group 5",
    "state":"ny"
},
  "bbox": [
    -73.677963,
    40.70865,
    -73.671992,
    40.7166
],
  "geometry": {"coordinates":[[[-73.67796300000001,40.716555],[-73.677029,40.71653],[-73.676113,40.716549],[-73.674165,40.716555],[-73.67410700000001,40.716505],[-73.674072,40.716435],[-73.673704,40.716485],[-73.67366,40.716447],[-73.673281,40.716499],[-73.67320599999999,40.716442],[-73.672336,40.7166],[-73.672202,40.716105],[-73.67216999999999,40.71605],[-73.671992,40.715857],[-73.67266600000001,40.715416],[-73.673023,40.715183],[-73.673177,40.715076],[-73.673261,40.714991],[-73.673447,40.71448],[-73.67364000000001,40.713943],[-73.673688,40.713797],[-73.67400000000001,40.712929],[-73.674227,40.71229],[-73.674441,40.711659],[-73.674465,40.711585],[-73.674617,40.711127],[-73.67490599999999,40.710239],[-73.675319,40.709],[-73.675354,40.708901],[-73.67547999999999,40.70865],[-73.67555900000001,40.708855],[-73.67583399999999,40.709568],[-73.67610000000001,40.710282],[-73.676371,40.710996],[-73.67661699999999,40.711663],[-73.676648,40.711772],[-73.67668500000001,40.711875],[-73.677076,40.713293],[-73.677103,40.713363],[-73.677103,40.713407],[-73.67730400000001,40.714163],[-73.67749499999999,40.71486],[-73.67768,40.715528],[-73.677722,40.715702],[-73.67786099999999,40.716222],[-73.677943,40.716511],[-73.67796300000001,40.716555]]],"type":"Polygon"}
}