{
  "id": "360610127002",
  "type": "Feature",
  "properties": {
    "area_land":43405,
    "area_water":0,
    "geoid":"360610127002",
    "name":"Block Group 2",
    "state":"ny"
},
  "bbox": [
    -73.990764,
    40.759791,
    -73.987015,
    40.762235
],
  "geometry": {"coordinates":[[[-73.99031600000001,40.761606],[-73.989863,40.762235],[-73.989698,40.762165],[-73.987882,40.761402],[-73.987015,40.761038],[-73.987475,40.760405],[-73.987927,40.759791],[-73.98871800000001,40.760125],[-73.990764,40.760988],[-73.99031600000001,40.761606]]],"type":"Polygon"}
}