{
  "id": "360810919003",
  "type": "Feature",
  "properties": {
    "area_land":152661,
    "area_water":0,
    "geoid":"360810919003",
    "name":"Block Group 3",
    "state":"ny"
},
  "bbox": [
    -73.849411,
    40.775615,
    -73.843387,
    40.778611
],
  "geometry": {"coordinates":[[[-73.849411,40.778211],[-73.849198,40.778611],[-73.84884,40.778601],[-73.847933,40.778604],[-73.84703399999999,40.778606],[-73.846113,40.778605],[-73.84519299999999,40.778607],[-73.844291,40.778606],[-73.84338700000001,40.778609],[-73.84350000000001,40.77658],[-73.843554,40.775615],[-73.844454,40.775647],[-73.845356,40.775666],[-73.84631899999999,40.775711],[-73.8472,40.775745],[-73.84804099999999,40.77577],[-73.849116,40.775788],[-73.849079,40.776376],[-73.84903799999999,40.777005],[-73.849035,40.777288],[-73.849018,40.777405],[-73.84899900000001,40.777522],[-73.848978,40.777635],[-73.848974,40.777675],[-73.848972,40.777773],[-73.848957,40.777891],[-73.848955,40.777934],[-73.848956,40.777962],[-73.84896000000001,40.777993],[-73.848968,40.778022],[-73.848974,40.778035],[-73.84900500000001,40.778072],[-73.84905000000001,40.778098],[-73.849114,40.778115],[-73.849176,40.778127],[-73.849206,40.778131],[-73.849237,40.778135],[-73.84929,40.778142],[-73.849312,40.77815],[-73.849333,40.778151],[-73.849357,40.778161],[-73.849378,40.778178],[-73.849396,40.778196],[-73.849411,40.778211]]],"type":"Polygon"}
}