{
  "id": "360630227022",
  "type": "Feature",
  "properties": {
    "area_land":13480368,
    "area_water":358486,
    "geoid":"360630227022",
    "name":"Block Group 2",
    "state":"ny"
},
  "bbox": [
    -78.773177,
    43.069256,
    -78.731161,
    43.112946
],
  "geometry": {"coordinates":[[[-78.773177,43.111919],[-78.77315,43.112098],[-78.77311899999999,43.112185],[-78.772987,43.112448],[-78.77161099999999,43.112457],[-78.77037300000001,43.112474],[-78.765727,43.112515],[-78.757137,43.112591],[-78.756469,43.112607],[-78.756367,43.112609],[-78.753818,43.112646],[-78.752968,43.112671],[-78.752937,43.112672],[-78.748706,43.112731],[-78.74246599999999,43.112843],[-78.7423,43.112846],[-78.738966,43.112923],[-78.73894300000001,43.112924],[-78.738877,43.112927],[-78.73885199999999,43.112928],[-78.738798,43.112929],[-78.738709,43.112931],[-78.73849800000001,43.112936],[-78.738281,43.112942],[-78.738139,43.112946],[-78.73848,43.112382],[-78.739036,43.111515],[-78.739109,43.111403],[-78.73918500000001,43.111261],[-78.739369,43.11086],[-78.739805,43.109493],[-78.74009,43.10791],[-78.740073,43.107248],[-78.739921,43.106641],[-78.739885,43.106495],[-78.739757,43.106201],[-78.739458,43.105656],[-78.739237,43.105195],[-78.739189,43.105126],[-78.738749,43.104495],[-78.738305,43.103944],[-78.737599,43.10333],[-78.73739399999999,43.103152],[-78.73563900000001,43.101748],[-78.734431,43.100736],[-78.73394500000001,43.100253],[-78.73374800000001,43.100031],[-78.73330799999999,43.099426],[-78.73286899999999,43.098534],[-78.732703,43.098154],[-78.73174,43.095944],[-78.731374,43.09515],[-78.73120400000001,43.094527],[-78.731165,43.093953],[-78.731161,43.09389],[-78.731189,43.093281],[-78.731255,43.092785],[-78.73147,43.091803],[-78.732004,43.090095],[-78.732507,43.088288],[-78.73262800000001,43.087949],[-78.732647,43.087869],[-78.73289,43.086902],[-78.73319100000001,43.085939],[-78.733231,43.085859],[-78.733356,43.085528],[-78.733678,43.08468],[-78.733721,43.084531],[-78.733729,43.084506],[-78.73372999999999,43.084392],[-78.73360599999999,43.084219],[-78.734955,43.08319],[-78.735168,43.083031],[-78.735748,43.08247],[-78.73615700000001,43.081797],[-78.736377,43.081232],[-78.7367,43.080285],[-78.737663,43.078256],[-78.739949,43.076106],[-78.741249,43.074854],[-78.741176,43.074338],[-78.741517,43.073691],[-78.742279,43.072208],[-78.742508,43.07177],[-78.743185,43.07095],[-78.744015,43.070376],[-78.74493099999999,43.069921],[-78.74535400000001,43.069786],[-78.746197,43.069614],[-78.747118,43.069435],[-78.74765600000001,43.069655],[-78.751257,43.069256],[-78.75373999999999,43.069459],[-78.755487,43.070077],[-78.757653,43.07086],[-78.759141,43.070928],[-78.76000000000001,43.070873],[-78.76103999999999,43.070715],[-78.761922,43.070494],[-78.763582,43.070338],[-78.76532,43.070267],[-78.76588599999999,43.070226],[-78.76699499999999,43.070204],[-78.768094,43.070103],[-78.768292,43.070139],[-78.76902699999999,43.070027],[-78.77078400000001,43.069539],[-78.770785,43.069592],[-78.770786,43.069669],[-78.77078400000001,43.069746],[-78.77078299999999,43.069819],[-78.770768,43.070447],[-78.770782,43.07084],[-78.770841,43.071286],[-78.770912,43.071716],[-78.771089,43.072627],[-78.771147,43.073119],[-78.77121699999999,43.0743],[-78.771299,43.075682],[-78.77145299999999,43.078662],[-78.77160499999999,43.082371],[-78.77166699999999,43.083111],[-78.771697,43.083415],[-78.771997,43.086443],[-78.772147,43.087985],[-78.772356,43.090122],[-78.772462,43.091984],[-78.77248,43.092622],[-78.77249,43.092955],[-78.772498,43.09348],[-78.772527,43.093899],[-78.77254499999999,43.094171],[-78.77256800000001,43.094479],[-78.772638,43.095406],[-78.772662,43.095715],[-78.77269699999999,43.096229],[-78.77270799999999,43.096382],[-78.77273099999999,43.097012],[-78.772785,43.097966],[-78.77293899999999,43.101308],[-78.77296800000001,43.102435],[-78.773016,43.104718],[-78.773026,43.105154],[-78.773071,43.106971],[-78.77307999999999,43.107384],[-78.77310900000001,43.108624],[-78.77311899999999,43.109038],[-78.773133,43.109648],[-78.773144,43.110105],[-78.77315400000001,43.110539],[-78.773171,43.111221],[-78.773177,43.111919]]],"type":"Polygon"}
}