{
  "id": "360550116031",
  "type": "Feature",
  "properties": {
    "area_land":1752564,
    "area_water":38224,
    "geoid":"360550116031",
    "name":"Block Group 1",
    "state":"ny"
},
  "bbox": [
    -77.511433,
    43.123757,
    -77.481893,
    43.135155
],
  "geometry": {"coordinates":[[[-77.511433,43.129197],[-77.51140100000001,43.129171],[-77.511326,43.129121],[-77.51122100000001,43.129088],[-77.511184,43.129088],[-77.510982,43.129121],[-77.510924,43.129137],[-77.51089899999999,43.129138],[-77.51087699999999,43.129154],[-77.510794,43.129165],[-77.510772,43.129168],[-77.51074800000001,43.129185],[-77.510715,43.129191],[-77.510689,43.129192],[-77.510644,43.129209],[-77.51058399999999,43.129214],[-77.510502,43.129231],[-77.510457,43.129247],[-77.51042,43.129247],[-77.51022500000001,43.129274],[-77.510075,43.129285],[-77.50976,43.129296],[-77.5097,43.129292],[-77.50952100000001,43.129296],[-77.50947600000001,43.129307],[-77.509438,43.129307],[-77.509146,43.129367],[-77.50902600000001,43.129405],[-77.508921,43.129455],[-77.50863699999999,43.129619],[-77.508464,43.129756],[-77.508427,43.1298],[-77.50841200000001,43.129844],[-77.50841200000001,43.129899],[-77.50842400000001,43.12993],[-77.508426,43.129948],[-77.508455,43.129969],[-77.508456,43.129987],[-77.508509,43.130031],[-77.508523,43.130066],[-77.508539,43.13008],[-77.508523,43.130186],[-77.508509,43.130206],[-77.508464,43.130245],[-77.508404,43.130272],[-77.508321,43.1303],[-77.50825399999999,43.130305],[-77.508216,43.130327],[-77.508171,43.130332],[-77.508156,43.130349],[-77.508089,43.13036],[-77.508047,43.130385],[-77.508022,43.130387],[-77.50797900000001,43.130414],[-77.507954,43.130415],[-77.507819,43.130491],[-77.507789,43.130497],[-77.50753400000001,43.13065],[-77.507295,43.130815],[-77.507182,43.130875],[-77.507108,43.130923],[-77.507085,43.13093],[-77.50705499999999,43.130952],[-77.50693699999999,43.131011],[-77.506912,43.131012],[-77.506897,43.131029],[-77.50658300000001,43.131144],[-77.50653,43.131155],[-77.506478,43.131171],[-77.50642499999999,43.131182],[-77.506365,43.131204],[-77.506333,43.131204],[-77.50631300000001,43.131215],[-77.50626800000001,43.131223],[-77.50624500000001,43.131231],[-77.506159,43.131242],[-77.506186,43.13014],[-77.50620600000001,43.129352],[-77.503851,43.12937],[-77.503851,43.129129],[-77.501631,43.129146],[-77.501644,43.129377],[-77.501667,43.130637],[-77.501604,43.130628],[-77.50153299999999,43.13061],[-77.501497,43.130593],[-77.501453,43.130584],[-77.50138099999999,43.130557],[-77.501301,43.130539],[-77.501149,43.130557],[-77.500972,43.130642],[-77.500845,43.130663],[-77.50080199999999,43.130674],[-77.500777,43.130674],[-77.500742,43.130701],[-77.50071699999999,43.130702],[-77.50068,43.130724],[-77.500598,43.130762],[-77.50051499999999,43.130817],[-77.500463,43.130866],[-77.500455,43.130883],[-77.500418,43.130927],[-77.50040300000001,43.130959],[-77.50040199999999,43.130977],[-77.50038000000001,43.130992],[-77.50037399999999,43.131012],[-77.500343,43.131053],[-77.500338,43.131071],[-77.500305,43.131124],[-77.500305,43.131146],[-77.500282,43.131162],[-77.50028,43.13118],[-77.50026,43.131228],[-77.500243,43.131252],[-77.500207,43.131283],[-77.500207,43.131305],[-77.50017699999999,43.131332],[-77.50015500000001,43.131382],[-77.50013199999999,43.131393],[-77.500125,43.13142],[-77.500097,43.131467],[-77.50008,43.131481],[-77.500062,43.131512],[-77.500057,43.13153],[-77.50002000000001,43.131574],[-77.500016,43.131592],[-77.49999,43.131634],[-77.499982,43.131661],[-77.499953,43.131709],[-77.49995199999999,43.131727],[-77.499937,43.131744],[-77.499933,43.131762],[-77.499916,43.131792],[-77.499915,43.13181],[-77.499892,43.131826],[-77.499892,43.131864],[-77.499877,43.131881],[-77.499877,43.131919],[-77.499855,43.131958],[-77.499854,43.132188],[-77.49986,43.132313],[-77.499854,43.132353],[-77.499854,43.13243],[-77.499832,43.132446],[-77.499769,43.132506],[-77.499719,43.132534],[-77.49947,43.132614],[-77.49939500000001,43.132669],[-77.499523,43.132793],[-77.49952,43.133305],[-77.499467,43.133781],[-77.499162,43.134107],[-77.498788,43.134566],[-77.498649,43.1349],[-77.49861,43.135137],[-77.498504,43.135142],[-77.49811200000001,43.135155],[-77.497894,43.135147],[-77.497564,43.135128],[-77.49736799999999,43.135112],[-77.49712,43.135091],[-77.49667599999999,43.135042],[-77.49632099999999,43.134983],[-77.496004,43.134913],[-77.49576399999999,43.134847],[-77.495642,43.13481],[-77.495374,43.13473],[-77.49472,43.13448],[-77.493889,43.134049],[-77.493741,43.133968],[-77.49226899999999,43.133158],[-77.491512,43.13271],[-77.491232,43.132551],[-77.490047,43.131869],[-77.489662,43.131647],[-77.487959,43.130667],[-77.48666,43.129894],[-77.48649500000001,43.12977],[-77.486413,43.129709],[-77.485975,43.129372],[-77.485787,43.129221],[-77.48557,43.129032],[-77.485409,43.128916],[-77.485197,43.12882],[-77.484939,43.128734],[-77.48466500000001,43.128693],[-77.48441099999999,43.128693],[-77.484116,43.128717],[-77.483965,43.128727],[-77.48388300000001,43.128724],[-77.483773,43.128652],[-77.48371400000001,43.128597],[-77.48366900000001,43.128508],[-77.483863,43.128482],[-77.48398299999999,43.128468],[-77.48398899999999,43.128357],[-77.483992,43.128305],[-77.48403999999999,43.128261],[-77.484222,43.128192],[-77.484425,43.128134],[-77.48472700000001,43.128034],[-77.48497,43.127935],[-77.485083,43.127856],[-77.48510400000001,43.127773],[-77.484966,43.127533],[-77.484832,43.127376],[-77.48472,43.127278],[-77.484644,43.127225],[-77.48459699999999,43.127208],[-77.484568,43.127197],[-77.484858,43.126774],[-77.485078,43.126596],[-77.484863,43.126699],[-77.484174,43.12703],[-77.48411400000001,43.127013],[-77.483963,43.12698],[-77.483659,43.126943],[-77.483307,43.126915],[-77.483051,43.126886],[-77.482912,43.126846],[-77.48280099999999,43.126801],[-77.482697,43.126748],[-77.482558,43.126656],[-77.482071,43.126258],[-77.481999,43.126176],[-77.48195200000001,43.1261],[-77.481917,43.126018],[-77.481893,43.125904],[-77.481898,43.125807],[-77.481915,43.125728],[-77.481944,43.125651],[-77.48201299999999,43.125513],[-77.482089,43.125375],[-77.482859,43.12406],[-77.483037,43.123763],[-77.485866,43.123771],[-77.486734,43.123757],[-77.500111,43.123881],[-77.503044,43.123902],[-77.503362,43.123904],[-77.50369999999999,43.123906],[-77.50582300000001,43.123919],[-77.506107,43.123921],[-77.50675,43.123925],[-77.5067,43.123948],[-77.50667,43.123976],[-77.506649,43.124011],[-77.506612,43.12413],[-77.50659,43.12435],[-77.50656499999999,43.124576],[-77.50653699999999,43.124697],[-77.506479,43.124805],[-77.506443,43.124911],[-77.506444,43.125001],[-77.506462,43.125115],[-77.506445,43.125334],[-77.506443,43.125427],[-77.50646399999999,43.125481],[-77.506507,43.125535],[-77.50658300000001,43.125575],[-77.506671,43.125604],[-77.506775,43.125622],[-77.506775,43.12618],[-77.506783,43.126549],[-77.506794,43.126647],[-77.50684200000001,43.126728],[-77.50691999999999,43.126788],[-77.507029,43.12683],[-77.50716,43.126855],[-77.50848999999999,43.126823],[-77.508948,43.126807],[-77.509027,43.126787],[-77.509083,43.126752],[-77.509113,43.126703],[-77.509111,43.126198],[-77.50952599999999,43.12599],[-77.509719,43.125877],[-77.50988599999999,43.125752],[-77.51004,43.125586],[-77.51007300000001,43.125449],[-77.510088,43.125243],[-77.510246,43.125186],[-77.510291,43.125143],[-77.5103,43.125057],[-77.51035299999999,43.1249],[-77.510407,43.124621],[-77.51099499999999,43.124744],[-77.51093400000001,43.125298],[-77.51085999999999,43.12558],[-77.510813,43.125742],[-77.510772,43.12585],[-77.510732,43.125911],[-77.510307,43.126494],[-77.5103,43.126521],[-77.51030299999999,43.126545],[-77.51033700000001,43.126583],[-77.511244,43.127032],[-77.51127200000001,43.127077],[-77.511296,43.127183],[-77.511303,43.12743],[-77.511319,43.12816],[-77.511335,43.128388],[-77.511351,43.128481],[-77.511366,43.128548],[-77.511419,43.128644],[-77.511433,43.129197]]],"type":"Polygon"}
}