{
  "id": "360130308004",
  "type": "Feature",
  "properties": {
    "area_land":643065,
    "area_water":0,
    "geoid":"360130308004",
    "name":"Block Group 4",
    "state":"ny"
},
  "bbox": [
    -79.249846,
    42.075909,
    -79.239274,
    42.083048
],
  "geometry": {"coordinates":[[[-79.24984600000001,42.082953],[-79.24880400000001,42.082963],[-79.248287,42.082966],[-79.247308,42.082971],[-79.246326,42.082989],[-79.245833,42.082998],[-79.24489199999999,42.082998],[-79.24396900000001,42.083004],[-79.242786,42.083019],[-79.241721,42.083015],[-79.240655,42.083039],[-79.24024799999999,42.083048],[-79.239591,42.083044],[-79.239599,42.081878],[-79.239592,42.080809],[-79.23961199999999,42.079686],[-79.239586,42.079409],[-79.239475,42.078701],[-79.239424,42.078532],[-79.23927399999999,42.078229],[-79.240353,42.077954],[-79.24058599999999,42.077873],[-79.24033900000001,42.07772],[-79.240064,42.077509],[-79.23988799999999,42.077314],[-79.239824,42.077234],[-79.239744,42.077105],[-79.239644,42.076893],[-79.239588,42.076695],[-79.239554,42.076413],[-79.23953299999999,42.076114],[-79.23960700000001,42.076114],[-79.240934,42.076112],[-79.242114,42.076103],[-79.242773,42.076106],[-79.24513,42.076106],[-79.245487,42.076094],[-79.24602299999999,42.076077],[-79.24615,42.076079],[-79.24724000000001,42.07608],[-79.248508,42.076061],[-79.24898899999999,42.075909],[-79.249471,42.076047],[-79.24970399999999,42.076044],[-79.249717,42.076754],[-79.249729,42.077447],[-79.24973900000001,42.078166],[-79.249754,42.078857],[-79.249759,42.079115],[-79.249781,42.080379],[-79.24980600000001,42.08158],[-79.24984600000001,42.082953]]],"type":"Polygon"}
}