{
  "id": "360670129001",
  "type": "Feature",
  "properties": {
    "area_land":964626,
    "area_water":0,
    "geoid":"360670129001",
    "name":"Block Group 1",
    "state":"ny"
},
  "bbox": [
    -76.217042,
    43.055921,
    -76.197301,
    43.06494
],
  "geometry": {"coordinates":[[[-76.21704200000001,43.064865],[-76.212908,43.064881],[-76.205354,43.06494],[-76.20475999999999,43.064434],[-76.200783,43.064413],[-76.199439,43.064534],[-76.19926100000001,43.06423],[-76.199208,43.063836],[-76.199186,43.063668],[-76.199414,43.063671],[-76.199466,43.063476],[-76.199488,43.063376],[-76.19950900000001,43.063276],[-76.199516,43.063185],[-76.19952600000001,43.063068],[-76.19948599999999,43.062748],[-76.19940699999999,43.06253],[-76.199263,43.062308],[-76.19825299999999,43.060966],[-76.197301,43.05963],[-76.20004,43.060428],[-76.200048,43.060066],[-76.19981,43.059678],[-76.199877,43.057392],[-76.19987,43.055994],[-76.20030300000001,43.055969],[-76.20146200000001,43.055923],[-76.201736,43.055921],[-76.20182,43.055955],[-76.201983,43.056066],[-76.202429,43.056442],[-76.202656,43.056609],[-76.203062,43.056907],[-76.203852,43.057428],[-76.204137,43.057594],[-76.20435000000001,43.057704],[-76.205213,43.058096],[-76.205307,43.058133],[-76.205528,43.058154],[-76.20584100000001,43.058137],[-76.206339,43.058115],[-76.207536,43.058062],[-76.21026000000001,43.057933],[-76.210415,43.057947],[-76.210508,43.057974],[-76.210662,43.058073],[-76.21213400000001,43.059171],[-76.21251599999999,43.059445],[-76.212638,43.059563],[-76.212664,43.059602],[-76.21272,43.059713],[-76.212818,43.060269],[-76.212946,43.060977],[-76.21306300000001,43.06166],[-76.213224,43.062528],[-76.213863,43.062493],[-76.215861,43.062306],[-76.216706,43.062226],[-76.216718,43.062339],[-76.216758,43.062694],[-76.21677,43.062811],[-76.21682800000001,43.063262],[-76.21695800000001,43.064213],[-76.21704200000001,43.064865]]],"type":"Polygon"}
}