{
  "id": "360430101005",
  "type": "Feature",
  "properties": {
    "area_land":40027495,
    "area_water":30873,
    "geoid":"360430101005",
    "name":"Block Group 5",
    "state":"ny"
},
  "bbox": [
    -75.207362,
    42.884126,
    -75.100999,
    42.940574
],
  "geometry": {"coordinates":[[[-75.207362,42.940574],[-75.203586,42.940193],[-75.19675599999999,42.93946],[-75.194807,42.939243],[-75.194002,42.939155],[-75.186044,42.938285],[-75.177273,42.937309],[-75.171885,42.936729],[-75.171121,42.936648],[-75.162627,42.935704],[-75.156581,42.935034],[-75.14215900000001,42.933467],[-75.124612,42.931496],[-75.119162,42.930807],[-75.118731,42.930755],[-75.116911,42.93053],[-75.114442,42.930231],[-75.113388,42.930114],[-75.11848999999999,42.922313],[-75.121667,42.917463],[-75.12185100000001,42.917184],[-75.121667,42.917101],[-75.119472,42.91618],[-75.11326,42.913632],[-75.10638,42.910703],[-75.100999,42.908363],[-75.10320400000001,42.905606],[-75.10329299999999,42.905505],[-75.106314,42.901745],[-75.11465699999999,42.891359],[-75.11688599999999,42.888583],[-75.117363,42.887989],[-75.11747099999999,42.887995],[-75.118415,42.888036],[-75.118998,42.888051],[-75.126,42.888321],[-75.128145,42.888365],[-75.13135,42.888431],[-75.13287800000001,42.888462],[-75.136799,42.888524],[-75.13775800000001,42.888542],[-75.143569,42.888652],[-75.144993,42.888686],[-75.147818,42.888735],[-75.149874,42.888788],[-75.15125399999999,42.888793],[-75.152451,42.88879],[-75.15522799999999,42.888783],[-75.15547100000001,42.888787],[-75.156988,42.88824],[-75.156896,42.888383],[-75.156828,42.888434],[-75.15648,42.888785],[-75.156409,42.888879],[-75.15657899999999,42.888904],[-75.157051,42.888975],[-75.157652,42.889045],[-75.158421,42.889084],[-75.16037,42.889085],[-75.16115499999999,42.889075],[-75.161693,42.88904],[-75.162173,42.888986],[-75.163438,42.888797],[-75.16497699999999,42.888564],[-75.167979,42.888037],[-75.169005,42.887873],[-75.174147,42.88711],[-75.174851,42.887015],[-75.17916099999999,42.886378],[-75.180944,42.886107],[-75.181039,42.886093],[-75.181443,42.886047],[-75.181888,42.886011],[-75.184411,42.885857],[-75.18557800000001,42.885808],[-75.18546600000001,42.886007],[-75.185625,42.88605],[-75.185845,42.885801],[-75.187095,42.885786],[-75.18749800000001,42.885773],[-75.188182,42.885692],[-75.18871900000001,42.885599],[-75.189302,42.885496],[-75.189643,42.885451],[-75.189943,42.885433],[-75.190792,42.885375],[-75.191005,42.885364],[-75.19337299999999,42.885185],[-75.196208,42.884983],[-75.196303,42.884976],[-75.196974,42.884919],[-75.197945,42.884836],[-75.19807900000001,42.884825],[-75.198335,42.884806],[-75.19895200000001,42.884736],[-75.199259,42.884689],[-75.19941799999999,42.884662],[-75.20044900000001,42.884479],[-75.200991,42.884369],[-75.20107,42.88435],[-75.201435,42.884263],[-75.20171000000001,42.884179],[-75.20186699999999,42.884126],[-75.202005,42.885232],[-75.20228899999999,42.887505],[-75.202656,42.891417],[-75.202675,42.891669],[-75.20339199999999,42.899263],[-75.204166,42.907137],[-75.204176,42.907236],[-75.204508,42.910594],[-75.20462499999999,42.911785],[-75.204638,42.911943],[-75.205083,42.916818],[-75.20508700000001,42.916866],[-75.205716,42.923388],[-75.20648,42.931318],[-75.20649,42.931426],[-75.20706,42.937334],[-75.207066,42.937407],[-75.207362,42.940574]]],"type":"Polygon"}
}