{
  "id": "360810351001",
  "type": "Feature",
  "properties": {
    "area_land":43962,
    "area_water":0,
    "geoid":"360810351001",
    "name":"Block Group 1",
    "state":"ny"
},
  "bbox": [
    -73.876992,
    40.756536,
    -73.875139,
    40.761621
],
  "geometry": {"coordinates":[[[-73.876992,40.761621],[-73.876014,40.761444],[-73.87580699999999,40.760308],[-73.875511,40.75868],[-73.875139,40.756634],[-73.876068,40.756536],[-73.87645500000001,40.75866],[-73.876738,40.76021],[-73.876992,40.761621]]],"type":"Polygon"}
}