{
  "id": "360471142021",
  "type": "Feature",
  "properties": {
    "area_land":69090,
    "area_water":0,
    "geoid":"360471142021",
    "name":"Block Group 1",
    "state":"ny"
},
  "bbox": [
    -73.894312,
    40.680854,
    -73.888924,
    40.684543
],
  "geometry": {"coordinates":[[[-73.894312,40.681566],[-73.893253,40.682067],[-73.891975,40.682743],[-73.892523,40.683424],[-73.89166,40.684044],[-73.890878,40.684543],[-73.890201,40.683864],[-73.889747,40.684131],[-73.889607,40.684214],[-73.888924,40.683126],[-73.889293,40.682955],[-73.890283,40.682484],[-73.891378,40.681969],[-73.89201799999999,40.681668],[-73.89263699999999,40.681374],[-73.893733,40.680854],[-73.894312,40.681566]]],"type":"Polygon"}
}