{
  "id": "360470185011",
  "type": "Feature",
  "properties": {
    "area_land":29043,
    "area_water":0,
    "geoid":"360470185011",
    "name":"Block Group 1",
    "state":"ny"
},
  "bbox": [
    -73.973485,
    40.69321,
    -73.971872,
    40.696246
],
  "geometry": {"coordinates":[[[-73.973485,40.696246],[-73.97247,40.696207],[-73.97245100000001,40.696112],[-73.97242799999999,40.695997],[-73.972409,40.695904],[-73.971872,40.69321],[-73.972911,40.693251],[-73.972992,40.693646],[-73.973123,40.694293],[-73.973309,40.69521],[-73.973446,40.695948],[-73.97345799999999,40.696052],[-73.97346899999999,40.696141],[-73.973485,40.696246]]],"type":"Polygon"}
}