{
  "id": "360290079011",
  "type": "Feature",
  "properties": {
    "area_land":1474831,
    "area_water":73386,
    "geoid":"360290079011",
    "name":"Block Group 1",
    "state":"ny"
},
  "bbox": [
    -78.851249,
    43.014949,
    -78.822177,
    43.031078
],
  "geometry": {"coordinates":[[[-78.851249,43.019254],[-78.849188,43.019338],[-78.84611,43.019461],[-78.845478,43.019376],[-78.841745,43.018863],[-78.840431,43.019187],[-78.83935,43.019453],[-78.837366,43.021004],[-78.833619,43.02395],[-78.83334600000001,43.024165],[-78.833258,43.024293],[-78.83266999999999,43.025143],[-78.831818,43.026142],[-78.830731,43.028867],[-78.830473,43.029157],[-78.830189,43.029662],[-78.828805,43.030139],[-78.827314,43.029929],[-78.82560100000001,43.029913],[-78.82497600000001,43.030131],[-78.824653,43.030503],[-78.824178,43.031078],[-78.824005,43.031077],[-78.823502,43.031068],[-78.822748,43.03107],[-78.822211,43.031023],[-78.822203,43.030222],[-78.82219600000001,43.029091],[-78.82219499999999,43.028678],[-78.82219499999999,43.028029],[-78.822185,43.026244],[-78.82218399999999,43.02613],[-78.822183,43.025841],[-78.82218,43.025121],[-78.82217900000001,43.024798],[-78.822177,43.024282],[-78.822197,43.021769],[-78.82220700000001,43.020627],[-78.82222299999999,43.018734],[-78.82224100000001,43.01684],[-78.822253,43.014949],[-78.82385499999999,43.014955],[-78.824941,43.014958],[-78.826024,43.014962],[-78.826016,43.015815],[-78.826352,43.015812],[-78.826476,43.015825],[-78.826572,43.015846],[-78.826673,43.015888],[-78.82676600000001,43.015939],[-78.82744700000001,43.01646],[-78.82787399999999,43.016787],[-78.829019,43.01766],[-78.827921,43.018594],[-78.82784100000001,43.018651],[-78.827727,43.018711],[-78.827563,43.018772],[-78.827422,43.018841],[-78.827302,43.018918],[-78.827173,43.019028],[-78.828157,43.01965],[-78.829097,43.018838],[-78.829875,43.018181],[-78.831119,43.017434],[-78.83156,43.017178],[-78.831986,43.017472],[-78.833125,43.018352],[-78.83361499999999,43.018733],[-78.834838,43.019596],[-78.83569799999999,43.019804],[-78.836371,43.019819],[-78.836854,43.019653],[-78.837209,43.019532],[-78.83792099999999,43.019205],[-78.83802799999999,43.019092],[-78.838948,43.018789],[-78.842071,43.017759],[-78.84672999999999,43.017739],[-78.851055,43.017979],[-78.85105799999999,43.01866],[-78.851057,43.018759],[-78.85110899999999,43.018873],[-78.851159,43.019056],[-78.851249,43.019254]]],"type":"Polygon"}
}