{
  "id": "361190143003",
  "type": "Feature",
  "properties": {
    "area_land":130709,
    "area_water":0,
    "geoid":"361190143003",
    "name":"Block Group 3",
    "state":"ny"
},
  "bbox": [
    -73.922183,
    41.288068,
    -73.915212,
    41.291702
],
  "geometry": {"coordinates":[[[-73.922183,41.291478],[-73.921897,41.291512],[-73.92055999999999,41.291625],[-73.91996899999999,41.291687],[-73.91978,41.291702],[-73.92007700000001,41.291099],[-73.920179,41.290864],[-73.920252,41.290664],[-73.91974399999999,41.29076],[-73.919472,41.2908],[-73.91908100000001,41.290821],[-73.91857299999999,41.290807],[-73.917908,41.290815],[-73.917357,41.290807],[-73.917185,41.290788],[-73.91703,41.290771],[-73.915873,41.29076],[-73.91533699999999,41.290796],[-73.915262,41.290813],[-73.91522999999999,41.290005],[-73.915222,41.289835],[-73.915212,41.289614],[-73.915238,41.289004],[-73.916595,41.288984],[-73.917163,41.288983],[-73.917601,41.288983],[-73.91810099999999,41.288977],[-73.91848299999999,41.288975],[-73.91868100000001,41.288969],[-73.91891,41.288861],[-73.919662,41.288434],[-73.92010999999999,41.288192],[-73.92026799999999,41.288089],[-73.92028000000001,41.288068],[-73.920832,41.288878],[-73.921387,41.289654],[-73.921475,41.289762],[-73.92171399999999,41.290056],[-73.921899,41.290363],[-73.921954,41.290452],[-73.921994,41.290574],[-73.92214800000001,41.291242],[-73.922183,41.291478]]],"type":"Polygon"}
}