{
  "id": "360290079042",
  "type": "Feature",
  "properties": {
    "area_land":293093,
    "area_water":0,
    "geoid":"360290079042",
    "name":"Block Group 2",
    "state":"ny"
},
  "bbox": [
    -78.830149,
    42.980851,
    -78.822704,
    42.98677
],
  "geometry": {"coordinates":[[[-78.829279,42.984725],[-78.828731,42.98511],[-78.82865700000001,42.985188],[-78.828594,42.985285],[-78.828564,42.985359],[-78.828553,42.98542],[-78.828525,42.985941],[-78.828496,42.98677],[-78.826883,42.986757],[-78.825261,42.986742],[-78.824184,42.986731],[-78.822704,42.986713],[-78.822739,42.985884],[-78.82279699999999,42.984361],[-78.822802,42.984237],[-78.82286000000001,42.982747],[-78.822925,42.980859],[-78.82502700000001,42.980851],[-78.825501,42.980862],[-78.82787399999999,42.982518],[-78.827921,42.982517],[-78.829218,42.983401],[-78.83014900000001,42.984122],[-78.829279,42.984725]]],"type":"Polygon"}
}