{
  "id": "361190090002",
  "type": "Feature",
  "properties": {
    "area_land":383866,
    "area_water":0,
    "geoid":"361190090002",
    "name":"Block Group 2",
    "state":"ny"
},
  "bbox": [
    -73.775841,
    41.032534,
    -73.76956,
    41.044444
],
  "geometry": {"coordinates":[[[-73.775825,41.039777],[-73.775784,41.040162],[-73.77572499999999,41.040531],[-73.774928,41.043239],[-73.77468,41.043944],[-73.774587,41.044252],[-73.77425700000001,41.044346],[-73.773946,41.044444],[-73.774141,41.043787],[-73.77427,41.043342],[-73.77436,41.042983],[-73.77328900000001,41.043127],[-73.77118299999999,41.043479],[-73.77105299999999,41.043024],[-73.770976,41.042757],[-73.770849,41.042277],[-73.770782,41.042044],[-73.770655,41.04143],[-73.770596,41.040893],[-73.770563,41.040663],[-73.770509,41.040394],[-73.770414,41.040032],[-73.770257,41.039599],[-73.770116,41.039212],[-73.77000099999999,41.038964],[-73.76990600000001,41.03876],[-73.76956,41.037858],[-73.770567,41.037611],[-73.770663,41.037382],[-73.77057499999999,41.037295],[-73.770509,41.037164],[-73.770483,41.036964],[-73.770488,41.036831],[-73.77055,41.036636],[-73.77057600000001,41.036595],[-73.770611,41.036539],[-73.77069400000001,41.036487],[-73.77081200000001,41.036441],[-73.771931,41.036177],[-73.772383,41.036023],[-73.772665,41.035936],[-73.77305,41.035831],[-73.77385099999999,41.035639],[-73.773985,41.035595],[-73.77418,41.035513],[-73.774613,41.035304],[-73.774548,41.035178],[-73.774486,41.034934],[-73.774404,41.034513],[-73.774368,41.034252],[-73.774317,41.033912],[-73.77422300000001,41.033414],[-73.774153,41.032787],[-73.77412200000001,41.032679],[-73.77407700000001,41.032587],[-73.77516799999999,41.032534],[-73.77522500000001,41.033364],[-73.775319,41.034203],[-73.77555099999999,41.036205],[-73.775671,41.037688],[-73.77582,41.038967],[-73.775841,41.039305],[-73.775825,41.039777]]],"type":"Polygon"}
}