{
  "id": "360610087001",
  "type": "Feature",
  "properties": {
    "area_land":82681,
    "area_water":0,
    "geoid":"360610087001",
    "name":"Block Group 1",
    "state":"ny"
},
  "bbox": [
    -73.997862,
    40.73986,
    -73.993292,
    40.743431
],
  "geometry": {"coordinates":[[[-73.997434,40.741642],[-73.997007,40.742228],[-73.99657999999999,40.742811],[-73.996129,40.743431],[-73.993292,40.742233],[-73.99373900000001,40.741617],[-73.994028,40.741219],[-73.994165,40.741031],[-73.99459299999999,40.740442],[-73.995018,40.73986],[-73.997862,40.741056],[-73.997434,40.741642]]],"type":"Polygon"}
}