{
  "id": "361031585072",
  "type": "Feature",
  "properties": {
    "area_land":1415633,
    "area_water":0,
    "geoid":"361031585072",
    "name":"Block Group 2",
    "state":"ny"
},
  "bbox": [
    -73.077702,
    40.846888,
    -73.05865,
    40.861942
],
  "geometry": {"coordinates":[[[-73.077702,40.859382],[-73.07722,40.859492],[-73.076487,40.859694],[-73.076007,40.859797],[-73.07507,40.859927],[-73.07335999999999,40.860072],[-73.072695,40.860118],[-73.071676,40.86023],[-73.070943,40.860332],[-73.07083,40.860335],[-73.070671,40.860345],[-73.070274,40.860383],[-73.06862,40.860558],[-73.068502,40.860571],[-73.068448,40.860577],[-73.06839600000001,40.860583],[-73.066053,40.860885],[-73.065782,40.86092],[-73.06490599999999,40.861072],[-73.06439399999999,40.861179],[-73.06383700000001,40.861315],[-73.062946,40.861507],[-73.062282,40.861666],[-73.061572,40.861785],[-73.061396,40.861809],[-73.0609,40.861868],[-73.06050399999999,40.861914],[-73.06022900000001,40.861942],[-73.060107,40.861251],[-73.05986300000001,40.859732],[-73.059473,40.857483],[-73.05909200000001,40.855167],[-73.05865,40.852478],[-73.05945699999999,40.852493],[-73.059361,40.851971],[-73.061639,40.851857],[-73.06160199999999,40.851378],[-73.061043,40.848806],[-73.061396,40.848816],[-73.061849,40.848811],[-73.063677,40.848795],[-73.06348,40.847594],[-73.06338,40.846888],[-73.063473,40.846943],[-73.064554,40.847606],[-73.065135,40.847984],[-73.065578,40.848269],[-73.06622,40.848773],[-73.06696599999999,40.849434],[-73.06743899999999,40.849864],[-73.067609,40.850032],[-73.06780500000001,40.850181],[-73.068095,40.850447],[-73.06868299999999,40.851081],[-73.06891899999999,40.851363],[-73.069239,40.851761],[-73.06945399999999,40.852019],[-73.069553,40.852131],[-73.06965099999999,40.852243],[-73.069698,40.852296],[-73.069988,40.852627],[-73.070719,40.853412],[-73.07151500000001,40.854282],[-73.071607,40.854392],[-73.071726,40.854489],[-73.071849,40.854578],[-73.07197499999999,40.854666],[-73.072104,40.854757],[-73.07223500000001,40.85485],[-73.072366,40.854942],[-73.07250000000001,40.855032],[-73.072633,40.855126],[-73.07276,40.855227],[-73.072889,40.855324],[-73.073013,40.855425],[-73.073132,40.855526],[-73.07324800000001,40.855624],[-73.073493,40.855802],[-73.073618,40.855886],[-73.073742,40.855971],[-73.07386700000001,40.856053],[-73.073992,40.856134],[-73.07411399999999,40.856217],[-73.074235,40.8563],[-73.07435599999999,40.856381],[-73.074476,40.856465],[-73.074595,40.856544],[-73.074713,40.856623],[-73.07482899999999,40.856706],[-73.074945,40.856791],[-73.07505999999999,40.856877],[-73.075175,40.856965],[-73.075288,40.857056],[-73.075397,40.857151],[-73.075504,40.857248],[-73.07560599999999,40.857345],[-73.07574,40.857405],[-73.07612899999999,40.857795],[-73.076944,40.858597],[-73.077342,40.859042],[-73.077702,40.859382]]],"type":"Polygon"}
}