{
  "id": "360450625002",
  "type": "Feature",
  "properties": {
    "area_land":202672768,
    "area_water":475830,
    "geoid":"360450625002",
    "name":"Block Group 2",
    "state":"ny"
},
  "bbox": [
    -76.076293,
    43.668143,
    -75.774553,
    43.790341
],
  "geometry": {"coordinates":[[[-76.076185,43.672416],[-76.075266,43.674712],[-76.074528,43.67672],[-76.07451,43.676768],[-76.074448,43.676879],[-76.074335,43.677162],[-76.074005,43.677897],[-76.07379299999999,43.678307],[-76.073155,43.679689],[-76.072678,43.680578],[-76.072531,43.680858],[-76.072484,43.680953],[-76.07232,43.681282],[-76.072204,43.681511],[-76.072126,43.681666],[-76.071917,43.681992],[-76.071668,43.682324],[-76.07142399999999,43.682599],[-76.071095,43.68292],[-76.07058600000001,43.68333],[-76.070116,43.683664],[-76.07004999999999,43.68371],[-76.066784,43.686043],[-76.06650399999999,43.686246],[-76.066435,43.686296],[-76.06612199999999,43.686529],[-76.06518199999999,43.687218],[-76.06489000000001,43.687446],[-76.064556,43.687771],[-76.064311,43.68808],[-76.064136,43.688365],[-76.064014,43.688697],[-76.06389900000001,43.689116],[-76.063864,43.689303],[-76.064106,43.693251],[-76.06419699999999,43.694633],[-76.064206,43.694935],[-76.06418499999999,43.695398],[-76.06411199999999,43.69576],[-76.06404000000001,43.695993],[-76.06384199999999,43.696493],[-76.063298,43.697636],[-76.062952,43.69836],[-76.062729,43.698859],[-76.06263,43.699132],[-76.062495,43.699625],[-76.06243600000001,43.700021],[-76.06238999999999,43.700431],[-76.062364,43.700858],[-76.06227800000001,43.702978],[-76.062213,43.703852],[-76.06215,43.704349],[-76.061846,43.706578],[-76.06180999999999,43.706941],[-76.06178800000001,43.707378],[-76.06179,43.707628],[-76.061792,43.707874],[-76.06179400000001,43.707912],[-76.06180999999999,43.708191],[-76.06182200000001,43.708286],[-76.061871,43.708658],[-76.061876,43.708693],[-76.06195200000001,43.709245],[-76.06201900000001,43.709639],[-76.062062,43.709845],[-76.06210299999999,43.710044],[-76.062285,43.710913],[-76.062319,43.711072],[-76.062349,43.711217],[-76.062499,43.711983],[-76.062515,43.712043],[-76.062674,43.71262],[-76.062735,43.712795],[-76.06307,43.71362],[-76.06335799999999,43.714294],[-76.06348800000001,43.714641],[-76.06383599999999,43.71542],[-76.06470400000001,43.7175],[-76.064787,43.717699],[-76.064932,43.718071],[-76.06497299999999,43.718177],[-76.06503600000001,43.718384],[-76.06510299999999,43.718601],[-76.065169,43.719003],[-76.06519299999999,43.719352],[-76.06519299999999,43.719571],[-76.065155,43.719967],[-76.064998,43.720563],[-76.064436,43.722543],[-76.064279,43.723045],[-76.064193,43.723335],[-76.064159,43.723448],[-76.063963,43.72411],[-76.06364000000001,43.725342],[-76.063462,43.725951],[-76.063323,43.726302],[-76.063219,43.726514],[-76.062298,43.728191],[-76.061633,43.729435],[-76.061497,43.72969],[-76.060631,43.731322],[-76.059147,43.734097],[-76.058688,43.734994],[-76.058532,43.735302],[-76.05815699999999,43.736071],[-76.058114,43.736168],[-76.05783,43.736822],[-76.057732,43.737129],[-76.05763399999999,43.73749],[-76.057361,43.738735],[-76.057199,43.739494],[-76.056484,43.742738],[-76.05632300000001,43.74333],[-76.056248,43.743535],[-76.056044,43.743974],[-76.055933,43.744167],[-76.055694,43.744544],[-76.05549499999999,43.744807],[-76.05539,43.74493],[-76.055212,43.74515],[-76.055001,43.745382],[-76.054778,43.745599],[-76.054017,43.746285],[-76.053299,43.746915],[-76.052948,43.747188],[-76.052634,43.747418],[-76.052026,43.747821],[-76.050437,43.74884],[-76.04927499999999,43.749594],[-76.049048,43.749757],[-76.04860499999999,43.750116],[-76.048269,43.750431],[-76.047915,43.750808],[-76.04772,43.751051],[-76.047558,43.751287],[-76.04725999999999,43.751749],[-76.046716,43.752692],[-76.046358,43.753294],[-76.045604,43.75456],[-76.045339,43.755033],[-76.045053,43.755502],[-76.044783,43.75597],[-76.044209,43.756924],[-76.043297,43.758309],[-76.042968,43.75881],[-76.042663,43.759297],[-76.041996,43.760327],[-76.041265,43.761447],[-76.041132,43.761644],[-76.040255,43.762958],[-76.03964999999999,43.763872],[-76.03869899999999,43.76534],[-76.038465,43.765823],[-76.03834000000001,43.766159],[-76.03819300000001,43.76676],[-76.038161,43.767029],[-76.038146,43.767339],[-76.03808600000001,43.770117],[-76.03805199999999,43.770871],[-76.03797900000001,43.771236],[-76.03788,43.771593],[-76.037719,43.772044],[-76.036852,43.774347],[-76.036755,43.77465],[-76.036,43.776716],[-76.035399,43.778377],[-76.034696,43.780287],[-76.034553,43.780776],[-76.034458,43.781256],[-76.034423,43.781839],[-76.034071,43.781823],[-76.033131,43.781755],[-76.032138,43.781667],[-76.03189500000001,43.781652],[-76.03169699999999,43.781639],[-76.031521,43.781637],[-76.031306,43.781647],[-76.02995900000001,43.781809],[-76.029218,43.781911],[-76.029156,43.781919],[-76.028871,43.781956],[-76.02846599999999,43.781965],[-76.028325,43.781958],[-76.027832,43.781898],[-76.027599,43.781864],[-76.025246,43.781522],[-76.024089,43.781375],[-76.023527,43.781283],[-76.023267,43.781193],[-76.02238199999999,43.780726],[-76.021676,43.780376],[-76.021433,43.780277],[-76.02113,43.780211],[-76.02096,43.780208],[-76.020488,43.780268],[-76.019913,43.780389],[-76.018776,43.780652],[-76.018421,43.780721],[-76.018064,43.780728],[-76.017724,43.780692],[-76.016678,43.780518],[-76.01657400000001,43.780505],[-76.01656199999999,43.78031],[-76.016559,43.779838],[-76.01661,43.778409],[-76.016628,43.77828],[-76.016666,43.778161],[-76.016897,43.777699],[-76.017044,43.777466],[-76.017264,43.777208],[-76.017409,43.776996],[-76.017528,43.776732],[-76.01756899999999,43.77661],[-76.01763099999999,43.776357],[-76.017635,43.776173],[-76.017616,43.776038],[-76.017489,43.775621],[-76.017323,43.775319],[-76.01712999999999,43.775094],[-76.01688900000001,43.774883],[-76.016831,43.774832],[-76.01650600000001,43.774617],[-76.016312,43.774524],[-76.015804,43.77435],[-76.014884,43.774115],[-76.014528,43.774031],[-76.01391099999999,43.773957],[-76.013695,43.773944],[-76.013301,43.773937],[-76.012996,43.773942],[-76.012556,43.773989],[-76.012263,43.774045],[-76.01193000000001,43.774134],[-76.010943,43.774455],[-76.010249,43.774696],[-76.009547,43.774917],[-76.008837,43.775098],[-76.008578,43.775132],[-76.008353,43.775152],[-76.007604,43.775177],[-76.00606500000001,43.775207],[-76.00546900000001,43.775156],[-76.004806,43.775026],[-76.00462,43.774972],[-76.003153,43.774606],[-76.002466,43.77442],[-76.001327,43.774134],[-76.00035099999999,43.773968],[-75.998424,43.773574],[-75.99755999999999,43.773406],[-75.99663099999999,43.773244],[-75.995699,43.773096],[-75.994766,43.772959],[-75.992795,43.77263],[-75.992424,43.772571],[-75.99106999999999,43.77236],[-75.99028800000001,43.772267],[-75.989071,43.772159],[-75.988208,43.772114],[-75.987184,43.772104],[-75.986942,43.772115],[-75.98608400000001,43.772212],[-75.98572900000001,43.772241],[-75.98553699999999,43.772241],[-75.985192,43.772224],[-75.98494100000001,43.772189],[-75.98449100000001,43.7721],[-75.98291399999999,43.771711],[-75.982119,43.771471],[-75.981477,43.771256],[-75.979513,43.770558],[-75.977678,43.76992],[-75.97581599999999,43.7693],[-75.97543400000001,43.769183],[-75.974681,43.768966],[-75.97412799999999,43.768851],[-75.97342500000001,43.768725],[-75.972679,43.768602],[-75.968605,43.767846],[-75.967772,43.767707],[-75.966183,43.767414],[-75.96268499999999,43.766788],[-75.962266,43.766714],[-75.96079899999999,43.766453],[-75.959641,43.766224],[-75.959344,43.76614],[-75.95925800000001,43.766181],[-75.95880200000001,43.766323],[-75.95846400000001,43.7664],[-75.958021,43.766453],[-75.95761899999999,43.766482],[-75.956504,43.766551],[-75.955648,43.766619],[-75.954114,43.766721],[-75.953233,43.766789],[-75.952454,43.766843],[-75.94632,43.767345],[-75.941912,43.76767],[-75.94161099999999,43.767695],[-75.940241,43.767812],[-75.937744,43.76805],[-75.93705300000001,43.768101],[-75.935903,43.7682],[-75.93526799999999,43.768239],[-75.93499799999999,43.768244],[-75.934652,43.768233],[-75.93439100000001,43.768197],[-75.93414199999999,43.768139],[-75.93317500000001,43.767869],[-75.929265,43.766666],[-75.92888499999999,43.766569],[-75.928512,43.766492],[-75.92768700000001,43.766354],[-75.926131,43.766082],[-75.92437099999999,43.765743],[-75.923979,43.765679],[-75.923861,43.765675],[-75.923423,43.765579],[-75.923399,43.765681],[-75.92341500000001,43.765811],[-75.92336,43.765858],[-75.92322299999999,43.766041],[-75.92198500000001,43.768004],[-75.921576,43.768567],[-75.921289,43.768883],[-75.92027,43.769914],[-75.91931200000001,43.770855],[-75.91788,43.772303],[-75.91447700000001,43.775678],[-75.914002,43.776109],[-75.91356500000001,43.776491],[-75.913037,43.776952],[-75.91261900000001,43.77733],[-75.91236000000001,43.777545],[-75.912306,43.777587],[-75.912094,43.777752],[-75.912081,43.77776],[-75.91179,43.777952],[-75.911479,43.778122],[-75.91105399999999,43.778326],[-75.909711,43.778907],[-75.90814399999999,43.779569],[-75.906577,43.780256],[-75.90579700000001,43.780616],[-75.90348899999999,43.781628],[-75.903155,43.781767],[-75.902987,43.781823],[-75.902824,43.781874],[-75.902497,43.781975],[-75.900707,43.78245],[-75.898534,43.783059],[-75.897809,43.783274],[-75.896023,43.783761],[-75.89588999999999,43.783793],[-75.895602,43.783828],[-75.89535100000001,43.783833],[-75.895045,43.783823],[-75.891803,43.78366],[-75.890474,43.783643],[-75.89008200000001,43.783654],[-75.889551,43.783668],[-75.888807,43.783711],[-75.886852,43.783916],[-75.88630499999999,43.783977],[-75.885291,43.784049],[-75.885149,43.784053],[-75.88479700000001,43.784095],[-75.884519,43.784138],[-75.883703,43.7843],[-75.88312999999999,43.784383],[-75.882518,43.784442],[-75.881545,43.784497],[-75.88083,43.784525],[-75.87988,43.784533],[-75.879555,43.784529],[-75.87938699999999,43.784527],[-75.87870100000001,43.784492],[-75.87844,43.784494],[-75.877895,43.784467],[-75.877717,43.784469],[-75.87764300000001,43.784447],[-75.877326,43.784247],[-75.875596,43.78322],[-75.87499699999999,43.782854],[-75.874475,43.782504],[-75.871613,43.780719],[-75.870892,43.780283],[-75.87025199999999,43.77988],[-75.869473,43.779406],[-75.86833300000001,43.778723],[-75.867783,43.778437],[-75.86743300000001,43.778281],[-75.86674499999999,43.778002],[-75.86560299999999,43.777527],[-75.864704,43.777151],[-75.863636,43.77669],[-75.86333999999999,43.776577],[-75.862977,43.776473],[-75.86228300000001,43.776324],[-75.861114,43.776123],[-75.860781,43.776074],[-75.860181,43.776022],[-75.85867500000001,43.775947],[-75.85793200000001,43.775925],[-75.857277,43.77591],[-75.85661,43.775868],[-75.856348,43.775843],[-75.855895,43.775782],[-75.855441,43.775694],[-75.85515700000001,43.775619],[-75.85477299999999,43.775505],[-75.854077,43.775269],[-75.85149699999999,43.774229],[-75.85020299999999,43.773727],[-75.849069,43.773268],[-75.84858,43.773046],[-75.84837,43.772934],[-75.847658,43.772495],[-75.84675799999999,43.771895],[-75.84576800000001,43.771277],[-75.84524,43.771005],[-75.84469900000001,43.770768],[-75.844297,43.770615],[-75.843836,43.770455],[-75.840063,43.769019],[-75.83981199999999,43.768963],[-75.839578,43.768928],[-75.838953,43.768857],[-75.83825,43.768806],[-75.83756099999999,43.768772],[-75.83481999999999,43.768595],[-75.834124,43.768567],[-75.833383,43.768525],[-75.833229,43.768508],[-75.829161,43.7682],[-75.82778,43.768117],[-75.825514,43.767952],[-75.824403,43.767884],[-75.823759,43.767834],[-75.821547,43.767677],[-75.82004999999999,43.767561],[-75.819472,43.767527],[-75.818121,43.767469],[-75.817431,43.767477],[-75.816951,43.767509],[-75.817035,43.76861],[-75.817132,43.76954],[-75.817217,43.770066],[-75.817441,43.771984],[-75.817504,43.77266],[-75.81758499999999,43.773417],[-75.81763599999999,43.773788],[-75.817688,43.774117],[-75.817753,43.774581],[-75.817879,43.775817],[-75.817892,43.776023],[-75.817908,43.776288],[-75.817959,43.776759],[-75.818077,43.7777],[-75.818105,43.777993],[-75.81814799999999,43.778349],[-75.8184,43.780102],[-75.818456,43.780586],[-75.81854199999999,43.781182],[-75.81896,43.784446],[-75.819031,43.784895],[-75.81934800000001,43.78742],[-75.819543,43.788843],[-75.81964600000001,43.78966],[-75.81970099999999,43.790025],[-75.819737,43.790267],[-75.819737,43.790341],[-75.819496,43.790293],[-75.819131,43.790281],[-75.818101,43.790246],[-75.817699,43.790224],[-75.81706699999999,43.790169],[-75.816783,43.790151],[-75.816664,43.790143],[-75.815421,43.790033],[-75.81509800000001,43.790024],[-75.814482,43.790033],[-75.814301,43.790026],[-75.813789,43.789965],[-75.812777,43.78993],[-75.812341,43.789894],[-75.811942,43.789846],[-75.811436,43.789798],[-75.81095999999999,43.789784],[-75.81030199999999,43.789785],[-75.809912,43.789772],[-75.809687,43.789758],[-75.80937,43.78971],[-75.808984,43.789672],[-75.80891099999999,43.789665],[-75.808742,43.789648],[-75.807687,43.789609],[-75.807388,43.789591],[-75.806909,43.789571],[-75.80668300000001,43.789571],[-75.8065,43.78958],[-75.806147,43.789575],[-75.804928,43.789505],[-75.786759,43.78832],[-75.78512600000001,43.774683],[-75.78444500000001,43.769002],[-75.784386,43.768508],[-75.78430899999999,43.767858],[-75.784234,43.767242],[-75.78421,43.767044],[-75.782155,43.753304],[-75.78215,43.753273],[-75.78166,43.750069],[-75.780973,43.74429],[-75.780064,43.737964],[-75.779049,43.7288],[-75.778988,43.728192],[-75.778955,43.727856],[-75.778008,43.71829],[-75.77691900000001,43.708997],[-75.775982,43.701429],[-75.77549,43.696991],[-75.77547199999999,43.696826],[-75.774553,43.688884],[-75.774885,43.688932],[-75.78727000000001,43.689822],[-75.78769699999999,43.689851],[-75.818943,43.692091],[-75.819067,43.6921],[-75.819605,43.692138],[-75.81977000000001,43.69215],[-75.82770600000001,43.692731],[-75.827831,43.69274],[-75.84848100000001,43.694219],[-75.853565,43.694583],[-75.857124,43.694838],[-75.858948,43.694968],[-75.85897300000001,43.69497],[-75.85953600000001,43.69501],[-75.860007,43.695034],[-75.860156,43.695041],[-75.86073,43.695069],[-75.86103799999999,43.695085],[-75.861423,43.695104],[-75.86210699999999,43.695138],[-75.862719,43.695168],[-75.86286200000001,43.695175],[-75.863407,43.695202],[-75.86438699999999,43.69525],[-75.86517000000001,43.695291],[-75.866203,43.695348],[-75.867788,43.695455],[-75.869986,43.695611],[-75.871741,43.695737],[-75.87239,43.695781],[-75.87332600000001,43.69585],[-75.87744600000001,43.69614],[-75.878317,43.6962],[-75.882891,43.696519],[-75.88843900000001,43.696906],[-75.88858999999999,43.696917],[-75.889231,43.696962],[-75.891661,43.697151],[-75.891623,43.697133],[-75.891867,43.697146],[-75.892292,43.697175],[-75.89254099999999,43.697193],[-75.892712,43.697204],[-75.894008,43.697296],[-75.89475,43.697347],[-75.895568,43.697403],[-75.896556,43.697472],[-75.900183,43.697704],[-75.90291999999999,43.697878],[-75.903403,43.697909],[-75.904169,43.697957],[-75.90437,43.697969],[-75.905326,43.698084],[-75.905383,43.698085],[-75.9055,43.698093],[-75.905682,43.698109],[-75.90586999999999,43.698128],[-75.90594900000001,43.698137],[-75.906057,43.698148],[-75.906212,43.698165],[-75.906381,43.698175],[-75.906538,43.698184],[-75.906741,43.698195],[-75.906981,43.698209],[-75.907231,43.698224],[-75.907602,43.698246],[-75.907995,43.69827],[-75.908277,43.698274],[-75.90858299999999,43.698261],[-75.908664,43.698255],[-75.90876299999999,43.698247],[-75.909026,43.69822],[-75.910608,43.698306],[-75.91247199999999,43.698407],[-75.913523,43.698464],[-75.915882,43.698592],[-75.920073,43.698896],[-75.922079,43.699058],[-75.92587899999999,43.699364],[-75.932654,43.699902],[-75.936762,43.700136],[-75.936815,43.700139],[-75.95231200000001,43.701257],[-75.95505199999999,43.701455],[-75.9765,43.703001],[-75.97653099999999,43.70301],[-75.99010699999999,43.70392],[-75.9924,43.704128],[-75.99329299999999,43.704208],[-75.994848,43.704353],[-75.996323,43.704476],[-75.997659,43.704593],[-76.001689,43.704949],[-76.002764,43.705044],[-76.00381,43.705136],[-76.00622199999999,43.705348],[-76.00858599999999,43.705557],[-76.010935,43.705764],[-76.011044,43.705775],[-76.011342,43.7058],[-76.012169,43.705875],[-76.012221,43.70588],[-76.013186,43.705962],[-76.014342,43.706067],[-76.01531900000001,43.706132],[-76.015719,43.70616],[-76.01681000000001,43.706236],[-76.020045,43.70654],[-76.025087,43.707018],[-76.024958,43.704431],[-76.02474100000001,43.701355],[-76.024626,43.699709],[-76.024502,43.698847],[-76.02449,43.698762],[-76.02420600000001,43.695445],[-76.023815,43.690563],[-76.02357600000001,43.687227],[-76.023554,43.686925],[-76.023353,43.684119],[-76.02332199999999,43.683691],[-76.02318699999999,43.682508],[-76.02316999999999,43.682287],[-76.02301300000001,43.680289],[-76.022941,43.679374],[-76.022919,43.679097],[-76.02275299999999,43.677666],[-76.02234199999999,43.672466],[-76.022305,43.671986],[-76.022035,43.668542],[-76.022003,43.668143],[-76.022593,43.668159],[-76.036928,43.669165],[-76.044781,43.669713],[-76.05768500000001,43.670653],[-76.057806,43.670662],[-76.05825299999999,43.670697],[-76.061183,43.670924],[-76.062648,43.671045],[-76.062704,43.671049],[-76.06302100000001,43.671066],[-76.065144,43.671231],[-76.066391,43.671328],[-76.066425,43.671331],[-76.067435,43.67141],[-76.069138,43.671559],[-76.06940899999999,43.67158],[-76.070409,43.671659],[-76.070825,43.671692],[-76.07629300000001,43.672143],[-76.076185,43.672416]]],"type":"Polygon"}
}