{
  "id": "360050301001",
  "type": "Feature",
  "properties": {
    "area_land":99893,
    "area_water":0,
    "geoid":"360050301001",
    "name":"Block Group 1",
    "state":"ny"
},
  "bbox": [
    -73.92023,
    40.880768,
    -73.916037,
    40.88557
],
  "geometry": {"coordinates":[[[-73.92023,40.88271],[-73.91980700000001,40.883939],[-73.919267,40.884805],[-73.918761,40.88557],[-73.916037,40.884867],[-73.916769,40.883986],[-73.917282,40.882977],[-73.917942,40.881872],[-73.91922099999999,40.880768],[-73.919479,40.880857],[-73.91964400000001,40.880972],[-73.91973,40.881115],[-73.919752,40.881259],[-73.919759,40.881446],[-73.919752,40.881596],[-73.919749,40.881783],[-73.919759,40.88199],[-73.91983,40.882155],[-73.919967,40.882399],[-73.92023,40.88271]]],"type":"Polygon"}
}