{
  "id": "360594129002",
  "type": "Feature",
  "properties": {
    "area_land":391856,
    "area_water":0,
    "geoid":"360594129002",
    "name":"Block Group 2",
    "state":"ny"
},
  "bbox": [
    -73.614674,
    40.674954,
    -73.602534,
    40.680043
],
  "geometry": {"coordinates":[[[-73.61467399999999,40.679069],[-73.611249,40.679421],[-73.609644,40.679553],[-73.608605,40.679629],[-73.607714,40.679708],[-73.60753800000001,40.67971],[-73.60748,40.679702],[-73.607221,40.679621],[-73.60702000000001,40.679547],[-73.60679,40.679924],[-73.60668800000001,40.680033],[-73.606604,40.680043],[-73.60638400000001,40.679739],[-73.606273,40.679552],[-73.606191,40.679354],[-73.60617999999999,40.679317],[-73.60604600000001,40.678864],[-73.605985,40.678656],[-73.60582700000001,40.67819],[-73.603239,40.678377],[-73.603154,40.677693],[-73.603103,40.677247],[-73.60305700000001,40.676997],[-73.603037,40.676862],[-73.602981,40.676686],[-73.60289899999999,40.676499],[-73.60279199999999,40.676335],[-73.60270199999999,40.676202],[-73.602617,40.676026],[-73.602574,40.675883],[-73.60253400000001,40.675651],[-73.60379500000001,40.675564],[-73.604024,40.675537],[-73.604148,40.675532],[-73.604202,40.675518],[-73.604955,40.675423],[-73.605191,40.675395],[-73.60536399999999,40.675363],[-73.605844,40.675299],[-73.606512,40.675208],[-73.606737,40.675186],[-73.607282,40.675148],[-73.608491,40.675124],[-73.608935,40.67512],[-73.609337,40.675363],[-73.609673,40.675509],[-73.610235,40.6754],[-73.61057,40.675326],[-73.61112,40.675223],[-73.612151,40.675021],[-73.612396,40.674954],[-73.612791,40.675568],[-73.612887,40.675726],[-73.613001,40.675912],[-73.613299,40.67638],[-73.61371800000001,40.677041],[-73.61394,40.677385],[-73.61394900000001,40.677414],[-73.61411200000001,40.677697],[-73.614279,40.678009],[-73.614307,40.678088],[-73.614431,40.678366],[-73.614535,40.678625],[-73.614582,40.678774],[-73.61467399999999,40.679069]]],"type":"Polygon"}
}