{
  "id": "360610075003",
  "type": "Feature",
  "properties": {
    "area_land":30394,
    "area_water":0,
    "geoid":"360610075003",
    "name":"Block Group 3",
    "state":"ny"
},
  "bbox": [
    -74.007523,
    40.732852,
    -74.005829,
    40.736534
],
  "geometry": {"coordinates":[[[-74.00739900000001,40.73337],[-74.007344,40.733588],[-74.00716199999999,40.734296],[-74.007012,40.734872],[-74.00698,40.735002],[-74.006799,40.735723],[-74.006621,40.736432],[-74.00582900000001,40.736534],[-74.00596,40.735845],[-74.006069,40.735134],[-74.006181,40.734439],[-74.006294,40.733742],[-74.006407,40.733054],[-74.00752300000001,40.732852],[-74.00739900000001,40.73337]]],"type":"Polygon"}
}