{
  "id": "360811579016",
  "type": "Feature",
  "properties": {
    "area_land":195303,
    "area_water":0,
    "geoid":"360811579016",
    "name":"Block Group 6",
    "state":"ny"
},
  "bbox": [
    -73.710296,
    40.747034,
    -73.701168,
    40.752493
],
  "geometry": {"coordinates":[[[-73.710296,40.747908],[-73.709537,40.748316],[-73.70869399999999,40.748758],[-73.70786099999999,40.749191],[-73.70707400000001,40.74961],[-73.706298,40.750025],[-73.705484,40.750467],[-73.705342,40.750539],[-73.70468099999999,40.75088],[-73.7045,40.750981],[-73.70388199999999,40.751305],[-73.703692,40.751403],[-73.70308300000001,40.751725],[-73.702882,40.751833],[-73.70211500000001,40.75224],[-73.702049,40.752275],[-73.701633,40.752493],[-73.701438,40.751332],[-73.701342,40.750767],[-73.701168,40.748865],[-73.70171000000001,40.748808],[-73.702645,40.748607],[-73.703547,40.748412],[-73.70445100000001,40.748219],[-73.705372,40.748021],[-73.70629099999999,40.747824],[-73.707196,40.747629],[-73.70809800000001,40.747435],[-73.709035,40.747235],[-73.709971,40.747034],[-73.710296,40.747908]]],"type":"Polygon"}
}