{
  "id": "360630242023",
  "type": "Feature",
  "properties": {
    "area_land":27143412,
    "area_water":272691,
    "geoid":"360630242023",
    "name":"Block Group 3",
    "state":"ny"
},
  "bbox": [
    -78.755064,
    43.253054,
    -78.696777,
    43.33819
],
  "geometry": {"coordinates":[[[-78.755064,43.287187],[-78.755022,43.291598],[-78.754897,43.304833],[-78.754856,43.309245],[-78.754876,43.309487],[-78.754937,43.310213],[-78.754958,43.310455],[-78.75465800000001,43.312556],[-78.754625,43.31368],[-78.75434799999999,43.323416],[-78.754256,43.326662],[-78.75427500000001,43.32782],[-78.75433099999999,43.33105],[-78.754335,43.331294],[-78.75435,43.332181],[-78.754355,43.332452],[-78.754355,43.333372],[-78.754357,43.336134],[-78.754358,43.337055],[-78.75310399999999,43.337282],[-78.74934399999999,43.337963],[-78.748574,43.338103],[-78.748091,43.33819],[-78.747837,43.337444],[-78.747078,43.335207],[-78.746825,43.334462],[-78.746819,43.333657],[-78.746818,43.333499],[-78.746797,43.332924],[-78.746762,43.33264],[-78.74674899999999,43.332589],[-78.746658,43.33221],[-78.746533,43.331988],[-78.746374,43.331822],[-78.74615900000001,43.331642],[-78.746021,43.331562],[-78.74580400000001,43.331511],[-78.745407,43.331468],[-78.74427799999999,43.331457],[-78.74401400000001,43.331409],[-78.743792,43.331319],[-78.743568,43.331168],[-78.743432,43.330968],[-78.74339000000001,43.330854],[-78.743376,43.330729],[-78.743397,43.330598],[-78.743459,43.33048],[-78.743584,43.330341],[-78.744035,43.329946],[-78.74419399999999,43.329787],[-78.744204,43.329771],[-78.744333,43.329585],[-78.744482,43.329341],[-78.74453,43.329194],[-78.74454799999999,43.329065],[-78.74452700000001,43.328975],[-78.744437,43.328857],[-78.743972,43.328441],[-78.743802,43.32831],[-78.743695,43.328206],[-78.743618,43.328074],[-78.743584,43.327956],[-78.74356299999999,43.327811],[-78.74356299999999,43.327658],[-78.743584,43.327499],[-78.743695,43.327145],[-78.743723,43.326951],[-78.743702,43.326805],[-78.74359800000001,43.326639],[-78.743424,43.326486],[-78.74319300000001,43.326358],[-78.742876,43.326223],[-78.742515,43.326105],[-78.74213399999999,43.326008],[-78.741849,43.32589],[-78.741711,43.325807],[-78.741128,43.325516],[-78.740954,43.32546],[-78.740531,43.325391],[-78.740129,43.325425],[-78.739825,43.325458],[-78.73952,43.325513],[-78.73938099999999,43.325527],[-78.73872900000001,43.325534],[-78.73854799999999,43.325499],[-78.738382,43.325437],[-78.738229,43.325333],[-78.738097,43.325187],[-78.737813,43.324903],[-78.737709,43.324764],[-78.73765299999999,43.324653],[-78.73759099999999,43.324473],[-78.73744600000001,43.323937],[-78.73735499999999,43.323801],[-78.737195,43.323669],[-78.73702900000001,43.323565],[-78.73684900000001,43.323489],[-78.73661300000001,43.323468],[-78.73643199999999,43.323468],[-78.736321,43.323454],[-78.736261,43.323389],[-78.73625199999999,43.32335],[-78.73625699999999,43.323293],[-78.736294,43.323253],[-78.73654999999999,43.323093],[-78.73662,43.32301],[-78.736647,43.322955],[-78.736689,43.322795],[-78.736728,43.322716],[-78.736786,43.32265],[-78.737404,43.322164],[-78.73759099999999,43.321942],[-78.73774400000001,43.321734],[-78.73789600000001,43.321554],[-78.738035,43.321416],[-78.738181,43.321249],[-78.738223,43.321169],[-78.738212,43.321011],[-78.738157,43.320952],[-78.738077,43.320903],[-78.73800300000001,43.320882],[-78.73768099999999,43.320826],[-78.73748000000001,43.320806],[-78.73714,43.320806],[-78.736991,43.32079],[-78.73676500000001,43.320715],[-78.736599,43.320644],[-78.736463,43.320571],[-78.736356,43.320494],[-78.736069,43.320196],[-78.735884,43.319856],[-78.73577299999999,43.319481],[-78.735725,43.319232],[-78.73573,43.31912],[-78.735749,43.319014],[-78.73580800000001,43.318899],[-78.73603,43.318566],[-78.736141,43.31822],[-78.73614600000001,43.31814],[-78.736079,43.317901],[-78.735961,43.317721],[-78.735856,43.317582],[-78.735725,43.317471],[-78.735614,43.317422],[-78.735454,43.317395],[-78.73505900000001,43.317388],[-78.73485100000001,43.317374],[-78.73466999999999,43.317339],[-78.73461,43.317308],[-78.73454700000001,43.31722],[-78.734504,43.317131],[-78.734483,43.317013],[-78.734476,43.316896],[-78.734448,43.316805],[-78.734393,43.316722],[-78.734358,43.316688],[-78.734295,43.316653],[-78.73415,43.316618],[-78.734004,43.316563],[-78.733914,43.3165],[-78.733768,43.316362],[-78.73368499999999,43.316209],[-78.73362299999999,43.316126],[-78.733553,43.31606],[-78.73347,43.316022],[-78.73338,43.316008],[-78.733283,43.316022],[-78.73312300000001,43.316077],[-78.73299799999999,43.316133],[-78.732839,43.316188],[-78.732707,43.316223],[-78.732325,43.31623],[-78.73220000000001,43.316202],[-78.732124,43.316161],[-78.73207499999999,43.316119],[-78.732034,43.315987],[-78.732034,43.315876],[-78.732069,43.315641],[-78.73205900000001,43.315446],[-78.73202000000001,43.315391],[-78.731909,43.315308],[-78.731784,43.315232],[-78.73168,43.31519],[-78.731604,43.31519],[-78.73152,43.315204],[-78.731354,43.315294],[-78.73125,43.315308],[-78.73116,43.315294],[-78.731049,43.315246],[-78.730975,43.315186],[-78.730903,43.315079],[-78.73082700000001,43.31501],[-78.730709,43.314947],[-78.73057,43.314892],[-78.730355,43.314823],[-78.73023000000001,43.314739],[-78.730126,43.314642],[-78.730098,43.314538],[-78.730098,43.314411],[-78.730104,43.314366],[-78.727619,43.314781],[-78.723337,43.315497],[-78.72016499999999,43.316028],[-78.717681,43.316444],[-78.71745199999999,43.316462],[-78.716767,43.316518],[-78.716539,43.316537],[-78.71595499999999,43.316641],[-78.714206,43.316954],[-78.713624,43.317059],[-78.710261,43.317597],[-78.70017300000001,43.319213],[-78.696811,43.319753],[-78.696805,43.317515],[-78.6968,43.315314],[-78.696797,43.310893],[-78.69679499999999,43.310804],[-78.696777,43.309473],[-78.696791,43.308568],[-78.697451,43.308573],[-78.69957599999999,43.308559],[-78.700216,43.308557],[-78.704516,43.308551],[-78.710492,43.308527],[-78.711465,43.308524],[-78.712901,43.308543],[-78.713599,43.308594],[-78.713914,43.308627],[-78.714195,43.308655],[-78.71503800000001,43.308741],[-78.71531899999999,43.30877],[-78.715664,43.308391],[-78.715987,43.308091],[-78.716184,43.307839],[-78.71624799999999,43.307721],[-78.71632700000001,43.30735],[-78.716319,43.307239],[-78.716279,43.307129],[-78.71620799999999,43.307066],[-78.716082,43.306979],[-78.714566,43.306356],[-78.71446400000001,43.306246],[-78.71440800000001,43.306151],[-78.714377,43.306064],[-78.714377,43.305922],[-78.714416,43.305827],[-78.714969,43.304732],[-78.71523000000001,43.304218],[-78.71549899999999,43.303453],[-78.715625,43.303011],[-78.715688,43.30264],[-78.715704,43.302349],[-78.715688,43.302057],[-78.715633,43.301607],[-78.715433,43.30079],[-78.71522,43.300254],[-78.71505399999999,43.299977],[-78.714951,43.299843],[-78.714659,43.299567],[-78.71313600000001,43.298242],[-78.71299399999999,43.298155],[-78.71289899999999,43.298053],[-78.71279,43.297865],[-78.71272999999999,43.29765],[-78.71264600000001,43.296668],[-78.71267,43.295215],[-78.712585,43.293855],[-78.712385,43.292464],[-78.71229200000001,43.292183],[-78.71225800000001,43.292013],[-78.71224599999999,43.291715],[-78.71227,43.291466],[-78.71233599999999,43.291119],[-78.712445,43.290733],[-78.712599,43.290378],[-78.712748,43.290158],[-78.71301200000001,43.289847],[-78.713303,43.28957],[-78.713623,43.289332],[-78.713696,43.289279],[-78.714494,43.288864],[-78.715132,43.288574],[-78.715761,43.288304],[-78.716323,43.287965],[-78.716714,43.287675],[-78.716757,43.287607],[-78.716807,43.287377],[-78.71680000000001,43.287286],[-78.71678,43.287214],[-78.71672700000001,43.287136],[-78.716627,43.287044],[-78.71652,43.28699],[-78.715824,43.286753],[-78.715298,43.286518],[-78.715249,43.286476],[-78.714972,43.286238],[-78.714834,43.286141],[-78.714716,43.286127],[-78.71448700000001,43.28612],[-78.714314,43.286086],[-78.71419,43.286037],[-78.713899,43.28583],[-78.71386200000001,43.285781],[-78.713809,43.285712],[-78.713194,43.285103],[-78.712715,43.284629],[-78.712604,43.284477],[-78.712535,43.284331],[-78.712507,43.2842],[-78.712479,43.283819],[-78.71232000000001,43.282684],[-78.712334,43.282183],[-78.71237499999999,43.281975],[-78.712445,43.281795],[-78.712535,43.281608],[-78.71261800000001,43.281484],[-78.712735,43.281345],[-78.712992,43.281186],[-78.713335,43.28094],[-78.713795,43.280359],[-78.71393999999999,43.28011],[-78.71405799999999,43.27984],[-78.714107,43.279688],[-78.714141,43.279487],[-78.714134,43.279314],[-78.714079,43.279169],[-78.713982,43.279051],[-78.713719,43.27885],[-78.713448,43.278657],[-78.713345,43.278584],[-78.71322000000001,43.278418],[-78.713121,43.278307],[-78.712957,43.278155],[-78.712818,43.278065],[-78.712666,43.278003],[-78.712535,43.277968],[-78.71225800000001,43.27794],[-78.711731,43.277933],[-78.71114900000001,43.277983],[-78.710748,43.278016],[-78.710374,43.278082],[-78.710249,43.278138],[-78.710149,43.278202],[-78.71008999999999,43.278241],[-78.709771,43.27847],[-78.709626,43.278553],[-78.709467,43.278608],[-78.709294,43.278636],[-78.709127,43.27865],[-78.708975,43.27865],[-78.708656,43.278574],[-78.708624,43.278562],[-78.708539,43.278532],[-78.70795699999999,43.278456],[-78.707583,43.278452],[-78.707444,43.278466],[-78.707313,43.278494],[-78.707185,43.278536],[-78.70707,43.278549],[-78.70689,43.278556],[-78.706627,43.278516],[-78.70644,43.278466],[-78.70618399999999,43.278347],[-78.705549,43.278051],[-78.70492400000001,43.27776],[-78.70359000000001,43.277301],[-78.70332399999999,43.27721],[-78.70295400000001,43.277016],[-78.702853,43.276961],[-78.702687,43.276843],[-78.702569,43.276532],[-78.702527,43.276311],[-78.702507,43.276068],[-78.702507,43.275895],[-78.702527,43.275643],[-78.702611,43.27549],[-78.702804,43.275228],[-78.70287399999999,43.275075],[-78.702888,43.274888],[-78.702881,43.274702],[-78.70277299999999,43.274539],[-78.70266599999999,43.274376],[-78.702327,43.273996],[-78.701807,43.273494],[-78.70162000000001,43.273266],[-78.701305,43.272827],[-78.701156,43.272584],[-78.70098299999999,43.272189],[-78.700834,43.271809],[-78.700793,43.271567],[-78.700793,43.271325],[-78.700862,43.271136],[-78.701165,43.270769],[-78.701331,43.27061],[-78.70146800000001,43.270459],[-78.70150599999999,43.270255],[-78.701481,43.269933],[-78.70143299999999,43.26976],[-78.70135000000001,43.269577],[-78.701184,43.269401],[-78.700962,43.269238],[-78.700755,43.269058],[-78.700667,43.268922],[-78.700609,43.268753],[-78.700609,43.26856],[-78.70063,43.268394],[-78.700602,43.268203],[-78.700512,43.268051],[-78.700401,43.267913],[-78.700087,43.267648],[-78.70005500000001,43.267622],[-78.699896,43.267449],[-78.69972300000001,43.267228],[-78.69950799999999,43.266778],[-78.69937400000001,43.266393],[-78.69935599999999,43.266193],[-78.69935599999999,43.265965],[-78.69939100000001,43.265686],[-78.699432,43.265556],[-78.69951500000001,43.265425],[-78.69968799999999,43.265231],[-78.69973299999999,43.265196],[-78.70011599999999,43.265252],[-78.700368,43.265306],[-78.700727,43.265376],[-78.70099500000001,43.265413],[-78.70114599999999,43.265424],[-78.70129300000001,43.265428],[-78.701454,43.265421],[-78.701702,43.265379],[-78.701909,43.265331],[-78.70213099999999,43.265258],[-78.70228299999999,43.265188],[-78.702399,43.265111],[-78.702575,43.264922],[-78.702626,43.264854],[-78.702662,43.264779],[-78.702697,43.264687],[-78.70271700000001,43.26455],[-78.70271099999999,43.262975],[-78.702716,43.262876],[-78.702736,43.262792],[-78.702782,43.262726],[-78.70280700000001,43.262699],[-78.70285800000001,43.262671],[-78.702941,43.262634],[-78.702996,43.262621],[-78.705296,43.262533],[-78.711944,43.262259],[-78.7119,43.253268],[-78.71265200000001,43.253272],[-78.717607,43.2533],[-78.718957,43.253308],[-78.71972,43.253302],[-78.72158899999999,43.253309],[-78.72275,43.253294],[-78.72501200000001,43.253287],[-78.726254,43.253263],[-78.726513,43.253256],[-78.72869799999999,43.253236],[-78.73298699999999,43.253168],[-78.733716,43.253146],[-78.73473,43.253132],[-78.740438,43.253054],[-78.74046,43.25567],[-78.740464,43.256085],[-78.740475,43.257389],[-78.740504,43.258802],[-78.740514,43.260225],[-78.7405,43.263519],[-78.74048999999999,43.266136],[-78.742203,43.266148],[-78.742942,43.266145],[-78.74441899999999,43.266141],[-78.747353,43.266157],[-78.74787000000001,43.266161],[-78.748807,43.266169],[-78.75000199999999,43.266159],[-78.7503,43.266161],[-78.75172600000001,43.266174],[-78.75268199999999,43.266172],[-78.752753,43.266173],[-78.75319399999999,43.266176],[-78.75391399999999,43.266183],[-78.754516,43.266177],[-78.754912,43.266174],[-78.754958,43.266174],[-78.754957,43.266366],[-78.754957,43.266941],[-78.754957,43.267134],[-78.754957,43.267236],[-78.75496,43.267544],[-78.75496099999999,43.267647],[-78.754981,43.271555],[-78.755043,43.283279],[-78.755064,43.287187]]],"type":"Polygon"}
}