{
  "id": "360610156014",
  "type": "Feature",
  "properties": {
    "area_land":15311,
    "area_water":0,
    "geoid":"360610156014",
    "name":"Block Group 4",
    "state":"ny"
},
  "bbox": [
    -73.949425,
    40.783571,
    -73.947069,
    40.785021
],
  "geometry": {"coordinates":[[[-73.94942500000001,40.784348],[-73.948925,40.785021],[-73.948678,40.784916],[-73.947069,40.784236],[-73.94758400000001,40.783571],[-73.949252,40.784274],[-73.94942500000001,40.784348]]],"type":"Polygon"}
}