{
  "id": "360690505004",
  "type": "Feature",
  "properties": {
    "area_land":25969908,
    "area_water":0,
    "geoid":"360690505004",
    "name":"Block Group 4",
    "state":"ny"
},
  "bbox": [
    -77.426154,
    42.883061,
    -77.370185,
    42.9445
],
  "geometry": {"coordinates":[[[-77.426154,42.899846],[-77.425483,42.900112],[-77.42489999999999,42.900332],[-77.424138,42.900621],[-77.42345899999999,42.900891],[-77.422721,42.901163],[-77.42113500000001,42.901781],[-77.42097200000001,42.901845],[-77.419878,42.902258],[-77.419967,42.902542],[-77.419983,42.902605],[-77.420191,42.903429],[-77.420215,42.903667],[-77.42020100000001,42.903846],[-77.42016700000001,42.904027],[-77.420141,42.904158],[-77.42011599999999,42.904286],[-77.420036,42.904545],[-77.41999800000001,42.904674],[-77.419753,42.905279],[-77.419321,42.906349],[-77.419026,42.907099],[-77.41878800000001,42.907707],[-77.417655,42.910495],[-77.417461,42.910985],[-77.41734700000001,42.911274],[-77.41727,42.911471],[-77.417188,42.911683],[-77.41710500000001,42.911944],[-77.417039,42.912233],[-77.416982,42.912624],[-77.41696399999999,42.912921],[-77.41697000000001,42.914121],[-77.41699699999999,42.915634],[-77.41703099999999,42.917493],[-77.417033,42.917922],[-77.41707,42.91955],[-77.41706600000001,42.919874],[-77.417023,42.920446],[-77.416955,42.920973],[-77.416843,42.921507],[-77.416691,42.922048],[-77.416541,42.92249],[-77.416392,42.922836],[-77.41608600000001,42.923465],[-77.41582699999999,42.923927],[-77.41527000000001,42.924868],[-77.414494,42.926232],[-77.413738,42.927514],[-77.41339000000001,42.928194],[-77.413191,42.928653],[-77.413078,42.928985],[-77.412908,42.929615],[-77.412683,42.930708],[-77.412144,42.933337],[-77.411951,42.934224],[-77.41185900000001,42.934748],[-77.411801,42.935431],[-77.41174700000001,42.936872],[-77.411714,42.937588],[-77.41168399999999,42.938322],[-77.411683,42.938479],[-77.411672,42.940225],[-77.41167799999999,42.941099],[-77.411681,42.941694],[-77.41168399999999,42.942092],[-77.4117,42.943479],[-77.41170700000001,42.944074],[-77.410313,42.944102],[-77.409938,42.944105],[-77.408956,42.944115],[-77.407568,42.944139],[-77.406865,42.944139],[-77.40557099999999,42.944155],[-77.404867,42.944152],[-77.40463099999999,42.944155],[-77.402863,42.944184],[-77.402091,42.94418],[-77.401358,42.944178],[-77.399985,42.944196],[-77.399776,42.944197],[-77.39935699999999,42.944201],[-77.399005,42.944212],[-77.39872800000001,42.94422],[-77.398697,42.944222],[-77.397918,42.944234],[-77.397897,42.944234],[-77.39762,42.944238],[-77.39610500000001,42.944258],[-77.39537799999999,42.944268],[-77.394035,42.944266],[-77.39335800000001,42.944278],[-77.391563,42.944273],[-77.39100500000001,42.944272],[-77.390703,42.944271],[-77.390272,42.944284],[-77.390068,42.944373],[-77.389398,42.944455],[-77.389034,42.9445],[-77.38738499999999,42.94434],[-77.386714,42.944275],[-77.384671,42.944276],[-77.37854299999999,42.944282],[-77.376501,42.944285],[-77.376138,42.944287],[-77.375151,42.944294],[-77.375052,42.94429],[-77.37469,42.944279],[-77.37387,42.944271],[-77.37141,42.944248],[-77.370591,42.944241],[-77.370537,42.943467],[-77.370436,42.941979],[-77.37045000000001,42.941144],[-77.370464,42.940369],[-77.37049,42.938976],[-77.37055700000001,42.935434],[-77.37055100000001,42.9348],[-77.37054000000001,42.933408],[-77.370532,42.93313],[-77.37051099999999,42.932297],[-77.37050499999999,42.93202],[-77.370453,42.929377],[-77.370394,42.926334],[-77.370334,42.921451],[-77.37030300000001,42.918809],[-77.37025199999999,42.91863],[-77.370215,42.918404],[-77.3702,42.918313],[-77.370188,42.917591],[-77.37018500000001,42.917379],[-77.370195,42.915277],[-77.37020800000001,42.913903],[-77.370215,42.913176],[-77.370237,42.912675],[-77.37025300000001,42.91231],[-77.37030799999999,42.911714],[-77.37031399999999,42.911573],[-77.37034199999999,42.910993],[-77.370355,42.910252],[-77.37036000000001,42.908262],[-77.370364,42.907158],[-77.370368,42.906993],[-77.37038099999999,42.906512],[-77.37038,42.9065],[-77.370379,42.906336],[-77.370379,42.906298],[-77.370367,42.905658],[-77.370351,42.904718],[-77.370313,42.903628],[-77.370304,42.903335],[-77.370265,42.902953],[-77.370255,42.898974],[-77.37025,42.896782],[-77.37036500000001,42.889595],[-77.37035400000001,42.887039],[-77.370341,42.883875],[-77.370341,42.883061],[-77.372321,42.883085],[-77.37333,42.883098],[-77.37826099999999,42.883082],[-77.37865499999999,42.883081],[-77.379707,42.883068],[-77.380242,42.883069],[-77.38083399999999,42.883069],[-77.381834,42.88307],[-77.38261300000001,42.883077],[-77.383206,42.883084],[-77.384479,42.883096],[-77.388301,42.883134],[-77.38847199999999,42.883136],[-77.38957499999999,42.883141],[-77.391563,42.883129],[-77.393822,42.883116],[-77.39498,42.883126],[-77.39752900000001,42.883127],[-77.399518,42.883129],[-77.400198,42.883128],[-77.40224000000001,42.883124],[-77.40292100000001,42.883124],[-77.403284,42.883124],[-77.40430600000001,42.883126],[-77.404374,42.883128],[-77.40473799999999,42.88314],[-77.40493499999999,42.883153],[-77.405085,42.883163],[-77.405525,42.883209],[-77.405722,42.88323],[-77.406147,42.883296],[-77.406192,42.883304],[-77.40698500000001,42.883483],[-77.407402,42.883603],[-77.407489,42.883628],[-77.407813,42.883732],[-77.408953,42.884118],[-77.40908899999999,42.884165],[-77.411477,42.885028],[-77.41235,42.885347],[-77.413482,42.88576],[-77.413735,42.885852],[-77.414494,42.886128],[-77.414748,42.88622],[-77.414844,42.886256],[-77.415133,42.886366],[-77.41522999999999,42.886403],[-77.41585600000001,42.886652],[-77.41640599999999,42.886905],[-77.416814,42.887104],[-77.41696,42.887187],[-77.41822000000001,42.88791],[-77.418736,42.888208],[-77.42190100000001,42.890037],[-77.42335199999999,42.890875],[-77.42354899999999,42.890987],[-77.423627,42.891031],[-77.423862,42.891164],[-77.423941,42.891209],[-77.424105,42.891302],[-77.4246,42.891584],[-77.42476499999999,42.891678],[-77.425009,42.891818],[-77.425308,42.891991],[-77.425742,42.892241],[-77.42598700000001,42.892382],[-77.426008,42.892395],[-77.426033,42.892411],[-77.426072,42.892431],[-77.426095,42.892443],[-77.426095,42.892666],[-77.426096,42.893338],[-77.426097,42.893562],[-77.426097,42.893586],[-77.42609899999999,42.893661],[-77.42610000000001,42.893686],[-77.426103,42.894053],[-77.42611100000001,42.894887],[-77.42610500000001,42.895157],[-77.426098,42.895525],[-77.426095,42.895745],[-77.42609299999999,42.896004],[-77.426087,42.897176],[-77.426085,42.897442],[-77.42608300000001,42.89784],[-77.42608300000001,42.897922],[-77.42608300000001,42.898104],[-77.426084,42.898396],[-77.426085,42.89865],[-77.426086,42.898833],[-77.42608799999999,42.899038],[-77.42609400000001,42.899656],[-77.426096,42.899749],[-77.426154,42.899846]]],"type":"Polygon"}
}