{
  "id": "360471126002",
  "type": "Feature",
  "properties": {
    "area_land":57287,
    "area_water":0,
    "geoid":"360471126002",
    "name":"Block Group 2",
    "state":"ny"
},
  "bbox": [
    -73.894439,
    40.663223,
    -73.891738,
    40.666581
],
  "geometry": {"coordinates":[[[-73.89443900000001,40.666297],[-73.893446,40.666446],[-73.892526,40.666581],[-73.892132,40.665034],[-73.891738,40.663507],[-73.892661,40.663369],[-73.89364999999999,40.663223],[-73.894042,40.664752],[-73.89443900000001,40.666297]]],"type":"Polygon"}
}