{
  "id": "360610112011",
  "type": "Feature",
  "properties": {
    "area_land":79536,
    "area_water":0,
    "geoid":"360610112011",
    "name":"Block Group 1",
    "state":"ny"
},
  "bbox": [
    -73.977686,
    40.762293,
    -73.973015,
    40.765675
],
  "geometry": {"coordinates":[[[-73.97719600000001,40.764324],[-73.976703,40.764996],[-73.97623400000001,40.765675],[-73.973636,40.76457],[-73.973015,40.764279],[-73.973465,40.763659],[-73.973968,40.762967],[-73.974457,40.762293],[-73.97768600000001,40.763645],[-73.97719600000001,40.764324]]],"type":"Polygon"}
}