{
  "id": "360470720001",
  "type": "Feature",
  "properties": {
    "area_land":158228,
    "area_water":0,
    "geoid":"360470720001",
    "name":"Block Group 1",
    "state":"ny"
},
  "bbox": [
    -73.924298,
    40.626251,
    -73.917995,
    40.632096
],
  "geometry": {"coordinates":[[[-73.92400499999999,40.628567],[-73.92312800000001,40.629143],[-73.92221499999999,40.62973],[-73.921301,40.630324],[-73.920418,40.630904],[-73.919543,40.631471],[-73.918604,40.632096],[-73.91835,40.629767],[-73.91824200000001,40.62877],[-73.918162,40.628005],[-73.917995,40.626458],[-73.919,40.626365],[-73.919938,40.626307],[-73.920869,40.626251],[-73.921119,40.628586],[-73.922087,40.628528],[-73.92305500000001,40.628467],[-73.92398799999999,40.628407],[-73.92429799999999,40.628386],[-73.92400499999999,40.628567]]],"type":"Polygon"}
}