{
  "id": "360811435001",
  "type": "Feature",
  "properties": {
    "area_land":191305,
    "area_water":0,
    "geoid":"360811435001",
    "name":"Block Group 1",
    "state":"ny"
},
  "bbox": [
    -73.775355,
    40.751582,
    -73.764569,
    40.755746
],
  "geometry": {"coordinates":[[[-73.77475,40.753501],[-73.774466,40.753575],[-73.77386,40.753837],[-73.77364,40.753928],[-73.773003,40.754197],[-73.772801,40.754269],[-73.77209999999999,40.754482],[-73.77189300000001,40.754531],[-73.77128999999999,40.754689],[-73.770968,40.754777],[-73.770133,40.754993],[-73.769941,40.755045],[-73.76932600000001,40.755208],[-73.769049,40.755277],[-73.768316,40.755466],[-73.768148,40.755477],[-73.76714800000001,40.75565],[-73.76615,40.755746],[-73.765832,40.755042],[-73.765468,40.754371],[-73.76456899999999,40.753508],[-73.765596,40.753216],[-73.766322,40.75384],[-73.76724900000001,40.753573],[-73.76813300000001,40.753333],[-73.76901599999999,40.753089],[-73.770033,40.752812],[-73.77096,40.752557],[-73.771868,40.752308],[-73.77275,40.752063],[-73.773633,40.751823],[-73.77452,40.751582],[-73.775355,40.753354],[-73.77475,40.753501]]],"type":"Polygon"}
}