{
  "id": "360179704003",
  "type": "Feature",
  "properties": {
    "area_land":795810,
    "area_water":0,
    "geoid":"360179704003",
    "name":"Block Group 3",
    "state":"ny"
},
  "bbox": [
    -75.51864,
    42.522382,
    -75.506042,
    42.532759
],
  "geometry": {"coordinates":[[[-75.51864,42.531634],[-75.515705,42.53187],[-75.51513,42.531914],[-75.514769,42.531944],[-75.513527,42.532042],[-75.51244699999999,42.532127],[-75.511816,42.532179],[-75.51105800000001,42.532238],[-75.509214,42.532382],[-75.508622,42.532428],[-75.50783,42.532493],[-75.507474,42.532541],[-75.506743,42.532695],[-75.50645799999999,42.532759],[-75.506281,42.532406],[-75.506175,42.532122],[-75.50604199999999,42.531426],[-75.50606399999999,42.531022],[-75.506122,42.53072],[-75.506412,42.529762],[-75.50649199999999,42.529587],[-75.506739,42.529113],[-75.506939,42.528814],[-75.507295,42.528374],[-75.507856,42.527769],[-75.507925,42.527696],[-75.50808000000001,42.527467],[-75.508262,42.527128],[-75.508346,42.527],[-75.50842299999999,42.526906],[-75.50857999999999,42.526763],[-75.509456,42.526089],[-75.510319,42.525222],[-75.510541,42.525022],[-75.51075400000001,42.524858],[-75.511083,42.524654],[-75.511843,42.524293],[-75.511985,42.524199],[-75.51245299999999,42.523799],[-75.512658,42.523624],[-75.513059,42.523295],[-75.513161,42.523201],[-75.513215,42.523106],[-75.51324099999999,42.522993],[-75.513265,42.522687],[-75.51329,42.522589],[-75.51332600000001,42.522508],[-75.51340999999999,42.522382],[-75.514056,42.52266],[-75.514544,42.522837],[-75.51519399999999,42.523032],[-75.515632,42.523145],[-75.516272,42.523281],[-75.516395,42.523301],[-75.51680399999999,42.523363],[-75.517405,42.523434],[-75.517613,42.524604],[-75.517757,42.525403],[-75.51787299999999,42.526055],[-75.51788500000001,42.526116],[-75.517928,42.526334],[-75.51806999999999,42.527075],[-75.518156,42.527525],[-75.518265,42.528194],[-75.518334,42.528591],[-75.518366,42.528937],[-75.51837,42.528978],[-75.518457,42.529873],[-75.51850899999999,42.530369],[-75.51856100000001,42.530837],[-75.51864,42.531634]]],"type":"Polygon"}
}