{
  "id": "360470766001",
  "type": "Feature",
  "properties": {
    "area_land":82578,
    "area_water":0,
    "geoid":"360470766001",
    "name":"Block Group 1",
    "state":"ny"
},
  "bbox": [
    -73.958198,
    40.630512,
    -73.955473,
    40.635509
],
  "geometry": {"coordinates":[[[-73.958198,40.635289],[-73.957168,40.635405],[-73.95624100000001,40.635509],[-73.955791,40.633118],[-73.955473,40.631431],[-73.95552600000001,40.63143],[-73.955673,40.631421],[-73.95583000000001,40.631397],[-73.955974,40.631362],[-73.95612,40.631311],[-73.956239,40.631258],[-73.95636500000001,40.631186],[-73.95643099999999,40.631124],[-73.956519,40.631012],[-73.956575,40.630904],[-73.95661,40.630792],[-73.956622,40.630695],[-73.956616,40.630591],[-73.95729900000001,40.630512],[-73.957753,40.632903],[-73.958198,40.635289]]],"type":"Polygon"}
}