{
  "id": "360930320003",
  "type": "Feature",
  "properties": {
    "area_land":360595,
    "area_water":0,
    "geoid":"360930320003",
    "name":"Block Group 3",
    "state":"ny"
},
  "bbox": [
    -73.903717,
    42.815556,
    -73.892342,
    42.820582
],
  "geometry": {"coordinates":[[[-73.903717,42.820582],[-73.90169,42.819555],[-73.901567,42.819076],[-73.900378,42.81955],[-73.899585,42.819885],[-73.89864900000001,42.819743],[-73.896922,42.819737],[-73.89526499999999,42.819877],[-73.893714,42.820138],[-73.893669,42.820139],[-73.892342,42.820173],[-73.892433,42.817852],[-73.892456,42.816761],[-73.892506,42.815556],[-73.89378000000001,42.815668],[-73.894699,42.81579],[-73.894941,42.815827],[-73.896134,42.81595],[-73.897311,42.816061],[-73.898472,42.816256],[-73.899632,42.816462],[-73.90079299999999,42.816621],[-73.90197000000001,42.816805],[-73.90307,42.816974],[-73.90340500000001,42.818196],[-73.903492,42.819333],[-73.903717,42.820582]]],"type":"Polygon"}
}