{
  "id": "360470169004",
  "type": "Feature",
  "properties": {
    "area_land":36242,
    "area_water":0,
    "geoid":"360470169004",
    "name":"Block Group 4",
    "state":"ny"
},
  "bbox": [
    -73.98448,
    40.65694,
    -73.979513,
    40.660137
],
  "geometry": {"coordinates":[[[-73.983918,40.660137],[-73.981717,40.658809],[-73.98097799999999,40.658363],[-73.980268,40.657935],[-73.979513,40.657479],[-73.97977,40.657229],[-73.98007,40.65694],[-73.982275,40.658271],[-73.98448,40.659598],[-73.983918,40.660137]]],"type":"Polygon"}
}