{
  "id": "360810306003",
  "type": "Feature",
  "properties": {
    "area_land":240746,
    "area_water":0,
    "geoid":"360810306003",
    "name":"Block Group 3",
    "state":"ny"
},
  "bbox": [
    -73.78062,
    40.664141,
    -73.769975,
    40.668028
],
  "geometry": {"coordinates":[[[-73.78062,40.667526],[-73.77970500000001,40.66759],[-73.777913,40.667715],[-73.777013,40.667776],[-73.77616399999999,40.667867],[-73.77522399999999,40.667915],[-73.774311,40.667982],[-73.773425,40.668028],[-73.771545,40.667963],[-73.771137,40.667446],[-73.771057,40.667338],[-73.770776,40.666963],[-73.770336,40.666375],[-73.769975,40.66591],[-73.770779,40.665562],[-73.771557,40.665216],[-73.772335,40.66487],[-73.77311400000001,40.664529],[-73.773188,40.664613],[-73.77364300000001,40.665215],[-73.774035,40.665726],[-73.774193,40.665658],[-73.774997,40.665303],[-73.77582,40.664938],[-73.776628,40.664586],[-73.777631,40.664141],[-73.778274,40.664866],[-73.778437,40.665062],[-73.778953,40.665644],[-73.779594,40.66637],[-73.77993600000001,40.666752],[-73.780143,40.666987],[-73.780252,40.66711],[-73.780394,40.66727],[-73.78062,40.667526]]],"type":"Polygon"}
}