{
  "id": "360810697012",
  "type": "Feature",
  "properties": {
    "area_land":24980,
    "area_water":0,
    "geoid":"360810697012",
    "name":"Block Group 2",
    "state":"ny"
},
  "bbox": [
    -73.861763,
    40.725944,
    -73.859014,
    40.727893
],
  "geometry": {"coordinates":[[[-73.861566,40.72725],[-73.861161,40.727893],[-73.859014,40.727109],[-73.85942,40.726465],[-73.85976700000001,40.725944],[-73.860013,40.726123],[-73.860275,40.72629],[-73.860551,40.726445],[-73.860839,40.726586],[-73.86113899999999,40.726713],[-73.861447,40.726825],[-73.861763,40.726922],[-73.861566,40.72725]]],"type":"Polygon"}
}