{
  "id": "360810814002",
  "type": "Feature",
  "properties": {
    "area_land":107607,
    "area_water":0,
    "geoid":"360810814002",
    "name":"Block Group 2",
    "state":"ny"
},
  "bbox": [
    -73.806453,
    40.670484,
    -73.803576,
    40.674784
],
  "geometry": {"coordinates":[[[-73.806406,40.670995],[-73.806369,40.671521],[-73.806365,40.671777],[-73.806365,40.672222],[-73.80638399999999,40.674683],[-73.806197,40.674784],[-73.80540000000001,40.674711],[-73.804512,40.674632],[-73.804283,40.674621],[-73.803597,40.674551],[-73.803591,40.672316],[-73.80357600000001,40.670484],[-73.804479,40.670487],[-73.805566,40.670613],[-73.806453,40.670729],[-73.806406,40.670995]]],"type":"Polygon"}
}