{
  "id": "360594104004",
  "type": "Feature",
  "properties": {
    "area_land":305990,
    "area_water":0,
    "geoid":"360594104004",
    "name":"Block Group 4",
    "state":"ny"
},
  "bbox": [
    -73.723816,
    40.666325,
    -73.714165,
    40.672184
],
  "geometry": {"coordinates":[[[-73.72361100000001,40.667806],[-73.72342399999999,40.668465],[-73.723316,40.668843],[-73.72324,40.669042],[-73.72297500000001,40.669805],[-73.722753,40.670456],[-73.722167,40.672184],[-73.721408,40.671788],[-73.720947,40.671557],[-73.72058699999999,40.671413],[-73.72038499999999,40.671344],[-73.720083,40.671253],[-73.71901699999999,40.67099],[-73.718906,40.670955],[-73.71865,40.670887],[-73.718405,40.670807],[-73.717887,40.670616],[-73.716961,40.670196],[-73.715937,40.669728],[-73.715144,40.669364],[-73.71465600000001,40.66914],[-73.714332,40.669013],[-73.71416499999999,40.668965],[-73.71425000000001,40.668809],[-73.714337,40.668615],[-73.71453700000001,40.668195],[-73.715435,40.666325],[-73.716278,40.66656],[-73.71712599999999,40.666798],[-73.717873,40.667001],[-73.718073,40.667082],[-73.719894,40.667785],[-73.719979,40.667561],[-73.720173,40.667125],[-73.72026,40.666936],[-73.720347,40.666804],[-73.720401,40.666741],[-73.720415,40.666704],[-73.723816,40.667157],[-73.72361100000001,40.667806]]],"type":"Polygon"}
}