{
  "id": "360550066001",
  "type": "Feature",
  "properties": {
    "area_land":177116,
    "area_water":0,
    "geoid":"360550066001",
    "name":"Block Group 1",
    "state":"ny"
},
  "bbox": [
    -77.636025,
    43.137887,
    -77.626028,
    43.139886
],
  "geometry": {"coordinates":[[[-77.63602299999999,43.139886],[-77.635092,43.139878],[-77.631232,43.139875],[-77.630484,43.139879],[-77.628951,43.139878],[-77.627348,43.139878],[-77.626036,43.139875],[-77.62602800000001,43.138444],[-77.62669200000001,43.137979],[-77.626822,43.137887],[-77.627844,43.137891],[-77.628935,43.137895],[-77.63464999999999,43.137895],[-77.636016,43.137899],[-77.63601800000001,43.138448],[-77.63602,43.138896],[-77.636025,43.139355],[-77.63602299999999,43.139886]]],"type":"Polygon"}
}