{
  "id": "360239702002",
  "type": "Feature",
  "properties": {
    "area_land":28864848,
    "area_water":1576116,
    "geoid":"360239702002",
    "name":"Block Group 2",
    "state":"ny"
},
  "bbox": [
    -76.195944,
    42.702946,
    -76.127,
    42.777919
],
  "geometry": {"coordinates":[[[-76.195944,42.77473],[-76.19106499999999,42.774957],[-76.18987199999999,42.775013],[-76.187045,42.775143],[-76.17813099999999,42.775558],[-76.177769,42.775575],[-76.17456900000001,42.775724],[-76.171026,42.775889],[-76.16944700000001,42.775964],[-76.16009200000001,42.776398],[-76.15506499999999,42.776632],[-76.15494099999999,42.77664],[-76.154849,42.776642],[-76.153398,42.77671],[-76.15337,42.776713],[-76.15334199999999,42.776712],[-76.146322,42.777062],[-76.14592500000001,42.777082],[-76.144583,42.777149],[-76.14449500000001,42.777151],[-76.14446100000001,42.777153],[-76.14443300000001,42.777154],[-76.144363,42.777156],[-76.14264300000001,42.777207],[-76.142347,42.777216],[-76.139253,42.777364],[-76.138026,42.77742],[-76.137264,42.777456],[-76.130627,42.777769],[-76.13011400000001,42.777775],[-76.12943199999999,42.777783],[-76.12926400000001,42.777792],[-76.12738299999999,42.777898],[-76.127,42.777919],[-76.127075,42.7771],[-76.12724799999999,42.775888],[-76.127475,42.774686],[-76.127697,42.773744],[-76.127971,42.772799],[-76.128294,42.771803],[-76.128846,42.770372],[-76.12924,42.769473],[-76.12949500000001,42.768956],[-76.12998899999999,42.768],[-76.13104199999999,42.766069],[-76.131294,42.76558],[-76.132023,42.764236],[-76.132834,42.762715],[-76.133292,42.761756],[-76.133623,42.76099],[-76.134135,42.759647],[-76.13438600000001,42.758888],[-76.134664,42.757926],[-76.135707,42.754061],[-76.13632699999999,42.751796],[-76.136386,42.751576],[-76.136442,42.751367],[-76.13708099999999,42.749058],[-76.137817,42.746269],[-76.13831500000001,42.744438],[-76.138496,42.743815],[-76.138721,42.743104],[-76.138986,42.742349],[-76.139259,42.741596],[-76.139669,42.74052],[-76.139714,42.740406],[-76.140012,42.739686],[-76.14138699999999,42.736234],[-76.142261,42.734059],[-76.142532,42.733391],[-76.142956,42.732305],[-76.143304,42.731316],[-76.143596,42.730366],[-76.143742,42.729821],[-76.144468,42.726853],[-76.144823,42.725375],[-76.145663,42.721951],[-76.14637500000001,42.718978],[-76.146477,42.718545],[-76.146501,42.718441],[-76.146609,42.718021],[-76.146756,42.717407],[-76.146958,42.716566],[-76.147582,42.714005],[-76.148371,42.710771],[-76.148475,42.710343],[-76.148813,42.708917],[-76.14905899999999,42.707959],[-76.149288,42.7072],[-76.14934,42.707032],[-76.149399,42.706865],[-76.14972400000001,42.706034],[-76.14994,42.705543],[-76.150398,42.704579],[-76.150704,42.704048],[-76.15088900000001,42.704039],[-76.157087,42.703747],[-76.1583,42.70369],[-76.158446,42.703601],[-76.158618,42.70353],[-76.158727,42.703506],[-76.159322,42.703447],[-76.160464,42.703383],[-76.16075600000001,42.703403],[-76.160769,42.703377],[-76.170495,42.702946],[-76.171932,42.716465],[-76.173542,42.731976],[-76.19221899999999,42.730979],[-76.192612,42.73581],[-76.193848,42.749989],[-76.195802,42.773054],[-76.195944,42.77473]]],"type":"Polygon"}
}