{
  "id": "360550116012",
  "type": "Feature",
  "properties": {
    "area_land":1155173,
    "area_water":14685,
    "geoid":"360550116012",
    "name":"Block Group 2",
    "state":"ny"
},
  "bbox": [
    -77.485104,
    43.123431,
    -77.463612,
    43.131396
],
  "geometry": {"coordinates":[[[-77.485083,43.127856],[-77.48497,43.127935],[-77.48472700000001,43.128034],[-77.484425,43.128134],[-77.484222,43.128192],[-77.48403999999999,43.128261],[-77.483992,43.128305],[-77.48398899999999,43.128357],[-77.48398299999999,43.128468],[-77.483863,43.128482],[-77.48366900000001,43.128508],[-77.480082,43.128985],[-77.479834,43.129021],[-77.479443,43.129078],[-77.479223,43.12912],[-77.47903700000001,43.129168],[-77.47891199999999,43.12921],[-77.477537,43.129608],[-77.475887,43.130077],[-77.474964,43.13037],[-77.47217999999999,43.131258],[-77.472059,43.131296],[-77.471906,43.131334],[-77.471746,43.131359],[-77.471615,43.131371],[-77.47116699999999,43.131396],[-77.46975,43.131382],[-77.468855,43.131352],[-77.46686,43.131314],[-77.466193,43.131302],[-77.463956,43.131243],[-77.463971,43.130643],[-77.464009,43.129135],[-77.464029,43.128183],[-77.46404,43.127206],[-77.46404699999999,43.12662],[-77.464056,43.12579],[-77.46409800000001,43.124431],[-77.46411000000001,43.124043],[-77.464073,43.123899],[-77.464017,43.1238],[-77.463959,43.123729],[-77.46392,43.123682],[-77.46381100000001,43.123572],[-77.463722,43.123499],[-77.463612,43.123431],[-77.464754,43.123489],[-77.467803,43.123489],[-77.46798800000001,43.12349],[-77.468355,43.123493],[-77.468653,43.123496],[-77.47180299999999,43.12363],[-77.476021,43.123765],[-77.476218,43.123763],[-77.477717,43.123663],[-77.479573,43.123663],[-77.480912,43.123663],[-77.481019,43.123663],[-77.4811,43.123663],[-77.481318,43.123663],[-77.48274499999999,43.123757],[-77.483037,43.123763],[-77.482859,43.12406],[-77.482089,43.125375],[-77.48201299999999,43.125513],[-77.481944,43.125651],[-77.481915,43.125728],[-77.481898,43.125807],[-77.481893,43.125904],[-77.481917,43.126018],[-77.48195200000001,43.1261],[-77.481999,43.126176],[-77.482071,43.126258],[-77.482558,43.126656],[-77.482697,43.126748],[-77.48280099999999,43.126801],[-77.482912,43.126846],[-77.483051,43.126886],[-77.483307,43.126915],[-77.483659,43.126943],[-77.483963,43.12698],[-77.48411400000001,43.127013],[-77.484174,43.12703],[-77.484863,43.126699],[-77.485078,43.126596],[-77.484858,43.126774],[-77.484568,43.127197],[-77.48459699999999,43.127208],[-77.484644,43.127225],[-77.48472,43.127278],[-77.484832,43.127376],[-77.484966,43.127533],[-77.48510400000001,43.127773],[-77.485083,43.127856]]],"type":"Polygon"}
}