{
  "id": "360290141021",
  "type": "Feature",
  "properties": {
    "area_land":21641337,
    "area_water":247,
    "geoid":"360290141021",
    "name":"Block Group 1",
    "state":"ny"
},
  "bbox": [
    -78.696979,
    42.781835,
    -78.632261,
    42.834029
],
  "geometry": {"coordinates":[[[-78.696979,42.833093],[-78.69696999999999,42.833275],[-78.69694200000001,42.833866],[-78.696934,42.834029],[-78.69542199999999,42.83349],[-78.693457,42.832897],[-78.692229,42.832631],[-78.691681,42.832513],[-78.691211,42.832405],[-78.690105,42.832161],[-78.688362,42.831798],[-78.68537600000001,42.831103],[-78.683976,42.830751],[-78.68286000000001,42.830457],[-78.681901,42.830173],[-78.680289,42.829617],[-78.680139,42.829576],[-78.67982600000001,42.829461],[-78.678973,42.829122],[-78.678178,42.828828],[-78.67650399999999,42.828106],[-78.675235,42.827548],[-78.673675,42.826724],[-78.672861,42.826305],[-78.671814,42.825692],[-78.670644,42.824987],[-78.669634,42.824291],[-78.66880399999999,42.823766],[-78.66801,42.823148],[-78.667289,42.822603],[-78.665949,42.821485],[-78.66450399999999,42.820261],[-78.664101,42.81992],[-78.66406600000001,42.81989],[-78.663725,42.819634],[-78.66345699999999,42.819395],[-78.66296199999999,42.818954],[-78.662401,42.818476],[-78.661546,42.817787],[-78.660774,42.817189],[-78.660048,42.816675],[-78.65924800000001,42.816178],[-78.65840300000001,42.815682],[-78.65754800000001,42.81525],[-78.656353,42.814735],[-78.655002,42.814156],[-78.653953,42.81366],[-78.650887,42.812343],[-78.650401,42.812121],[-78.64975200000001,42.811826],[-78.648545,42.811283],[-78.647497,42.810844],[-78.646458,42.810329],[-78.645912,42.809966],[-78.645009,42.809332],[-78.64452199999999,42.808942],[-78.64374100000001,42.808259],[-78.643079,42.807455],[-78.641873,42.805526],[-78.64169099999999,42.805195],[-78.641368,42.804598],[-78.641093,42.80415],[-78.64042000000001,42.802858],[-78.639708,42.80162],[-78.63901799999999,42.800783],[-78.638385,42.80015],[-78.637794,42.799628],[-78.63731300000001,42.799271],[-78.636549,42.798809],[-78.636487,42.796683],[-78.636059,42.795997],[-78.63458799999999,42.794185],[-78.634134,42.793613],[-78.632914,42.792073],[-78.632881,42.792038],[-78.632876,42.791995],[-78.63284299999999,42.788983],[-78.632823,42.78798],[-78.63280399999999,42.787317],[-78.632812,42.786605],[-78.63270900000001,42.785861],[-78.63255599999999,42.784838],[-78.63252199999999,42.784182],[-78.63243199999999,42.783406],[-78.632261,42.781938],[-78.638561,42.781947],[-78.64646500000001,42.781959],[-78.662111,42.78196],[-78.665541,42.781959],[-78.671109,42.781954],[-78.67853599999999,42.781952],[-78.678982,42.781952],[-78.684292,42.781957],[-78.69689099999999,42.781835],[-78.69689,42.783731],[-78.696899,42.78448],[-78.696907,42.785824],[-78.696912,42.787642],[-78.696906,42.788827],[-78.69691,42.789509],[-78.696906,42.789535],[-78.696883,42.791863],[-78.69689099999999,42.792],[-78.69689099999999,42.793901],[-78.69690199999999,42.799535],[-78.696904,42.801281],[-78.696913,42.804831],[-78.696913,42.804917],[-78.696913,42.805121],[-78.696913,42.805224],[-78.69691400000001,42.805553],[-78.69691899999999,42.808174],[-78.696917,42.810129],[-78.696915,42.811166],[-78.696913,42.811595],[-78.696901,42.81265],[-78.696884,42.81294],[-78.696856,42.8134],[-78.696844,42.813525],[-78.69685200000001,42.813678],[-78.69689,42.814389],[-78.69683000000001,42.81536],[-78.696831,42.816155],[-78.696927,42.818953],[-78.696934,42.821608],[-78.696932,42.825271],[-78.696933,42.826974],[-78.696934,42.827431],[-78.69694699999999,42.830313],[-78.69695400000001,42.831906],[-78.696967,42.832639],[-78.69696999999999,42.832801],[-78.696979,42.833093]]],"type":"Polygon"}
}