{
  "id": "360470301002",
  "type": "Feature",
  "properties": {
    "area_land":50276,
    "area_water":0,
    "geoid":"360470301002",
    "name":"Block Group 2",
    "state":"ny"
},
  "bbox": [
    -73.916465,
    40.676495,
    -73.913559,
    40.678577
],
  "geometry": {"coordinates":[[[-73.916354,40.677824],[-73.916301,40.678577],[-73.91355900000001,40.678427],[-73.913585,40.677672],[-73.913696,40.676495],[-73.914638,40.676552],[-73.915544,40.676596],[-73.916465,40.676647],[-73.916354,40.677824]]],"type":"Polygon"}
}