{
  "id": "361031349063",
  "type": "Feature",
  "properties": {
    "area_land":864297,
    "area_water":0,
    "geoid":"361031349063",
    "name":"Block Group 3",
    "state":"ny"
},
  "bbox": [
    -73.237005,
    40.872897,
    -73.219536,
    40.882795
],
  "geometry": {"coordinates":[[[-73.236558,40.876277],[-73.23630900000001,40.876135],[-73.234476,40.87509],[-73.233704,40.87583],[-73.23298800000001,40.87662],[-73.232308,40.877372],[-73.232116,40.877581],[-73.231927,40.877703],[-73.23172,40.877734],[-73.231362,40.877719],[-73.230941,40.877715],[-73.230608,40.87773],[-73.230271,40.877772],[-73.230271,40.878585],[-73.230256,40.879439],[-73.23024100000001,40.880362],[-73.230255,40.881507],[-73.230208,40.881736],[-73.229966,40.882444],[-73.22953200000001,40.882316],[-73.22926099999999,40.882795],[-73.228516,40.88256],[-73.227653,40.882308],[-73.226831,40.882265],[-73.225943,40.882242],[-73.22509100000001,40.882204],[-73.22446100000001,40.882183],[-73.224227,40.882178],[-73.223344,40.882154],[-73.22246699999999,40.882121],[-73.221558,40.882087],[-73.22070100000001,40.882049],[-73.220536,40.881343],[-73.22034499999999,40.880713],[-73.220147,40.880072],[-73.219933,40.879416],[-73.21971600000001,40.878759],[-73.21953600000001,40.878119],[-73.219554,40.877897],[-73.219723,40.87745],[-73.21978900000001,40.87731],[-73.219842,40.877166],[-73.21989499999999,40.876982],[-73.21993399999999,40.87677],[-73.219956,40.876477],[-73.21995200000001,40.876355],[-73.219954,40.875829],[-73.219915,40.875778],[-73.219904,40.875186],[-73.219927,40.874606],[-73.219999,40.874613],[-73.22386400000001,40.875014],[-73.225368,40.875036],[-73.22678399999999,40.87516],[-73.229111,40.874301],[-73.230256,40.873814],[-73.230411,40.873753],[-73.230814,40.873698],[-73.232118,40.872921],[-73.232175,40.872897],[-73.232423,40.873187],[-73.23277299999999,40.873378],[-73.233419,40.873749],[-73.237005,40.875807],[-73.236558,40.876277]]],"type":"Polygon"}
}