{
  "id": "360050241001",
  "type": "Feature",
  "properties": {
    "area_land":30357,
    "area_water":0,
    "geoid":"360050241001",
    "name":"Block Group 1",
    "state":"ny"
},
  "bbox": [
    -73.909215,
    40.850371,
    -73.90605,
    40.852644
],
  "geometry": {"coordinates":[[[-73.908418,40.852644],[-73.907596,40.852217],[-73.90682099999999,40.851808],[-73.90604999999999,40.851401],[-73.906581,40.850821],[-73.906993,40.850371],[-73.90764799999999,40.85086],[-73.908411,40.851319],[-73.909215,40.851801],[-73.908418,40.852644]]],"type":"Polygon"}
}