{
  "id": "360610198002",
  "type": "Feature",
  "properties": {
    "area_land":96354,
    "area_water":0,
    "geoid":"360610198002",
    "name":"Block Group 2",
    "state":"ny"
},
  "bbox": [
    -73.946131,
    40.802561,
    -73.941167,
    40.806391
],
  "geometry": {"coordinates":[[[-73.94569300000001,40.804515],[-73.945239,40.805136],[-73.944783,40.805761],[-73.94430199999999,40.806391],[-73.94340200000001,40.806014],[-73.94275399999999,40.805744],[-73.94116699999999,40.805063],[-73.94165099999999,40.80445],[-73.94210200000001,40.80383],[-73.942567,40.803194],[-73.942994,40.802561],[-73.944597,40.803228],[-73.94613099999999,40.803877],[-73.94569300000001,40.804515]]],"type":"Polygon"}
}