{
  "id": "361150840003",
  "type": "Feature",
  "properties": {
    "area_land":6291868,
    "area_water":474,
    "geoid":"361150840003",
    "name":"Block Group 3",
    "state":"ny"
},
  "bbox": [
    -73.276216,
    43.351743,
    -73.250952,
    43.415039
],
  "geometry": {"coordinates":[[[-73.27621600000001,43.413297],[-73.276022,43.413219],[-73.275701,43.413048],[-73.275672,43.413033],[-73.275648,43.41307],[-73.27560800000001,43.413134],[-73.27543300000001,43.413318],[-73.27532600000001,43.41343],[-73.27527000000001,43.413518],[-73.275251,43.413612],[-73.275248,43.413699],[-73.2753,43.41382],[-73.275379,43.413966],[-73.27544899999999,43.414098],[-73.275465,43.414131],[-73.275465,43.414174],[-73.27544899999999,43.414225],[-73.275391,43.414289],[-73.27534,43.414347],[-73.275267,43.414399],[-73.27520699999999,43.414441],[-73.275153,43.414487],[-73.27512299999999,43.414513],[-73.275051,43.414597],[-73.274996,43.414678],[-73.27494299999999,43.414756],[-73.27485299999999,43.414917],[-73.27478499999999,43.415039],[-73.274693,43.415009],[-73.27457800000001,43.414971],[-73.274512,43.414964],[-73.27440799999999,43.414952],[-73.274235,43.414945],[-73.274084,43.414942],[-73.27374500000001,43.414936],[-73.27357499999999,43.414898],[-73.27342899999999,43.414849],[-73.27318,43.414718],[-73.27305699999999,43.41462],[-73.273011,43.414549],[-73.272924,43.414305],[-73.27285500000001,43.414192],[-73.272612,43.413952],[-73.27244899999999,43.41377],[-73.272345,43.413685],[-73.272212,43.41363],[-73.27197099999999,43.413568],[-73.27169000000001,43.413476],[-73.271326,43.41332],[-73.270956,43.413086],[-73.270754,43.412888],[-73.270702,43.412784],[-73.270686,43.412671],[-73.270686,43.412547],[-73.27073,43.412413],[-73.270886,43.412146],[-73.270922,43.412046],[-73.270923,43.412013],[-73.27092500000001,43.411948],[-73.270899,43.411815],[-73.27083399999999,43.411695],[-73.270751,43.411593],[-73.27046199999999,43.411398],[-73.27032199999999,43.411352],[-73.270173,43.411333],[-73.270062,43.411339],[-73.269971,43.411375],[-73.269841,43.411453],[-73.269373,43.411858],[-73.268924,43.412263],[-73.26875099999999,43.412383],[-73.268517,43.412513],[-73.268235,43.412636],[-73.26788999999999,43.41275],[-73.26704100000001,43.412937],[-73.26692,43.41293],[-73.266831,43.412907],[-73.266722,43.412849],[-73.266436,43.412628],[-73.265828,43.412106],[-73.265479,43.41175],[-73.265359,43.411643],[-73.265248,43.411578],[-73.26516599999999,43.411547],[-73.264483,43.411433],[-73.264178,43.411365],[-73.26384299999999,43.411261],[-73.263622,43.411164],[-73.263417,43.411054],[-73.263257,43.410938],[-73.26314600000001,43.410831],[-73.263006,43.410656],[-73.26277899999999,43.410295],[-73.262632,43.409974],[-73.262601,43.409908],[-73.26249199999999,43.409653],[-73.262308,43.409232],[-73.262162,43.408789],[-73.262129,43.408591],[-73.26204799999999,43.407805],[-73.262044,43.407688],[-73.26203599999999,43.407345],[-73.262041,43.40701],[-73.26205,43.406893],[-73.26208200000001,43.406763],[-73.262422,43.405982],[-73.262446,43.405864],[-73.262444,43.405752],[-73.262412,43.405694],[-73.26236,43.405645],[-73.262272,43.405596],[-73.26211000000001,43.405534],[-73.261898,43.405473],[-73.26169400000001,43.405447],[-73.261482,43.40544],[-73.26129400000001,43.405405],[-73.261174,43.405359],[-73.261049,43.405273],[-73.26092199999999,43.405156],[-73.26076,43.405059],[-73.26066899999999,43.405016],[-73.260617,43.405005],[-73.26060200000001,43.405002],[-73.26048,43.404974],[-73.260279,43.404961],[-73.26009000000001,43.404961],[-73.259953,43.404993],[-73.259941,43.405253],[-73.25990299999999,43.405448],[-73.25985799999999,43.405555],[-73.259304,43.406559],[-73.259187,43.406785],[-73.259122,43.406944],[-73.259096,43.407081],[-73.25909900000001,43.407201],[-73.25913300000001,43.407317],[-73.259169,43.407394],[-73.259546,43.40795],[-73.25928500000001,43.408057],[-73.258976,43.408152],[-73.258562,43.408211],[-73.258146,43.408252],[-73.257666,43.408299],[-73.25752199999999,43.4083],[-73.257361,43.408303],[-73.257172,43.40829],[-73.25712,43.408276],[-73.25687000000001,43.408192],[-73.256214,43.4079],[-73.255449,43.407532],[-73.255286,43.407453],[-73.25479199999999,43.407242],[-73.25391999999999,43.406932],[-73.25335800000001,43.406754],[-73.25244000000001,43.406489],[-73.251238,43.406182],[-73.250952,43.406147],[-73.251006,43.404862],[-73.251008,43.404798],[-73.251012,43.404733],[-73.251019,43.404576],[-73.25102099999999,43.404512],[-73.251024,43.404454],[-73.251063,43.40353],[-73.251091,43.402913],[-73.251222,43.399965],[-73.251231,43.39973],[-73.251307,43.398031],[-73.251312,43.397921],[-73.251465,43.394537],[-73.251471,43.39437],[-73.25166900000001,43.389921],[-73.252128,43.378341],[-73.252129,43.378315],[-73.252137,43.378098],[-73.252258,43.375072],[-73.252353,43.372994],[-73.252583,43.370998],[-73.252675,43.370286],[-73.252833,43.363494],[-73.253146,43.36274],[-73.253303,43.361208],[-73.253272,43.358555],[-73.253213,43.35802],[-73.25317800000001,43.357709],[-73.253304,43.355834],[-73.253179,43.355198],[-73.253085,43.354714],[-73.25322300000001,43.354316],[-73.253231,43.354209],[-73.253288,43.353],[-73.25636299999999,43.352676],[-73.260643,43.352228],[-73.262258,43.352061],[-73.265586,43.351743],[-73.265579,43.351783],[-73.265557,43.351925],[-73.265246,43.353871],[-73.264392,43.359288],[-73.264166,43.360651],[-73.264101,43.361005],[-73.264084,43.361094],[-73.264011,43.361348],[-73.26386100000001,43.361696],[-73.263122,43.363112],[-73.262895,43.363591],[-73.26212099999999,43.365537],[-73.26177,43.366443],[-73.261201,43.367872],[-73.261047,43.368332],[-73.26092,43.368816],[-73.26085399999999,43.369122],[-73.260755,43.369985],[-73.260643,43.372078],[-73.26061199999999,43.372382],[-73.26048900000001,43.373007],[-73.260304,43.37363],[-73.259884,43.374609],[-73.25975099999999,43.3749],[-73.259581,43.375324],[-73.259451,43.375704],[-73.259198,43.376536],[-73.25908699999999,43.377053],[-73.258751,43.378876],[-73.258465,43.380186],[-73.25834399999999,43.380805],[-73.258242,43.381417],[-73.258156,43.381999],[-73.258127,43.382398],[-73.258262,43.385277],[-73.258335,43.386051],[-73.25849100000001,43.386991],[-73.258618,43.387465],[-73.258674,43.387621],[-73.25881,43.387888],[-73.258971,43.38813],[-73.259372,43.388651],[-73.261026,43.390664],[-73.261321,43.390992],[-73.262006,43.391692],[-73.262241,43.39196],[-73.262888,43.392827],[-73.26319100000001,43.393273],[-73.263267,43.393381],[-73.263611,43.393877],[-73.263786,43.394108],[-73.263957,43.394275],[-73.264214,43.394492],[-73.26469,43.394816],[-73.264881,43.394923],[-73.26527400000001,43.395104],[-73.267197,43.395887],[-73.267692,43.396091],[-73.26815999999999,43.396309],[-73.268345,43.396406],[-73.26858900000001,43.396549],[-73.268867,43.39673],[-73.269172,43.396963],[-73.269351,43.397116],[-73.269516,43.397282],[-73.26979300000001,43.397596],[-73.270123,43.398062],[-73.27230400000001,43.401469],[-73.272706,43.402097],[-73.273026,43.402612],[-73.273189,43.402914],[-73.273437,43.403461],[-73.273707,43.404159],[-73.273821,43.40448],[-73.274601,43.406845],[-73.275305,43.409038],[-73.275485,43.409615],[-73.27573700000001,43.410493],[-73.276,43.411284],[-73.27610300000001,43.411762],[-73.276177,43.412232],[-73.27621600000001,43.413297]]],"type":"Polygon"}
}