{
  "id": "360810861002",
  "type": "Feature",
  "properties": {
    "area_land":101216,
    "area_water":0,
    "geoid":"360810861002",
    "name":"Block Group 2",
    "state":"ny"
},
  "bbox": [
    -73.820301,
    40.75383,
    -73.815339,
    40.758144
],
  "geometry": {"coordinates":[[[-73.81961800000001,40.755966],[-73.81926799999999,40.7562],[-73.81893700000001,40.75641],[-73.81786,40.757066],[-73.81860500000001,40.757542],[-73.81653,40.758144],[-73.816215,40.75747],[-73.8159,40.756799],[-73.815584,40.756129],[-73.81533899999999,40.755432],[-73.815634,40.75563],[-73.81703400000001,40.754722],[-73.81772100000001,40.754276],[-73.81840800000001,40.75383],[-73.820301,40.755515],[-73.81961800000001,40.755966]]],"type":"Polygon"}
}