{
  "id": "360910627003",
  "type": "Feature",
  "properties": {
    "area_land":427830,
    "area_water":9627,
    "geoid":"360910627003",
    "name":"Block Group 3",
    "state":"ny"
},
  "bbox": [
    -73.701406,
    42.778347,
    -73.69084,
    42.79104
],
  "geometry": {"coordinates":[[[-73.70140600000001,42.786475],[-73.69985200000001,42.787163],[-73.69934000000001,42.787406],[-73.699056,42.78764],[-73.69901400000001,42.787592],[-73.698958,42.787491],[-73.698899,42.787402],[-73.698899,42.787369],[-73.698984,42.787248],[-73.698994,42.787208],[-73.698977,42.787181],[-73.698954,42.787189],[-73.69891800000001,42.787212],[-73.699028,42.787031],[-73.698829,42.787171],[-73.698421,42.787455],[-73.697661,42.787954],[-73.697553,42.788015],[-73.69699799999999,42.788194],[-73.69668,42.78828],[-73.69647399999999,42.788371],[-73.696386,42.788436],[-73.696135,42.788673],[-73.69588400000001,42.788883],[-73.696798,42.789559],[-73.695106,42.790942],[-73.694762,42.791021],[-73.694654,42.791037],[-73.69449899999999,42.79104],[-73.694318,42.791017],[-73.694159,42.79098],[-73.694047,42.790933],[-73.693707,42.790663],[-73.692756,42.789978],[-73.692213,42.789548],[-73.691742,42.789211],[-73.691198,42.788818],[-73.69083999999999,42.78861],[-73.691461,42.788167],[-73.69157800000001,42.788085],[-73.69188800000001,42.787865],[-73.692273,42.787634],[-73.69374500000001,42.786832],[-73.694008,42.786634],[-73.694084,42.786539],[-73.694158,42.786403],[-73.694344,42.785951],[-73.69441399999999,42.785764],[-73.694844,42.784837],[-73.695069,42.784308],[-73.6952,42.783945],[-73.695588,42.782762],[-73.69635,42.780486],[-73.69641300000001,42.78021],[-73.69657100000001,42.77941],[-73.696774,42.778462],[-73.69679499999999,42.778347],[-73.696862,42.778377],[-73.69766799999999,42.778735],[-73.69764499999999,42.778847],[-73.69745399999999,42.779832],[-73.69729700000001,42.78065],[-73.697406,42.78067],[-73.697486,42.780269],[-73.697518,42.780146],[-73.697571,42.780128],[-73.69769599999999,42.780134],[-73.697898,42.78017],[-73.69838799999999,42.780296],[-73.69851,42.780352],[-73.698564,42.780407],[-73.698677,42.780664],[-73.698857,42.78091],[-73.698944,42.781018],[-73.699185,42.78138],[-73.69938500000001,42.781623],[-73.69938999999999,42.781682],[-73.699349,42.78174],[-73.698885,42.781992],[-73.69794400000001,42.782433],[-73.69883400000001,42.783517],[-73.699639,42.784529],[-73.700249,42.785244],[-73.70036399999999,42.785376],[-73.700564,42.785604],[-73.700997,42.786059],[-73.7012,42.786277],[-73.70140600000001,42.786475]]],"type":"Polygon"}
}