{
  "id": "360610024002",
  "type": "Feature",
  "properties": {
    "area_land":54215,
    "area_water":0,
    "geoid":"360610024002",
    "name":"Block Group 2",
    "state":"ny"
},
  "bbox": [
    -73.975164,
    40.724161,
    -73.971857,
    40.727428
],
  "geometry": {"coordinates":[[[-73.97516400000001,40.724877],[-73.974733,40.725468],[-73.97426900000001,40.726109],[-73.973799,40.726752],[-73.973298,40.727428],[-73.97205,40.726881],[-73.971977,40.72683],[-73.971857,40.726759],[-73.971886,40.726623],[-73.971969,40.726362],[-73.972024,40.72622],[-73.97208500000001,40.726062],[-73.972313,40.725644],[-73.97250200000001,40.725352],[-73.972776,40.724906],[-73.97317,40.724242],[-73.973281,40.724279],[-73.97348599999999,40.724161],[-73.974248,40.724486],[-73.974817,40.724729],[-73.97516400000001,40.724877]]],"type":"Polygon"}
}