{
  "id": "361190146042",
  "type": "Feature",
  "properties": {
    "area_land":1601661,
    "area_water":3957855,
    "geoid":"361190146042",
    "name":"Block Group 2",
    "state":"ny"
},
  "bbox": [
    -73.972284,
    41.226346,
    -73.933968,
    41.269993
],
  "geometry": {"coordinates":[[[-73.972284,41.256193],[-73.971484,41.259593],[-73.969684,41.263193],[-73.96688399999999,41.267193],[-73.964184,41.269993],[-73.960463,41.265107],[-73.96078199999999,41.264893],[-73.96117099999999,41.264647],[-73.962557,41.263828],[-73.96288800000001,41.263562],[-73.963165,41.263372],[-73.963429,41.263138],[-73.963784,41.26278],[-73.96415,41.262238],[-73.964279,41.261991],[-73.964709,41.261098],[-73.964851,41.260705],[-73.964922,41.260448],[-73.96497599999999,41.260194],[-73.965,41.259974],[-73.965,41.259879],[-73.96497599999999,41.259764],[-73.96498,41.259517],[-73.965031,41.259216],[-73.965112,41.258993],[-73.965112,41.258918],[-73.965085,41.258803],[-73.965098,41.258746],[-73.965058,41.258658],[-73.96505399999999,41.258488],[-73.965132,41.258187],[-73.965383,41.257581],[-73.965417,41.257524],[-73.965434,41.257426],[-73.96556200000001,41.257324],[-73.96563,41.25723],[-73.965671,41.257104],[-73.965664,41.25703],[-73.965613,41.256986],[-73.965586,41.256945],[-73.965583,41.256834],[-73.96562299999999,41.256722],[-73.965654,41.256583],[-73.96575199999999,41.256306],[-73.96579300000001,41.256133],[-73.965896,41.256011],[-73.96591100000001,41.255994],[-73.965959,41.255825],[-73.965986,41.255592],[-73.966043,41.255558],[-73.96626999999999,41.255477],[-73.96628,41.25546],[-73.966267,41.255392],[-73.96625299999999,41.255382],[-73.965992,41.255416],[-73.965935,41.255331],[-73.96587700000001,41.25527],[-73.96585,41.255219],[-73.96585399999999,41.255131],[-73.96589400000001,41.254969],[-73.96591100000001,41.254803],[-73.965999,41.254492],[-73.966043,41.254424],[-73.966162,41.254356],[-73.96626999999999,41.254228],[-73.966311,41.253669],[-73.96614099999999,41.253324],[-73.966148,41.253202],[-73.96617500000001,41.253148],[-73.966206,41.253135],[-73.966247,41.253131],[-73.96633799999999,41.253155],[-73.96642300000001,41.252952],[-73.966453,41.252837],[-73.96646,41.252752],[-73.96642900000001,41.252685],[-73.966426,41.25262],[-73.966453,41.25257],[-73.96647,41.252557],[-73.96647,41.252515],[-73.966436,41.252468],[-73.966362,41.252397],[-73.966138,41.252278],[-73.965996,41.252224],[-73.965969,41.252222],[-73.96589400000001,41.252218],[-73.96581,41.252231],[-73.965739,41.252275],[-73.965542,41.252434],[-73.965467,41.252478],[-73.965386,41.252495],[-73.96535900000001,41.252485],[-73.965315,41.252444],[-73.965234,41.252407],[-73.96518,41.2524],[-73.96508799999999,41.252353],[-73.96505399999999,41.252312],[-73.965037,41.252201],[-73.965068,41.252096],[-73.965132,41.251991],[-73.965166,41.251967],[-73.965183,41.251937],[-73.965146,41.251839],[-73.965153,41.251805],[-73.965322,41.251713],[-73.965396,41.251635],[-73.965515,41.251378],[-73.96565699999999,41.25126],[-73.965789,41.251006],[-73.96594899999999,41.2508],[-73.96598899999999,41.250688],[-73.965992,41.250583],[-73.965959,41.250495],[-73.965963,41.250457],[-73.965965,41.250431],[-73.96592099999999,41.250339],[-73.965745,41.250153],[-73.965667,41.250045],[-73.965667,41.249969],[-73.96569700000001,41.249933],[-73.965675,41.249867],[-73.965288,41.249499],[-73.96524100000001,41.249474],[-73.96476699999999,41.249295],[-73.96443499999999,41.249142],[-73.96431800000001,41.249055],[-73.964275,41.249011],[-73.96426200000001,41.248942],[-73.96427799999999,41.248887],[-73.964275,41.248796],[-73.96421599999999,41.248738],[-73.964173,41.248714],[-73.96409199999999,41.248669],[-73.96393399999999,41.248534],[-73.96386099999999,41.248505],[-73.963784,41.248454],[-73.963719,41.248392],[-73.963689,41.248344],[-73.963646,41.248308],[-73.96297800000001,41.248122],[-73.962924,41.248064],[-73.96287599999999,41.248057],[-73.962869,41.248097],[-73.962844,41.248108],[-73.962822,41.248089],[-73.962743,41.248053],[-73.962638,41.248024],[-73.962262,41.247958],[-73.962215,41.24794],[-73.96217799999999,41.247871],[-73.96214500000001,41.247849],[-73.962076,41.247842],[-73.962025,41.247882],[-73.961985,41.247896],[-73.961927,41.2479],[-73.961821,41.247874],[-73.961671,41.247893],[-73.961562,41.247874],[-73.961471,41.247874],[-73.961445,41.247864],[-73.961422,41.24782],[-73.96133399999999,41.247813],[-73.961196,41.247823],[-73.961021,41.247791],[-73.960838,41.247783],[-73.9607,41.247805],[-73.960499,41.247794],[-73.960419,41.247802],[-73.960368,41.247823],[-73.960346,41.247849],[-73.960284,41.247856],[-73.960071,41.247845],[-73.960038,41.247878],[-73.95993900000001,41.24794],[-73.959819,41.247973],[-73.959739,41.247976],[-73.959633,41.248042],[-73.95951700000001,41.248049],[-73.959046,41.248024],[-73.958995,41.248009],[-73.958962,41.247936],[-73.95893700000001,41.247918],[-73.958206,41.24794],[-73.958067,41.248042],[-73.958016,41.248097],[-73.9579,41.248173],[-73.95781599999999,41.248246],[-73.957644,41.248344],[-73.957611,41.24841],[-73.957571,41.248454],[-73.95750200000001,41.248457],[-73.957447,41.248472],[-73.957309,41.248603],[-73.957065,41.2488],[-73.95700600000001,41.248858],[-73.956941,41.248895],[-73.95677999999999,41.248902],[-73.956306,41.248895],[-73.956262,41.248931],[-73.95624100000001,41.248982],[-73.95616,41.249011],[-73.955978,41.249011],[-73.955752,41.248967],[-73.95559900000001,41.24896],[-73.95554799999999,41.248982],[-73.95544599999999,41.248989],[-73.95520500000001,41.248902],[-73.95495,41.248822],[-73.954443,41.248581],[-73.954348,41.248552],[-73.954246,41.248537],[-73.954122,41.248625],[-73.954078,41.248705],[-73.954086,41.2488],[-73.954115,41.248873],[-73.954071,41.248931],[-73.953896,41.248924],[-73.953779,41.249039],[-73.953728,41.249091],[-73.95369100000001,41.249098],[-73.953625,41.249173],[-73.95358,41.249227],[-73.95408,41.249468],[-73.95407,41.249512],[-73.95411799999999,41.249542],[-73.954142,41.249528],[-73.954157,41.249525],[-73.95419200000001,41.249524],[-73.954308,41.249593],[-73.95428800000001,41.249658],[-73.954317,41.249709],[-73.95434899999999,41.249709],[-73.954407,41.249668],[-73.95490599999999,41.249929],[-73.954919,41.249946],[-73.954903,41.249967],[-73.954909,41.249987],[-73.954954,41.249977],[-73.95538500000001,41.250251],[-73.95547999999999,41.250332],[-73.955493,41.2504],[-73.95547999999999,41.250454],[-73.955392,41.250528],[-73.95527,41.250596],[-73.955168,41.250677],[-73.955144,41.250793],[-73.955141,41.250813],[-73.955101,41.250873],[-73.95497899999999,41.250901],[-73.95487,41.250941],[-73.95484999999999,41.251002],[-73.954857,41.251266],[-73.954843,41.25132],[-73.954796,41.251327],[-73.954775,41.251307],[-73.954775,41.251219],[-73.954735,41.251185],[-73.95468099999999,41.251165],[-73.95464,41.251192],[-73.95464,41.251266],[-73.954674,41.251368],[-73.954694,41.251489],[-73.954626,41.251577],[-73.954599,41.25174],[-73.954532,41.251855],[-73.95441,41.251943],[-73.95428800000001,41.252085],[-73.95415199999999,41.252356],[-73.953997,41.252417],[-73.95378700000001,41.252654],[-73.953712,41.252809],[-73.953712,41.252992],[-73.95376400000001,41.253237],[-73.953807,41.253317],[-73.953908,41.253418],[-73.953908,41.253513],[-73.953807,41.253533],[-73.953678,41.253533],[-73.953536,41.253513],[-73.953394,41.253527],[-73.953272,41.25356],[-73.952974,41.253574],[-73.952933,41.253621],[-73.952933,41.253689],[-73.95294699999999,41.253743],[-73.95298699999999,41.253791],[-73.952994,41.253831],[-73.95298699999999,41.253879],[-73.95292000000001,41.253906],[-73.952798,41.253933],[-73.952662,41.25398],[-73.95252000000001,41.253973],[-73.95239100000001,41.253987],[-73.952229,41.254048],[-73.95208700000001,41.254122],[-73.9517,41.254133],[-73.951626,41.254156],[-73.95161299999999,41.254217],[-73.951626,41.254264],[-73.95168700000001,41.254312],[-73.95168700000001,41.254373],[-73.951606,41.254454],[-73.951274,41.254731],[-73.95122600000001,41.254799],[-73.95122000000001,41.254846],[-73.95124,41.254887],[-73.951213,41.254961],[-73.95103,41.255063],[-73.950834,41.255313],[-73.950658,41.255361],[-73.950549,41.255401],[-73.950506,41.255459],[-73.950468,41.25551],[-73.950339,41.255584],[-73.95022400000001,41.255618],[-73.95022400000001,41.255706],[-73.950244,41.255794],[-73.9504,41.256004],[-73.95052200000001,41.256092],[-73.950569,41.256159],[-73.95055600000001,41.256241],[-73.950468,41.256302],[-73.95037600000001,41.256415],[-73.949532,41.254944],[-73.94929500000001,41.254529],[-73.94892299999999,41.25388],[-73.94876600000001,41.253605],[-73.946569,41.252341],[-73.945949,41.249891],[-73.946629,41.249718],[-73.947953,41.249323],[-73.947479,41.248855],[-73.947052,41.248449],[-73.946791,41.248183],[-73.946197,41.247515],[-73.945607,41.246956],[-73.94447599999999,41.2459],[-73.944209,41.245653],[-73.942915,41.244316],[-73.94239399999999,41.243766],[-73.942127,41.243539],[-73.94178700000001,41.243367],[-73.941545,41.243323],[-73.941045,41.243286],[-73.940907,41.243293],[-73.940675,41.243305],[-73.940364,41.243261],[-73.94009800000001,41.243182],[-73.939876,41.243074],[-73.939803,41.243008],[-73.939651,41.242869],[-73.93903899999999,41.242191],[-73.9388,41.241926],[-73.937471,41.240626],[-73.93731,41.240455],[-73.936655,41.239551],[-73.936482,41.239621],[-73.935732,41.239986],[-73.935046,41.240318],[-73.93456999999999,41.239996],[-73.93434999999999,41.239815],[-73.93413,41.2396],[-73.93396799999999,41.239469],[-73.934933,41.238925],[-73.93558,41.238561],[-73.937071,41.237723],[-73.937409,41.237138],[-73.937005,41.236368],[-73.935867,41.236059],[-73.936294,41.235269],[-73.936863,41.235377],[-73.936555,41.234157],[-73.93644399999999,41.23386],[-73.937551,41.233313],[-73.940359,41.233056],[-73.94355299999999,41.230685],[-73.945734,41.229252],[-73.948414,41.22771],[-73.950947,41.226346],[-73.951083,41.226494],[-73.953283,41.228994],[-73.957983,41.231694],[-73.961383,41.234194],[-73.96078300000001,41.239394],[-73.96128299999999,41.241994],[-73.96388399999999,41.243694],[-73.964142,41.243851],[-73.970519,41.247732],[-73.97078399999999,41.247893],[-73.97198400000001,41.251493],[-73.972284,41.256193]]],"type":"Polygon"}
}