{
  "id": "360550020003",
  "type": "Feature",
  "properties": {
    "area_land":241096,
    "area_water":0,
    "geoid":"360550020003",
    "name":"Block Group 3",
    "state":"ny"
},
  "bbox": [
    -77.638885,
    43.190242,
    -77.62899,
    43.193852
],
  "geometry": {"coordinates":[[[-77.63888,43.192228],[-77.63887699999999,43.192735],[-77.638862,43.193852],[-77.63726699999999,43.193837],[-77.633201,43.193826],[-77.63140799999999,43.193818],[-77.62913500000001,43.193818],[-77.62899,43.193849],[-77.62912,43.193313],[-77.62928700000001,43.192693],[-77.62949999999999,43.191808],[-77.629577,43.191487],[-77.62971400000001,43.190915],[-77.629874,43.190259],[-77.63397000000001,43.190242],[-77.633979,43.190868],[-77.63398100000001,43.191528],[-77.633715,43.191486],[-77.633752,43.191532],[-77.633796,43.191572],[-77.633881,43.19163],[-77.63398100000001,43.191689],[-77.636336,43.19169],[-77.638885,43.191682],[-77.63888,43.192228]]],"type":"Polygon"}
}