{
  "id": "360810334025",
  "type": "Feature",
  "properties": {
    "area_land":160001,
    "area_water":0,
    "geoid":"360810334025",
    "name":"Block Group 5",
    "state":"ny"
},
  "bbox": [
    -73.779478,
    40.673387,
    -73.773571,
    40.679654
],
  "geometry": {"coordinates":[[[-73.779478,40.678365],[-73.77842200000001,40.679032],[-73.777231,40.679654],[-73.774671,40.677413],[-73.774406,40.67718],[-73.773571,40.676449],[-73.77418,40.675559],[-73.77545499999999,40.673701],[-73.775672,40.673387],[-73.776847,40.674932],[-73.77713799999999,40.675315],[-73.77804500000001,40.676505],[-73.77815099999999,40.676648],[-73.77861799999999,40.677264],[-73.779082,40.677874],[-73.779478,40.678365]]],"type":"Polygon"}
}