{
  "id": "360670118005",
  "type": "Feature",
  "properties": {
    "area_land":5681490,
    "area_water":30170,
    "geoid":"360670118005",
    "name":"Block Group 5",
    "state":"ny"
},
  "bbox": [
    -76.324981,
    43.099861,
    -76.259164,
    43.144098
],
  "geometry": {"coordinates":[[[-76.32498099999999,43.143709],[-76.324941,43.14385],[-76.32481199999999,43.144098],[-76.32470000000001,43.144031],[-76.32441300000001,43.143878],[-76.324108,43.143742],[-76.32383,43.143651],[-76.32362500000001,43.143601],[-76.323027,43.143495],[-76.32214399999999,43.143358],[-76.321838,43.143297],[-76.32141300000001,43.143195],[-76.320553,43.142953],[-76.319909,43.14277],[-76.317443,43.142075],[-76.316778,43.141896],[-76.314616,43.141336],[-76.313126,43.140974],[-76.311774,43.140637],[-76.311059,43.140434],[-76.310687,43.140293],[-76.30968,43.139799],[-76.310321,43.139112],[-76.310486,43.138879],[-76.310526,43.138784],[-76.310552,43.138583],[-76.31057800000001,43.138218],[-76.31058400000001,43.1382],[-76.31065700000001,43.138049],[-76.310901,43.137695],[-76.31121,43.137236],[-76.311308,43.137101],[-76.31144399999999,43.136894],[-76.311588,43.136706],[-76.311722,43.136579],[-76.311823,43.136517],[-76.31206299999999,43.13643],[-76.31228400000001,43.136391],[-76.312971,43.136321],[-76.31376299999999,43.136233],[-76.314027,43.13619],[-76.314229,43.136124],[-76.314401,43.136032],[-76.314561,43.135907],[-76.31487,43.135613],[-76.315285,43.135229],[-76.315932,43.134631],[-76.31621800000001,43.13436],[-76.316272,43.134298],[-76.316372,43.134139],[-76.31641500000001,43.134015],[-76.316422,43.133807],[-76.316396,43.133451],[-76.316367,43.133086],[-76.316338,43.132645],[-76.316298,43.13218],[-76.316294,43.131722],[-76.316328,43.131711],[-76.316433,43.131657],[-76.31647100000001,43.131619],[-76.316492,43.131554],[-76.316492,43.131514],[-76.316478,43.13145],[-76.31643,43.13139],[-76.31637499999999,43.131351],[-76.316245,43.131312],[-76.31614500000001,43.13131],[-76.31605500000001,43.131328],[-76.315957,43.131376],[-76.315907,43.131426],[-76.31589200000001,43.131459],[-76.31563300000001,43.13148],[-76.31461299999999,43.131511],[-76.31417999999999,43.131514],[-76.313868,43.131475],[-76.313605,43.131404],[-76.313396,43.131324],[-76.31314500000001,43.131179],[-76.313018,43.13108],[-76.31292500000001,43.130987],[-76.31279499999999,43.130822],[-76.312586,43.130413],[-76.312307,43.129771],[-76.312134,43.129421],[-76.312062,43.129301],[-76.31183299999999,43.128991],[-76.31172599999999,43.128874],[-76.31237299999999,43.128517],[-76.312501,43.128419],[-76.312591,43.12832],[-76.31265,43.128232],[-76.312701,43.128077],[-76.312709,43.127874],[-76.312702,43.127822],[-76.312631,43.127666],[-76.31249800000001,43.127496],[-76.31244100000001,43.127446],[-76.31218200000001,43.1273],[-76.311739,43.127083],[-76.311402,43.126931],[-76.310991,43.126726],[-76.310396,43.126458],[-76.31029100000001,43.126414],[-76.309923,43.126308],[-76.309527,43.126237],[-76.309316,43.126211],[-76.309077,43.126203],[-76.308305,43.126231],[-76.307371,43.126274],[-76.30708799999999,43.126278],[-76.306729,43.126306],[-76.306506,43.126345],[-76.306344,43.126385],[-76.306094,43.126478],[-76.305948,43.126557],[-76.305858,43.12663],[-76.30571999999999,43.126744],[-76.30558600000001,43.126894],[-76.30547900000001,43.127053],[-76.30544,43.12714],[-76.305333,43.127528],[-76.30525799999999,43.127856],[-76.305251,43.127965],[-76.305266,43.128148],[-76.305323,43.12836],[-76.305375,43.128475],[-76.305398,43.128525],[-76.305418,43.12857],[-76.305678,43.129157],[-76.305796,43.129362],[-76.30597299999999,43.129565],[-76.30608700000001,43.129672],[-76.305944,43.129758],[-76.305756,43.129894],[-76.305533,43.13011],[-76.304974,43.130824],[-76.30471300000001,43.131196],[-76.304648,43.131358],[-76.304614,43.131512],[-76.304593,43.131762],[-76.30463399999999,43.132335],[-76.30423999999999,43.132352],[-76.304057,43.132373],[-76.30386900000001,43.132425],[-76.30369399999999,43.132515],[-76.303157,43.132833],[-76.302657,43.133135],[-76.302493,43.133232],[-76.302209,43.133401],[-76.30110999999999,43.134057],[-76.29970899999999,43.132792],[-76.299666,43.132752],[-76.29961400000001,43.132706],[-76.298002,43.131259],[-76.298113,43.131121],[-76.299015,43.129472],[-76.29994600000001,43.12792],[-76.300055,43.127679],[-76.300135,43.127397],[-76.30016999999999,43.127173],[-76.300185,43.126898],[-76.30006299999999,43.125213],[-76.300034,43.124852],[-76.300033,43.124524],[-76.300078,43.12422],[-76.30016000000001,43.12396],[-76.300269,43.123714],[-76.30038500000001,43.123517],[-76.300428,43.123445],[-76.300533,43.123309],[-76.30070000000001,43.123118],[-76.300842,43.12298],[-76.301498,43.122479],[-76.301698,43.122273],[-76.301794,43.12214],[-76.301872,43.121995],[-76.30192,43.121863],[-76.30194899999999,43.121727],[-76.301964,43.121542],[-76.301931,43.121313],[-76.301857,43.12112],[-76.301754,43.120944],[-76.301573,43.120727],[-76.30139,43.120562],[-76.300737,43.120066],[-76.30031200000001,43.119727],[-76.29947900000001,43.118976],[-76.299198,43.118757],[-76.298929,43.118589],[-76.296441,43.117209],[-76.29675899999999,43.116928],[-76.296931,43.11678],[-76.29352799999999,43.114737],[-76.292103,43.113881],[-76.291436,43.11348],[-76.29107,43.113288],[-76.290449,43.112976],[-76.29036600000001,43.112936],[-76.290043,43.112797],[-76.289288,43.112513],[-76.288647,43.112303],[-76.288265,43.112191],[-76.28713500000001,43.111905],[-76.286992,43.111876],[-76.286788,43.111841],[-76.286433,43.111779],[-76.286145,43.111735],[-76.285816,43.111696],[-76.2856,43.111673],[-76.28536099999999,43.111651],[-76.284471,43.111608],[-76.284002,43.1116],[-76.283536,43.111603],[-76.28213599999999,43.111637],[-76.281347,43.111659],[-76.28088200000001,43.11166],[-76.280793,43.111657],[-76.278401,43.111714],[-76.278312,43.111716],[-76.277413,43.111754],[-76.27723899999999,43.111767],[-76.276505,43.111821],[-76.27623,43.111853],[-76.275802,43.111905],[-76.275203,43.111985],[-76.27514600000001,43.111996],[-76.274314,43.112149],[-76.273725,43.11227],[-76.272268,43.112642],[-76.271987,43.112716],[-76.271022,43.112979],[-76.27080100000001,43.113022],[-76.270366,43.113084],[-76.27007399999999,43.113108],[-76.26997799999999,43.112915],[-76.26974800000001,43.112452],[-76.26902,43.111963],[-76.267899,43.11107],[-76.26776,43.110903],[-76.26539,43.108186],[-76.25999899999999,43.101928],[-76.259164,43.10092],[-76.261629,43.100822],[-76.268584,43.100423],[-76.27834300000001,43.099861],[-76.27851099999999,43.100165],[-76.278657,43.100429],[-76.27880399999999,43.100662],[-76.279043,43.100975],[-76.279104,43.101042],[-76.27949099999999,43.101447],[-76.28098300000001,43.102934],[-76.281431,43.103391],[-76.28165799999999,43.10355],[-76.281898,43.103694],[-76.28227,43.103876],[-76.282662,43.104054],[-76.283261,43.104333],[-76.284547,43.104863],[-76.285265,43.105183],[-76.287565,43.106256],[-76.288518,43.106698],[-76.288678,43.106777],[-76.288983,43.106921],[-76.28903699999999,43.106945],[-76.28946500000001,43.107138],[-76.290295,43.107526],[-76.290409,43.107568],[-76.290978,43.107857],[-76.291297,43.108031],[-76.291746,43.108333],[-76.29274599999999,43.109257],[-76.293138,43.109562],[-76.29357,43.109854],[-76.293987,43.110095],[-76.29436099999999,43.110278],[-76.29848200000001,43.112162],[-76.299323,43.112583],[-76.301592,43.11384],[-76.301874,43.113998],[-76.30374399999999,43.115096],[-76.304975,43.115779],[-76.30702700000001,43.116896],[-76.307481,43.117119],[-76.311448,43.118906],[-76.311976,43.119163],[-76.31230600000001,43.11935],[-76.312759,43.119654],[-76.313366,43.120094],[-76.313982,43.120575],[-76.315592,43.121895],[-76.31580099999999,43.122075],[-76.31604400000001,43.122346],[-76.31625699999999,43.122649],[-76.317565,43.124681],[-76.317654,43.124836],[-76.31841,43.126234],[-76.31867200000001,43.126752],[-76.31875599999999,43.126936],[-76.318955,43.127479],[-76.318994,43.127599],[-76.319238,43.128633],[-76.319322,43.128984],[-76.319385,43.129251],[-76.319424,43.12942],[-76.319509,43.129806],[-76.319605,43.130119],[-76.31964000000001,43.130208],[-76.319804,43.130574],[-76.320216,43.131353],[-76.320244,43.131421],[-76.320256,43.13145],[-76.32032,43.131616],[-76.320723,43.132951],[-76.320836,43.133334],[-76.321102,43.134094],[-76.321226,43.134411],[-76.32147399999999,43.13498],[-76.321991,43.136162],[-76.322287,43.136879],[-76.32262,43.137833],[-76.32362000000001,43.140643],[-76.324119,43.141773],[-76.324922,43.143475],[-76.324966,43.143594],[-76.32498099999999,43.143709]]],"type":"Polygon"}
}