{
  "id": "361190135002",
  "type": "Feature",
  "properties": {
    "area_land":309649,
    "area_water":0,
    "geoid":"361190135002",
    "name":"Block Group 2",
    "state":"ny"
},
  "bbox": [
    -73.850026,
    41.166897,
    -73.841325,
    41.172446
],
  "geometry": {"coordinates":[[[-73.84993,41.167067],[-73.849594,41.168081],[-73.849537,41.16836],[-73.849537,41.168702],[-73.84957300000001,41.168878],[-73.849677,41.16894],[-73.84961699999999,41.169027],[-73.8494,41.169374],[-73.849251,41.169695],[-73.849118,41.170041],[-73.848983,41.170489],[-73.848724,41.171341],[-73.84866100000001,41.171544],[-73.84849699999999,41.171976],[-73.848326,41.172356],[-73.848276,41.172427],[-73.848029,41.172285],[-73.84783400000001,41.172194],[-73.847651,41.172138],[-73.846508,41.172015],[-73.84631299999999,41.171971],[-73.84621,41.171939],[-73.84592000000001,41.171875],[-73.84572300000001,41.17185],[-73.845268,41.171824],[-73.844724,41.171816],[-73.844092,41.171843],[-73.843937,41.171859],[-73.843621,41.171942],[-73.843109,41.172151],[-73.84278399999999,41.172308],[-73.84253200000001,41.172446],[-73.84220000000001,41.172156],[-73.841854,41.171825],[-73.841431,41.171272],[-73.84133300000001,41.171093],[-73.841325,41.170979],[-73.841339,41.170863],[-73.841398,41.170663],[-73.841561,41.170362],[-73.841815,41.16993],[-73.841915,41.169798],[-73.84195800000001,41.169752],[-73.842308,41.169313],[-73.84266,41.169029],[-73.843276,41.168462],[-73.844544,41.1674],[-73.845522,41.167256],[-73.84648,41.167127],[-73.846976,41.167062],[-73.847588,41.166952],[-73.847835,41.166914],[-73.84803599999999,41.166897],[-73.848181,41.166897],[-73.848302,41.166911],[-73.848538,41.166965],[-73.84885,41.167017],[-73.849082,41.16702],[-73.84944299999999,41.166983],[-73.849766,41.166967],[-73.849904,41.166965],[-73.850026,41.166978],[-73.84993,41.167067]]],"type":"Polygon"}
}