{
  "id": "360811227015",
  "type": "Feature",
  "properties": {
    "area_land":100055,
    "area_water":0,
    "geoid":"360811227015",
    "name":"Block Group 5",
    "state":"ny"
},
  "bbox": [
    -73.810772,
    40.731931,
    -73.807828,
    40.736992
],
  "geometry": {"coordinates":[[[-73.810687,40.733682],[-73.81061800000001,40.73478],[-73.81060100000001,40.735042],[-73.810559,40.735737],[-73.81055000000001,40.735878],[-73.81049899999999,40.736699],[-73.81048199999999,40.736992],[-73.809512,40.736958],[-73.80857,40.736921],[-73.80867000000001,40.736377],[-73.80892799999999,40.734979],[-73.80892799999999,40.734832],[-73.808899,40.734673],[-73.808834,40.734506],[-73.80877099999999,40.734398],[-73.808674,40.734274],[-73.80860699999999,40.734205],[-73.808503,40.734116],[-73.808318,40.733996],[-73.808228,40.73395],[-73.808059,40.733882],[-73.807828,40.73382],[-73.807962,40.731931],[-73.810772,40.732326],[-73.810687,40.733682]]],"type":"Polygon"}
}