{
  "id": "360290098001",
  "type": "Feature",
  "properties": {
    "area_land":1887973,
    "area_water":0,
    "geoid":"360290098001",
    "name":"Block Group 1",
    "state":"ny"
},
  "bbox": [
    -78.730037,
    42.90159,
    -78.696909,
    42.911922
],
  "geometry": {"coordinates":[[[-78.72948,42.909588],[-78.729131,42.909568],[-78.728212,42.909476],[-78.727429,42.909372],[-78.726664,42.909258],[-78.724638,42.908958],[-78.724121,42.908889],[-78.72402,42.908875],[-78.72331800000001,42.908807],[-78.722148,42.908747],[-78.721525,42.908749],[-78.720293,42.908731],[-78.719099,42.9087],[-78.71823500000001,42.908678],[-78.718166,42.908676],[-78.717091,42.908761],[-78.71624199999999,42.908878],[-78.715225,42.909007],[-78.714793,42.909069],[-78.71426599999999,42.909162],[-78.713185,42.909339],[-78.712929,42.90938],[-78.711797,42.909564],[-78.710645,42.909749],[-78.70947700000001,42.909933],[-78.708234,42.910129],[-78.705941,42.910495],[-78.70490100000001,42.91066],[-78.704611,42.910703],[-78.704515,42.910718],[-78.703587,42.910859],[-78.700585,42.911343],[-78.699438,42.911524],[-78.696924,42.911922],[-78.696928,42.91094],[-78.696928,42.910659],[-78.696932,42.910148],[-78.696932,42.910111],[-78.696933,42.909983],[-78.696933,42.909661],[-78.696934,42.909292],[-78.696933,42.908602],[-78.696932,42.907997],[-78.69693599999999,42.906689],[-78.696932,42.906455],[-78.696929,42.906303],[-78.696928,42.906208],[-78.69692499999999,42.906037],[-78.69691400000001,42.905622],[-78.696912,42.904805],[-78.696912,42.903838],[-78.69690900000001,42.902828],[-78.696911,42.901931],[-78.69802,42.901885],[-78.699093,42.901844],[-78.700136,42.901806],[-78.701223,42.901765],[-78.70235700000001,42.901727],[-78.702977,42.901709],[-78.703509,42.901695],[-78.703973,42.901681],[-78.70456799999999,42.901664],[-78.70502,42.90165],[-78.70662,42.901594],[-78.706704,42.901594],[-78.707308,42.90159],[-78.70781700000001,42.901686],[-78.70838999999999,42.901796],[-78.708484,42.90183],[-78.710078,42.902493],[-78.71042,42.902627],[-78.710944,42.902842],[-78.713067,42.90386],[-78.71327100000001,42.903958],[-78.71426200000001,42.904271],[-78.71498099999999,42.904466],[-78.715141,42.904466],[-78.716165,42.904485],[-78.716684,42.904469],[-78.71731,42.904433],[-78.7182,42.904357],[-78.71900100000001,42.904284],[-78.720187,42.904201],[-78.721082,42.90416],[-78.722132,42.904138],[-78.72229400000001,42.904135],[-78.72258100000001,42.904156],[-78.722865,42.904192],[-78.723145,42.904242],[-78.72328400000001,42.904273],[-78.723578,42.904351],[-78.72382,42.90443],[-78.723997,42.904498],[-78.725218,42.904961],[-78.725635,42.905127],[-78.72698099999999,42.905285],[-78.727718,42.905219],[-78.728055,42.905168],[-78.728415,42.906759],[-78.728444,42.906891],[-78.728454,42.906996],[-78.72856899999999,42.907468],[-78.72866399999999,42.907916],[-78.728886,42.908457],[-78.72936199999999,42.909002],[-78.730037,42.909644],[-78.72948,42.909588]]],"type":"Polygon"}
}