{
  "id": "360550142023",
  "type": "Feature",
  "properties": {
    "area_land":6700645,
    "area_water":23683,
    "geoid":"360550142023",
    "name":"Block Group 3",
    "state":"ny"
},
  "bbox": [
    -77.754327,
    43.138694,
    -77.732308,
    43.1784
],
  "geometry": {"coordinates":[[[-77.754283,43.140866],[-77.75424,43.142567],[-77.754209,43.143955],[-77.754188,43.144984],[-77.754114,43.148565],[-77.75410599999999,43.148968],[-77.754041,43.151698],[-77.753981,43.15414],[-77.75395,43.155434],[-77.753911,43.156907],[-77.753888,43.157846],[-77.753848,43.159611],[-77.753843,43.159804],[-77.753834,43.160169],[-77.753833,43.160214],[-77.753829,43.160474],[-77.753826,43.160684],[-77.753822,43.161052],[-77.753821,43.161118],[-77.753742,43.16572],[-77.753732,43.166338],[-77.75372900000001,43.166525],[-77.75372400000001,43.166919],[-77.753721,43.167297],[-77.753716,43.167807],[-77.753704,43.16909],[-77.75369999999999,43.170152],[-77.753688,43.170726],[-77.753687,43.170757],[-77.753659,43.172079],[-77.75363299999999,43.173355],[-77.753562,43.176826],[-77.753541,43.1784],[-77.75210800000001,43.178026],[-77.747636,43.176858],[-77.74721,43.176765],[-77.746758,43.176682],[-77.74602,43.17656],[-77.74472400000001,43.176346],[-77.743048,43.17607],[-77.74240899999999,43.175939],[-77.74167799999999,43.175747],[-77.741553,43.175714],[-77.739209,43.175091],[-77.73762499999999,43.174684],[-77.737082,43.174537],[-77.736974,43.174515],[-77.736166,43.174406],[-77.73570100000001,43.174347],[-77.73462000000001,43.17449],[-77.73235,43.174781],[-77.732364,43.173682],[-77.73239599999999,43.171369],[-77.73239599999999,43.170361],[-77.732398,43.17023],[-77.732427,43.16723],[-77.73240300000001,43.164482],[-77.73240699999999,43.161291],[-77.732398,43.159753],[-77.732387,43.159361],[-77.732381,43.159071],[-77.732372,43.158804],[-77.732371,43.158776],[-77.73236799999999,43.158397],[-77.73236799999999,43.158369],[-77.732349,43.157843],[-77.732343,43.157437],[-77.73236799999999,43.154828],[-77.732376,43.152051],[-77.73237,43.147684],[-77.73237,43.147448],[-77.732359,43.146799],[-77.732308,43.14387],[-77.736031,43.143136],[-77.73941000000001,43.142388],[-77.740431,43.142163],[-77.74054099999999,43.142138],[-77.741541,43.141954],[-77.74426,43.141382],[-77.74478499999999,43.141261],[-77.746166,43.140947],[-77.747613,43.140544],[-77.74929400000001,43.140066],[-77.749375,43.140042],[-77.750158,43.139807],[-77.752685,43.139076],[-77.754092,43.13872],[-77.754158,43.138706],[-77.754217,43.138694],[-77.75426899999999,43.138905],[-77.754327,43.139342],[-77.754283,43.140866]]],"type":"Polygon"}
}