{
  "id": "360790108001",
  "type": "Feature",
  "properties": {
    "area_land":11326325,
    "area_water":78893,
    "geoid":"360790108001",
    "name":"Block Group 1",
    "state":"ny"
},
  "bbox": [
    -73.929024,
    41.331995,
    -73.889862,
    41.388342
],
  "geometry": {"coordinates":[[[-73.929024,41.345471],[-73.928853,41.34585],[-73.928749,41.346116],[-73.928563,41.346755],[-73.928427,41.34733],[-73.927975,41.348492],[-73.92780399999999,41.349019],[-73.92768,41.349325],[-73.92712299999999,41.350114],[-73.926599,41.350703],[-73.92635199999999,41.351001],[-73.92615499999999,41.351125],[-73.925961,41.351204],[-73.925933,41.351215],[-73.925569,41.351245],[-73.925438,41.351281],[-73.925284,41.351352],[-73.925271,41.351477],[-73.925162,41.351826],[-73.92498000000001,41.352045],[-73.92485600000001,41.352161],[-73.92470299999999,41.352241],[-73.923946,41.352503],[-73.923675,41.352568],[-73.92353199999999,41.352685],[-73.922916,41.353204],[-73.922878,41.35332],[-73.92285800000001,41.353379],[-73.92282899999999,41.353525],[-73.92277799999999,41.353663],[-73.92274500000001,41.35372],[-73.92270499999999,41.353786],[-73.922603,41.353881],[-73.922072,41.354274],[-73.921948,41.35439],[-73.921825,41.354535],[-73.921458,41.355166],[-73.921406,41.355259],[-73.921384,41.355388],[-73.92137700000001,41.355426],[-73.921406,41.35555],[-73.92150100000001,41.355637],[-73.921588,41.355666],[-73.921639,41.355703],[-73.921683,41.355754],[-73.92170400000001,41.355877],[-73.921655,41.356128],[-73.921621,41.356303],[-73.921606,41.356565],[-73.92163499999999,41.356695],[-73.92166400000001,41.356775],[-73.921672,41.356855],[-73.92163499999999,41.356965],[-73.92156300000001,41.357074],[-73.92122000000001,41.35743],[-73.921038,41.357641],[-73.920784,41.357866],[-73.92058,41.358005],[-73.920354,41.358128],[-73.92012099999999,41.35831],[-73.919918,41.358514],[-73.919262,41.35943],[-73.91897899999999,41.359735],[-73.918797,41.35983],[-73.918637,41.360111],[-73.91846099999999,41.360377],[-73.91827600000001,41.360624],[-73.917766,41.361277],[-73.91762,41.361539],[-73.91742000000001,41.361976],[-73.917267,41.36231],[-73.91703200000001,41.36271],[-73.91676699999999,41.363087],[-73.916443,41.363483],[-73.915828,41.364116],[-73.91544399999999,41.364445],[-73.915125,41.364717],[-73.91449900000001,41.365249],[-73.914187,41.365562],[-73.914024,41.365754],[-73.913904,41.365918],[-73.913889,41.365938],[-73.913737,41.366162],[-73.91305800000001,41.367178],[-73.912892,41.367462],[-73.912695,41.367894],[-73.912564,41.368258],[-73.912441,41.368731],[-73.912381,41.369147],[-73.91236600000001,41.369384],[-73.912361,41.371148],[-73.912375,41.371538],[-73.912385,41.371587],[-73.91244399999999,41.371877],[-73.91265199999999,41.372737],[-73.912677,41.372951],[-73.912665,41.373289],[-73.912575,41.37454],[-73.912566,41.374663],[-73.912564,41.374688],[-73.91257,41.374932],[-73.912611,41.375248],[-73.912766,41.376211],[-73.912784,41.376445],[-73.912786,41.376682],[-73.912728,41.37772],[-73.912701,41.3782],[-73.912683,41.378524],[-73.912651,41.37882],[-73.91251,41.379616],[-73.91250100000001,41.379686],[-73.912458,41.380036],[-73.912431,41.380505],[-73.912432,41.380604],[-73.912435,41.380856],[-73.91244,41.38137],[-73.91244399999999,41.381544],[-73.912156,41.381578],[-73.91176,41.381628],[-73.91079999999999,41.381666],[-73.90994000000001,41.381676],[-73.90985000000001,41.381686],[-73.90966400000001,41.381743],[-73.90937,41.381838],[-73.909272,41.381877],[-73.908835,41.382063],[-73.90843,41.382263],[-73.907601,41.382634],[-73.90694999999999,41.382927],[-73.906594,41.383127],[-73.906119,41.383474],[-73.905738,41.383691],[-73.90517199999999,41.383981],[-73.904956,41.384069],[-73.904751,41.384134],[-73.904583,41.384167],[-73.904116,41.384205],[-73.90395100000001,41.384235],[-73.903839,41.384281],[-73.90371,41.384349],[-73.90345600000001,41.384512],[-73.90325799999999,41.384626],[-73.903228,41.384639],[-73.902823,41.38482],[-73.90266099999999,41.384923],[-73.90252,41.385036],[-73.902362,41.385204],[-73.902196,41.385439],[-73.901826,41.38598],[-73.901723,41.386107],[-73.90158700000001,41.386227],[-73.901449,41.386304],[-73.90137799999999,41.386334],[-73.901239,41.386355],[-73.900885,41.386366],[-73.900507,41.3864],[-73.899822,41.38647],[-73.899638,41.386501],[-73.899128,41.386654],[-73.898448,41.386867],[-73.89827,41.386931],[-73.89821600000001,41.386984],[-73.898191,41.387034],[-73.897903,41.386908],[-73.89753,41.386763],[-73.89724200000001,41.386622],[-73.896619,41.386289],[-73.896198,41.386033],[-73.89559800000001,41.385647],[-73.895492,41.385606],[-73.895387,41.385595],[-73.895201,41.385613],[-73.895124,41.385603],[-73.89497900000001,41.38555],[-73.894893,41.385501],[-73.89473599999999,41.385561],[-73.89449,41.385705],[-73.89421299999999,41.385932],[-73.893883,41.386121],[-73.89384699999999,41.386164],[-73.893822,41.386268],[-73.89379599999999,41.386442],[-73.893739,41.386554],[-73.89364399999999,41.386686],[-73.893372,41.387018],[-73.893193,41.38726],[-73.89283500000001,41.387566],[-73.892703,41.38764],[-73.89253100000001,41.387709],[-73.89220299999999,41.387815],[-73.89212999999999,41.387856],[-73.892066,41.387922],[-73.89200599999999,41.38806],[-73.891926,41.388282],[-73.89188,41.388319],[-73.891813,41.388337],[-73.891739,41.388329],[-73.89169099999999,41.388313],[-73.891313,41.388066],[-73.89127499999999,41.388056],[-73.891211,41.388057],[-73.891043,41.388102],[-73.890463,41.388277],[-73.890315,41.388291],[-73.890049,41.388296],[-73.889956,41.388307],[-73.88986199999999,41.388342],[-73.89030099999999,41.381681],[-73.890317,41.381585],[-73.89042000000001,41.379992],[-73.89098799999999,41.371923],[-73.891092,41.370405],[-73.891113,41.369753],[-73.891127,41.369327],[-73.891165,41.368193],[-73.891351,41.364896],[-73.891724,41.354668],[-73.891817,41.354544],[-73.89210300000001,41.354135],[-73.892325,41.353786],[-73.892413,41.353572],[-73.89245,41.353405],[-73.892455,41.353251],[-73.892438,41.353101],[-73.89239000000001,41.352934],[-73.89232,41.352689],[-73.892284,41.352493],[-73.892291,41.352314],[-73.892369,41.351967],[-73.892466,41.351709],[-73.89261,41.351473],[-73.892768,41.351298],[-73.893063,41.351053],[-73.89437,41.350024],[-73.894651,41.349854],[-73.895285,41.349569],[-73.895658,41.349389],[-73.895866,41.349251],[-73.896237,41.348921],[-73.89637999999999,41.348771],[-73.896512,41.348598],[-73.896565,41.348495],[-73.896787,41.34787],[-73.896906,41.347666],[-73.89726400000001,41.347228],[-73.897559,41.346915],[-73.897831,41.346687],[-73.898944,41.345917],[-73.899278,41.345672],[-73.899428,41.345519],[-73.899734,41.345085],[-73.900007,41.344708],[-73.900571,41.344122],[-73.900801,41.343924],[-73.900983,41.343807],[-73.90147899999999,41.343558],[-73.901853,41.343358],[-73.902444,41.342964],[-73.90308400000001,41.342506],[-73.903291,41.342335],[-73.903504,41.342128],[-73.903733,41.341849],[-73.90382700000001,41.341706],[-73.90391700000001,41.341529],[-73.903997,41.341272],[-73.904017,41.341148],[-73.904005,41.340988],[-73.903941,41.34072],[-73.903616,41.339618],[-73.903565,41.339388],[-73.903558,41.339196],[-73.9036,41.338982],[-73.903694,41.3388],[-73.904325,41.337796],[-73.90437900000001,41.337661],[-73.904453,41.337652],[-73.904583,41.33762],[-73.904861,41.337484],[-73.905157,41.337353],[-73.90542499999999,41.337272],[-73.905835,41.337191],[-73.906098,41.337131],[-73.906301,41.337045],[-73.906845,41.336747],[-73.90703000000001,41.336619],[-73.907246,41.336436],[-73.908114,41.335597],[-73.90860600000001,41.335039],[-73.908755,41.334894],[-73.908952,41.334736],[-73.909389,41.334456],[-73.90962399999999,41.334319],[-73.909778,41.334257],[-73.90996800000001,41.334217],[-73.910248,41.33419],[-73.910492,41.334142],[-73.911338,41.334169],[-73.91174100000001,41.334175],[-73.91186,41.334163],[-73.91196100000001,41.334133],[-73.912234,41.334005],[-73.912493,41.333889],[-73.912631,41.333849],[-73.91294499999999,41.333802],[-73.913369,41.333705],[-73.91356399999999,41.333674],[-73.913781,41.333676],[-73.913928,41.333691],[-73.914299,41.333778],[-73.914638,41.333895],[-73.91477399999999,41.333919],[-73.914889,41.333915],[-73.91500499999999,41.333886],[-73.915114,41.333831],[-73.91559100000001,41.33339],[-73.9157,41.333258],[-73.915897,41.332888],[-73.91599600000001,41.332661],[-73.916014,41.332513],[-73.91592199999999,41.332174],[-73.915926,41.332124],[-73.915977,41.332064],[-73.91607999999999,41.332025],[-73.91626100000001,41.331995],[-73.916365,41.332],[-73.916449,41.332022],[-73.916552,41.332098],[-73.91676,41.33235],[-73.91711100000001,41.332667],[-73.917614,41.333269],[-73.917744,41.33338],[-73.918103,41.333588],[-73.918218,41.333685],[-73.918266,41.333759],[-73.91828,41.3339],[-73.918273,41.334123],[-73.91828,41.334365],[-73.918319,41.334483],[-73.91846200000001,41.334702],[-73.91838,41.334734],[-73.918221,41.334868],[-73.918094,41.335016],[-73.918071,41.335077],[-73.918076,41.33534],[-73.917986,41.335703],[-73.917997,41.336021],[-73.91804999999999,41.336337],[-73.918109,41.33652],[-73.918267,41.336729],[-73.918295,41.336824],[-73.918299,41.337339],[-73.918323,41.337512],[-73.91841100000001,41.337708],[-73.918418,41.337796],[-73.918386,41.338127],[-73.918263,41.338768],[-73.918267,41.338861],[-73.918558,41.339405],[-73.91869,41.339577],[-73.918747,41.339632],[-73.91883799999999,41.339687],[-73.918862,41.339701],[-73.91895599999999,41.339724],[-73.919039,41.339731],[-73.919099,41.339719],[-73.919149,41.339698],[-73.91922099999999,41.339652],[-73.91950300000001,41.339459],[-73.91970600000001,41.339274],[-73.919916,41.338961],[-73.92001,41.338863],[-73.92010999999999,41.338807],[-73.920558,41.338692],[-73.920587,41.338733],[-73.92068399999999,41.338832],[-73.920745,41.338849],[-73.920771,41.338852],[-73.921094,41.338832],[-73.921577,41.338815],[-73.922083,41.338799],[-73.922247,41.338779],[-73.922726,41.33867],[-73.92289,41.339047],[-73.92301999999999,41.339257],[-73.92323,41.339527],[-73.923395,41.339699],[-73.92355999999999,41.339843],[-73.923717,41.33997],[-73.92386399999999,41.340015],[-73.92393,41.340058],[-73.924026,41.340108],[-73.924335,41.340207],[-73.924578,41.340269],[-73.924633,41.340297],[-73.924779,41.340407],[-73.924876,41.340449],[-73.92500699999999,41.34048],[-73.92516000000001,41.340601],[-73.925499,41.340798],[-73.925523,41.340826],[-73.92554699999999,41.340963],[-73.92553700000001,41.341018],[-73.92543999999999,41.341312],[-73.92544700000001,41.34135],[-73.925527,41.341423],[-73.92577,41.341613],[-73.92610999999999,41.341854],[-73.926294,41.34198],[-73.92666199999999,41.342332],[-73.92692700000001,41.342684],[-73.927268,41.343025],[-73.927601,41.343386],[-73.927857,41.343618],[-73.928029,41.343799],[-73.928326,41.344201],[-73.92846400000001,41.344376],[-73.928521,41.34447],[-73.92882400000001,41.344962],[-73.92897600000001,41.345229],[-73.929024,41.345357],[-73.929024,41.345471]]],"type":"Polygon"}
}