{
  "id": "360550007002",
  "type": "Feature",
  "properties": {
    "area_land":225851,
    "area_water":0,
    "geoid":"360550007002",
    "name":"Block Group 2",
    "state":"ny"
},
  "bbox": [
    -77.613264,
    43.171046,
    -77.604442,
    43.175195
],
  "geometry": {"coordinates":[[[-77.613264,43.174924],[-77.61041899999999,43.175014],[-77.607606,43.175109],[-77.606525,43.175142],[-77.605879,43.175157],[-77.60520699999999,43.175176],[-77.604536,43.175195],[-77.604505,43.174501],[-77.60449,43.173856],[-77.604467,43.172729],[-77.60444200000001,43.171471],[-77.604709,43.17149],[-77.604917,43.171489],[-77.60517299999999,43.171478],[-77.605383,43.171457],[-77.605558,43.17143],[-77.607462,43.171046],[-77.607478,43.171707],[-77.60750899999999,43.17262],[-77.61252399999999,43.172452],[-77.61263099999999,43.172799],[-77.61272200000001,43.17312],[-77.612791,43.173341],[-77.61300900000001,43.174048],[-77.61315,43.174534],[-77.613264,43.174924]]],"type":"Polygon"}
}