{
  "id": "360610077003",
  "type": "Feature",
  "properties": {
    "area_land":57392,
    "area_water":0,
    "geoid":"360610077003",
    "name":"Block Group 3",
    "state":"ny"
},
  "bbox": [
    -74.005774,
    40.736877,
    -74.002523,
    40.740858
],
  "geometry": {"coordinates":[[[-74.005774,40.737169],[-74.00568699999999,40.737552],[-74.005591,40.738139],[-74.005495,40.738754],[-74.00539000000001,40.739412],[-74.005291,40.740024],[-74.00515799999999,40.740858],[-74.00506300000001,40.740818],[-74.00274400000001,40.739845],[-74.002523,40.739753],[-74.00278900000001,40.739396],[-74.003083,40.739077],[-74.003446,40.738756],[-74.003861,40.738395],[-74.004175,40.738134],[-74.00483,40.737548],[-74.005534,40.736877],[-74.00559,40.736917],[-74.00564,40.736961],[-74.005684,40.737009],[-74.00572099999999,40.73706],[-74.005751,40.737113],[-74.005774,40.737169]]],"type":"Polygon"}
}