{
  "id": "360811367004",
  "type": "Feature",
  "properties": {
    "area_land":245384,
    "area_water":0,
    "geoid":"360811367004",
    "name":"Block Group 4",
    "state":"ny"
},
  "bbox": [
    -73.767756,
    40.742437,
    -73.756698,
    40.749361
],
  "geometry": {"coordinates":[[[-73.76775600000001,40.74583],[-73.76732,40.74597],[-73.766842,40.746082],[-73.76638,40.746196],[-73.765912,40.746324],[-73.765034,40.746567],[-73.76329,40.747048],[-73.762422,40.747284],[-73.76153499999999,40.747533],[-73.76147,40.747549],[-73.760576,40.747856],[-73.75986,40.748181],[-73.759737,40.748249],[-73.758888,40.748623],[-73.75848000000001,40.748799],[-73.758213,40.748914],[-73.758072,40.748976],[-73.75791099999999,40.749042],[-73.757588,40.749155],[-73.75723000000001,40.749265],[-73.756866,40.749361],[-73.75681299999999,40.749272],[-73.756698,40.749076],[-73.757943,40.748673],[-73.758397,40.74852],[-73.758775,40.748322],[-73.75957,40.7479],[-73.76040500000001,40.747562],[-73.761335,40.747258],[-73.76073100000001,40.745981],[-73.759927,40.744288],[-73.759755,40.743914],[-73.760704,40.743653],[-73.76158700000001,40.743411],[-73.762469,40.74317],[-73.76335400000001,40.742928],[-73.764233,40.742687],[-73.765151,40.742437],[-73.765568,40.743258],[-73.766175,40.743567],[-73.766273,40.743616],[-73.766451,40.743721],[-73.76658500000001,40.743816],[-73.76668100000001,40.743894],[-73.76680899999999,40.744016],[-73.76697900000001,40.744223],[-73.76761500000001,40.745526],[-73.76770999999999,40.74573],[-73.76775600000001,40.74583]]],"type":"Polygon"}
}