{
  "id": "360610158014",
  "type": "Feature",
  "properties": {
    "area_land":25871,
    "area_water":0,
    "geoid":"360610158014",
    "name":"Block Group 4",
    "state":"ny"
},
  "bbox": [
    -73.953503,
    40.784565,
    -73.950927,
    40.786549
],
  "geometry": {"coordinates":[[[-73.953045,40.785874],[-73.952551,40.786549],[-73.95092699999999,40.785866],[-73.951426,40.785192],[-73.951883,40.784565],[-73.953503,40.785247],[-73.953045,40.785874]]],"type":"Polygon"}
}