{
  "id": "360130367002",
  "type": "Feature",
  "properties": {
    "area_land":114783686,
    "area_water":490109,
    "geoid":"360130367002",
    "name":"Block Group 2",
    "state":"ny"
},
  "bbox": [
    -79.64459,
    41.998353,
    -79.527301,
    42.118922
],
  "geometry": {"coordinates":[[[-79.64456,42.093071],[-79.644479,42.102232],[-79.64439400000001,42.103542],[-79.644474,42.103451],[-79.64444399999999,42.111501],[-79.64438699999999,42.118922],[-79.644267,42.118922],[-79.64392100000001,42.118918],[-79.641868,42.118894],[-79.636375,42.118887],[-79.634838,42.118868],[-79.62858300000001,42.118835],[-79.625635,42.118803],[-79.625128,42.118816],[-79.622518,42.118783],[-79.621013,42.118814],[-79.620665,42.118822],[-79.61854200000001,42.11881],[-79.617071,42.118802],[-79.615185,42.118808],[-79.611583,42.118796],[-79.609797,42.118774],[-79.60773500000001,42.118782],[-79.606115,42.118762],[-79.602313,42.118782],[-79.600413,42.118808],[-79.59875,42.118804],[-79.59864399999999,42.118803],[-79.598457,42.118802],[-79.596603,42.118796],[-79.594714,42.11875],[-79.592917,42.118734],[-79.58824300000001,42.118659],[-79.586456,42.118674],[-79.582341,42.118622],[-79.58085199999999,42.118619],[-79.580365,42.118612],[-79.578338,42.118582],[-79.573847,42.118515],[-79.57252200000001,42.118487],[-79.57136199999999,42.118482],[-79.56450700000001,42.118466],[-79.562504,42.118469],[-79.560315,42.118448],[-79.555927,42.118424],[-79.55485400000001,42.118409],[-79.55254600000001,42.118377],[-79.550932,42.118364],[-79.549483,42.118369],[-79.548421,42.118372],[-79.54466499999999,42.11835],[-79.543696,42.118351],[-79.543187,42.118352],[-79.542833,42.118353],[-79.54261,42.118353],[-79.540583,42.118333],[-79.53917199999999,42.118332],[-79.53585099999999,42.118299],[-79.533582,42.118293],[-79.53219900000001,42.11826],[-79.52730099999999,42.118188],[-79.527306,42.118098],[-79.527344,42.11712],[-79.52735199999999,42.115315],[-79.52738100000001,42.113284],[-79.527368,42.111891],[-79.52736,42.111269],[-79.527356,42.110965],[-79.52735800000001,42.109328],[-79.52737399999999,42.108478],[-79.52738100000001,42.107823],[-79.52743599999999,42.102823],[-79.527423,42.101091],[-79.52743,42.100163],[-79.52746999999999,42.098617],[-79.527562,42.095488],[-79.52762,42.092296],[-79.527632,42.091639],[-79.52763299999999,42.090083],[-79.52764500000001,42.085444],[-79.527402,42.08453],[-79.527641,42.083706],[-79.52762300000001,42.074819],[-79.52761,42.071718],[-79.527646,42.066375],[-79.52768500000001,42.063696],[-79.52766800000001,42.059078],[-79.52768,42.054974],[-79.52772,42.05107],[-79.52772,42.04968],[-79.527749,42.047033],[-79.527744,42.046139],[-79.52775699999999,42.042857],[-79.527799,42.040122],[-79.527811,42.034594],[-79.527793,42.032984],[-79.52783100000001,42.031254],[-79.527854,42.030239],[-79.52788200000001,42.027341],[-79.52787499999999,42.024253],[-79.527883,42.023265],[-79.527888,42.020683],[-79.52794900000001,42.01692],[-79.527945,42.014553],[-79.52794400000001,42.013459],[-79.52794400000001,42.012468],[-79.527962,42.009441],[-79.527952,42.008182],[-79.52795999999999,42.005269],[-79.527981,42.003106],[-79.527967,42.001169],[-79.527992,42.000101],[-79.527986,41.999092],[-79.52798799999999,41.99891],[-79.527993,41.998555],[-79.53162399999999,41.998488],[-79.53838500000001,41.998362],[-79.539278,41.998353],[-79.54178400000001,41.998365],[-79.551717,41.998414],[-79.55219700000001,41.998384],[-79.5528,41.998475],[-79.55312600000001,41.998555],[-79.558705,41.998554],[-79.558808,41.998554],[-79.56187300000001,41.998634],[-79.56451800000001,41.998674],[-79.569985,41.99877],[-79.57324300000001,41.998821],[-79.58104,41.998874],[-79.592415,41.998924],[-79.60997999999999,41.999002],[-79.610839,41.999006],[-79.621908,41.999054],[-79.624377,41.999064],[-79.62530099999999,41.999067],[-79.625468,41.999059],[-79.63041200000001,41.998786],[-79.631281,41.998761],[-79.630882,41.999066],[-79.630623,41.999306],[-79.630438,41.999471],[-79.630296,41.999631],[-79.63018599999999,41.99982],[-79.630133,41.999971],[-79.63005,42.000414],[-79.630011,42.000992],[-79.63001,42.001183],[-79.63000700000001,42.002822],[-79.629981,42.003763],[-79.62997300000001,42.005006],[-79.629948,42.007571],[-79.629957,42.009899],[-79.629964,42.013452],[-79.62996,42.014733],[-79.629949,42.018034],[-79.62996,42.019914],[-79.629959,42.020804],[-79.629938,42.023162],[-79.62989899999999,42.024884],[-79.629859,42.028678],[-79.629851,42.029087],[-79.629841,42.029542],[-79.629817,42.030742],[-79.62982,42.031729],[-79.629811,42.03427],[-79.62979900000001,42.034934],[-79.629811,42.035525],[-79.62976999999999,42.039528],[-79.629768,42.040979],[-79.629744,42.041305],[-79.62966400000001,42.041635],[-79.628843,42.044006],[-79.628182,42.045892],[-79.62786199999999,42.046833],[-79.62751299999999,42.047794],[-79.62719300000001,42.048748],[-79.626853,42.049701],[-79.626537,42.050654],[-79.62612300000001,42.051852],[-79.62587000000001,42.052662],[-79.62559400000001,42.053451],[-79.623954,42.058275],[-79.62361799999999,42.059214],[-79.62331500000001,42.06014],[-79.622983,42.061067],[-79.62287999999999,42.061388],[-79.6224,42.063249],[-79.62217699999999,42.064202],[-79.622163,42.06428],[-79.622096,42.064652],[-79.622096,42.06491],[-79.622153,42.065138],[-79.622254,42.065314],[-79.622407,42.065551],[-79.622803,42.066093],[-79.623136,42.066503],[-79.623215,42.066663],[-79.623288,42.066856],[-79.62334799999999,42.067104],[-79.62345500000001,42.06741],[-79.62374800000001,42.068021],[-79.624225,42.068866],[-79.62445200000001,42.069191],[-79.62508,42.069932],[-79.626458,42.071941],[-79.62670199999999,42.072352],[-79.6268,42.072539],[-79.626887,42.072778],[-79.62693,42.072956],[-79.626991,42.073415],[-79.62699499999999,42.073704],[-79.62697300000001,42.074328],[-79.62694399999999,42.074606],[-79.626831,42.075291],[-79.626717,42.075794],[-79.62617899999999,42.07773],[-79.626057,42.078363],[-79.62602200000001,42.07865],[-79.62602200000001,42.078928],[-79.62609999999999,42.079576],[-79.626187,42.080105],[-79.62630799999999,42.080722],[-79.62637599999999,42.081054],[-79.626429,42.08137],[-79.626439,42.081603],[-79.62630900000001,42.082457],[-79.62621799999999,42.082876],[-79.626172,42.083269],[-79.62618500000001,42.083656],[-79.626215,42.083879],[-79.62634199999999,42.084473],[-79.626386,42.084599],[-79.626566,42.084929],[-79.626904,42.085368],[-79.627396,42.085834],[-79.62764300000001,42.086078],[-79.627971,42.086063],[-79.629549,42.08607],[-79.631862,42.08607],[-79.635801,42.086095],[-79.638395,42.086132],[-79.642982,42.086144],[-79.64453899999999,42.086139],[-79.64458999999999,42.088323],[-79.64456,42.093071]]],"type":"Polygon"}
}