{
  "id": "360470594022",
  "type": "Feature",
  "properties": {
    "area_land":76076,
    "area_water":0,
    "geoid":"360470594022",
    "name":"Block Group 2",
    "state":"ny"
},
  "bbox": [
    -73.945374,
    40.59116,
    -73.941233,
    40.593691
],
  "geometry": {"coordinates":[[[-73.945374,40.59328],[-73.944408,40.593385],[-73.943484,40.593487],[-73.94255800000001,40.593588],[-73.941631,40.593691],[-73.941233,40.591572],[-73.942154,40.591469],[-73.943085,40.591368],[-73.944012,40.591265],[-73.94497200000001,40.59116],[-73.945374,40.59328]]],"type":"Polygon"}
}