{
  "id": "360594110001",
  "type": "Feature",
  "properties": {
    "area_land":891262,
    "area_water":25402,
    "geoid":"360594110001",
    "name":"Block Group 1",
    "state":"ny"
},
  "bbox": [
    -73.746845,
    40.620546,
    -73.73423,
    40.633052
],
  "geometry": {"coordinates":[[[-73.74684499999999,40.628982],[-73.74565200000001,40.628751],[-73.745593,40.629163],[-73.74562899999999,40.629217],[-73.746616,40.630695],[-73.74658700000001,40.631015],[-73.74618100000001,40.63126],[-73.745867,40.63145],[-73.745446,40.631405],[-73.744725,40.631154],[-73.74328300000001,40.630835],[-73.741799,40.630899],[-73.74168899999999,40.630904],[-73.74166200000001,40.630905],[-73.74137,40.631008],[-73.741272,40.631043],[-73.74001199999999,40.632097],[-73.739892,40.632303],[-73.739029,40.632554],[-73.738632,40.63267],[-73.737881,40.632717],[-73.737172,40.633052],[-73.736361,40.632362],[-73.736439,40.632306],[-73.73643800000001,40.631871],[-73.73566599999999,40.630161],[-73.735654,40.630133],[-73.735654,40.62995],[-73.735474,40.629813],[-73.735444,40.629584],[-73.73562699999999,40.629497],[-73.735525,40.629235],[-73.737345,40.628687],[-73.737233,40.628414],[-73.73715900000001,40.628214],[-73.736959,40.627713],[-73.736693,40.627055],[-73.736425,40.626392],[-73.736289,40.62604],[-73.73621799999999,40.625856],[-73.736036,40.625472],[-73.735917,40.625268],[-73.735635,40.624804],[-73.735371,40.624414],[-73.73523,40.624194],[-73.73497399999999,40.623792],[-73.73462600000001,40.623248],[-73.73451,40.623067],[-73.73423,40.622606],[-73.735373,40.622196],[-73.737381,40.621476],[-73.73752,40.621411],[-73.7375,40.621303],[-73.73746800000001,40.620752],[-73.739204,40.620546],[-73.73934300000001,40.621199],[-73.739378,40.621361],[-73.739401,40.621516],[-73.739476,40.621848],[-73.73961300000001,40.622452],[-73.739773,40.623183],[-73.74032099999999,40.623108],[-73.740787,40.623027],[-73.74092899999999,40.623026],[-73.740988,40.623018],[-73.741439,40.622955],[-73.74194900000001,40.622884],[-73.74237100000001,40.622826],[-73.74265,40.622785],[-73.743798,40.622616],[-73.743944,40.623179],[-73.744061,40.623717],[-73.74415,40.624072],[-73.745006,40.623815],[-73.745852,40.623559],[-73.74611899999999,40.62348],[-73.746191,40.623466],[-73.746709,40.623407],[-73.746706,40.623492],[-73.74673799999999,40.623948],[-73.74673900000001,40.624387],[-73.7467,40.625254],[-73.746646,40.62599],[-73.746621,40.626882],[-73.746618,40.627477],[-73.74684499999999,40.628982]]],"type":"Polygon"}
}