{
  "id": "360850170052",
  "type": "Feature",
  "properties": {
    "area_land":425378,
    "area_water":0,
    "geoid":"360850170052",
    "name":"Block Group 2",
    "state":"ny"
},
  "bbox": [
    -74.18083,
    40.535535,
    -74.1689,
    40.544487
],
  "geometry": {"coordinates":[[[-74.179919,40.536728],[-74.179654,40.536962],[-74.17911599999999,40.537493],[-74.178549,40.53811],[-74.17790599999999,40.538703],[-74.17780999999999,40.538779],[-74.177666,40.53891],[-74.177544,40.539046],[-74.17743900000001,40.539189],[-74.17734799999999,40.539346],[-74.177278,40.539507],[-74.17723100000001,40.539844],[-74.177223,40.540023],[-74.177235,40.540186],[-74.177262,40.540341],[-74.177308,40.5405],[-74.177331,40.540619],[-74.177374,40.540834],[-74.177368,40.54113],[-74.17734900000001,40.541274],[-74.17734799999999,40.541405],[-74.177364,40.541543],[-74.17739899999999,40.541686],[-74.17741700000001,40.541766],[-74.177442,40.541945],[-74.177448,40.542117],[-74.177435,40.542298],[-74.177403,40.542479],[-74.17734900000001,40.542664],[-74.17728099999999,40.542828],[-74.177194,40.542994],[-74.17690899999999,40.5437],[-74.176498,40.544487],[-74.175783,40.544083],[-74.175169,40.543775],[-74.17442800000001,40.543449],[-74.17377399999999,40.543153],[-74.17317799999999,40.542889],[-74.172451,40.542567],[-74.171751,40.542234],[-74.171261,40.542011],[-74.17101,40.541909],[-74.17059,40.54173],[-74.170385,40.541639],[-74.17020100000001,40.541559],[-74.169786,40.541378],[-74.16922099999999,40.54112],[-74.169149,40.541076],[-74.169088,40.54102],[-74.169043,40.540955],[-74.169016,40.540886],[-74.16901,40.540839],[-74.16889999999999,40.540193],[-74.16901300000001,40.540098],[-74.16922599999999,40.540093],[-74.16940700000001,40.540075],[-74.169586,40.540047],[-74.169793,40.539998],[-74.16995300000001,40.539949],[-74.17014500000001,40.539874],[-74.170271,40.539814],[-74.17092,40.539232],[-74.17159700000001,40.538648],[-74.17195599999999,40.53836],[-74.172292,40.538138],[-74.17321200000001,40.538003],[-74.17342600000001,40.537994],[-74.17366,40.537967],[-74.173889,40.537924],[-74.174132,40.537858],[-74.174898,40.537417],[-74.175715,40.536962],[-74.17605,40.536804],[-74.17639200000001,40.536621],[-74.176855,40.536376],[-74.17791,40.535815],[-74.178085,40.535741],[-74.178269,40.535675],[-74.178468,40.535617],[-74.17862,40.53558],[-74.178867,40.535535],[-74.17911100000001,40.535559],[-74.179363,40.535597],[-74.17961099999999,40.535647],[-74.179844,40.535707],[-74.18083,40.535925],[-74.179919,40.536728]]],"type":"Polygon"}
}