{
  "id": "361031906043",
  "type": "Feature",
  "properties": {
    "area_land":5138154,
    "area_water":21694297,
    "geoid":"361031906043",
    "name":"Block Group 3",
    "state":"ny"
},
  "bbox": [
    -72.576593,
    40.808195,
    -72.472892,
    40.884888
],
  "geometry": {"coordinates":[[[-72.574,40.827059],[-72.57019200000001,40.827875],[-72.56633600000001,40.828611],[-72.56488,40.829059],[-72.56328000000001,40.829587],[-72.560976,40.830531],[-72.55880000000001,40.831411],[-72.556752,40.832355],[-72.554271,40.833476],[-72.551919,40.83458],[-72.550031,40.835652],[-72.548207,40.836516],[-72.546975,40.837236],[-72.545215,40.838564],[-72.543567,40.83994],[-72.542495,40.840868],[-72.54212699999999,40.84138],[-72.541455,40.842756],[-72.541039,40.84378],[-72.540543,40.844788],[-72.540223,40.845796],[-72.539964,40.846854],[-72.53987100000001,40.847236],[-72.539599,40.848788],[-72.539247,40.850676],[-72.539103,40.851532],[-72.536789,40.851596],[-72.536691,40.851572],[-72.536592,40.851567],[-72.536395,40.851586],[-72.536147,40.851605],[-72.536058,40.851596],[-72.535861,40.851544],[-72.535608,40.851455],[-72.53542,40.85138],[-72.53527,40.851305],[-72.535111,40.851211],[-72.53498,40.851113],[-72.534891,40.851019],[-72.534862,40.850977],[-72.53484400000001,40.850921],[-72.53484400000001,40.850874],[-72.53487199999999,40.850836],[-72.534909,40.850836],[-72.534937,40.850846],[-72.53490499999999,40.850785],[-72.534806,40.850705],[-72.53467000000001,40.850616],[-72.534539,40.850546],[-72.534351,40.850471],[-72.534239,40.850405],[-72.53411699999999,40.850339],[-72.53402800000001,40.850297],[-72.533916,40.850217],[-72.533705,40.850128],[-72.53355500000001,40.850077],[-72.53335800000001,40.850011],[-72.533001,40.849875],[-72.53285099999999,40.849833],[-72.532701,40.849758],[-72.53248600000001,40.849669],[-72.531666,40.849392],[-72.531656,40.849444],[-72.53115,40.849299],[-72.53097200000001,40.849224],[-72.530873,40.849186],[-72.530767,40.849128],[-72.529757,40.848945],[-72.528188,40.848627],[-72.527644,40.848563],[-72.52746999999999,40.848535],[-72.52703,40.848455],[-72.52695,40.848436],[-72.526809,40.848408],[-72.526481,40.848319],[-72.526167,40.848296],[-72.52567000000001,40.848188],[-72.52486399999999,40.848014],[-72.524016,40.847747],[-72.523894,40.847696],[-72.52365500000001,40.847635],[-72.52342,40.847569],[-72.523144,40.847522],[-72.522586,40.84741],[-72.52227600000001,40.847321],[-72.521817,40.847185],[-72.521503,40.847063],[-72.520983,40.846838],[-72.52065,40.846702],[-72.52042,40.846585],[-72.52026600000001,40.846481],[-72.520186,40.846402],[-72.520144,40.84636],[-72.520064,40.846346],[-72.52004100000001,40.846374],[-72.520078,40.846421],[-72.520111,40.846449],[-72.52014800000001,40.846491],[-72.52018099999999,40.846561],[-72.52028,40.846678],[-72.520425,40.846833],[-72.520625,40.846982],[-72.519351,40.851844],[-72.519323,40.851989],[-72.51891999999999,40.852055],[-72.51855500000001,40.852149],[-72.518151,40.852247],[-72.518072,40.852266],[-72.518034,40.852285],[-72.518006,40.852299],[-72.517847,40.85236],[-72.517758,40.852411],[-72.517725,40.852435],[-72.517645,40.852477],[-72.517476,40.85251],[-72.517359,40.852533],[-72.517275,40.852547],[-72.51723699999999,40.852556],[-72.51714800000001,40.852585],[-72.51706900000001,40.852631],[-72.516291,40.852341],[-72.516291,40.852163],[-72.516244,40.852111],[-72.516113,40.851972],[-72.51594799999999,40.851867],[-72.515705,40.851755],[-72.51548,40.851638],[-72.515269,40.851567],[-72.51499699999999,40.85153],[-72.51479999999999,40.85153],[-72.51472,40.851516],[-72.51445099999999,40.851484],[-72.514433,40.851519],[-72.51417600000001,40.852213],[-72.51400099999999,40.852652],[-72.51373,40.85337],[-72.51359600000001,40.853723],[-72.513488,40.853999],[-72.513293,40.854508],[-72.513206,40.854721],[-72.513104,40.854972],[-72.513026,40.855169],[-72.51293,40.855412],[-72.512854,40.855616],[-72.512778,40.8558],[-72.51215500000001,40.857414],[-72.512489,40.857474],[-72.51289300000001,40.857539],[-72.513356,40.857621],[-72.513954,40.857719],[-72.51391599999999,40.859621],[-72.513903,40.860115],[-72.51389500000001,40.86043],[-72.513868,40.861287],[-72.51382700000001,40.862695],[-72.513694,40.862695],[-72.51213300000001,40.862576],[-72.510825,40.862473],[-72.50946500000001,40.862369],[-72.507349,40.862209],[-72.507097,40.862184],[-72.506083,40.86211],[-72.50481600000001,40.86202],[-72.50131399999999,40.861775],[-72.501355,40.861672],[-72.50158,40.861158],[-72.501862,40.860492],[-72.502242,40.859613],[-72.500263,40.859297],[-72.499914,40.858595],[-72.499487,40.859074],[-72.498892,40.85946],[-72.49754900000001,40.861479],[-72.497539,40.86149],[-72.495772,40.863558],[-72.494367,40.864534],[-72.49200999999999,40.867524],[-72.491705,40.868151],[-72.490988,40.87018],[-72.49069799999999,40.871477],[-72.490858,40.873876],[-72.491888,40.874502],[-72.492238,40.874341],[-72.49200999999999,40.873589],[-72.49204899999999,40.873415],[-72.491567,40.873125],[-72.491803,40.872838],[-72.492475,40.872628],[-72.495518,40.873635],[-72.497069,40.874287],[-72.498572,40.875172],[-72.49956400000001,40.875378],[-72.500598,40.87673],[-72.50082399999999,40.87717],[-72.50145500000001,40.878739],[-72.50214200000001,40.879908],[-72.50186600000001,40.882326],[-72.50171400000001,40.882559],[-72.501439,40.882933],[-72.501313,40.883078],[-72.501155,40.883281],[-72.501076,40.883474],[-72.501144,40.883678],[-72.501223,40.883893],[-72.50136999999999,40.883972],[-72.501721,40.883349],[-72.501993,40.883463],[-72.501982,40.883859],[-72.50148299999999,40.884425],[-72.50138099999999,40.884516],[-72.50144899999999,40.884561],[-72.50251400000001,40.884154],[-72.50265,40.884301],[-72.50149500000001,40.884641],[-72.501212,40.884629],[-72.501192,40.884874],[-72.501035,40.884888],[-72.50096000000001,40.882959],[-72.50087600000001,40.882052],[-72.50086,40.881428],[-72.500812,40.880724],[-72.499596,40.880244],[-72.49639500000001,40.878692],[-72.49012399999999,40.875652],[-72.489964,40.87514],[-72.47805,40.84546],[-72.47740899999999,40.843862],[-72.475436,40.838948],[-72.472892,40.833188],[-72.499469,40.825956],[-72.54076000000001,40.813709],[-72.54435100000001,40.812644],[-72.55923199999999,40.808195],[-72.566271,40.815316],[-72.567605,40.817054],[-72.57165000000001,40.821172],[-72.57347300000001,40.823161],[-72.576593,40.826563],[-72.574,40.827059]]],"type":"Polygon"}
}