{
  "id": "360594145012",
  "type": "Feature",
  "properties": {
    "area_land":441460,
    "area_water":23079,
    "geoid":"360594145012",
    "name":"Block Group 2",
    "state":"ny"
},
  "bbox": [
    -73.599262,
    40.637745,
    -73.589583,
    40.644973
],
  "geometry": {"coordinates":[[[-73.599175,40.642514],[-73.59878999999999,40.642674],[-73.598213,40.642887],[-73.597199,40.643227],[-73.59638699999999,40.6435],[-73.59505,40.643949],[-73.594981,40.643981],[-73.594891,40.644005],[-73.59412500000001,40.644267],[-73.592912,40.644663],[-73.59276800000001,40.644701],[-73.592606,40.644721],[-73.592454,40.644755],[-73.591745,40.64485],[-73.590867,40.644973],[-73.590683,40.643973],[-73.590249,40.641661],[-73.589961,40.640099],[-73.589583,40.638059],[-73.590464,40.637966],[-73.591342,40.637869],[-73.59249199999999,40.637745],[-73.592781,40.638303],[-73.592805,40.638386],[-73.592856,40.638449],[-73.592933,40.638597],[-73.59374200000001,40.638351],[-73.594545,40.638108],[-73.594598,40.638202],[-73.594854,40.638698],[-73.597425,40.638272],[-73.597544,40.638251],[-73.597767,40.638212],[-73.597903,40.63832],[-73.598001,40.63836],[-73.598083,40.638385],[-73.598189,40.638404],[-73.598264,40.638404],[-73.598339,40.638398],[-73.59841400000001,40.638391],[-73.598533,40.638385],[-73.598651,40.63841],[-73.598714,40.638441],[-73.59875099999999,40.638479],[-73.598764,40.638535],[-73.59875099999999,40.638616],[-73.598686,40.638758],[-73.598623,40.638879],[-73.598589,40.638919],[-73.59851999999999,40.638969],[-73.598389,40.639082],[-73.598095,40.639348],[-73.59806399999999,40.639401],[-73.598045,40.639438],[-73.598039,40.639473],[-73.598067,40.639519],[-73.598108,40.639557],[-73.598167,40.639591],[-73.59823900000001,40.63961],[-73.598326,40.639641],[-73.598467,40.639713],[-73.598748,40.639873],[-73.598855,40.639923],[-73.59899799999999,40.639994],[-73.599136,40.640076],[-73.599164,40.640132],[-73.599161,40.64016],[-73.599076,40.640232],[-73.59893,40.640335],[-73.598783,40.640463],[-73.598664,40.640779],[-73.598651,40.640897],[-73.59863900000001,40.641054],[-73.598658,40.641147],[-73.59868899999999,40.641304],[-73.59886400000001,40.641716],[-73.599262,40.642478],[-73.599175,40.642514]]],"type":"Polygon"}
}