{
  "id": "361031103002",
  "type": "Feature",
  "properties": {
    "area_land":890912,
    "area_water":0,
    "geoid":"361031103002",
    "name":"Block Group 2",
    "state":"ny"
},
  "bbox": [
    -73.414626,
    40.879847,
    -73.402685,
    40.896182
],
  "geometry": {"coordinates":[[[-73.414626,40.894534],[-73.412024,40.895476],[-73.41164999999999,40.895053],[-73.410985,40.895205],[-73.409949,40.895407],[-73.40956,40.895499],[-73.408827,40.895736],[-73.40849900000001,40.895823],[-73.40813300000001,40.895896],[-73.40675899999999,40.896155],[-73.4066,40.896182],[-73.4066,40.895728],[-73.406615,40.89532],[-73.406667,40.895026],[-73.40673700000001,40.894767],[-73.406859,40.894458],[-73.407163,40.893649],[-73.407247,40.893264],[-73.407248,40.893046],[-73.40714199999999,40.89281],[-73.407033,40.892611],[-73.406575,40.891852],[-73.40651699999999,40.891769],[-73.406424,40.891635],[-73.406227,40.891428],[-73.405883,40.891066],[-73.405615,40.890788],[-73.405249,40.890148],[-73.404982,40.88967],[-73.404777,40.889319],[-73.40438,40.888671],[-73.403997,40.888011],[-73.40386700000001,40.887709],[-73.40366299999999,40.887149],[-73.403426,40.886344],[-73.403334,40.885901],[-73.403319,40.885611],[-73.403319,40.885443],[-73.403295,40.884833],[-73.403288,40.884605],[-73.403243,40.884139],[-73.403144,40.883624],[-73.402852,40.882518],[-73.402739,40.882126],[-73.40268500000001,40.881903],[-73.402694,40.881744],[-73.40273000000001,40.881606],[-73.402868,40.881453],[-73.40319700000001,40.881125],[-73.403289,40.880988],[-73.40334900000001,40.880851],[-73.403373,40.880691],[-73.403289,40.879878],[-73.404669,40.879847],[-73.405586,40.879848],[-73.405715,40.879861],[-73.405939,40.879923],[-73.40644500000001,40.880169],[-73.406691,40.880211],[-73.407355,40.880152],[-73.40832399999999,40.880126],[-73.40837000000001,40.881163],[-73.4084,40.881793],[-73.408385,40.881904],[-73.40834700000001,40.881987],[-73.408278,40.882083],[-73.40817199999999,40.88214],[-73.40804900000001,40.882156],[-73.40807100000001,40.882449],[-73.40809299999999,40.882617],[-73.408072,40.882713],[-73.408027,40.882793],[-73.407973,40.882865],[-73.407889,40.882926],[-73.407798,40.882979],[-73.40769,40.883017],[-73.40757000000001,40.88304],[-73.406235,40.88309],[-73.40600499999999,40.883094],[-73.406143,40.883677],[-73.40628700000001,40.884059],[-73.406814,40.885283],[-73.406897,40.885405],[-73.40699600000001,40.885504],[-73.407155,40.885611],[-73.40762100000001,40.885989],[-73.407934,40.885768],[-73.40819500000001,40.885673],[-73.408637,40.885497],[-73.408858,40.88544],[-73.40907199999999,40.885436],[-73.409254,40.885471],[-73.409407,40.885546],[-73.409499,40.885649],[-73.40956,40.885757],[-73.409583,40.885913],[-73.40956,40.886108],[-73.40952299999999,40.886271],[-73.409521,40.886447],[-73.409583,40.886603],[-73.409706,40.886729],[-73.40988,40.886817],[-73.41008600000001,40.886855],[-73.41038399999999,40.886843],[-73.410796,40.886859],[-73.410965,40.886897],[-73.411095,40.886962],[-73.411216,40.887076],[-73.411315,40.887229],[-73.411316,40.887416],[-73.411231,40.887831],[-73.411216,40.887973],[-73.411216,40.888087],[-73.411269,40.888236],[-73.411368,40.888392],[-73.411834,40.888877],[-73.412055,40.888256],[-73.412307,40.888335],[-73.412902,40.888575],[-73.412924,40.889525],[-73.412947,40.88985],[-73.412955,40.889972],[-73.413009,40.890532],[-73.413053,40.891112],[-73.41309200000001,40.891444],[-73.413115,40.891636],[-73.41329899999999,40.892128],[-73.413421,40.892437],[-73.41356500000001,40.892665],[-73.413695,40.892833],[-73.413871,40.893085],[-73.4141,40.89337],[-73.414147,40.893437],[-73.414314,40.893672],[-73.41448099999999,40.894107],[-73.41452700000001,40.894252],[-73.41458,40.894374],[-73.414626,40.894534]]],"type":"Polygon"}
}