{
  "id": "361031591073",
  "type": "Feature",
  "properties": {
    "area_land":1350659,
    "area_water":0,
    "geoid":"361031591073",
    "name":"Block Group 3",
    "state":"ny"
},
  "bbox": [
    -73.012376,
    40.800953,
    -72.999887,
    40.817313
],
  "geometry": {"coordinates":[[[-73.012376,40.816238],[-73.010391,40.816416],[-73.01020200000001,40.816433],[-73.009424,40.8165],[-73.00852,40.816579],[-73.007982,40.816626],[-73.006815,40.81673],[-73.005807,40.816822],[-73.00496699999999,40.816893],[-73.004144,40.816966],[-73.00339700000001,40.817032],[-73.002747,40.817084],[-72.999887,40.817313],[-72.99990099999999,40.817047],[-72.99996400000001,40.816561],[-73.000169,40.815696],[-73.00048200000001,40.814734],[-73.00097,40.813309],[-73.001893,40.810492],[-73.002133,40.809778],[-73.00255799999999,40.808516],[-73.003344,40.805942],[-73.003393,40.805788],[-73.00483199999999,40.801327],[-73.00674600000001,40.801212],[-73.00873,40.801085],[-73.010706,40.800953],[-73.01074300000001,40.801284],[-73.010904,40.802653],[-73.011156,40.805117],[-73.01116399999999,40.805205],[-73.01130999999999,40.806287],[-73.011385,40.806843],[-73.011483,40.807948],[-73.011988,40.812598],[-73.01215500000001,40.81401],[-73.012255,40.814925],[-73.012322,40.815654],[-73.012376,40.816238]]],"type":"Polygon"}
}