{
  "id": "360430114001",
  "type": "Feature",
  "properties": {
    "area_land":60342522,
    "area_water":1095453,
    "geoid":"360430114001",
    "name":"Block Group 1",
    "state":"ny"
},
  "bbox": [
    -75.115866,
    43.114816,
    -74.968765,
    43.227333
],
  "geometry": {"coordinates":[[[-75.115577,43.170237],[-75.105678,43.182401],[-75.101378,43.187686],[-75.10033900000001,43.188962],[-75.100218,43.189111],[-75.083279,43.209909],[-75.079212,43.214972],[-75.07760399999999,43.216934],[-75.07757599999999,43.216986],[-75.069327,43.227133],[-75.069165,43.227333],[-75.068541,43.227174],[-75.068184,43.226824],[-75.067571,43.226227],[-75.067375,43.225239],[-75.06709600000001,43.22485],[-75.066311,43.224448],[-75.065084,43.224163],[-75.064065,43.223976],[-75.06361800000001,43.223747],[-75.063079,43.223561],[-75.06271,43.223379],[-75.06256500000001,43.223033],[-75.062566,43.222179],[-75.062783,43.220313],[-75.062583,43.219688],[-75.061708,43.219156],[-75.060518,43.218753],[-75.05920500000001,43.218652],[-75.05817500000001,43.218537],[-75.057261,43.218396],[-75.05680700000001,43.218256],[-75.056304,43.218016],[-75.055176,43.216987],[-75.05501700000001,43.217085],[-75.054986,43.217056],[-75.05464600000001,43.216776],[-75.054575,43.216701],[-75.05452,43.216625],[-75.054354,43.216391],[-75.05413299999999,43.216155],[-75.053574,43.215674],[-75.05317100000001,43.215302],[-75.052744,43.214971],[-75.05237,43.214768],[-75.05186399999999,43.214615],[-75.051227,43.214396],[-75.050461,43.214183],[-75.04941700000001,43.213829],[-75.04919599999999,43.213761],[-75.048872,43.213692],[-75.048399,43.213624],[-75.048057,43.213603],[-75.047804,43.21356],[-75.04757600000001,43.213471],[-75.04737299999999,43.213373],[-75.047248,43.213288],[-75.04702,43.213035],[-75.04700099999999,43.212981],[-75.046935,43.212697],[-75.04684899999999,43.212612],[-75.046628,43.212539],[-75.046336,43.212492],[-75.04628700000001,43.212471],[-75.046055,43.212322],[-75.04592,43.2122],[-75.045856,43.212122],[-75.045788,43.212008],[-75.045688,43.211809],[-75.045635,43.211617],[-75.045624,43.21148],[-75.04562799999999,43.211227],[-75.04566699999999,43.211138],[-75.045745,43.211035],[-75.04582000000001,43.210978],[-75.04589799999999,43.210942],[-75.046222,43.210832],[-75.04634,43.210754],[-75.046415,43.210729],[-75.046657,43.210688],[-75.047405,43.210688],[-75.04826300000001,43.210651],[-75.048666,43.210665],[-75.048872,43.210676],[-75.048976,43.210654],[-75.049122,43.210594],[-75.049289,43.21048],[-75.049346,43.210412],[-75.049471,43.210183],[-75.04951,43.210054],[-75.049528,43.209884],[-75.049528,43.209663],[-75.04950700000001,43.20961],[-75.04943900000001,43.209563],[-75.049357,43.209471],[-75.04919599999999,43.20922],[-75.04898300000001,43.208917],[-75.04891499999999,43.208779],[-75.048823,43.208469],[-75.048811,43.208442],[-75.048734,43.208264],[-75.04863,43.20814],[-75.048573,43.208093],[-75.048506,43.207976],[-75.048399,43.207848],[-75.04833499999999,43.207816],[-75.048278,43.207759],[-75.04810999999999,43.207522],[-75.048075,43.207473],[-75.047932,43.207221],[-75.047904,43.207129],[-75.047871,43.207076],[-75.047768,43.206987],[-75.04768300000001,43.20678],[-75.047434,43.206577],[-75.047391,43.206513],[-75.047213,43.206184],[-75.047173,43.206141],[-75.04707399999999,43.20607],[-75.04696,43.205946],[-75.046899,43.205818],[-75.046835,43.205721],[-75.046785,43.205686],[-75.046661,43.205622],[-75.04662500000001,43.205583],[-75.046522,43.205412],[-75.046454,43.20538],[-75.04639,43.205369],[-75.046269,43.205316],[-75.046155,43.205277],[-75.046066,43.205227],[-75.045992,43.205149],[-75.04568500000001,43.204848],[-75.045635,43.20478],[-75.04553199999999,43.204673],[-75.045435,43.204595],[-75.0453,43.204534],[-75.045129,43.204524],[-75.044944,43.204545],[-75.04474399999999,43.204542],[-75.04463,43.204511],[-75.044437,43.204475],[-75.044363,43.204461],[-75.044135,43.204476],[-75.043829,43.204476],[-75.043544,43.204401],[-75.04345499999999,43.204387],[-75.043334,43.204383],[-75.04322000000001,43.204415],[-75.04306,43.204433],[-75.04287100000001,43.204435],[-75.042615,43.204421],[-75.041984,43.204296],[-75.04176699999999,43.204239],[-75.041596,43.204171],[-75.041005,43.203977],[-75.04055200000001,43.203874],[-75.040154,43.20375],[-75.039466,43.203506],[-75.039074,43.203324],[-75.038743,43.203104],[-75.03732599999999,43.202326],[-75.036357,43.201826],[-75.036115,43.201666],[-75.035876,43.201468],[-75.035712,43.201333],[-75.03554800000001,43.201177],[-75.035399,43.200977],[-75.03527,43.200611],[-75.035231,43.200548],[-75.03505,43.20037],[-75.034786,43.200203],[-75.03461900000001,43.200029],[-75.034537,43.199972],[-75.034469,43.199901],[-75.033974,43.199461],[-75.033778,43.199322],[-75.033525,43.199087],[-75.033297,43.19892],[-75.033041,43.198753],[-75.032702,43.198473],[-75.03249599999999,43.198288],[-75.032321,43.198146],[-75.032129,43.198007],[-75.03188299999999,43.197808],[-75.03117399999999,43.197272],[-75.030715,43.197041],[-75.03061099999999,43.196999],[-75.030405,43.196916],[-75.030053,43.19684],[-75.02976099999999,43.196833],[-75.029169,43.196875],[-75.028949,43.196911],[-75.028617,43.196899],[-75.028026,43.196813],[-75.027777,43.196806],[-75.027456,43.196811],[-75.027385,43.196804],[-75.02734599999999,43.196776],[-75.027321,43.19674],[-75.027171,43.196406],[-75.02701500000001,43.196124],[-75.026804,43.195838],[-75.02674,43.195657],[-75.026701,43.195283],[-75.02669400000001,43.195076],[-75.026712,43.194801],[-75.02675499999999,43.194662],[-75.026904,43.194391],[-75.027047,43.194178],[-75.027253,43.193939],[-75.02736400000001,43.193795],[-75.027456,43.193585],[-75.027485,43.193404],[-75.02748099999999,43.193208],[-75.02741,43.193094],[-75.02723899999999,43.192939],[-75.027111,43.192889],[-75.027011,43.192864],[-75.026822,43.19285],[-75.026081,43.192864],[-75.02543,43.192866],[-75.024888,43.192777],[-75.02464999999999,43.192767],[-75.0245,43.192777],[-75.024343,43.192799],[-75.023916,43.192879],[-75.02359199999999,43.192879],[-75.02282200000001,43.192811],[-75.02252300000001,43.192745],[-75.022227,43.19261],[-75.02211200000001,43.192558],[-75.021822,43.192418],[-75.02159,43.192354],[-75.02129100000001,43.192235],[-75.020974,43.192092],[-75.020718,43.191953],[-75.020589,43.191857],[-75.0204,43.191601],[-75.02024,43.191377],[-75.02014800000001,43.191283],[-75.020084,43.191233],[-75.020045,43.191183],[-75.019977,43.191044],[-75.019959,43.190962],[-75.019941,43.190745],[-75.01999499999999,43.190331],[-75.02007,43.190021],[-75.020084,43.189829],[-75.020062,43.189537],[-75.02003000000001,43.189322],[-75.02002299999999,43.189115],[-75.01997,43.188862],[-75.019913,43.188777],[-75.01982700000001,43.188555],[-75.01978099999999,43.188466],[-75.019368,43.187946],[-75.019119,43.187676],[-75.018897,43.187502],[-75.01869000000001,43.187394],[-75.018344,43.187234],[-75.018201,43.187154],[-75.018096,43.187106],[-75.01803700000001,43.187114],[-75.018114,43.187256],[-75.018128,43.187318],[-75.01812099999999,43.18735],[-75.01809900000001,43.187369],[-75.01806999999999,43.187376],[-75.018034,43.187369],[-75.01795300000001,43.187332],[-75.01787,43.187307],[-75.017782,43.18731],[-75.01772699999999,43.187292],[-75.01773799999999,43.187223],[-75.017771,43.187205],[-75.017793,43.187175],[-75.01778899999999,43.187124],[-75.017768,43.187077],[-75.017662,43.186971],[-75.01687200000001,43.186487],[-75.016796,43.18633],[-75.01671899999999,43.186104],[-75.016705,43.185995],[-75.016637,43.185817],[-75.01651699999999,43.185605],[-75.016419,43.185321],[-75.016324,43.185202],[-75.01607,43.184957],[-75.015935,43.184866],[-75.01566200000001,43.184727],[-75.01542499999999,43.184622],[-75.01533000000001,43.184596],[-75.015022,43.184549],[-75.014957,43.184527],[-75.014895,43.184491],[-75.014774,43.184374],[-75.014381,43.184123],[-75.01424900000001,43.184002],[-75.014036,43.183773],[-75.01398500000001,43.183736],[-75.01379900000001,43.183649],[-75.013777,43.183616],[-75.013752,43.18346],[-75.01358,43.183237],[-75.01343799999999,43.183113],[-75.01266699999999,43.18264],[-75.012477,43.182505],[-75.012175,43.182261],[-75.011539,43.181806],[-75.011331,43.181682],[-75.011112,43.181511],[-75.01105699999999,43.181452],[-75.010948,43.181292],[-75.01082,43.181066],[-75.010583,43.1808],[-75.010403,43.180454],[-75.010363,43.180265],[-75.01035400000001,43.17974],[-75.010383,43.179423],[-75.010496,43.17915],[-75.010732,43.17866],[-75.01077100000001,43.17858],[-75.010824,43.178477],[-75.01084,43.178447],[-75.01091,43.178356],[-75.010988,43.178203],[-75.011039,43.17813],[-75.011112,43.177919],[-75.01117000000001,43.17762],[-75.01118099999999,43.177416],[-75.01110300000001,43.17715],[-75.01106299999999,43.176939],[-75.011,43.176859],[-75.010946,43.17679],[-75.010749,43.176615],[-75.010244,43.176284],[-75.010036,43.176134],[-75.009686,43.17597],[-75.00961,43.175923],[-75.00943599999999,43.175784],[-75.00937500000001,43.175671],[-75.00932,43.175537],[-75.009221,43.175358],[-75.00916700000001,43.175285],[-75.00905,43.175183],[-75.008926,43.175056],[-75.008875,43.174943],[-75.00885700000001,43.174855],[-75.008877,43.174604],[-75.008928,43.174418],[-75.009107,43.174043],[-75.009249,43.173843],[-75.009367,43.173719],[-75.009546,43.173555],[-75.009776,43.173278],[-75.009947,43.173129],[-75.010547,43.172812],[-75.01077600000001,43.172677],[-75.011134,43.172484],[-75.011403,43.172269],[-75.01149100000001,43.172214],[-75.011934,43.171996],[-75.012368,43.171766],[-75.01252100000001,43.171661],[-75.01259,43.171588],[-75.012663,43.171482],[-75.01282,43.171191],[-75.012851,43.171096],[-75.01288,43.170659],[-75.013006,43.170324],[-75.013017,43.170203],[-75.013013,43.170116],[-75.01298,43.169916],[-75.012947,43.169846],[-75.012885,43.169784],[-75.01265600000001,43.169599],[-75.012495,43.169489],[-75.012368,43.169453],[-75.012185,43.16946],[-75.012109,43.169493],[-75.011877,43.169559],[-75.011546,43.16969],[-75.011279,43.16981],[-75.011032,43.169879],[-75.010733,43.169941],[-75.010501,43.169977],[-75.010414,43.169981],[-75.01008899999999,43.16997],[-75.009637,43.169923],[-75.009429,43.169883],[-75.008815,43.169664],[-75.008501,43.169562],[-75.008304,43.169446],[-75.008246,43.169427],[-75.008191,43.169424],[-75.008151,43.169435],[-75.00805699999999,43.169482],[-75.00798399999999,43.1695],[-75.007823,43.169518],[-75.00765199999999,43.169493],[-75.007491,43.169482],[-75.007251,43.169427],[-75.006826,43.169285],[-75.006215,43.169118],[-75.00613199999999,43.169107],[-75.005731,43.16899],[-75.00557000000001,43.168917],[-75.005043,43.16852],[-75.00488300000001,43.168371],[-75.004105,43.167584],[-75.00404,43.167512],[-75.00435400000001,43.166673],[-75.004384,43.166586],[-75.00444400000001,43.165971],[-75.004662,43.165575],[-75.005304,43.164957],[-75.00538299999999,43.164823],[-75.005477,43.1648],[-75.005729,43.164793],[-75.005911,43.164767],[-75.00605,43.164709],[-75.006145,43.164647],[-75.00634700000001,43.164574],[-75.00642000000001,43.164534],[-75.006511,43.164461],[-75.006595,43.164378],[-75.006646,43.164303],[-75.006693,43.164232],[-75.006777,43.164141],[-75.006861,43.164075],[-75.006934,43.164035],[-75.00713500000001,43.163948],[-75.0077,43.163817],[-75.007864,43.163787],[-75.008194,43.163791],[-75.008442,43.163766],[-75.00877,43.163704],[-75.009034,43.16362],[-75.009136,43.163602],[-75.010051,43.163591],[-75.01024099999999,43.163569],[-75.011201,43.163423],[-75.01138,43.163409],[-75.011734,43.163317],[-75.012096,43.163164],[-75.01251600000001,43.162928],[-75.0128,43.16272],[-75.013086,43.162483],[-75.013334,43.162217],[-75.01338199999999,43.162184],[-75.013429,43.162123],[-75.013436,43.162057],[-75.013414,43.161929],[-75.01359100000001,43.161277],[-75.013599,43.161081],[-75.01356199999999,43.160869],[-75.013493,43.160713],[-75.01342699999999,43.160636],[-75.013221,43.160458],[-75.013105,43.160392],[-75.01272899999999,43.160243],[-75.012609,43.160214],[-75.012078,43.160155],[-75.01178299999999,43.160101],[-75.011477,43.160064],[-75.01129400000001,43.160031],[-75.010454,43.16001],[-75.010283,43.159988],[-75.009918,43.1599],[-75.00970700000001,43.159868],[-75.00926,43.15978],[-75.009045,43.159722],[-75.008673,43.159591],[-75.008261,43.1595],[-75.008104,43.159478],[-75.007785,43.159456],[-75.007588,43.159452],[-75.00659899999999,43.159328],[-75.006365,43.159281],[-75.00567599999999,43.159088],[-75.00533,43.158971],[-75.004741,43.158844],[-75.00400500000001,43.158654],[-75.003518,43.158589],[-75.003317,43.158552],[-75.003142,43.158541],[-75.002938,43.158516],[-75.002424,43.158352],[-75.00214699999999,43.15825],[-75.001682,43.157991],[-75.001288,43.157733],[-75.000754,43.157288],[-75.000576,43.157055],[-75.00036799999999,43.156869],[-75.000001,43.156471],[-74.99964199999999,43.156145],[-74.99919300000001,43.155853],[-74.998848,43.155667],[-74.998212,43.155401],[-74.99762699999999,43.155214],[-74.99749,43.155186],[-74.99726,43.155163],[-74.997074,43.155155],[-74.99689499999999,43.155159],[-74.996786,43.155183],[-74.996645,43.155245],[-74.99655199999999,43.155296],[-74.996349,43.155487],[-74.99594999999999,43.156001],[-74.995913,43.156103],[-74.99590600000001,43.156352],[-74.995921,43.156415],[-74.996261,43.156984],[-74.996754,43.157569],[-74.996813,43.157652],[-74.996866,43.157752],[-74.996909,43.157892],[-74.99697500000001,43.158379],[-74.99704300000001,43.159381],[-74.997051,43.159709],[-74.99704300000001,43.159881],[-74.997111,43.16022],[-74.99717800000001,43.160442],[-74.997297,43.160655],[-74.997407,43.160881],[-74.99744699999999,43.161067],[-74.997434,43.161273],[-74.997404,43.161366],[-74.997287,43.161537],[-74.997174,43.161663],[-74.996711,43.162009],[-74.996302,43.162278],[-74.995605,43.162645],[-74.995334,43.162809],[-74.995256,43.162836],[-74.995154,43.162851],[-74.994923,43.162847],[-74.99488700000001,43.162831],[-74.994844,43.162771],[-74.994784,43.162754],[-74.994714,43.162761],[-74.994596,43.162805],[-74.99446,43.162824],[-74.994315,43.162812],[-74.99413199999999,43.162812],[-74.99385700000001,43.162781],[-74.993689,43.162738],[-74.993365,43.16259],[-74.993228,43.162481],[-74.993092,43.162329],[-74.99301,43.16222],[-74.99294399999999,43.162087],[-74.99292,43.16199],[-74.99310199999999,43.161963],[-74.99321399999999,43.161746],[-74.992824,43.160431],[-74.991997,43.158687],[-74.991568,43.157977],[-74.98896000000001,43.156036],[-74.986497,43.154909],[-74.98335299999999,43.153925],[-74.982697,43.153419],[-74.98211999999999,43.152934],[-74.98165,43.151783],[-74.98063399999999,43.149554],[-74.97977400000001,43.147046],[-74.979544,43.146663],[-74.979506,43.146478],[-74.97913699999999,43.146207],[-74.97872700000001,43.145915],[-74.97821999999999,43.145584],[-74.977565,43.145165],[-74.977525,43.144629],[-74.97752800000001,43.144414],[-74.977734,43.143899],[-74.978318,43.143226],[-74.97848399999999,43.142489],[-74.978312,43.141917],[-74.977098,43.141344],[-74.974951,43.140642],[-74.974318,43.140447],[-74.973243,43.139789],[-74.97191100000001,43.139212],[-74.97175799999999,43.139252],[-74.971644,43.138988],[-74.971361,43.138906],[-74.970207,43.138209],[-74.969717,43.137891],[-74.968957,43.13739],[-74.968765,43.136924],[-74.968907,43.136238],[-74.96954100000001,43.135337],[-74.970602,43.134627],[-74.97147699999999,43.133772],[-74.971873,43.133419],[-74.972122,43.13289],[-74.972628,43.130904],[-74.972695,43.130459],[-74.97275500000001,43.130061],[-74.97278300000001,43.129878],[-74.972962,43.128434],[-74.972784,43.127302],[-74.97289499999999,43.125971],[-74.973388,43.12537],[-74.97433700000001,43.125069],[-74.97453,43.124907],[-74.975561,43.124831],[-74.97749899999999,43.124984],[-74.97832,43.124784],[-74.97905,43.122963],[-74.980473,43.120935],[-74.980656,43.119991],[-74.98008299999999,43.118736],[-74.979161,43.115935],[-74.978911,43.114816],[-74.979167,43.114923],[-74.982455,43.116374],[-74.983639,43.11684],[-74.989473,43.119451],[-74.999861,43.123999],[-74.99986,43.123967],[-75.00258100000001,43.125177],[-75.014674,43.130564],[-75.016858,43.131537],[-75.027974,43.13649],[-75.02931,43.136962],[-75.02951,43.137045],[-75.042046,43.141177],[-75.05307000000001,43.144943],[-75.055386,43.145739],[-75.05672300000001,43.146198],[-75.066963,43.14959],[-75.072762,43.151548],[-75.07678199999999,43.153243],[-75.07970400000001,43.154508],[-75.08541700000001,43.157026],[-75.089456,43.158679],[-75.09085,43.159219],[-75.092409,43.159701],[-75.093999,43.160383],[-75.109471,43.167099],[-75.115866,43.169881],[-75.115577,43.170237]]],"type":"Polygon"}
}