{
  "id": "360810556001",
  "type": "Feature",
  "properties": {
    "area_land":150465,
    "area_water":0,
    "geoid":"360810556001",
    "name":"Block Group 1",
    "state":"ny"
},
  "bbox": [
    -73.748917,
    40.723639,
    -73.742225,
    40.728586
],
  "geometry": {"coordinates":[[[-73.748187,40.726214],[-73.74751000000001,40.72671],[-73.746804,40.727223],[-73.74604600000001,40.727688],[-73.745317,40.728138],[-73.74458799999999,40.728586],[-73.742225,40.726366],[-73.742958,40.725919],[-73.743685,40.725469],[-73.74444699999999,40.725009],[-73.74520099999999,40.724539],[-73.745932,40.724087],[-73.746662,40.723639],[-73.74891700000001,40.725764],[-73.748187,40.726214]]],"type":"Polygon"}
}