{
  "id": "360290129014",
  "type": "Feature",
  "properties": {
    "area_land":1345993,
    "area_water":0,
    "geoid":"360290129014",
    "name":"Block Group 4",
    "state":"ny"
},
  "bbox": [
    -78.823916,
    42.770801,
    -78.815496,
    42.789973
],
  "geometry": {"coordinates":[[[-78.823916,42.771905],[-78.823864,42.774862],[-78.823852,42.775051],[-78.82384,42.776353],[-78.823857,42.777013],[-78.82385499999999,42.77739],[-78.82384500000001,42.777913],[-78.82382800000001,42.7788],[-78.823819,42.779307],[-78.823813,42.780103],[-78.823801,42.780922],[-78.82380000000001,42.781317],[-78.823803,42.781658],[-78.82380499999999,42.781877],[-78.823797,42.782464],[-78.82381599999999,42.783818],[-78.82381599999999,42.784554],[-78.82381700000001,42.785618],[-78.823821,42.786359],[-78.82382800000001,42.788193],[-78.823851,42.789218],[-78.823852,42.789263],[-78.822962,42.789258],[-78.822948,42.789595],[-78.822948,42.789973],[-78.822715,42.789969],[-78.82158200000001,42.789947],[-78.821054,42.789937],[-78.82011300000001,42.789497],[-78.81948800000001,42.789587],[-78.818237,42.789825],[-78.81659500000001,42.789838],[-78.816092,42.789842],[-78.816024,42.788889],[-78.815962,42.788192],[-78.81576200000001,42.78563],[-78.815567,42.783219],[-78.81550300000001,42.782317],[-78.815496,42.781174],[-78.815505,42.779936],[-78.815566,42.778743],[-78.815681,42.776779],[-78.815788,42.775754],[-78.81584599999999,42.775238],[-78.815934,42.774318],[-78.816221,42.772682],[-78.816576,42.770877],[-78.816603,42.770801],[-78.81714599999999,42.770883],[-78.819687,42.771265],[-78.82045599999999,42.771377],[-78.821865,42.771592],[-78.823865,42.771897],[-78.823916,42.771905]]],"type":"Polygon"}
}