{
  "id": "360499502002",
  "type": "Feature",
  "properties": {
    "area_land":253242983,
    "area_water":8931923,
    "geoid":"360499502002",
    "name":"Block Group 2",
    "state":"ny"
},
  "bbox": [
    -75.545886,
    43.980162,
    -75.313972,
    44.217655
],
  "geometry": {"coordinates":[[[-75.541962,44.10759],[-75.540192,44.109668],[-75.534256,44.116645],[-75.53382000000001,44.117157],[-75.533725,44.117269],[-75.533512,44.117506],[-75.526769,44.125064],[-75.512703,44.141342],[-75.505021,44.150232],[-75.499647,44.15645],[-75.499133,44.157067],[-75.498071,44.158385],[-75.493782,44.163481],[-75.485111,44.173359],[-75.479843,44.179372],[-75.471433,44.188976],[-75.470899,44.189585],[-75.467674,44.193268],[-75.467381,44.193594],[-75.465965,44.195223],[-75.46029799999999,44.201724],[-75.45438,44.208502],[-75.453373,44.209585],[-75.452442,44.210661],[-75.45197,44.211207],[-75.451437,44.211823],[-75.449658,44.213887],[-75.44725800000001,44.216657],[-75.44723999999999,44.216678],[-75.447164,44.216767],[-75.446969,44.216934],[-75.446791,44.217086],[-75.44661000000001,44.21724],[-75.446488,44.217344],[-75.446124,44.217655],[-75.44604,44.217621],[-75.430436,44.210836],[-75.41391900000001,44.203654],[-75.41333400000001,44.203399],[-75.398849,44.197064],[-75.388516,44.192532],[-75.387998,44.192305],[-75.384007,44.190555],[-75.381885,44.189625],[-75.37464799999999,44.186452],[-75.366399,44.182673],[-75.365853,44.182423],[-75.363184,44.181224],[-75.360801,44.180155],[-75.360771,44.180141],[-75.357124,44.178494],[-75.352757,44.176521],[-75.349863,44.175214],[-75.333172,44.167668],[-75.333122,44.167645],[-75.332313,44.167256],[-75.329723,44.165993],[-75.32820100000001,44.165251],[-75.32252,44.162482],[-75.319687,44.161101],[-75.31594,44.159275],[-75.31611599999999,44.15886],[-75.316344,44.158337],[-75.316609,44.157666],[-75.316695,44.157364],[-75.316771,44.156922],[-75.31676899999999,44.156527],[-75.31674700000001,44.156378],[-75.316666,44.156021],[-75.316536,44.155668],[-75.31639,44.155394],[-75.31567200000001,44.154151],[-75.31547399999999,44.153821],[-75.31493500000001,44.152921],[-75.31486099999999,44.152783],[-75.314812,44.152692],[-75.31464699999999,44.152348],[-75.314547,44.152034],[-75.314525,44.151917],[-75.314521,44.151504],[-75.31427499999999,44.151327],[-75.314156,44.151189],[-75.314098,44.15111],[-75.31403400000001,44.150991],[-75.313982,44.150815],[-75.31397200000001,44.150704],[-75.313982,44.15057],[-75.31403,44.150363],[-75.314063,44.150278],[-75.314093,44.150232],[-75.3142,44.150068],[-75.31442800000001,44.149773],[-75.314583,44.1496],[-75.314967,44.149175],[-75.315686,44.148418],[-75.316346,44.148753],[-75.316491,44.148847],[-75.31659000000001,44.148923],[-75.316661,44.149004],[-75.31681,44.149308],[-75.317379,44.149163],[-75.317706,44.149088],[-75.318083,44.149006],[-75.31815,44.148991],[-75.31905399999999,44.14879],[-75.320083,44.148493],[-75.320674,44.1483],[-75.32178,44.147983],[-75.322384,44.147807],[-75.323172,44.147585],[-75.324229,44.147318],[-75.324347,44.14729],[-75.324607,44.147229],[-75.32539300000001,44.147057],[-75.326553,44.146775],[-75.326863,44.1467],[-75.32766100000001,44.146486],[-75.328159,44.14637],[-75.328508,44.146309],[-75.328991,44.146238],[-75.330501,44.146088],[-75.33130300000001,44.146009],[-75.331767,44.145945],[-75.33247799999999,44.145798],[-75.33317599999999,44.145604],[-75.33376,44.145397],[-75.334076,44.145267],[-75.334727,44.144984],[-75.335677,44.144589],[-75.33665999999999,44.144169],[-75.33712800000001,44.143976],[-75.33761,44.143762],[-75.338059,44.14358],[-75.33848999999999,44.14339],[-75.339968,44.142768],[-75.340661,44.142476],[-75.34215,44.141805],[-75.343802,44.14102],[-75.344088,44.140884],[-75.344877,44.140509],[-75.345271,44.140302],[-75.345714,44.140051],[-75.346272,44.139676],[-75.34662,44.139411],[-75.346783,44.13928],[-75.346884,44.139196],[-75.347306,44.138801],[-75.34760199999999,44.138475],[-75.34769300000001,44.138374],[-75.347762,44.138298],[-75.348046,44.137922],[-75.34828400000001,44.137596],[-75.34851,44.137265],[-75.349418,44.135934],[-75.349903,44.135252],[-75.350252,44.134844],[-75.35057399999999,44.134545],[-75.350837,44.134341],[-75.35162800000001,44.133694],[-75.35201499999999,44.13336],[-75.352135,44.133239],[-75.352389,44.132947],[-75.35256800000001,44.132694],[-75.3528,44.132283],[-75.353616,44.13058],[-75.35389600000001,44.13006],[-75.354349,44.129368],[-75.35464399999999,44.128979],[-75.35512300000001,44.128403],[-75.355486,44.128025],[-75.35575,44.127766],[-75.356089,44.127464],[-75.35689000000001,44.126811],[-75.357572,44.126341],[-75.359106,44.125399],[-75.360253,44.124709],[-75.362038,44.123608],[-75.36227,44.123446],[-75.362697,44.123125],[-75.363259,44.12264],[-75.36389699999999,44.122075],[-75.36431399999999,44.121766],[-75.364698,44.121545],[-75.364942,44.121421],[-75.36520899999999,44.12131],[-75.365341,44.121252],[-75.36595,44.121056],[-75.36624,44.120996],[-75.36687499999999,44.120902],[-75.367357,44.120863],[-75.367221,44.120362],[-75.36709399999999,44.120075],[-75.366871,44.119623],[-75.366634,44.1191],[-75.36632299999999,44.1185],[-75.36616600000001,44.118263],[-75.365937,44.11798],[-75.365768,44.117807],[-75.365548,44.117616],[-75.36533300000001,44.117446],[-75.365071,44.117269],[-75.364707,44.117057],[-75.36439900000001,44.116916],[-75.36319399999999,44.116419],[-75.362621,44.116125],[-75.36215799999999,44.115814],[-75.361914,44.115623],[-75.361705,44.115429],[-75.361493,44.115196],[-75.36123000000001,44.114815],[-75.361102,44.114589],[-75.36084700000001,44.11399],[-75.360702,44.113537],[-75.360618,44.113131],[-75.360587,44.112845],[-75.360579,44.112355],[-75.36066700000001,44.110462],[-75.360688,44.110243],[-75.360724,44.11002],[-75.360772,44.109786],[-75.36092499999999,44.109309],[-75.361017,44.109083],[-75.361705,44.10756],[-75.362054,44.1068],[-75.36216,44.106513],[-75.362319,44.105998],[-75.36246800000001,44.105319],[-75.362498,44.105055],[-75.362532,44.104761],[-75.362543,44.104688],[-75.362617,44.104192],[-75.36272,44.103418],[-75.362836,44.102654],[-75.36293000000001,44.102266],[-75.363034,44.101877],[-75.36312700000001,44.101602],[-75.363406,44.100862],[-75.363541,44.100478],[-75.36370700000001,44.10005],[-75.36377,44.099859],[-75.364082,44.099037],[-75.364329,44.09836],[-75.36566500000001,44.094767],[-75.365756,44.09452],[-75.365838,44.094301],[-75.366148,44.093467],[-75.36622699999999,44.093219],[-75.366293,44.092893],[-75.36630700000001,44.092439],[-75.366288,44.092258],[-75.366238,44.091937],[-75.365583,44.08992],[-75.365272,44.088931],[-75.36515799999999,44.088613],[-75.365084,44.088361],[-75.364603,44.086893],[-75.364514,44.086553],[-75.364481,44.086349],[-75.36446100000001,44.085981],[-75.36447200000001,44.085762],[-75.364518,44.085491],[-75.364628,44.08513],[-75.364746,44.08486],[-75.36493900000001,44.084536],[-75.36549100000001,44.083741],[-75.36637500000001,44.082508],[-75.366795,44.081871],[-75.366938,44.081571],[-75.367052,44.081258],[-75.367081,44.081134],[-75.367115,44.080879],[-75.36713,44.080519],[-75.36709500000001,44.080148],[-75.367025,44.079838],[-75.366921,44.079586],[-75.36675,44.079223],[-75.36656600000001,44.078937],[-75.366376,44.078638],[-75.365672,44.077491],[-75.365601,44.077376],[-75.365505,44.077187],[-75.36543399999999,44.077017],[-75.36525399999999,44.076499],[-75.365179,44.076127],[-75.36511900000001,44.075579],[-75.36507,44.075244],[-75.364879,44.073514],[-75.364835,44.07319],[-75.364794,44.072881],[-75.364722,44.072572],[-75.364622,44.072293],[-75.364475,44.071971],[-75.364245,44.071622],[-75.364104,44.071448],[-75.363895,44.071217],[-75.36309799999999,44.070419],[-75.362578,44.069886],[-75.362416,44.069692],[-75.36219199999999,44.069389],[-75.36201199999999,44.069058],[-75.361794,44.068539],[-75.361587,44.067916],[-75.36130900000001,44.067091],[-75.361288,44.067041],[-75.361222,44.06688],[-75.361142,44.06671],[-75.36092499999999,44.066303],[-75.36068299999999,44.065952],[-75.36045300000001,44.065664],[-75.36017200000001,44.06535],[-75.359301,44.064376],[-75.3588,44.063805],[-75.358684,44.063653],[-75.358425,44.063222],[-75.358323,44.062957],[-75.35814000000001,44.062351],[-75.358074,44.062024],[-75.358053,44.061599],[-75.35807200000001,44.061318],[-75.358107,44.061061],[-75.358158,44.060887],[-75.358232,44.060651],[-75.358367,44.060359],[-75.3587,44.059819],[-75.359116,44.059141],[-75.359216,44.058922],[-75.359314,44.058666],[-75.359426,44.05832],[-75.35948500000001,44.057934],[-75.359489,44.057738],[-75.359449,44.057013],[-75.359358,44.056053],[-75.35929299999999,44.055722],[-75.35925,44.055572],[-75.359064,44.055113],[-75.35883699999999,44.054713],[-75.358193,44.053859],[-75.35686699999999,44.052115],[-75.356742,44.051916],[-75.356567,44.051611],[-75.356438,44.05134],[-75.356386,44.051203],[-75.35632,44.051029],[-75.356298,44.050961],[-75.356261,44.050847],[-75.35611299999999,44.050182],[-75.35551599999999,44.047222],[-75.35539300000001,44.046611],[-75.3553,44.046065],[-75.355295,44.045967],[-75.355287,44.045655],[-75.35531,44.045424],[-75.35534199999999,44.045241],[-75.355391,44.045013],[-75.35548900000001,44.044734],[-75.355659,44.044411],[-75.355791,44.044216],[-75.356138,44.043751],[-75.35635000000001,44.043486],[-75.35662499999999,44.043103],[-75.35666399999999,44.043042],[-75.357113,44.04271],[-75.357359,44.042284],[-75.35723900000001,44.041948],[-75.357062,44.041541],[-75.35699099999999,44.039901],[-75.35698499999999,44.039759],[-75.35697500000001,44.039049],[-75.356987,44.038864],[-75.357052,44.038384],[-75.35712700000001,44.038089],[-75.35735200000001,44.037508],[-75.357859,44.036197],[-75.35798,44.035824],[-75.358074,44.035539],[-75.358204,44.03507],[-75.358355,44.034469],[-75.35839799999999,44.034297],[-75.358515,44.033958],[-75.35873100000001,44.033345],[-75.358869,44.033003],[-75.359116,44.032491],[-75.359171,44.032348],[-75.35925,44.032119],[-75.359301,44.031957],[-75.359341,44.031759],[-75.359368,44.031409],[-75.359358,44.031122],[-75.359281,44.030726],[-75.35918700000001,44.030428],[-75.35839799999999,44.028539],[-75.358379,44.028471],[-75.358294,44.028155],[-75.358251,44.027859],[-75.358244,44.02757],[-75.35826900000001,44.027157],[-75.35844,44.026074],[-75.358484,44.025641],[-75.358492,44.025234],[-75.358465,44.024957],[-75.358051,44.022739],[-75.35772799999999,44.021087],[-75.35756600000001,44.020297],[-75.35754300000001,44.020105],[-75.35753,44.019691],[-75.357568,44.019253],[-75.357662,44.018736],[-75.358047,44.016638],[-75.35832499999999,44.01507],[-75.358594,44.013718],[-75.35873599999999,44.013155],[-75.359488,44.010836],[-75.359832,44.009788],[-75.359984,44.009236],[-75.360015,44.008978],[-75.360018,44.008724],[-75.360007,44.008486],[-75.359897,44.007891],[-75.359588,44.006704],[-75.358974,44.004326],[-75.35873599999999,44.003309],[-75.358647,44.002515],[-75.358571,44.00162],[-75.358555,44.001262],[-75.358587,44.00077],[-75.358762,43.999469],[-75.358904,43.998571],[-75.35902400000001,43.997595],[-75.359055,43.997109],[-75.359055,43.995209],[-75.359081,43.994779],[-75.359105,43.994572],[-75.359162,43.994274],[-75.35923,43.99405],[-75.359421,43.993532],[-75.35944600000001,43.993475],[-75.360124,43.991943],[-75.360353,43.991473],[-75.361194,43.98993],[-75.36139300000001,43.989567],[-75.36167399999999,43.989088],[-75.361932,43.988605],[-75.36273,43.987169],[-75.36324999999999,43.986196],[-75.36369500000001,43.985234],[-75.363895,43.984748],[-75.36433599999999,43.983795],[-75.36480400000001,43.982723],[-75.364864,43.982783],[-75.364923,43.98282],[-75.365084,43.982839],[-75.36557500000001,43.982813],[-75.36588,43.982792],[-75.36760200000001,43.982615],[-75.36935699999999,43.982477],[-75.370058,43.982438],[-75.372742,43.982227],[-75.37340500000001,43.982168],[-75.37428199999999,43.982123],[-75.374424,43.982116],[-75.374568,43.982123],[-75.37480600000001,43.982161],[-75.37499699999999,43.982206],[-75.376093,43.982637],[-75.377319,43.983086],[-75.37837399999999,43.983442],[-75.37918000000001,43.983766],[-75.380044,43.984082],[-75.380785,43.984394],[-75.38160999999999,43.984691],[-75.383163,43.985202],[-75.383554,43.985344],[-75.384131,43.985553],[-75.38468399999999,43.985766],[-75.38489199999999,43.985883],[-75.38514499999999,43.985987],[-75.385301,43.986077],[-75.38589899999999,43.986616],[-75.38597900000001,43.986672],[-75.38636200000001,43.986949],[-75.386458,43.98703],[-75.387075,43.987762],[-75.387224,43.987886],[-75.38746399999999,43.988044],[-75.387586,43.988096],[-75.387692,43.988126],[-75.387804,43.988146],[-75.387912,43.988149],[-75.388064,43.988136],[-75.389139,43.987937],[-75.389915,43.987824],[-75.390513,43.987648],[-75.39057699999999,43.987629],[-75.391251,43.987486],[-75.391465,43.987426],[-75.39174300000001,43.987308],[-75.391824,43.987256],[-75.39263099999999,43.986639],[-75.39365100000001,43.985795],[-75.393788,43.98567],[-75.393995,43.98543],[-75.394138,43.98528],[-75.394223,43.985205],[-75.39440500000001,43.985086],[-75.394554,43.985021],[-75.39473599999999,43.984969],[-75.395263,43.984831],[-75.395562,43.984792],[-75.395948,43.984818],[-75.396092,43.984813],[-75.396252,43.984787],[-75.39644,43.984722],[-75.396631,43.98463],[-75.396835,43.984485],[-75.396998,43.984355],[-75.397121,43.984225],[-75.39726400000001,43.984024],[-75.397479,43.983686],[-75.397597,43.983563],[-75.397682,43.983525],[-75.397801,43.983507],[-75.397942,43.983504],[-75.39811,43.983525],[-75.398577,43.983623],[-75.39924000000001,43.98384],[-75.39955999999999,43.983927],[-75.39966099999999,43.983932],[-75.39974100000001,43.983925],[-75.399889,43.983878],[-75.400156,43.983767],[-75.40024200000001,43.983744],[-75.400318,43.983735],[-75.400474,43.983735],[-75.400598,43.983748],[-75.400851,43.983818],[-75.40103999999999,43.983902],[-75.40130600000001,43.98398],[-75.401618,43.984025],[-75.401878,43.984045],[-75.402125,43.984045],[-75.40226800000001,43.98403],[-75.403308,43.983852],[-75.403749,43.98375],[-75.4041,43.983646],[-75.40434500000001,43.983589],[-75.40461999999999,43.983542],[-75.405123,43.983473],[-75.405429,43.983414],[-75.406203,43.983209],[-75.406914,43.98304],[-75.408061,43.982817],[-75.408394,43.982743],[-75.408649,43.98266],[-75.408905,43.98259],[-75.40901599999999,43.982548],[-75.409085,43.982525],[-75.40934,43.982438],[-75.409576,43.982392],[-75.410133,43.982314],[-75.410448,43.982245],[-75.410719,43.982173],[-75.411177,43.981996],[-75.411703,43.981826],[-75.412171,43.981689],[-75.412418,43.981599],[-75.41289500000001,43.98138],[-75.413315,43.981129],[-75.413445,43.981064],[-75.41358099999999,43.981019],[-75.41371100000001,43.981],[-75.41384100000001,43.981],[-75.414224,43.980978],[-75.415063,43.980952],[-75.415533,43.98097],[-75.41570900000001,43.980951],[-75.415858,43.980905],[-75.416343,43.980652],[-75.416453,43.98062],[-75.41659,43.9806],[-75.416876,43.980607],[-75.417025,43.980646],[-75.417188,43.980715],[-75.41745400000001,43.980865],[-75.41759399999999,43.980962],[-75.417723,43.981032],[-75.41786500000001,43.981073],[-75.41798300000001,43.981078],[-75.418094,43.981071],[-75.41843299999999,43.981001],[-75.418572,43.980947],[-75.418767,43.980857],[-75.41896699999999,43.980752],[-75.41914300000001,43.980672],[-75.419624,43.980532],[-75.420047,43.980387],[-75.420339,43.980238],[-75.420469,43.980193],[-75.420598,43.980165],[-75.420711,43.980162],[-75.42085899999999,43.980186],[-75.420969,43.980232],[-75.421099,43.980323],[-75.42131999999999,43.980498],[-75.421537,43.980653],[-75.42165199999999,43.980698],[-75.421723,43.980711],[-75.42197,43.980711],[-75.422094,43.980743],[-75.422211,43.980795],[-75.422432,43.980918],[-75.422549,43.980964],[-75.423135,43.981092],[-75.42389799999999,43.981314],[-75.424058,43.981354],[-75.424267,43.981394],[-75.42449000000001,43.981413],[-75.424578,43.98142],[-75.42543999999999,43.981471],[-75.425707,43.981512],[-75.425954,43.981576],[-75.42641500000001,43.981719],[-75.426805,43.981862],[-75.42701099999999,43.98192],[-75.427598,43.982042],[-75.428358,43.982148],[-75.428624,43.982185],[-75.428969,43.982256],[-75.42906600000001,43.982282],[-75.429502,43.982527],[-75.429733,43.982645],[-75.429846,43.982683],[-75.430002,43.982709],[-75.430164,43.982722],[-75.430255,43.982719],[-75.43041100000001,43.982715],[-75.430671,43.982675],[-75.430905,43.982655],[-75.431107,43.982655],[-75.43129500000001,43.982675],[-75.43168900000001,43.982736],[-75.432166,43.982829],[-75.432348,43.982894],[-75.43253,43.982972],[-75.432647,43.983037],[-75.43334400000001,43.983519],[-75.433459,43.983618],[-75.433331,43.983698],[-75.43322499999999,43.983779],[-75.43315699999999,43.983888],[-75.432997,43.984323],[-75.432864,43.984607],[-75.43262199999999,43.984972],[-75.432399,43.985267],[-75.43230200000001,43.985553],[-75.432276,43.985702],[-75.432276,43.985839],[-75.432311,43.986071],[-75.432396,43.986292],[-75.432436,43.986357],[-75.4325,43.986461],[-75.432636,43.986584],[-75.432925,43.986863],[-75.43297,43.987027],[-75.433008,43.987154],[-75.433083,43.987266],[-75.433347,43.987577],[-75.433639,43.987869],[-75.433679,43.988062],[-75.43375899999999,43.988174],[-75.434005,43.988401],[-75.434254,43.988613],[-75.43452000000001,43.988808],[-75.43471599999999,43.989003],[-75.43482899999999,43.989151],[-75.43491400000001,43.9893],[-75.435011,43.98943],[-75.436074,43.990344],[-75.436516,43.990694],[-75.4375,43.991617],[-75.43809400000001,43.992382],[-75.43964699999999,43.994275],[-75.439965,43.994716],[-75.440414,43.995382],[-75.440487,43.995451],[-75.440676,43.995631],[-75.440811,43.995805],[-75.441001,43.996112],[-75.441141,43.996323],[-75.441434,43.996719],[-75.44184799999999,43.997189],[-75.442669,43.998119],[-75.44313,43.998684],[-75.443702,43.999363],[-75.44422900000001,43.999987],[-75.44472500000001,44.000542],[-75.44498900000001,44.000832],[-75.445341,44.001219],[-75.44551300000001,44.001477],[-75.44564099999999,44.001696],[-75.44574799999999,44.001841],[-75.44605300000001,44.002254],[-75.446613,44.003054],[-75.446721,44.003217],[-75.446799,44.003362],[-75.447684,44.00469],[-75.447754,44.004807],[-75.447802,44.004915],[-75.44792,44.005271],[-75.447986,44.005525],[-75.448375,44.006583],[-75.448414,44.006739],[-75.448482,44.007299],[-75.44847,44.007483],[-75.448403,44.007672],[-75.448261,44.007924],[-75.44787599999999,44.008609],[-75.447362,44.009507],[-75.446838,44.010503],[-75.44667099999999,44.010849],[-75.446381,44.011408],[-75.446135,44.011812],[-75.445976,44.012026],[-75.445866,44.012234],[-75.445851,44.012291],[-75.44585499999999,44.012334],[-75.445874,44.012392],[-75.445943,44.012531],[-75.446185,44.012934],[-75.44670600000001,44.013685],[-75.447259,44.014437],[-75.44760100000001,44.014982],[-75.44774200000001,44.015149],[-75.44834400000001,44.015948],[-75.44873,44.016543],[-75.448746,44.016568],[-75.44895200000001,44.016868],[-75.44906899999999,44.017065],[-75.449372,44.017526],[-75.449462,44.017673],[-75.449535,44.01782],[-75.449602,44.017988],[-75.44972300000001,44.018241],[-75.44981799999999,44.018487],[-75.449941,44.018735],[-75.450048,44.018873],[-75.450389,44.019222],[-75.450526,44.019375],[-75.45071299999999,44.019615],[-75.450968,44.019917],[-75.451089,44.020041],[-75.45164200000001,44.020696],[-75.45178,44.020842],[-75.451949,44.020996],[-75.452157,44.021161],[-75.452693,44.021546],[-75.453243,44.022015],[-75.45431000000001,44.022822],[-75.454555,44.022995],[-75.455023,44.023301],[-75.455466,44.023561],[-75.45587,44.023835],[-75.456397,44.024239],[-75.45674099999999,44.024469],[-75.457324,44.024766],[-75.457993,44.025092],[-75.45842,44.025294],[-75.459496,44.025733],[-75.460375,44.026134],[-75.460503,44.026197],[-75.460645,44.026281],[-75.46075999999999,44.026367],[-75.46085600000001,44.026457],[-75.46096799999999,44.026624],[-75.461,44.026731],[-75.461027,44.026916],[-75.46107600000001,44.027415],[-75.461156,44.027824],[-75.461309,44.028912],[-75.461426,44.029855],[-75.46154300000001,44.03055],[-75.46171200000001,44.03145],[-75.461788,44.032105],[-75.461932,44.032972],[-75.461995,44.033189],[-75.46206599999999,44.03336],[-75.462074,44.033416],[-75.46237000000001,44.033374],[-75.462644,44.033317],[-75.46302300000001,44.033207],[-75.463371,44.033101],[-75.463713,44.03304],[-75.464894,44.032882],[-75.46548799999999,44.032774],[-75.466241,44.032681],[-75.46675399999999,44.032665],[-75.467437,44.032564],[-75.46777400000001,44.032541],[-75.46830799999999,44.032472],[-75.46863999999999,44.03245],[-75.468757,44.03245],[-75.469078,44.032486],[-75.469397,44.032549],[-75.46968,44.032626],[-75.46970399999999,44.032642],[-75.46984,44.032745],[-75.470032,44.032955],[-75.470135,44.033085],[-75.47025600000001,44.033178],[-75.47032299999999,44.033211],[-75.470489,44.033257],[-75.470578,44.033263],[-75.470983,44.033241],[-75.471114,44.033251],[-75.471418,44.033304],[-75.47211799999999,44.033472],[-75.472863,44.033637],[-75.473043,44.033691],[-75.473196,44.033764],[-75.47333,44.03389],[-75.473704,44.034312],[-75.474058,44.03464],[-75.474182,44.034774],[-75.474293,44.034862],[-75.474733,44.035136],[-75.474929,44.035267],[-75.475049,44.03533],[-75.47528200000001,44.035418],[-75.47545599999999,44.035458],[-75.475646,44.035484],[-75.475936,44.035497],[-75.476266,44.035484],[-75.47653699999999,44.035491],[-75.47682,44.035533],[-75.477048,44.035578],[-75.47763999999999,44.035614],[-75.478004,44.035649],[-75.478403,44.035665],[-75.47935699999999,44.035566],[-75.47987000000001,44.035564],[-75.479905,44.035561],[-75.48004,44.035551],[-75.48036,44.035498],[-75.480718,44.03548],[-75.48116,44.035498],[-75.481571,44.035532],[-75.481911,44.035579],[-75.48222,44.035631],[-75.48236799999999,44.035653],[-75.48276,44.035679],[-75.482895,44.035671],[-75.483148,44.035655],[-75.483468,44.035673],[-75.483598,44.035667],[-75.483768,44.035639],[-75.484038,44.035595],[-75.48472,44.035508],[-75.48488,44.035489],[-75.485094,44.035483],[-75.485384,44.035486],[-75.48558199999999,44.03548],[-75.48582,44.035464],[-75.486189,44.035446],[-75.486622,44.035415],[-75.486816,44.035401],[-75.487211,44.035363],[-75.489249,44.035235],[-75.48971299999999,44.035231],[-75.490088,44.035209],[-75.49048000000001,44.035158],[-75.49086800000001,44.035115],[-75.49120000000001,44.035101],[-75.49207699999999,44.035085],[-75.49275299999999,44.035034],[-75.49363099999999,44.034919],[-75.494467,44.03474],[-75.494699,44.034728],[-75.495606,44.034774],[-75.496027,44.034783],[-75.496835,44.034827],[-75.497333,44.034821],[-75.4978,44.034783],[-75.498803,44.034681],[-75.49937199999999,44.034637],[-75.49999699999999,44.034612],[-75.50075699999999,44.034562],[-75.501548,44.034496],[-75.501901,44.034472],[-75.502002,44.034463],[-75.502014,44.036244],[-75.502014,44.036274],[-75.499636,44.039194],[-75.49826299999999,44.040837],[-75.493342,44.046835],[-75.497407,44.048679],[-75.49926000000001,44.049517],[-75.499341,44.04959],[-75.499638,44.049859],[-75.502741,44.051253],[-75.499638,44.055132],[-75.498451,44.056647],[-75.49355799999999,44.062843],[-75.491609,44.065278],[-75.49105400000001,44.065979],[-75.490888,44.066177],[-75.490668,44.066439],[-75.49051900000001,44.066627],[-75.48825600000001,44.069475],[-75.48772700000001,44.070141],[-75.487703,44.070172],[-75.487689,44.07019],[-75.487674,44.070208],[-75.487628,44.070267],[-75.487588,44.070317],[-75.48588100000001,44.072467],[-75.485139,44.073402],[-75.484528,44.074172],[-75.49291599999999,44.078116],[-75.49964,44.081407],[-75.501846,44.082443],[-75.50751200000001,44.085106],[-75.507625,44.085159],[-75.507724,44.085206],[-75.50836700000001,44.085508],[-75.516593,44.089308],[-75.5184,44.090151],[-75.523466,44.092512],[-75.531522,44.096243],[-75.53335199999999,44.09709],[-75.545886,44.102978],[-75.541962,44.10759]]],"type":"Polygon"}
}