{
  "id": "361130780003",
  "type": "Feature",
  "properties": {
    "area_land":82624871,
    "area_water":31120736,
    "geoid":"361130780003",
    "name":"Block Group 3",
    "state":"ny"
},
  "bbox": [
    -73.70725,
    43.545182,
    -73.525347,
    43.678377
],
  "geometry": {"coordinates":[[[-73.70725,43.631911],[-73.70720799999999,43.632092],[-73.70703899999999,43.632459],[-73.70688800000001,43.633089],[-73.706847,43.633836],[-73.706835,43.634052],[-73.70684,43.634239],[-73.685424,43.64004],[-73.677305,43.644683],[-73.667742,43.65018],[-73.667519,43.650309],[-73.661058,43.654053],[-73.654313,43.65798],[-73.646349,43.662525],[-73.64564799999999,43.662954],[-73.640097,43.666228],[-73.639595,43.666651],[-73.637823,43.66784],[-73.635734,43.66868],[-73.63196000000001,43.670892],[-73.63265199999999,43.678377],[-73.62711899999999,43.676232],[-73.626914,43.676153],[-73.626019,43.675807],[-73.624551,43.675238],[-73.603714,43.666855],[-73.603576,43.666801],[-73.60343899999999,43.666741],[-73.602507,43.666361],[-73.58139199999999,43.658109],[-73.546447,43.644408],[-73.546116,43.644296],[-73.53470900000001,43.639781],[-73.534038,43.639526],[-73.533053,43.639137],[-73.525347,43.636071],[-73.525373,43.636009],[-73.5254,43.635946],[-73.525412,43.635917],[-73.525469,43.635838],[-73.52554600000001,43.635731],[-73.525668,43.63566],[-73.525837,43.635633],[-73.526016,43.635641],[-73.526196,43.63569],[-73.526319,43.635746],[-73.52678899999999,43.636014],[-73.526895,43.636004],[-73.52713799999999,43.635887],[-73.527148,43.635787],[-73.527069,43.63556],[-73.527047,43.635438],[-73.527081,43.635284],[-73.527148,43.635171],[-73.527294,43.635017],[-73.527484,43.634765],[-73.52754,43.634644],[-73.52763,43.634506],[-73.527888,43.634332],[-73.52814499999999,43.633914],[-73.52814499999999,43.633841],[-73.528111,43.633687],[-73.52817899999999,43.633614],[-73.528302,43.633574],[-73.528403,43.633452],[-73.528436,43.63333],[-73.52847,43.633103],[-73.528515,43.632893],[-73.528537,43.632835],[-73.528577,43.632733],[-73.529523,43.632293],[-73.529703,43.63218],[-73.529938,43.631896],[-73.530095,43.631758],[-73.53022900000001,43.631653],[-73.531876,43.630647],[-73.532145,43.630428],[-73.532313,43.630104],[-73.53238,43.629893],[-73.532526,43.629714],[-73.53277199999999,43.62956],[-73.533097,43.62939],[-73.533614,43.629088],[-73.53420699999999,43.628563],[-73.534453,43.628392],[-73.534599,43.628311],[-73.53505800000001,43.628108],[-73.53530499999999,43.627906],[-73.53563,43.627541],[-73.535899,43.627338],[-73.535977,43.627184],[-73.536044,43.627127],[-73.536179,43.627119],[-73.53646999999999,43.627265],[-73.536571,43.627257],[-73.536986,43.627078],[-73.537255,43.626851],[-73.537389,43.626551],[-73.53755700000001,43.626413],[-73.537781,43.626332],[-73.538073,43.626259],[-73.538364,43.626154],[-73.538667,43.625975],[-73.539036,43.625675],[-73.539249,43.625391],[-73.539552,43.625075],[-73.54076999999999,43.623696],[-73.54147500000001,43.622767],[-73.54170999999999,43.62259],[-73.541805,43.622466],[-73.541984,43.622275],[-73.54239099999999,43.621727],[-73.542523,43.621515],[-73.542655,43.621378],[-73.54279699999999,43.621276],[-73.54288200000001,43.62107],[-73.54303299999999,43.620893],[-73.543137,43.620674],[-73.543161,43.620551],[-73.54317500000001,43.620393],[-73.54319599999999,43.620311],[-73.54320800000001,43.620263],[-73.54335,43.620202],[-73.543407,43.620058],[-73.543426,43.619901],[-73.54352,43.619723],[-73.543605,43.619538],[-73.543953,43.61886],[-73.544027,43.61878],[-73.54406299999999,43.61869],[-73.544027,43.618573],[-73.54401900000001,43.618462],[-73.544056,43.61834],[-73.544152,43.618254],[-73.544203,43.618143],[-73.54430499999999,43.618112],[-73.544415,43.618016],[-73.544569,43.618016],[-73.54471599999999,43.618011],[-73.544892,43.617958],[-73.545068,43.61791],[-73.54510500000001,43.617846],[-73.54508300000001,43.617751],[-73.54514899999999,43.617639],[-73.545295,43.617512],[-73.545427,43.617432],[-73.545618,43.617353],[-73.545816,43.617262],[-73.54595500000001,43.617146],[-73.546058,43.617045],[-73.54612400000001,43.616907],[-73.546402,43.616726],[-73.546498,43.616684],[-73.54662999999999,43.616663],[-73.546747,43.616626],[-73.546879,43.616546],[-73.546989,43.616435],[-73.547099,43.616297],[-73.54715,43.616169],[-73.547202,43.615989],[-73.547246,43.615856],[-73.547319,43.615713],[-73.54738500000001,43.615596],[-73.547473,43.615474],[-73.54747999999999,43.615304],[-73.547511,43.615071],[-73.547539,43.615018],[-73.547715,43.614975],[-73.547935,43.614938],[-73.548103,43.614869],[-73.548221,43.614747],[-73.548367,43.614614],[-73.548411,43.614444],[-73.548462,43.614285],[-73.548506,43.61412],[-73.548587,43.613935],[-73.54859399999999,43.613781],[-73.54871900000001,43.613632],[-73.548851,43.613393],[-73.548939,43.613197],[-73.548968,43.613027],[-73.54902,43.612884],[-73.54919099999999,43.61272],[-73.54926500000001,43.612587],[-73.54941100000001,43.612438],[-73.549492,43.612274],[-73.54955,43.612131],[-73.549536,43.611844],[-73.549605,43.61168],[-73.549789,43.611573],[-73.54992799999999,43.61152],[-73.549987,43.611573],[-73.549965,43.611642],[-73.550031,43.611722],[-73.550155,43.611696],[-73.55022099999999,43.611621],[-73.550206,43.61142],[-73.550404,43.611319],[-73.55053599999999,43.611165],[-73.55070499999999,43.611016],[-73.550888,43.610942],[-73.551042,43.61091],[-73.551137,43.610809],[-73.55121800000001,43.610703],[-73.551365,43.610597],[-73.55157,43.610544],[-73.55175300000001,43.610475],[-73.55191600000001,43.610388],[-73.552376,43.610039],[-73.552623,43.609909],[-73.552735,43.609901],[-73.552892,43.609982],[-73.553026,43.609998],[-73.553206,43.609998],[-73.55329500000001,43.609966],[-73.55345199999999,43.609836],[-73.55349699999999,43.609731],[-73.55356399999999,43.609438],[-73.55365399999999,43.609252],[-73.55374399999999,43.609146],[-73.55374399999999,43.608968],[-73.55373299999999,43.608895],[-73.553665,43.60883],[-73.55343000000001,43.608724],[-73.55338500000001,43.608619],[-73.55353100000001,43.60844],[-73.55356399999999,43.608367],[-73.55355400000001,43.608253],[-73.553453,43.608148],[-73.553408,43.608075],[-73.553397,43.607994],[-73.55344100000001,43.607929],[-73.55354199999999,43.607896],[-73.55374399999999,43.608042],[-73.55387899999999,43.608099],[-73.554036,43.608115],[-73.554204,43.608099],[-73.55435,43.60805],[-73.554507,43.607969],[-73.55515699999999,43.607466],[-73.555269,43.607393],[-73.555336,43.607255],[-73.555359,43.607141],[-73.55530299999999,43.606882],[-73.55530299999999,43.606516],[-73.55528,43.606427],[-73.555224,43.606362],[-73.55511199999999,43.606305],[-73.55505599999999,43.6062],[-73.55502799999999,43.60612],[-73.55520199999999,43.605761],[-73.555359,43.605461],[-73.555437,43.605339],[-73.55546,43.605234],[-73.555448,43.60512],[-73.55525799999999,43.604885],[-73.55514599999999,43.604812],[-73.55514599999999,43.604722],[-73.55519,43.604649],[-73.555448,43.604633],[-73.555606,43.604577],[-73.555909,43.604536],[-73.556077,43.604455],[-73.55635700000001,43.604228],[-73.557044,43.603817],[-73.557131,43.603659],[-73.557168,43.603546],[-73.557142,43.603229],[-73.557243,43.603107],[-73.5574,43.602937],[-73.55807799999999,43.60253],[-73.55809499999999,43.602526],[-73.558497,43.602439],[-73.55901299999999,43.602277],[-73.559327,43.602131],[-73.559596,43.601968],[-73.55982,43.601757],[-73.56022400000001,43.601204],[-73.56029100000001,43.60101],[-73.56031400000001,43.60088],[-73.56038100000001,43.600815],[-73.56047100000001,43.600766],[-73.560605,43.600701],[-73.561009,43.60062],[-73.561121,43.600571],[-73.561525,43.600165],[-73.562625,43.599271],[-73.562939,43.599044],[-73.563118,43.598897],[-73.56326,43.598742],[-73.563363,43.598586],[-73.56349299999999,43.59835],[-73.563568,43.59816],[-73.56374599999999,43.598004],[-73.56388099999999,43.597841],[-73.56406,43.597695],[-73.564307,43.597582],[-73.564474,43.597558],[-73.56455800000001,43.597599],[-73.56461400000001,43.597694],[-73.564679,43.597741],[-73.56469800000001,43.597815],[-73.564666,43.59789],[-73.564487,43.597923],[-73.564397,43.597971],[-73.56433,43.598069],[-73.56423100000001,43.598181],[-73.56425,43.598363],[-73.56431499999999,43.59837],[-73.564437,43.59835],[-73.56458600000001,43.598316],[-73.564773,43.598289],[-73.564894,43.598248],[-73.56502500000001,43.59815],[-73.56508100000001,43.597924],[-73.56519299999999,43.597842],[-73.565202,43.597782],[-73.56513699999999,43.597748],[-73.56505300000001,43.597633],[-73.565062,43.597491],[-73.5651,43.597322],[-73.56520500000001,43.597208],[-73.56533899999999,43.597094],[-73.565586,43.596802],[-73.565631,43.596607],[-73.565618,43.596468],[-73.565318,43.596216],[-73.565196,43.595999],[-73.565196,43.595806],[-73.565296,43.595573],[-73.56542899999999,43.595437],[-73.565651,43.595324],[-73.56580599999999,43.595228],[-73.566149,43.59481],[-73.566238,43.594618],[-73.566271,43.594312],[-73.566294,43.593806],[-73.566349,43.592979],[-73.566271,43.592642],[-73.56611599999999,43.592441],[-73.565917,43.592216],[-73.56578399999999,43.591967],[-73.565817,43.59179],[-73.566061,43.591357],[-73.56651599999999,43.590803],[-73.566804,43.590626],[-73.567059,43.590546],[-73.567414,43.590514],[-73.567857,43.590578],[-73.568068,43.590602],[-73.56819,43.590602],[-73.56826700000001,43.590538],[-73.56833399999999,43.590353],[-73.568478,43.590305],[-73.568755,43.590337],[-73.56891,43.590313],[-73.569154,43.590104],[-73.569288,43.589914],[-73.56931,43.589622],[-73.569237,43.589392],[-73.569289,43.589304],[-73.569577,43.58924],[-73.569644,43.589184],[-73.569755,43.588951],[-73.569732,43.588839],[-73.56956599999999,43.588718],[-73.569688,43.588429],[-73.569699,43.588349],[-73.569621,43.588253],[-73.56955499999999,43.58814],[-73.569588,43.588028],[-73.569788,43.587883],[-73.570076,43.587803],[-73.57024199999999,43.587763],[-73.570364,43.587691],[-73.570409,43.587578],[-73.570553,43.58749],[-73.570719,43.587466],[-73.570908,43.58749],[-73.57134000000001,43.58741],[-73.57173899999999,43.587209],[-73.571883,43.58708],[-73.571961,43.586928],[-73.571972,43.586607],[-73.57202700000001,43.586542],[-73.572349,43.586358],[-73.572382,43.586294],[-73.572271,43.586093],[-73.57204900000001,43.585908],[-73.571927,43.585764],[-73.571916,43.585483],[-73.57195,43.585186],[-73.57204900000001,43.585073],[-73.572316,43.584913],[-73.57241500000001,43.58484],[-73.57247099999999,43.58472],[-73.572571,43.584648],[-73.57286999999999,43.584688],[-73.573069,43.58484],[-73.57321399999999,43.584945],[-73.573391,43.585001],[-73.57359,43.585033],[-73.573801,43.585033],[-73.57393399999999,43.58501],[-73.574067,43.584914],[-73.574156,43.584745],[-73.574245,43.584255],[-73.57425600000001,43.583974],[-73.574145,43.583709],[-73.574012,43.583508],[-73.57397899999999,43.583404],[-73.574045,43.583331],[-73.574112,43.583331],[-73.574367,43.583436],[-73.574555,43.583468],[-73.574888,43.58346],[-73.575276,43.583492],[-73.57540899999999,43.583548],[-73.575497,43.583653],[-73.575653,43.583709],[-73.57577499999999,43.583693],[-73.576007,43.58362],[-73.576185,43.5835],[-73.57639500000001,43.583034],[-73.57645100000001,43.582697],[-73.576429,43.582568],[-73.576318,43.58244],[-73.57533100000001,43.582367],[-73.575154,43.582327],[-73.57504299999999,43.582231],[-73.57505399999999,43.582126],[-73.575165,43.582086],[-73.575265,43.582102],[-73.57538700000001,43.582134],[-73.575542,43.582094],[-73.575675,43.582014],[-73.57570800000001,43.581893],[-73.57571900000001,43.581749],[-73.57579699999999,43.581701],[-73.575963,43.581709],[-73.57607400000001,43.581693],[-73.57647299999999,43.581476],[-73.57719400000001,43.581146],[-73.577393,43.581187],[-73.577493,43.581283],[-73.577349,43.581837],[-73.577305,43.582223],[-73.577185,43.582484],[-73.57723799999999,43.582576],[-73.577382,43.582648],[-73.57754799999999,43.58266],[-73.577759,43.582587],[-73.57793599999999,43.582587],[-73.578036,43.582627],[-73.578102,43.582716],[-73.57821300000001,43.58278],[-73.578402,43.582788],[-73.578524,43.582724],[-73.57868999999999,43.582579],[-73.578834,43.582354],[-73.578845,43.58229],[-73.578768,43.582105],[-73.578819,43.582031],[-73.578872,43.581955],[-73.57889,43.581929],[-73.578901,43.58176],[-73.578934,43.581696],[-73.57905599999999,43.581664],[-73.579223,43.581696],[-73.579311,43.581824],[-73.579356,43.581937],[-73.579544,43.582154],[-73.579655,43.582194],[-73.57991,43.582202],[-73.58007600000001,43.582137],[-73.580043,43.581969],[-73.580032,43.58188],[-73.58011,43.581856],[-73.580209,43.58188],[-73.580265,43.581977],[-73.58042,43.582105],[-73.580575,43.582049],[-73.580631,43.581985],[-73.580653,43.581848],[-73.58058699999999,43.581623],[-73.580709,43.581471],[-73.580731,43.581262],[-73.580686,43.581109],[-73.580709,43.581029],[-73.580797,43.581013],[-73.580952,43.581021],[-73.58123000000001,43.581045],[-73.58144,43.581045],[-73.581518,43.580997],[-73.581585,43.580892],[-73.58156200000001,43.580579],[-73.581684,43.580419],[-73.581806,43.580306],[-73.581928,43.58017],[-73.581951,43.580073],[-73.581873,43.579937],[-73.58160700000001,43.579768],[-73.581551,43.579326],[-73.58154,43.579141],[-73.581585,43.579077],[-73.58165099999999,43.579061],[-73.581873,43.579093],[-73.58199500000001,43.579029],[-73.582095,43.578908],[-73.58215,43.57878],[-73.58205,43.578676],[-73.581917,43.578603],[-73.58170699999999,43.578563],[-73.581352,43.578571],[-73.58087500000001,43.578732],[-73.580775,43.578828],[-73.580742,43.578941],[-73.58055299999999,43.579085],[-73.580354,43.579149],[-73.58013200000001,43.579117],[-73.58001,43.579117],[-73.579888,43.57919],[-73.57974400000001,43.579318],[-73.579408,43.579423],[-73.5793,43.579519],[-73.578834,43.579591],[-73.57866799999999,43.579672],[-73.578491,43.579872],[-73.57835799999999,43.579904],[-73.578136,43.579945],[-73.577825,43.579961],[-73.57777,43.579913],[-73.57777,43.579736],[-73.577725,43.579647],[-73.577581,43.579607],[-73.577415,43.579591],[-73.577237,43.579591],[-73.57716000000001,43.579519],[-73.577127,43.579431],[-73.577145,43.579346],[-73.57717100000001,43.579222],[-73.57724899999999,43.578692],[-73.577337,43.578507],[-73.57757100000001,43.577908],[-73.577748,43.577258],[-73.577782,43.577153],[-73.577848,43.577073],[-73.57792600000001,43.577001],[-73.578059,43.576977],[-73.57834699999999,43.576904],[-73.578846,43.576703],[-73.578979,43.57672],[-73.57905700000001,43.576792],[-73.579168,43.577025],[-73.579279,43.577113],[-73.579623,43.577145],[-73.579922,43.577137],[-73.58024399999999,43.577017],[-73.580388,43.576832],[-73.58041,43.576607],[-73.580399,43.576093],[-73.580257,43.575453],[-73.58037899999999,43.574588],[-73.58051,43.574109],[-73.580865,43.573707],[-73.58094199999999,43.573643],[-73.58123000000001,43.573442],[-73.581441,43.57337],[-73.58162900000001,43.573402],[-73.581762,43.573482],[-73.581884,43.573651],[-73.581862,43.573796],[-73.581773,43.573924],[-73.581784,43.574046],[-73.58198400000001,43.574165],[-73.582284,43.574165],[-73.582461,43.574101],[-73.582516,43.574037],[-73.582561,43.57394],[-73.582494,43.57386],[-73.58241700000001,43.573715],[-73.582461,43.573378],[-73.58239399999999,43.573177],[-73.582339,43.573073],[-73.582539,43.572968],[-73.58274900000001,43.572944],[-73.582927,43.572976],[-73.582971,43.573097],[-73.583015,43.573354],[-73.58309300000001,43.573394],[-73.58320399999999,43.573386],[-73.58355400000001,43.573262],[-73.583833,43.57313],[-73.584057,43.573024],[-73.58413400000001,43.57298],[-73.584368,43.572848],[-73.58463500000001,43.572743],[-73.584768,43.572647],[-73.584834,43.572566],[-73.584801,43.572502],[-73.58464600000001,43.572406],[-73.58460100000001,43.572325],[-73.58462299999999,43.57214],[-73.58479,43.572028],[-73.58504499999999,43.571843],[-73.58534400000001,43.571787],[-73.586808,43.571763],[-73.58726299999999,43.571674],[-73.58761800000001,43.571538],[-73.587862,43.571345],[-73.58793900000001,43.571208],[-73.58807299999999,43.570902],[-73.588317,43.570509],[-73.58840499999999,43.570187],[-73.588505,43.56985],[-73.588627,43.569609],[-73.58882699999999,43.569415],[-73.589004,43.569311],[-73.589814,43.569159],[-73.590446,43.568998],[-73.591533,43.568588],[-73.59217700000001,43.568419],[-73.59241,43.568395],[-73.592698,43.568419],[-73.592842,43.56846],[-73.59290900000001,43.568612],[-73.592997,43.568645],[-73.593186,43.568613],[-73.593552,43.568508],[-73.593829,43.568484],[-73.594206,43.56846],[-73.595082,43.568259],[-73.59817700000001,43.567464],[-73.598377,43.567448],[-73.59856499999999,43.567472],[-73.598654,43.567536],[-73.598787,43.567697],[-73.59892000000001,43.567753],[-73.599142,43.567825],[-73.599242,43.567833],[-73.59932000000001,43.567793],[-73.59970300000001,43.567517],[-73.600188,43.567392],[-73.600617,43.567275],[-73.600983,43.567227],[-73.60163799999999,43.567219],[-73.601749,43.567275],[-73.60186,43.56742],[-73.60199299999999,43.56799],[-73.602126,43.568038],[-73.60230300000001,43.56799],[-73.602492,43.567966],[-73.60272500000001,43.568006],[-73.602847,43.568151],[-73.602847,43.568328],[-73.602858,43.568424],[-73.602925,43.568472],[-73.60303500000001,43.568464],[-73.603146,43.568344],[-73.60340100000001,43.568223],[-73.60352399999999,43.568159],[-73.603557,43.568062],[-73.60351199999999,43.567982],[-73.603324,43.567862],[-73.603268,43.567757],[-73.603279,43.567685],[-73.603357,43.567629],[-73.60353499999999,43.567661],[-73.603712,43.567717],[-73.603812,43.567773],[-73.60386699999999,43.567902],[-73.603956,43.567958],[-73.604123,43.56795],[-73.60427799999999,43.567934],[-73.604355,43.56787],[-73.604544,43.567637],[-73.60464399999999,43.56758],[-73.604877,43.567484],[-73.605121,43.567492],[-73.605509,43.567572],[-73.60564599999999,43.567561],[-73.60580899999999,43.567387],[-73.606064,43.567283],[-73.606263,43.567211],[-73.606718,43.567138],[-73.606796,43.567082],[-73.60688399999999,43.566978],[-73.60689600000001,43.566881],[-73.606829,43.566793],[-73.606674,43.566729],[-73.606274,43.566753],[-73.606064,43.566704],[-73.605964,43.566568],[-73.605931,43.566423],[-73.605986,43.566319],[-73.606041,43.566198],[-73.606379,43.565865],[-73.606829,43.565355],[-73.60692899999999,43.565162],[-73.60692899999999,43.564985],[-73.607373,43.563852],[-73.607495,43.56378],[-73.607617,43.563755],[-73.607905,43.563755],[-73.60816,43.563739],[-73.608493,43.563635],[-73.60880400000001,43.563603],[-73.608892,43.563659],[-73.608937,43.563788],[-73.608992,43.564053],[-73.60917000000001,43.564551],[-73.609269,43.564632],[-73.609436,43.56464],[-73.609635,43.564624],[-73.609813,43.564575],[-73.60995699999999,43.564519],[-73.610135,43.564431],[-73.61029000000001,43.564431],[-73.610445,43.564487],[-73.610556,43.564503],[-73.610722,43.564455],[-73.610878,43.564366],[-73.610978,43.56427],[-73.611,43.564069],[-73.61108900000001,43.563876],[-73.611299,43.563844],[-73.61142100000001,43.563884],[-73.611532,43.563948],[-73.611632,43.563932],[-73.611721,43.563868],[-73.61181000000001,43.563731],[-73.61183200000001,43.563591],[-73.611943,43.563498],[-73.612032,43.563455],[-73.612154,43.563423],[-73.61227599999999,43.563431],[-73.612453,43.563455],[-73.61257500000001,43.563431],[-73.61272,43.563326],[-73.61307499999999,43.563141],[-73.613186,43.563061],[-73.61323,43.562932],[-73.613186,43.562804],[-73.613108,43.562747],[-73.61291900000001,43.562739],[-73.612764,43.562755],[-73.61257500000001,43.562763],[-73.612487,43.562683],[-73.612409,43.562345],[-73.612365,43.562281],[-73.61226499999999,43.562233],[-73.612165,43.562273],[-73.612065,43.562273],[-73.611976,43.562185],[-73.611954,43.562096],[-73.611999,43.562],[-73.611999,43.561955],[-73.611999,43.561895],[-73.611954,43.561807],[-73.61181000000001,43.561694],[-73.61148799999999,43.561517],[-73.611322,43.561341],[-73.611189,43.56126],[-73.610978,43.561067],[-73.610967,43.560931],[-73.611,43.560641],[-73.611011,43.560496],[-73.61108900000001,43.560368],[-73.61124,43.560235],[-73.611666,43.559749],[-73.611788,43.559548],[-73.61194399999999,43.559244],[-73.612143,43.558801],[-73.61222100000001,43.558697],[-73.61230999999999,43.558649],[-73.61259800000001,43.558689],[-73.612754,43.558745],[-73.61282,43.558761],[-73.612953,43.558745],[-73.613353,43.558496],[-73.61341899999999,43.55844],[-73.61346399999999,43.558359],[-73.61346399999999,43.558295],[-73.613719,43.558142],[-73.614085,43.557909],[-73.61419600000001,43.557796],[-73.61424,43.557676],[-73.61420699999999,43.557555],[-73.614107,43.557281],[-73.614118,43.557113],[-73.61420699999999,43.557008],[-73.614351,43.556903],[-73.614385,43.556799],[-73.614374,43.556662],[-73.61412900000001,43.556107],[-73.61403,43.556043],[-73.613908,43.556043],[-73.613663,43.556188],[-73.613564,43.556204],[-73.61341899999999,43.556051],[-73.61332,43.556027],[-73.61310899999999,43.556059],[-73.612953,43.556019],[-73.612876,43.555954],[-73.612854,43.55589],[-73.61310899999999,43.555705],[-73.613198,43.555617],[-73.613242,43.555496],[-73.613231,43.555367],[-73.613153,43.555215],[-73.613153,43.55511],[-73.61309799999999,43.555038],[-73.612965,43.555038],[-73.612837,43.554999],[-73.612809,43.554901],[-73.612709,43.554885],[-73.612565,43.554917],[-73.61239999999999,43.554998],[-73.61238,43.555051],[-73.61234,43.555159],[-73.61232,43.555254],[-73.612269,43.55532],[-73.612188,43.555371],[-73.611946,43.555429],[-73.611784,43.555444],[-73.61166299999999,43.55543],[-73.61156200000001,43.555378],[-73.61151099999999,43.555269],[-73.611467,43.55521],[-73.61144299999999,43.555211],[-73.611301,43.555218],[-73.611079,43.555266],[-73.610968,43.555323],[-73.610957,43.555459],[-73.610923,43.55558],[-73.610823,43.555709],[-73.610713,43.555701],[-73.610624,43.555685],[-73.610579,43.555604],[-73.610535,43.555492],[-73.610435,43.555443],[-73.610246,43.555443],[-73.610135,43.555419],[-73.609891,43.55517],[-73.609503,43.554808],[-73.609037,43.554237],[-73.609048,43.554116],[-73.60912500000001,43.554036],[-73.609514,43.553811],[-73.609525,43.55373],[-73.60947,43.553642],[-73.60897,43.553642],[-73.60882599999999,43.553698],[-73.608704,43.553762],[-73.608637,43.553771],[-73.60799400000001,43.553272],[-73.607749,43.553103],[-73.60760500000001,43.553055],[-73.607505,43.553055],[-73.607405,43.553023],[-73.60706500000001,43.552757],[-73.606939,43.552461],[-73.606995,43.551866],[-73.607084,43.551681],[-73.60729499999999,43.551544],[-73.607417,43.551424],[-73.607572,43.551239],[-73.607772,43.551142],[-73.60802700000001,43.55107],[-73.608205,43.551029],[-73.608338,43.550949],[-73.60844899999999,43.550836],[-73.60880400000001,43.550386],[-73.60907,43.549871],[-73.60925899999999,43.549469],[-73.609292,43.549172],[-73.609437,43.548794],[-73.609414,43.548658],[-73.609337,43.548545],[-73.60924799999999,43.548271],[-73.60922600000001,43.548127],[-73.609292,43.548038],[-73.609437,43.547869],[-73.60957000000001,43.547732],[-73.610058,43.546879],[-73.610225,43.546727],[-73.610269,43.546582],[-73.610269,43.546461],[-73.61028,43.546268],[-73.610302,43.546067],[-73.61036900000001,43.545922],[-73.610613,43.545729],[-73.61081299999999,43.545657],[-73.610879,43.545584],[-73.610946,43.545399],[-73.61112300000001,43.54523],[-73.611268,43.545182],[-73.611368,43.545214],[-73.611423,43.545303],[-73.611445,43.545424],[-73.611234,43.546212],[-73.611279,43.546309],[-73.611423,43.546349],[-73.611582,43.546299],[-73.611642,43.546246],[-73.611706,43.546175],[-73.622197,43.546656],[-73.635772,43.547272],[-73.642938,43.546991],[-73.662993,43.545749],[-73.663421,43.545607],[-73.663555,43.54553],[-73.663858,43.545359],[-73.664027,43.545261],[-73.66474100000001,43.545371],[-73.664823,43.545383],[-73.665193,43.545436],[-73.66545600000001,43.545524],[-73.665085,43.546034],[-73.66492,43.546263],[-73.66484699999999,43.546352],[-73.664731,43.546486],[-73.66468,43.546534],[-73.66451000000001,43.546678],[-73.664376,43.546778],[-73.663837,43.547146],[-73.663566,43.547341],[-73.66322599999999,43.547586],[-73.662724,43.547921],[-73.66185,43.548485],[-73.661682,43.548599],[-73.660749,43.549261],[-73.660213,43.549675],[-73.659858,43.549991],[-73.65961299999999,43.550209],[-73.659418,43.550391],[-73.659013,43.550756],[-73.658871,43.550886],[-73.658277,43.551424],[-73.65781699999999,43.551839],[-73.65746,43.552158],[-73.656986,43.552596],[-73.656671,43.552906],[-73.65647199999999,43.553142],[-73.656346,43.553344],[-73.656305,43.553411],[-73.656177,43.553703],[-73.656125,43.553845],[-73.655901,43.554538],[-73.655777,43.554922],[-73.65557800000001,43.555537],[-73.65552700000001,43.555686],[-73.65548699999999,43.555808],[-73.655351,43.556241],[-73.655286,43.556457],[-73.655176,43.55682],[-73.65517,43.556841],[-73.65515600000001,43.556888],[-73.65509299999999,43.557109],[-73.65503699999999,43.557312],[-73.654999,43.557457],[-73.65498700000001,43.557501],[-73.654887,43.557909],[-73.65483500000001,43.558117],[-73.654989,43.558158],[-73.655072,43.558196],[-73.655232,43.558297],[-73.655531,43.558517],[-73.656025,43.558892],[-73.65633200000001,43.55911],[-73.65656300000001,43.559236],[-73.656654,43.559276],[-73.657843,43.559757],[-73.65797499999999,43.559823],[-73.658084,43.559876],[-73.658586,43.560103],[-73.65884,43.560241],[-73.659171,43.560472],[-73.65931999999999,43.560621],[-73.65946,43.560796],[-73.659575,43.56094],[-73.659682,43.5611],[-73.659863,43.561489],[-73.660106,43.562101],[-73.66013700000001,43.562171],[-73.66032800000001,43.562629],[-73.66036800000001,43.562763],[-73.660403,43.563033],[-73.660402,43.563367],[-73.660353,43.564006],[-73.66035599999999,43.564138],[-73.660358,43.564242],[-73.660376,43.564422],[-73.66042,43.56459],[-73.660545,43.564922],[-73.660571,43.56515],[-73.66055,43.565316],[-73.66053599999999,43.565428],[-73.660456,43.565692],[-73.660393,43.565824],[-73.660287,43.566008],[-73.660207,43.566124],[-73.659904,43.566478],[-73.659842,43.566593],[-73.659808,43.566671],[-73.659767,43.566801],[-73.659707,43.566993],[-73.659637,43.567262],[-73.65957,43.567515],[-73.65942699999999,43.567948],[-73.659289,43.56848],[-73.65926,43.568743],[-73.659255,43.568789],[-73.659226,43.569051],[-73.659137,43.569712],[-73.658997,43.570182],[-73.65894900000001,43.570465],[-73.658956,43.570624],[-73.658987,43.570767],[-73.65904399999999,43.570935],[-73.659372,43.571696],[-73.659452,43.57188],[-73.659736,43.572421],[-73.660337,43.573405],[-73.660586,43.573883],[-73.660799,43.574357],[-73.66088000000001,43.574567],[-73.66099199999999,43.574906],[-73.661033,43.575258],[-73.66104,43.575389],[-73.661056,43.575768],[-73.661063,43.576232],[-73.661041,43.576675],[-73.661018,43.57712],[-73.661016,43.577163],[-73.661011,43.577333],[-73.66100400000001,43.577641],[-73.66100900000001,43.577727],[-73.66103099999999,43.578124],[-73.66112800000001,43.578598],[-73.66159399999999,43.580578],[-73.661624,43.580794],[-73.661637,43.580992],[-73.661753,43.582347],[-73.66176299999999,43.582815],[-73.66168399999999,43.584282],[-73.66152,43.58611],[-73.66132899999999,43.587937],[-73.661292,43.588331],[-73.661202,43.589174],[-73.661141,43.589493],[-73.661033,43.589764],[-73.660849,43.590065],[-73.660786,43.590155],[-73.661214,43.590525],[-73.661681,43.590893],[-73.66222500000001,43.591252],[-73.66331099999999,43.591921],[-73.66484199999999,43.59285],[-73.666819,43.594049],[-73.66846,43.595049],[-73.673275,43.597965],[-73.67395999999999,43.598384],[-73.675338,43.599188],[-73.676051,43.599587],[-73.67676299999999,43.599957],[-73.677623,43.600418],[-73.68036499999999,43.601881],[-73.68174399999999,43.602631],[-73.683263,43.603414],[-73.683826,43.603667],[-73.684472,43.603916],[-73.68478500000001,43.604022],[-73.685393,43.604196],[-73.68629900000001,43.604412],[-73.686831,43.60451],[-73.687442,43.604593],[-73.687828,43.604636],[-73.688202,43.604667],[-73.688765,43.60469],[-73.689334,43.605312],[-73.69044700000001,43.606532],[-73.69087,43.606965],[-73.69090300000001,43.606998],[-73.691231,43.607373],[-73.691666,43.607868],[-73.691878,43.608134],[-73.692035,43.60828],[-73.69236600000001,43.608554],[-73.692487,43.608687],[-73.69266500000001,43.60893],[-73.69316999999999,43.609689],[-73.693518,43.610288],[-73.693625,43.6105],[-73.694294,43.611845],[-73.694569,43.612255],[-73.69614,43.614302],[-73.69640099999999,43.61467],[-73.696848,43.615451],[-73.696871,43.615492],[-73.697204,43.616173],[-73.697309,43.616443],[-73.697502,43.617032],[-73.69752,43.617087],[-73.697731,43.617547],[-73.69789400000001,43.617838],[-73.69813600000001,43.61827],[-73.698255,43.618483],[-73.69837800000001,43.618717],[-73.698403,43.61877],[-73.69849499999999,43.618964],[-73.69871500000001,43.619402],[-73.698892,43.619821],[-73.69898999999999,43.620051],[-73.699155,43.620354],[-73.699248,43.620509],[-73.69932,43.620629],[-73.699494,43.620864],[-73.69968900000001,43.621068],[-73.699825,43.621247],[-73.69999300000001,43.621551],[-73.700221,43.622257],[-73.70030800000001,43.622528],[-73.70059000000001,43.623189],[-73.700672,43.623329],[-73.70074099999999,43.623423],[-73.700947,43.623523],[-73.701751,43.62397],[-73.70193,43.624108],[-73.70276,43.624803],[-73.702895,43.624906],[-73.70299799999999,43.625],[-73.70311,43.625138],[-73.703172,43.625262],[-73.703227,43.625513],[-73.70326900000001,43.625788],[-73.70331299999999,43.625932],[-73.703366,43.626004],[-73.703416,43.626045],[-73.703491,43.626108],[-73.703962,43.626409],[-73.704829,43.626923],[-73.70495699999999,43.627009],[-73.70504800000001,43.627103],[-73.705201,43.627331],[-73.70534000000001,43.627611],[-73.705384,43.62775],[-73.70541799999999,43.627908],[-73.705538,43.628639],[-73.705563,43.62869],[-73.705685,43.628827],[-73.70585199999999,43.628995],[-73.706002,43.629163],[-73.706242,43.629477],[-73.706568,43.629901],[-73.706782,43.630232],[-73.706833,43.630334],[-73.707015,43.630822],[-73.707159,43.631332],[-73.70717999999999,43.631469],[-73.707244,43.631747],[-73.70725,43.631911]]],"type":"Polygon"}
}