{
  "id": "361190084012",
  "type": "Feature",
  "properties": {
    "area_land":2841568,
    "area_water":3801,
    "geoid":"361190084012",
    "name":"Block Group 2",
    "state":"ny"
},
  "bbox": [
    -73.744747,
    40.964418,
    -73.713281,
    40.982882
],
  "geometry": {"coordinates":[[[-73.744747,40.980429],[-73.744747,40.980563],[-73.74461599999999,40.980895],[-73.744401,40.981109],[-73.74429000000001,40.981262],[-73.744276,40.98186],[-73.74429000000001,40.982109],[-73.74435200000001,40.982262],[-73.744505,40.982365],[-73.74465600000001,40.982445],[-73.744615,40.982606],[-73.744574,40.982661],[-73.744373,40.982796],[-73.744259,40.982848],[-73.744163,40.982882],[-73.74413,40.982683],[-73.74398100000001,40.981782],[-73.743832,40.981793],[-73.742814,40.981899],[-73.74250600000001,40.981899],[-73.742284,40.981876],[-73.742059,40.981827],[-73.741766,40.981749],[-73.74148099999999,40.98161],[-73.740838,40.981204],[-73.740437,40.980882],[-73.740084,40.980626],[-73.739915,40.980525],[-73.7397,40.980426],[-73.739423,40.980326],[-73.73899400000001,40.980214],[-73.73865600000001,40.980161],[-73.738288,40.980146],[-73.737826,40.980172],[-73.73746199999999,40.980229],[-73.73730999999999,40.980261],[-73.73671299999999,40.980362],[-73.73643800000001,40.980452],[-73.736043,40.980615],[-73.73576199999999,40.980723],[-73.73551,40.9808],[-73.735193,40.980859],[-73.73483299999999,40.980913],[-73.734763,40.980922],[-73.733153,40.980958],[-73.7315,40.980983],[-73.731296,40.980979],[-73.73121,40.980973],[-73.730909,40.980953],[-73.729787,40.980839],[-73.728892,40.980743],[-73.728624,40.980726],[-73.72842300000001,40.980713],[-73.728145,40.980712],[-73.72775,40.980747],[-73.72604200000001,40.980993],[-73.72507899999999,40.981124],[-73.724509,40.981144],[-73.724051,40.981103],[-73.722639,40.980852],[-73.721341,40.980608],[-73.719554,40.980273],[-73.718249,40.980021],[-73.718053,40.979984],[-73.716651,40.979718],[-73.715419,40.979491],[-73.71328099999999,40.979095],[-73.71374400000001,40.977963],[-73.713905,40.977493],[-73.713954,40.97721],[-73.71396900000001,40.977086],[-73.71396900000001,40.976836],[-73.71395099999999,40.976429],[-73.713928,40.975887],[-73.713883,40.975346],[-73.714944,40.975443],[-73.715716,40.975455],[-73.71640600000001,40.975435],[-73.71663599999999,40.975426],[-73.718262,40.975316],[-73.718293,40.975314],[-73.71955800000001,40.975204],[-73.72001299999999,40.975124],[-73.72005900000001,40.975116],[-73.720467,40.975043],[-73.72105999999999,40.97488],[-73.721537,40.974724],[-73.721779,40.974629],[-73.721971,40.974554],[-73.722499,40.974311],[-73.723313,40.973813],[-73.724069,40.973212],[-73.724407,40.972863],[-73.72489400000001,40.972204],[-73.725162,40.971793],[-73.725318,40.971418],[-73.725331,40.971381],[-73.726021,40.969493],[-73.72640800000001,40.968536],[-73.727118,40.967336],[-73.727693,40.966566],[-73.727873,40.966379],[-73.72851199999999,40.965785],[-73.728948,40.965386],[-73.729416,40.965017],[-73.72998200000001,40.964632],[-73.730335,40.964418],[-73.73045999999999,40.964836],[-73.730585,40.965161],[-73.73067500000001,40.965438],[-73.730709,40.965653],[-73.73066799999999,40.965999],[-73.730889,40.966348],[-73.730952,40.966431],[-73.73097199999999,40.966583],[-73.73094500000001,40.967365],[-73.730965,40.967401],[-73.73103399999999,40.967526],[-73.731104,40.96767],[-73.731139,40.967767],[-73.73121500000001,40.967864],[-73.731319,40.967926],[-73.731572,40.967986],[-73.731838,40.968085],[-73.732094,40.968217],[-73.732254,40.968234],[-73.73389400000001,40.968344],[-73.734207,40.968365],[-73.73445599999999,40.968372],[-73.734503,40.968388],[-73.73456,40.968407],[-73.73465,40.968455],[-73.734747,40.968532],[-73.73488500000001,40.96859],[-73.735004,40.968605],[-73.735349,40.968646],[-73.735882,40.968683],[-73.735945,40.968687],[-73.736028,40.968763],[-73.73608299999999,40.96886],[-73.736187,40.969179],[-73.73626299999999,40.969303],[-73.73636,40.969365],[-73.73643,40.969379],[-73.73652,40.969359],[-73.736672,40.969165],[-73.736734,40.969054],[-73.736822,40.968993],[-73.737025,40.968839],[-73.737171,40.968756],[-73.73743399999999,40.968694],[-73.737545,40.968694],[-73.737746,40.968732],[-73.73796,40.968857],[-73.73816100000001,40.968891],[-73.738258,40.96885],[-73.73834100000001,40.968767],[-73.73848700000001,40.968414],[-73.738743,40.968158],[-73.739006,40.967916],[-73.739318,40.967833],[-73.739643,40.967839],[-73.739941,40.967895],[-73.74019699999999,40.968054],[-73.74038400000001,40.968227],[-73.740585,40.968345],[-73.740813,40.968372],[-73.741293,40.968396],[-73.741467,40.968405],[-73.74158199999999,40.96841],[-73.74218500000001,40.968535],[-73.742649,40.968729],[-73.742783,40.968807],[-73.74317499999999,40.969033],[-73.74341699999999,40.969289],[-73.743431,40.969504],[-73.74339000000001,40.96967],[-73.743296,40.969905],[-73.74316399999999,40.970235],[-73.74308499999999,40.970462],[-73.743078,40.970718],[-73.743168,40.970905],[-73.74341699999999,40.971141],[-73.743591,40.971272],[-73.743646,40.971417],[-73.74362499999999,40.971805],[-73.74363200000001,40.973528],[-73.74372200000001,40.973701],[-73.744103,40.973992],[-73.744186,40.974158],[-73.744158,40.974345],[-73.74402000000001,40.974483],[-73.743681,40.97467],[-73.74350699999999,40.974829],[-73.743452,40.974961],[-73.743431,40.975154],[-73.743551,40.975627],[-73.743624,40.975917],[-73.743681,40.976023],[-73.74390200000001,40.97612],[-73.744124,40.976203],[-73.744221,40.976293],[-73.74422800000001,40.976397],[-73.74420000000001,40.976487],[-73.744158,40.976514],[-73.743729,40.976542],[-73.74363200000001,40.97659],[-73.743591,40.976673],[-73.743611,40.976985],[-73.74371499999999,40.977293],[-73.743764,40.97741],[-73.744158,40.977964],[-73.74420000000001,40.978199],[-73.744151,40.978408],[-73.744096,40.978739],[-73.744131,40.978884],[-73.744449,40.979476],[-73.744574,40.979822],[-73.744747,40.980217],[-73.744747,40.980429]]],"type":"Polygon"}
}