{
  "id": "360670151005",
  "type": "Feature",
  "properties": {
    "area_land":1080223,
    "area_water":0,
    "geoid":"360670151005",
    "name":"Block Group 5",
    "state":"ny"
},
  "bbox": [
    -76.014652,
    43.013991,
    -75.999997,
    43.029697
],
  "geometry": {"coordinates":[[[-76.014652,43.029212],[-76.014634,43.029283],[-76.014596,43.029315],[-76.012984,43.029351],[-76.012439,43.029365],[-76.012022,43.029375],[-76.011495,43.029372],[-76.00973,43.029353],[-76.009395,43.029348],[-76.009083,43.029349],[-76.008776,43.029361],[-76.00859800000001,43.029369],[-76.008286,43.029401],[-76.00714499999999,43.029536],[-76.006592,43.029611],[-76.00628399999999,43.029656],[-76.006074,43.029697],[-76.005184,43.029636],[-76.00493899999999,43.029608],[-76.004637,43.029558],[-76.004386,43.0295],[-76.00430900000001,43.029342],[-76.004115,43.029045],[-76.003585,43.028311],[-76.002983,43.027496],[-76.00221000000001,43.026459],[-76.00119599999999,43.025079],[-76.00024500000001,43.023788],[-75.99999699999999,43.023438],[-76.00057099999999,43.023375],[-76.00057,43.022948],[-76.00275499999999,43.022789],[-76.00438,43.021498],[-76.005951,43.022262],[-76.00776,43.022234],[-76.011859,43.022173],[-76.011785,43.022068],[-76.011689,43.021976],[-76.011554,43.021907],[-76.011257,43.021834],[-76.010938,43.021787],[-76.010653,43.021764],[-76.01037599999999,43.021799],[-76.010178,43.021801],[-76.009935,43.021762],[-76.009415,43.021597],[-76.00874899999999,43.021401],[-76.00797,43.021068],[-76.007594,43.020864],[-76.007458,43.02077],[-76.007296,43.020591],[-76.007167,43.020429],[-76.00693699999999,43.019985],[-76.00686899999999,43.019789],[-76.006809,43.019712],[-76.006732,43.019661],[-76.00665499999999,43.019593],[-76.006561,43.019422],[-76.006382,43.019277],[-76.00633000000001,43.019153],[-76.006304,43.018991],[-76.00627900000001,43.018479],[-76.006227,43.018044],[-76.006167,43.01777],[-76.00609900000001,43.017557],[-76.006005,43.017438],[-76.00574899999999,43.017284],[-76.005681,43.017207],[-76.005655,43.017068],[-76.005689,43.016855],[-76.00573199999999,43.016786],[-76.00594599999999,43.016641],[-76.006057,43.016513],[-76.006074,43.016436],[-76.00606500000001,43.016291],[-76.006022,43.016146],[-76.005928,43.015933],[-76.005852,43.015873],[-76.00553600000001,43.015797],[-76.005484,43.015754],[-76.005476,43.015694],[-76.005544,43.015515],[-76.00560400000001,43.015447],[-76.005672,43.015396],[-76.005843,43.015353],[-76.006227,43.015319],[-76.00680199999999,43.01537],[-76.00733200000001,43.015455],[-76.00769099999999,43.015558],[-76.008912,43.016206],[-76.0091,43.016232],[-76.00921099999999,43.016215],[-76.00933000000001,43.016164],[-76.009441,43.016087],[-76.009792,43.015771],[-76.010519,43.015246],[-76.010775,43.015007],[-76.01085,43.014913],[-76.01098,43.014751],[-76.011134,43.014512],[-76.011415,43.013991],[-76.01193499999999,43.014069],[-76.011888,43.014229],[-76.011865,43.014268],[-76.010817,43.015574],[-76.01024200000001,43.016326],[-76.00986899999999,43.016872],[-76.009744,43.01708],[-76.009675,43.017214],[-76.00960600000001,43.017423],[-76.009586,43.017567],[-76.009591,43.017784],[-76.009648,43.018056],[-76.009748,43.018263],[-76.00980800000001,43.018349],[-76.00988700000001,43.018462],[-76.010063,43.018642],[-76.010243,43.018779],[-76.011573,43.019688],[-76.011797,43.019855],[-76.012739,43.02058],[-76.013068,43.020871],[-76.013231,43.021057],[-76.014003,43.022125],[-76.014245,43.022464],[-76.01435600000001,43.022659],[-76.014399,43.022752],[-76.014455,43.022979],[-76.01448499999999,43.023368],[-76.01450699999999,43.023826],[-76.014588,43.02493],[-76.014612,43.025926],[-76.01461500000001,43.02618],[-76.014636,43.028277],[-76.014647,43.028756],[-76.014652,43.029212]]],"type":"Polygon"}
}