{
  "id": "360290150031",
  "type": "Feature",
  "properties": {
    "area_land":83549423,
    "area_water":94365,
    "geoid":"360290150031",
    "name":"Block Group 1",
    "state":"ny"
},
  "bbox": [
    -78.581048,
    42.605589,
    -78.462045,
    42.693918
],
  "geometry": {"coordinates":[[[-78.581031,42.60705],[-78.581022,42.607513],[-78.58099199999999,42.610016],[-78.58098200000001,42.61083],[-78.580957,42.613398],[-78.580917,42.615592],[-78.58089099999999,42.616088],[-78.58089200000001,42.616991],[-78.58089200000001,42.617128],[-78.580834,42.618932],[-78.58080699999999,42.621233],[-78.580744,42.624348],[-78.580708,42.627632],[-78.580707,42.627696],[-78.58022800000001,42.627707],[-78.575412,42.627764],[-78.57481799999999,42.627776],[-78.573385,42.627793],[-78.56861000000001,42.627849],[-78.56844100000001,42.627855],[-78.565849,42.627877],[-78.563553,42.627925],[-78.557068,42.62806],[-78.55462300000001,42.628112],[-78.551033,42.628189],[-78.550962,42.626269],[-78.550961,42.626218],[-78.550817,42.62626],[-78.549387,42.626342],[-78.549155,42.626702],[-78.548743,42.626921],[-78.548338,42.627733],[-78.548022,42.627886],[-78.547304,42.628031],[-78.546344,42.628788],[-78.54584699999999,42.628944],[-78.545591,42.629024],[-78.54472199999999,42.629074],[-78.544245,42.629384],[-78.543527,42.629529],[-78.543334,42.629708],[-78.54323100000001,42.629957],[-78.542817,42.630223],[-78.539993,42.631123],[-78.53948099999999,42.631546],[-78.53927899999999,42.631954],[-78.539164,42.632501],[-78.539207,42.633783],[-78.53908,42.633848],[-78.539311,42.634265],[-78.53979200000001,42.634642],[-78.539592,42.635003],[-78.53923899999999,42.635316],[-78.538945,42.635699],[-78.53887400000001,42.636704],[-78.53865,42.636905],[-78.53761900000001,42.637111],[-78.537598,42.636859],[-78.537295,42.63667],[-78.53725,42.636257],[-78.53707199999999,42.636047],[-78.53676299999999,42.636018],[-78.536312,42.635665],[-78.53606499999999,42.635637],[-78.53534500000001,42.635827],[-78.53510199999999,42.635707],[-78.53509200000001,42.635181],[-78.534882,42.634994],[-78.534108,42.634977],[-78.53367799999999,42.634876],[-78.533162,42.634613],[-78.532747,42.634124],[-78.532644,42.633596],[-78.532403,42.63343],[-78.532005,42.633307],[-78.531829,42.633052],[-78.53169699999999,42.632477],[-78.531486,42.632335],[-78.530846,42.632047],[-78.530337,42.631601],[-78.530377,42.631373],[-78.53068399999999,42.630671],[-78.530387,42.630344],[-78.530349,42.629748],[-78.529894,42.629487],[-78.529929,42.628618],[-78.529667,42.628178],[-78.52894000000001,42.627751],[-78.52848299999999,42.627741],[-78.52832100000001,42.627737],[-78.52791499999999,42.627796],[-78.52668,42.627627],[-78.525749,42.626825],[-78.52526,42.626629],[-78.525187,42.626123],[-78.524671,42.625812],[-78.52407700000001,42.62514],[-78.52370000000001,42.625149],[-78.523507,42.625168],[-78.523398,42.625174],[-78.521784,42.62526],[-78.521111,42.625648],[-78.520832,42.625888],[-78.51979799999999,42.626182],[-78.519606,42.626237],[-78.519453,42.626305],[-78.518846,42.626322],[-78.52048000000001,42.628155],[-78.520579,42.628266],[-78.52104799999999,42.628792],[-78.522234,42.630121],[-78.534435,42.643835],[-78.543147,42.653627],[-78.545608,42.656405],[-78.546261,42.657166],[-78.546421,42.657366],[-78.546702,42.657776],[-78.54709,42.658396],[-78.547455,42.659044],[-78.54780599999999,42.65968],[-78.548097,42.660272],[-78.54838700000001,42.660946],[-78.548582,42.661547],[-78.54879800000001,42.662528],[-78.54883599999999,42.662677],[-78.549376,42.662829],[-78.550496,42.663284],[-78.551508,42.663323],[-78.551632,42.663034],[-78.55188699999999,42.662857],[-78.55232100000001,42.662843],[-78.552812,42.662991],[-78.553248,42.662931],[-78.553575,42.662775],[-78.553658,42.662632],[-78.553697,42.662567],[-78.553732,42.662483],[-78.553742,42.662379],[-78.55372,42.662254],[-78.55364899999999,42.662121],[-78.55357600000001,42.662027],[-78.55333,42.661749],[-78.55328,42.661682],[-78.5532,42.661588],[-78.553163,42.66153],[-78.553129,42.661455],[-78.55336200000001,42.660806],[-78.553561,42.66049],[-78.554395,42.660554],[-78.554756,42.660323],[-78.554782,42.660302],[-78.554614,42.659926],[-78.55444799999999,42.659532],[-78.553496,42.657416],[-78.553431,42.65727],[-78.55336200000001,42.657118],[-78.55245600000001,42.655103],[-78.551709,42.653442],[-78.551464,42.652897],[-78.551436,42.652854],[-78.551311,42.652534],[-78.55085,42.65149],[-78.55059,42.651051],[-78.550383,42.650542],[-78.550436,42.650519],[-78.550828,42.650343],[-78.55114500000001,42.650167],[-78.551535,42.649695],[-78.553026,42.649612],[-78.55413799999999,42.649705],[-78.555846,42.649627],[-78.556253,42.649521],[-78.556663,42.649347],[-78.556894,42.648986],[-78.557433,42.648677],[-78.55757,42.648359],[-78.558301,42.647895],[-78.558564,42.647511],[-78.55938500000001,42.647117],[-78.55993700000001,42.646488],[-78.561305,42.646357],[-78.56246899999999,42.645924],[-78.563464,42.645831],[-78.56447199999999,42.645441],[-78.56501400000001,42.645369],[-78.56565500000001,42.645283],[-78.56607,42.644994],[-78.56653900000001,42.644867],[-78.56705100000001,42.644466],[-78.56776600000001,42.644413],[-78.56833399999999,42.64415],[-78.569581,42.643971],[-78.570284,42.643414],[-78.570579,42.643008],[-78.57133399999999,42.642727],[-78.571748,42.642438],[-78.573474,42.64188],[-78.574612,42.64131],[-78.575757,42.641357],[-78.577105,42.640951],[-78.57904499999999,42.639688],[-78.579897,42.639294],[-78.580544,42.639171],[-78.58049800000001,42.642371],[-78.580409,42.648673],[-78.580398,42.649436],[-78.580394,42.649727],[-78.580257,42.655478],[-78.580196,42.659534],[-78.580122,42.664036],[-78.579949,42.671073],[-78.579902,42.673274],[-78.579662,42.684332],[-78.57954599999999,42.687541],[-78.579481,42.691815],[-78.57954599999999,42.69296],[-78.57572,42.692746],[-78.57557,42.692746],[-78.571186,42.692764],[-78.567809,42.692796],[-78.567554,42.692801],[-78.564566,42.692817],[-78.547793,42.69276],[-78.53885200000001,42.69272],[-78.533877,42.692723],[-78.529207,42.692726],[-78.51625300000001,42.692746],[-78.514791,42.692737],[-78.51473300000001,42.692739],[-78.51456399999999,42.692744],[-78.51331,42.692784],[-78.499847,42.693219],[-78.49584400000001,42.6933],[-78.484709,42.693528],[-78.47024999999999,42.693818],[-78.463801,42.693918],[-78.463798,42.6937],[-78.463796,42.693594],[-78.46374,42.691462],[-78.46374299999999,42.690842],[-78.46372700000001,42.687078],[-78.46372700000001,42.687059],[-78.46372,42.684824],[-78.463669,42.679478],[-78.463669,42.679463],[-78.46363599999999,42.678378],[-78.463568,42.674312],[-78.463551,42.673312],[-78.46352899999999,42.672141],[-78.463491,42.670579],[-78.46348500000001,42.670353],[-78.463476,42.669431],[-78.46339,42.666462],[-78.463306,42.662872],[-78.463302,42.662723],[-78.463211,42.659804],[-78.463206,42.659646],[-78.463187,42.659028],[-78.46316899999999,42.658449],[-78.463168,42.658408],[-78.462868,42.649114],[-78.46286499999999,42.649044],[-78.46284799999999,42.64829],[-78.462847,42.648243],[-78.46281,42.647099],[-78.462805,42.646961],[-78.46256700000001,42.640836],[-78.462553,42.639693],[-78.462549,42.639339],[-78.46254399999999,42.638674],[-78.462045,42.62503],[-78.462165,42.620232],[-78.462211,42.617213],[-78.46222,42.616974],[-78.46223000000001,42.616736],[-78.462233,42.616657],[-78.46237000000001,42.606545],[-78.466448,42.606533],[-78.46798200000001,42.606536],[-78.468225,42.606535],[-78.472139,42.606525],[-78.473086,42.606542],[-78.477884,42.606557],[-78.49422199999999,42.606733],[-78.49481299999999,42.60675],[-78.495851,42.606755],[-78.49749799999999,42.606797],[-78.499779,42.606768],[-78.499855,42.606785],[-78.502156,42.606787],[-78.51112000000001,42.60666],[-78.51672600000001,42.606593],[-78.533193,42.606382],[-78.550164,42.605833],[-78.563793,42.605589],[-78.581048,42.605694],[-78.581031,42.60705]]],"type":"Polygon"}
}