{
  "id": "360810779024",
  "type": "Feature",
  "properties": {
    "area_land":61847,
    "area_water":0,
    "geoid":"360810779024",
    "name":"Block Group 4",
    "state":"ny"
},
  "bbox": [
    -73.8317,
    40.724961,
    -73.82708,
    40.728285
],
  "geometry": {"coordinates":[[[-73.831485,40.727995],[-73.83126,40.727963],[-73.83103199999999,40.727944],[-73.830803,40.727938],[-73.830348,40.727967],[-73.82940000000001,40.728285],[-73.828715,40.727058],[-73.82843200000001,40.726722],[-73.828249,40.726583],[-73.828051,40.726453],[-73.82784100000001,40.726335],[-73.82762099999999,40.726228],[-73.82739100000001,40.726135],[-73.82715399999999,40.726054],[-73.82714,40.725885],[-73.82708,40.725132],[-73.827555,40.724961],[-73.827753,40.72513],[-73.827895,40.72523],[-73.82802100000001,40.725308],[-73.828208,40.725407],[-73.828367,40.725478],[-73.828582,40.725557],[-73.828895,40.725642],[-73.82910099999999,40.72568],[-73.82933300000001,40.725734],[-73.829601,40.725818],[-73.829745,40.725874],[-73.82995099999999,40.725968],[-73.830085,40.726039],[-73.83025499999999,40.726143],[-73.830383,40.726233],[-73.830567,40.726384],[-73.830748,40.726566],[-73.830865,40.72671],[-73.831468,40.727664],[-73.8317,40.728034],[-73.831485,40.727995]]],"type":"Polygon"}
}