{
  "id": "360670143001",
  "type": "Feature",
  "properties": {
    "area_land":1994398,
    "area_water":0,
    "geoid":"360670143001",
    "name":"Block Group 1",
    "state":"ny"
},
  "bbox": [
    -76.071072,
    43.055956,
    -76.051041,
    43.071139
],
  "geometry": {"coordinates":[[[-76.07101,43.064631],[-76.070988,43.065063],[-76.07095700000001,43.065625],[-76.07091800000001,43.066059],[-76.07085600000001,43.067005],[-76.07081100000001,43.067644],[-76.070808,43.067861],[-76.070834,43.068261],[-76.070841,43.068493],[-76.070897,43.069239],[-76.070998,43.070489],[-76.07023599999999,43.070549],[-76.067623,43.070615],[-76.06759700000001,43.070638],[-76.067545,43.070649],[-76.06580099999999,43.070724],[-76.065741,43.07072],[-76.065696,43.070705],[-76.065662,43.070683],[-76.065586,43.070607],[-76.065437,43.070644],[-76.06516000000001,43.070674],[-76.063541,43.070738],[-76.061258,43.070826],[-76.058525,43.07094],[-76.058303,43.07097],[-76.05352600000001,43.071139],[-76.053206,43.071131],[-76.051041,43.071079],[-76.051576,43.068061],[-76.051508,43.06791],[-76.051388,43.066475],[-76.051137,43.0631],[-76.051569,43.063118],[-76.05185400000001,43.063131],[-76.05216900000001,43.063146],[-76.052548,43.063163],[-76.054354,43.06324],[-76.05565199999999,43.063293],[-76.056432,43.063334],[-76.057168,43.063363],[-76.057338,43.063371],[-76.05717199999999,43.06096],[-76.057058,43.058102],[-76.057039,43.057622],[-76.057002,43.056631],[-76.056985,43.055962],[-76.060819,43.055956],[-76.061851,43.055969],[-76.064752,43.055964],[-76.06644,43.05596],[-76.066692,43.05596],[-76.066846,43.05596],[-76.06685299999999,43.056031],[-76.066863,43.056136],[-76.066885,43.056372],[-76.066937,43.056895],[-76.066964,43.057119],[-76.066986,43.057306],[-76.06698900000001,43.057355],[-76.067018,43.057778],[-76.06709499999999,43.058571],[-76.067103,43.058655],[-76.067137,43.059267],[-76.067094,43.059621],[-76.067065,43.059744],[-76.06699,43.059986],[-76.066889,43.060226],[-76.066697,43.060566],[-76.066411,43.060927],[-76.066187,43.061152],[-76.066602,43.061414],[-76.06664499999999,43.061441],[-76.06688699999999,43.061616],[-76.067136,43.06181],[-76.067441,43.062084],[-76.067702,43.062323],[-76.068111,43.062712],[-76.068292,43.062888],[-76.06848599999999,43.06307],[-76.068603,43.063178],[-76.06868299999999,43.063253],[-76.068764,43.063327],[-76.06908,43.063552],[-76.06930800000001,43.063769],[-76.069368,43.06381],[-76.06963500000001,43.063928],[-76.070814,43.063981],[-76.071072,43.063993],[-76.07101,43.064631]]],"type":"Polygon"}
}