{
  "id": "361231503001",
  "type": "Feature",
  "properties": {
    "area_land":79966156,
    "area_water":8364247,
    "geoid":"361231503001",
    "name":"Block Group 1",
    "state":"ny"
},
  "bbox": [
    -77.357355,
    42.669025,
    -77.233214,
    42.761587
],
  "geometry": {"coordinates":[[[-77.35735,42.669193],[-77.357337,42.669301],[-77.357333,42.669337],[-77.357305,42.669567],[-77.357305,42.670367],[-77.35725600000001,42.670704],[-77.35720499999999,42.671067],[-77.357105,42.672066],[-77.357005,42.672866],[-77.357006,42.673566],[-77.356906,42.674666],[-77.356906,42.674801],[-77.356906,42.675266],[-77.35680600000001,42.675866],[-77.35680600000001,42.676166],[-77.35672599999999,42.677206],[-77.356486,42.680326],[-77.35640600000001,42.681366],[-77.356306,42.681962],[-77.356206,42.682566],[-77.356106,42.683566],[-77.356106,42.683761],[-77.356106,42.684066],[-77.356106,42.684266],[-77.356106,42.684366],[-77.35608499999999,42.684693],[-77.356025,42.685676],[-77.35600599999999,42.686004],[-77.35600599999999,42.686066],[-77.35583,42.687294],[-77.355806,42.687466],[-77.355806,42.688566],[-77.355706,42.689866],[-77.35542599999999,42.691169],[-77.355406,42.691266],[-77.355306,42.692466],[-77.35510499999999,42.693401],[-77.355006,42.693866],[-77.354806,42.694966],[-77.354606,42.695966],[-77.354563,42.696221],[-77.354406,42.697166],[-77.354221,42.697718],[-77.354006,42.698366],[-77.353747,42.6994],[-77.353606,42.699966],[-77.35300599999999,42.701466],[-77.352779,42.702031],[-77.352406,42.702966],[-77.351906,42.704366],[-77.351206,42.706066],[-77.35027100000001,42.708215],[-77.350206,42.708366],[-77.349406,42.710266],[-77.349121,42.710835],[-77.34860500000001,42.711866],[-77.348333,42.712571],[-77.348105,42.713166],[-77.347505,42.714466],[-77.347217,42.715073],[-77.346605,42.716366],[-77.345805,42.717866],[-77.345005,42.719466],[-77.34428699999999,42.720661],[-77.344105,42.720966],[-77.343205,42.722466],[-77.34300500000001,42.722866],[-77.342405,42.724065],[-77.34220500000001,42.724466],[-77.34140499999999,42.725866],[-77.341272,42.726098],[-77.340605,42.727266],[-77.339905,42.728566],[-77.339305,42.729666],[-77.338536,42.731032],[-77.33840499999999,42.731266],[-77.337605,42.732666],[-77.337279,42.733136],[-77.33670499999999,42.733966],[-77.336262,42.734519],[-77.335905,42.734966],[-77.334987,42.736216],[-77.334805,42.736466],[-77.333505,42.738166],[-77.332705,42.739066],[-77.332041,42.739812],[-77.33190500000001,42.739966],[-77.331005,42.740966],[-77.330405,42.741566],[-77.329705,42.742366],[-77.329233,42.742905],[-77.329005,42.743166],[-77.328205,42.743966],[-77.327505,42.744666],[-77.326905,42.745366],[-77.326105,42.746166],[-77.325605,42.746666],[-77.32510499999999,42.747266],[-77.324405,42.747966],[-77.323739,42.748548],[-77.323605,42.748666],[-77.322605,42.749366],[-77.322005,42.749866],[-77.32160500000001,42.750066],[-77.32155400000001,42.750066],[-77.321404,42.750066],[-77.321354,42.750066],[-77.320228,42.751492],[-77.319919,42.751849],[-77.318682,42.753283],[-77.317314,42.754874],[-77.31618,42.756176],[-77.31552499999999,42.757118],[-77.315006,42.757866],[-77.31446099999999,42.759132],[-77.314154,42.759548],[-77.313546,42.760375],[-77.313272,42.760823],[-77.31300400000001,42.761265],[-77.311515,42.761424],[-77.311412,42.761436],[-77.30949099999999,42.761459],[-77.307024,42.761453],[-77.305617,42.76145],[-77.305528,42.761442],[-77.30504999999999,42.761449],[-77.30361600000001,42.761469],[-77.303139,42.761477],[-77.30294000000001,42.761478],[-77.30234400000001,42.761483],[-77.30214599999999,42.761486],[-77.301545,42.761505],[-77.299744,42.761566],[-77.299144,42.761587],[-77.29812800000001,42.761564],[-77.296565,42.76153],[-77.29508199999999,42.761511],[-77.294067,42.761499],[-77.29052,42.761515],[-77.284615,42.761542],[-77.282437,42.761536],[-77.280233,42.76153],[-77.27995799999999,42.76153],[-77.279881,42.761528],[-77.276335,42.761478],[-77.276279,42.761478],[-77.27611400000001,42.761478],[-77.276059,42.761478],[-77.275305,42.761473],[-77.273043,42.761458],[-77.27229,42.761453],[-77.268291,42.761425],[-77.265738,42.761425],[-77.263685,42.761431],[-77.257105,42.761399],[-77.25586699999999,42.761382],[-77.255627,42.76138],[-77.25374600000001,42.761372],[-77.25119599999999,42.761354],[-77.249719,42.761345],[-77.248738,42.761343],[-77.247006,42.761342],[-77.24579799999999,42.761346],[-77.244818,42.761351],[-77.244319,42.761353],[-77.242825,42.761361],[-77.242327,42.761365],[-77.242195,42.761365],[-77.2418,42.761367],[-77.241669,42.761368],[-77.241546,42.761368],[-77.24136300000001,42.76137],[-77.241225,42.76137],[-77.241178,42.76137],[-77.241056,42.761371],[-77.239664,42.761374],[-77.235488,42.761387],[-77.235258,42.761388],[-77.23409700000001,42.761384],[-77.23409599999999,42.761238],[-77.234095,42.760807],[-77.234095,42.760663],[-77.234094,42.760639],[-77.234094,42.760566],[-77.234094,42.760544],[-77.234093,42.760298],[-77.23408999999999,42.759561],[-77.234089,42.759317],[-77.23408499999999,42.759142],[-77.234073,42.758621],[-77.23406900000001,42.758447],[-77.234056,42.757594],[-77.23402,42.755041],[-77.234008,42.75419],[-77.234004,42.753847],[-77.233992,42.752818],[-77.23398899999999,42.752475],[-77.234036,42.751284],[-77.234086,42.750031],[-77.23412399999999,42.747716],[-77.234144,42.746526],[-77.234092,42.746026],[-77.23393799999999,42.744529],[-77.233887,42.74403],[-77.23388,42.74263],[-77.233859,42.738431],[-77.233853,42.737033],[-77.233844,42.736434],[-77.233818,42.734641],[-77.23381000000001,42.734043],[-77.23378200000001,42.732267],[-77.233698,42.726941],[-77.233671,42.725166],[-77.233634,42.722459],[-77.23352199999999,42.714338],[-77.233487,42.711633],[-77.233486,42.711599],[-77.233484,42.711498],[-77.233484,42.711465],[-77.23344899999999,42.710929],[-77.23334699999999,42.709323],[-77.233315,42.708789],[-77.233312,42.708569],[-77.233306,42.707912],[-77.233304,42.707693],[-77.233395,42.70747],[-77.233419,42.70733],[-77.233424,42.707122],[-77.233389,42.706497],[-77.23338699999999,42.706455],[-77.23341000000001,42.705639],[-77.23334800000001,42.704578],[-77.23329099999999,42.703206],[-77.23328600000001,42.702852],[-77.233278,42.702071],[-77.233284,42.701946],[-77.233289,42.701828],[-77.233318,42.701718],[-77.233361,42.701654],[-77.233357,42.701414],[-77.233345,42.700697],[-77.23334199999999,42.700458],[-77.233341,42.700424],[-77.233339,42.700322],[-77.233339,42.700289],[-77.23328600000001,42.696181],[-77.233214,42.690495],[-77.23985,42.690502],[-77.24395800000001,42.690507],[-77.243955,42.690352],[-77.24395,42.689955],[-77.243956,42.689889],[-77.243965,42.689811],[-77.24401400000001,42.689753],[-77.244156,42.683568],[-77.244906,42.683561],[-77.249701,42.683525],[-77.25116300000001,42.683528],[-77.25126400000001,42.676381],[-77.258522,42.676119],[-77.258521,42.675975],[-77.25848000000001,42.669039],[-77.266587,42.669058],[-77.27717800000001,42.669032],[-77.278355,42.669039],[-77.282685,42.669043],[-77.28564900000001,42.669039],[-77.294543,42.669028],[-77.29750799999999,42.669025],[-77.299296,42.669032],[-77.304661,42.669056],[-77.30645,42.669066],[-77.306735,42.669073],[-77.307593,42.669095],[-77.307879,42.669103],[-77.308894,42.669107],[-77.311939,42.669122],[-77.312955,42.669128],[-77.313626,42.669121],[-77.31564,42.669104],[-77.316312,42.6691],[-77.333854,42.669082],[-77.340037,42.669105],[-77.347853,42.669143],[-77.34925200000001,42.669128],[-77.34943699999999,42.669134],[-77.349992,42.669152],[-77.350177,42.669159],[-77.350238,42.669157],[-77.350424,42.669155],[-77.350486,42.669155],[-77.351859,42.669155],[-77.355981,42.669157],[-77.357355,42.669158],[-77.35735,42.669193]]],"type":"Polygon"}
}