{
  "id": "360290017002",
  "type": "Feature",
  "properties": {
    "area_land":277478,
    "area_water":0,
    "geoid":"360290017002",
    "name":"Block Group 2",
    "state":"ny"
},
  "bbox": [
    -78.844086,
    42.876667,
    -78.839222,
    42.885055
],
  "geometry": {"coordinates":[[[-78.844084,42.877911],[-78.844081,42.878931],[-78.844078,42.87935],[-78.84407299999999,42.88014],[-78.84407,42.880592],[-78.84406300000001,42.881034],[-78.844059,42.881335],[-78.84405,42.881923],[-78.84404499999999,42.882664],[-78.844038,42.883336],[-78.844027,42.885055],[-78.843035,42.885042],[-78.84304400000001,42.883339],[-78.842522,42.883342],[-78.84180600000001,42.883352],[-78.83944200000001,42.883346],[-78.839229,42.883346],[-78.83922800000001,42.882206],[-78.839225,42.881622],[-78.839225,42.881086],[-78.839224,42.88014],[-78.839223,42.879662],[-78.839223,42.879293],[-78.83922200000001,42.879245],[-78.839232,42.879098],[-78.83926200000001,42.878953],[-78.839311,42.878811],[-78.83938000000001,42.878674],[-78.839467,42.878542],[-78.839614,42.878374],[-78.83974499999999,42.878259],[-78.83984,42.878188],[-78.841521,42.876935],[-78.841719,42.876788],[-78.841914,42.876667],[-78.841917,42.876841],[-78.842687,42.876973],[-78.844086,42.877213],[-78.844084,42.877911]]],"type":"Polygon"}
}