{
  "id": "360050185002",
  "type": "Feature",
  "properties": {
    "area_land":40269,
    "area_water":0,
    "geoid":"360050185002",
    "name":"Block Group 2",
    "state":"ny"
},
  "bbox": [
    -73.905531,
    40.828194,
    -73.902275,
    40.830625
],
  "geometry": {"coordinates":[[[-73.905531,40.829104],[-73.904506,40.830625],[-73.904173,40.830521],[-73.903846,40.83045],[-73.903541,40.830436],[-73.902275,40.829637],[-73.90239200000001,40.829463],[-73.90346099999999,40.828533],[-73.903852,40.828194],[-73.90509,40.829014],[-73.905531,40.829104]]],"type":"Polygon"}
}