{
  "id": "360610066005",
  "type": "Feature",
  "properties": {
    "area_land":17036,
    "area_water":0,
    "geoid":"360610066005",
    "name":"Block Group 5",
    "state":"ny"
},
  "bbox": [
    -73.982665,
    40.73855,
    -73.979967,
    40.740115
],
  "geometry": {"coordinates":[[[-73.98221100000001,40.740115],[-73.979967,40.739168],[-73.980418,40.73855],[-73.982665,40.739497],[-73.98221100000001,40.740115]]],"type":"Polygon"}
}