{
  "id": "360610121006",
  "type": "Feature",
  "properties": {
    "area_land":22082,
    "area_water":0,
    "geoid":"360610121006",
    "name":"Block Group 6",
    "state":"ny"
},
  "bbox": [
    -73.99407,
    40.760354,
    -73.990764,
    40.762184
],
  "geometry": {"coordinates":[[[-73.99360900000001,40.762184],[-73.992656,40.761784],[-73.992363,40.76166],[-73.990764,40.760988],[-73.99123,40.760354],[-73.99281000000001,40.76102],[-73.993101,40.761143],[-73.99406999999999,40.761552],[-73.99360900000001,40.762184]]],"type":"Polygon"}
}