{
  "id": "360594140013",
  "type": "Feature",
  "properties": {
    "area_land":218630,
    "area_water":0,
    "geoid":"360594140013",
    "name":"Block Group 3",
    "state":"ny"
},
  "bbox": [
    -73.581896,
    40.679587,
    -73.574607,
    40.685091
],
  "geometry": {"coordinates":[[[-73.581896,40.684827],[-73.581594,40.68486],[-73.580119,40.684954],[-73.57922499999999,40.685019],[-73.57832399999999,40.685083],[-73.578211,40.685091],[-73.57814500000001,40.684514],[-73.57811,40.684415],[-73.57807699999999,40.684382],[-73.577995,40.684332],[-73.577901,40.684307],[-73.577072,40.684358],[-73.57701400000001,40.684263],[-73.576959,40.683715],[-73.576885,40.68372],[-73.57684999999999,40.68348],[-73.576791,40.68296],[-73.576655,40.682966],[-73.575486,40.683049],[-73.57534200000001,40.683049],[-73.575266,40.683035],[-73.57516200000001,40.682996],[-73.575108,40.682963],[-73.575019,40.682877],[-73.574894,40.682674],[-73.574822,40.682495],[-73.574755,40.682349],[-73.57470600000001,40.682157],[-73.57464899999999,40.681726],[-73.574607,40.681251],[-73.574617,40.680924],[-73.57462099999999,40.680702],[-73.57465500000001,40.68045],[-73.57477,40.680077],[-73.574771,40.679915],[-73.574737,40.679679],[-73.57493100000001,40.679657],[-73.575638,40.679594],[-73.57584,40.679587],[-73.576063,40.6796],[-73.577479,40.679676],[-73.578065,40.679712],[-73.57840299999999,40.679722],[-73.579099,40.679759],[-73.579311,40.680829],[-73.57938799999999,40.681285],[-73.579396,40.681402],[-73.579476,40.682086],[-73.579556,40.682771],[-73.579645,40.683531],[-73.580403,40.683481],[-73.580726,40.683459],[-73.581684,40.683392],[-73.581729,40.683794],[-73.58178700000001,40.684295],[-73.581828,40.684651],[-73.581851,40.684727],[-73.581875,40.684781],[-73.581896,40.684827]]],"type":"Polygon"}
}