{
  "id": "360471124001",
  "type": "Feature",
  "properties": {
    "area_land":51878,
    "area_water":0,
    "geoid":"360471124001",
    "name":"Block Group 1",
    "state":"ny"
},
  "bbox": [
    -73.886183,
    40.665141,
    -73.883152,
    40.667905
],
  "geometry": {"coordinates":[[[-73.886183,40.667521],[-73.88529699999999,40.667653],[-73.884411,40.667785],[-73.88359699999999,40.667905],[-73.883199,40.666376],[-73.883152,40.666181],[-73.883309,40.666112],[-73.883912,40.665852],[-73.884122,40.665761],[-73.884743,40.665495],[-73.88493699999999,40.665407],[-73.885563,40.665141],[-73.885795,40.665994],[-73.886183,40.667521]]],"type":"Polygon"}
}