{
  "id": "360150103002",
  "type": "Feature",
  "properties": {
    "area_land":30259932,
    "area_water":10406,
    "geoid":"360150103002",
    "name":"Block Group 2",
    "state":"ny"
},
  "bbox": [
    -76.966091,
    42.143438,
    -76.888079,
    42.200273
],
  "geometry": {"coordinates":[[[-76.96609100000001,42.143547],[-76.96605700000001,42.143652],[-76.966024,42.143753],[-76.965754,42.144581],[-76.965887,42.146577],[-76.965901,42.146783],[-76.965909,42.146903],[-76.96590500000001,42.146923],[-76.965846,42.147275],[-76.965766,42.147658],[-76.965751,42.147723],[-76.965897,42.148331],[-76.96589299999999,42.148427],[-76.965878,42.149872],[-76.965887,42.150107],[-76.965953,42.151822],[-76.965946,42.152371],[-76.965895,42.153283],[-76.965817,42.153945],[-76.965748,42.154523],[-76.965737,42.154632],[-76.965737,42.154694],[-76.965648,42.16609],[-76.96556099999999,42.174588],[-76.96555499999999,42.175162],[-76.965507,42.180063],[-76.96546600000001,42.184602],[-76.96546600000001,42.184705],[-76.965435,42.191578],[-76.965434,42.191867],[-76.965433,42.192226],[-76.965423,42.193166],[-76.965411,42.194623],[-76.96537600000001,42.199156],[-76.96172900000001,42.19919],[-76.955012,42.199045],[-76.953656,42.199041],[-76.95023399999999,42.19907],[-76.93651800000001,42.199144],[-76.93622499999999,42.199151],[-76.93594,42.199157],[-76.923041,42.199457],[-76.918736,42.199557],[-76.910214,42.199754],[-76.902964,42.199923],[-76.90084299999999,42.199976],[-76.896649,42.200117],[-76.896385,42.20012],[-76.896188,42.200124],[-76.892999,42.200157],[-76.889859,42.200273],[-76.889726,42.199755],[-76.88959699999999,42.199332],[-76.889498,42.199019],[-76.88936099999999,42.198244],[-76.889323,42.19776],[-76.889308,42.197058],[-76.889338,42.19641],[-76.889521,42.1957],[-76.88965899999999,42.195399],[-76.889826,42.194998],[-76.890055,42.194655],[-76.89028500000001,42.194404],[-76.890475,42.194197],[-76.890818,42.193705],[-76.891001,42.193396],[-76.891169,42.193022],[-76.891246,42.192797],[-76.891251,42.192777],[-76.891383,42.192259],[-76.891497,42.19187],[-76.89159600000001,42.191592],[-76.89183300000001,42.191027],[-76.892066,42.190587],[-76.89219900000001,42.190337],[-76.892398,42.189093],[-76.89239000000001,42.18883],[-76.89236,42.188494],[-76.892016,42.187617],[-76.891642,42.186968],[-76.89114600000001,42.186278],[-76.890795,42.185648],[-76.890483,42.185061],[-76.890147,42.184309],[-76.88992,42.183543],[-76.889788,42.183119],[-76.889464,42.181893],[-76.889185,42.180975],[-76.889048,42.180674],[-76.88888,42.180277],[-76.888316,42.178934],[-76.888198,42.178677],[-76.888178,42.178633],[-76.888094,42.178374],[-76.888079,42.177985],[-76.888176,42.177075],[-76.888201,42.17684],[-76.888507,42.175787],[-76.88869099999999,42.175223],[-76.88882700000001,42.174875],[-76.88885000000001,42.174818],[-76.889842,42.173506],[-76.890147,42.173105],[-76.89019999999999,42.173029],[-76.891001,42.171953],[-76.89116199999999,42.171747],[-76.891948,42.170721],[-76.892253,42.170332],[-76.892864,42.169535],[-76.892978,42.169386],[-76.89300799999999,42.169352],[-76.893863,42.168196],[-76.894717,42.167051],[-76.89496800000001,42.16672],[-76.895839,42.165571],[-76.89627400000001,42.164976],[-76.896625,42.164507],[-76.89751,42.163504],[-76.898349,42.162539],[-76.898512,42.162377],[-76.898715,42.162176],[-76.89895199999999,42.161963],[-76.899135,42.161822],[-76.89934100000001,42.161673],[-76.899692,42.161482],[-76.90043900000001,42.161146],[-76.901241,42.160803],[-76.903656,42.159675],[-76.904123,42.159474],[-76.904781,42.15931],[-76.905277,42.159216],[-76.906795,42.158957],[-76.907169,42.158953],[-76.907428,42.158976],[-76.909305,42.159067],[-76.912746,42.159187],[-76.913021,42.159197],[-76.916149,42.159331],[-76.916752,42.159411],[-76.91766,42.159579],[-76.91824699999999,42.159659],[-76.91930600000001,42.159768],[-76.91972800000001,42.159811],[-76.920714,42.159909],[-76.921032,42.159941],[-76.921162,42.159952],[-76.921406,42.159979],[-76.922406,42.160078],[-76.923345,42.160175],[-76.923466,42.160188],[-76.923733,42.160216],[-76.924099,42.160216],[-76.924122,42.160488],[-76.926338,42.159526],[-76.936004,42.15533],[-76.94319400000001,42.15221],[-76.943973,42.151873],[-76.94499,42.151436],[-76.946753,42.150667],[-76.946913,42.150774],[-76.948652,42.151926],[-76.948645,42.15172],[-76.948448,42.149953],[-76.94824,42.148085],[-76.948194,42.147806],[-76.94803400000001,42.146265],[-76.947958,42.145681],[-76.94959799999999,42.145784],[-76.949888,42.145804],[-76.95142199999999,42.145891],[-76.952,42.145913],[-76.95204,42.145914],[-76.95363399999999,42.145994],[-76.954847,42.146059],[-76.955168,42.146063],[-76.955519,42.146021],[-76.955832,42.145926],[-76.95616,42.145727],[-76.95719699999999,42.145002],[-76.95786099999999,42.144747],[-76.95928000000001,42.144526],[-76.96005100000001,42.14448],[-76.96058499999999,42.144381],[-76.96137899999999,42.144167],[-76.963446,42.143557],[-76.963988,42.143461],[-76.964545,42.143438],[-76.96574099999999,42.143456],[-76.966041,42.143471],[-76.966064,42.143496],[-76.96607899999999,42.143532],[-76.96609100000001,42.143547]]],"type":"Polygon"}
}