{
  "id": "360290044014",
  "type": "Feature",
  "properties": {
    "area_land":247822,
    "area_water":0,
    "geoid":"360290044014",
    "name":"Block Group 4",
    "state":"ny"
},
  "bbox": [
    -78.804177,
    42.937324,
    -78.798562,
    42.944099
],
  "geometry": {"coordinates":[[[-78.80365999999999,42.942031],[-78.803366,42.942147],[-78.80335100000001,42.942166],[-78.803352,42.942193],[-78.799689,42.943652],[-78.799036,42.943905],[-78.798562,42.944099],[-78.798824,42.942921],[-78.79882000000001,42.940938],[-78.799082,42.938117],[-78.799025,42.938064],[-78.799025,42.937342],[-78.80056500000001,42.93734],[-78.80211,42.937337],[-78.802622,42.937335],[-78.803391,42.937324],[-78.803629,42.937324],[-78.80364400000001,42.939327],[-78.803653,42.941101],[-78.804177,42.941825],[-78.80365999999999,42.942031]]],"type":"Polygon"}
}