{
  "id": "360550112051",
  "type": "Feature",
  "properties": {
    "area_land":1814577,
    "area_water":636,
    "geoid":"360550112051",
    "name":"Block Group 1",
    "state":"ny"
},
  "bbox": [
    -77.491009,
    43.21376,
    -77.475015,
    43.230605
],
  "geometry": {"coordinates":[[[-77.490413,43.215718],[-77.48872299999999,43.218965],[-77.48720299999999,43.22184],[-77.4868,43.222599],[-77.486756,43.222695],[-77.486672,43.223004],[-77.486634,43.223191],[-77.486616,43.223347],[-77.486609,43.223545],[-77.48661199999999,43.22368],[-77.486628,43.223838],[-77.486818,43.224874],[-77.487032,43.22708],[-77.487382,43.230605],[-77.48712399999999,43.230581],[-77.48535699999999,43.230417],[-77.48464300000001,43.230364],[-77.48424300000001,43.230339],[-77.483846,43.230322],[-77.482809,43.230278],[-77.482545,43.230273],[-77.48218900000001,43.230269],[-77.480969,43.230298],[-77.480559,43.230306],[-77.480175,43.230316],[-77.47806199999999,43.230367],[-77.475965,43.230411],[-77.475949,43.229306],[-77.475936,43.228427],[-77.475917,43.227545],[-77.475911,43.226648],[-77.475904,43.226211],[-77.47589499999999,43.224404],[-77.47589600000001,43.224224],[-77.47589600000001,43.224043],[-77.475882,43.221575],[-77.47586800000001,43.220253],[-77.475853,43.219332],[-77.475843,43.218699],[-77.475838,43.218399],[-77.475825,43.217494],[-77.47557999999999,43.216422],[-77.475256,43.214856],[-77.475194,43.214559],[-77.475117,43.214214],[-77.47509700000001,43.214123],[-77.475015,43.213795],[-77.47615399999999,43.21376],[-77.477769,43.213788],[-77.478904,43.21377],[-77.479902,43.213784],[-77.48151300000001,43.213773],[-77.482568,43.213815],[-77.483328,43.213887],[-77.48520600000001,43.214036],[-77.487036,43.214207],[-77.48881,43.214327],[-77.49030399999999,43.214334],[-77.49100900000001,43.214584],[-77.490413,43.215718]]],"type":"Polygon"}
}