{
  "id": "360550112073",
  "type": "Feature",
  "properties": {
    "area_land":1682572,
    "area_water":0,
    "geoid":"360550112073",
    "name":"Block Group 3",
    "state":"ny"
},
  "bbox": [
    -77.496209,
    43.203943,
    -77.474625,
    43.214584
],
  "geometry": {"coordinates":[[[-77.495672,43.205644],[-77.49448599999999,43.207952],[-77.493447,43.209916],[-77.493061,43.210644],[-77.49211,43.212463],[-77.49183499999999,43.212995],[-77.49114899999999,43.2143],[-77.49111600000001,43.214364],[-77.49100900000001,43.214584],[-77.49030399999999,43.214334],[-77.48881,43.214327],[-77.487036,43.214207],[-77.48520600000001,43.214036],[-77.483328,43.213887],[-77.482568,43.213815],[-77.48151300000001,43.213773],[-77.479902,43.213784],[-77.478904,43.21377],[-77.477769,43.213788],[-77.47615399999999,43.21376],[-77.475015,43.213795],[-77.47500700000001,43.213763],[-77.474926,43.213417],[-77.474906,43.213331],[-77.474861,43.213084],[-77.47480299999999,43.212771],[-77.47475300000001,43.212498],[-77.47472399999999,43.212339],[-77.474639,43.211575],[-77.474636,43.208629],[-77.474632,43.20748],[-77.474625,43.205085],[-77.47687000000001,43.204694],[-77.477413,43.204621],[-77.47789,43.204572],[-77.48291,43.204168],[-77.484652,43.204064],[-77.485975,43.203983],[-77.48751900000001,43.203943],[-77.492019,43.203961],[-77.493143,43.204156],[-77.49329299999999,43.204181],[-77.49356899999999,43.204226],[-77.494598,43.204396],[-77.49620899999999,43.204637],[-77.495672,43.205644]]],"type":"Polygon"}
}