{
  "id": "360550062003",
  "type": "Feature",
  "properties": {
    "area_land":183197,
    "area_water":0,
    "geoid":"360550062003",
    "name":"Block Group 3",
    "state":"ny"
},
  "bbox": [
    -77.662597,
    43.137956,
    -77.653884,
    43.144341
],
  "geometry": {"coordinates":[[[-77.66259700000001,43.141378],[-77.660904,43.141969],[-77.65916300000001,43.142565],[-77.658767,43.142701],[-77.658399,43.142824],[-77.655815,43.143697],[-77.65460899999999,43.144101],[-77.653915,43.144341],[-77.65390600000001,43.143879],[-77.653892,43.143033],[-77.653892,43.14293],[-77.65388400000001,43.142183],[-77.65576900000001,43.142141],[-77.65678200000001,43.142122],[-77.65702,43.142113],[-77.657273,43.142082],[-77.658325,43.141938],[-77.658235,43.141726],[-77.65818,43.141572],[-77.65810399999999,43.141263],[-77.658081,43.141187],[-77.65802600000001,43.140849],[-77.65801500000001,43.140582],[-77.65802600000001,43.140349],[-77.65803,43.140117],[-77.658083,43.139704],[-77.65812099999999,43.139525],[-77.658151,43.139439],[-77.65838599999999,43.138651],[-77.658411,43.138546],[-77.66017100000001,43.137956],[-77.660644,43.138616],[-77.661125,43.139291],[-77.66160600000001,43.139962],[-77.66207799999999,43.140637],[-77.66231399999999,43.140974],[-77.66259700000001,43.141378]]],"type":"Polygon"}
}