{
  "id": "360910619011",
  "type": "Feature",
  "properties": {
    "area_land":1102771,
    "area_water":0,
    "geoid":"360910619011",
    "name":"Block Group 1",
    "state":"ny"
},
  "bbox": [
    -73.82521,
    42.922652,
    -73.813514,
    42.935585
],
  "geometry": {"coordinates":[[[-73.82521,42.935181],[-73.824668,42.935209],[-73.82386200000001,42.935252],[-73.821535,42.935436],[-73.821253,42.935464],[-73.82023100000001,42.935545],[-73.819245,42.935585],[-73.818427,42.935575],[-73.815214,42.935527],[-73.813973,42.935474],[-73.813867,42.934527],[-73.813811,42.933877],[-73.813641,42.932666],[-73.813652,42.932576],[-73.813697,42.932472],[-73.813832,42.932311],[-73.813971,42.932193],[-73.814086,42.932116],[-73.81459099999999,42.931856],[-73.81476600000001,42.931722],[-73.81485499999999,42.931626],[-73.815372,42.930878],[-73.81542,42.930779],[-73.81547399999999,42.930573],[-73.81547999999999,42.930446],[-73.81545300000001,42.930277],[-73.815354,42.929751],[-73.815288,42.929212],[-73.81526599999999,42.929023],[-73.815225,42.928874],[-73.815166,42.928753],[-73.81507499999999,42.928669],[-73.81499700000001,42.928613],[-73.814808,42.928529],[-73.814556,42.928445],[-73.81426399999999,42.928301],[-73.813514,42.927809],[-73.81375,42.927602],[-73.813946,42.9274],[-73.814485,42.926911],[-73.81446099999999,42.926901],[-73.814328,42.926792],[-73.81422999999999,42.926695],[-73.814106,42.926516],[-73.81405100000001,42.926392],[-73.813987,42.926215],[-73.813968,42.926003],[-73.81397800000001,42.9258],[-73.814678,42.925748],[-73.815091,42.925649],[-73.81514300000001,42.925641],[-73.815195,42.925658],[-73.815145,42.925549],[-73.81472599999999,42.924443],[-73.814488,42.923687],[-73.814435,42.923463],[-73.814402,42.92322],[-73.814976,42.923176],[-73.82292099999999,42.922652],[-73.822981,42.923142],[-73.823004,42.923268],[-73.82304600000001,42.923621],[-73.82308500000001,42.923795],[-73.823221,42.924399],[-73.823459,42.925157],[-73.823533,42.925496],[-73.823618,42.925881],[-73.823796,42.92686],[-73.82380999999999,42.926936],[-73.823971,42.927813],[-73.823987,42.927879],[-73.824162,42.928789],[-73.824226,42.929302],[-73.82431800000001,42.929867],[-73.824606,42.931641],[-73.824887,42.933189],[-73.82508799999999,42.934425],[-73.825136,42.934731],[-73.82521,42.935181]]],"type":"Polygon"}
}