{
  "id": "360550080001",
  "type": "Feature",
  "properties": {
    "area_land":199765,
    "area_water":0,
    "geoid":"360550080001",
    "name":"Block Group 1",
    "state":"ny"
},
  "bbox": [
    -77.591525,
    43.175452,
    -77.586514,
    43.182317
],
  "geometry": {"coordinates":[[[-77.591525,43.182183],[-77.58651399999999,43.182317],[-77.58670499999999,43.182031],[-77.586934,43.181699],[-77.58733100000001,43.181115],[-77.587789,43.180475],[-77.58791100000001,43.180292],[-77.588262,43.179771],[-77.588741,43.179078],[-77.589956,43.17732],[-77.590108,43.177102],[-77.587423,43.177381],[-77.587377,43.176622],[-77.587323,43.175531],[-77.588498,43.175506],[-77.59122600000001,43.175452],[-77.59109599999999,43.175662],[-77.591123,43.175966],[-77.591161,43.176496],[-77.591228,43.177451],[-77.591268,43.178189],[-77.59132099999999,43.178952],[-77.591359,43.179532],[-77.59136700000001,43.179677],[-77.591398,43.180158],[-77.591413,43.180368],[-77.59145599999999,43.181015],[-77.591489,43.181609],[-77.591525,43.182183]]],"type":"Polygon"}
}