{
  "id": "360810414001",
  "type": "Feature",
  "properties": {
    "area_land":311778,
    "area_water":0,
    "geoid":"360810414001",
    "name":"Block Group 1",
    "state":"ny"
},
  "bbox": [
    -73.7832,
    40.696871,
    -73.773957,
    40.703217
],
  "geometry": {"coordinates":[[[-73.78319999999999,40.700699],[-73.782757,40.700745],[-73.782391,40.701382],[-73.782027,40.702031],[-73.781656,40.702598],[-73.78045,40.70228],[-73.77784200000001,40.703217],[-73.77691,40.702525],[-73.773957,40.699806],[-73.775057,40.69934],[-73.775834,40.698988],[-73.77663099999999,40.69862],[-73.777445,40.69826],[-73.778263,40.69791],[-73.779082,40.697564],[-73.7799,40.697218],[-73.78072,40.696871],[-73.78187800000001,40.698454],[-73.78284499999999,40.699767],[-73.78319999999999,40.700699]]],"type":"Polygon"}
}