{
  "id": "360550130014",
  "type": "Feature",
  "properties": {
    "area_land":6657033,
    "area_water":183384,
    "geoid":"360550130014",
    "name":"Block Group 4",
    "state":"ny"
},
  "bbox": [
    -77.616,
    43.094836,
    -77.571374,
    43.115957
],
  "geometry": {"coordinates":[[[-77.616,43.110593],[-77.61590700000001,43.110555],[-77.61470300000001,43.110173],[-77.614676,43.11016],[-77.614425,43.110068],[-77.61438699999999,43.110063],[-77.61434199999999,43.110041],[-77.61426,43.110019],[-77.614193,43.110008],[-77.613848,43.109887],[-77.613788,43.109876],[-77.613743,43.109854],[-77.613601,43.109827],[-77.613563,43.109805],[-77.613399,43.10975],[-77.613219,43.109712],[-77.613136,43.109674],[-77.613024,43.109663],[-77.612987,43.109635],[-77.612942,43.10963],[-77.612921,43.109609],[-77.612863,43.109592],[-77.61275500000001,43.109559],[-77.61271000000001,43.109542],[-77.612657,43.109531],[-77.612612,43.109515],[-77.612516,43.109487],[-77.611699,43.111005],[-77.61120699999999,43.111908],[-77.612039,43.111882],[-77.611727,43.112872],[-77.611251,43.114398],[-77.610474,43.114422],[-77.60983899999999,43.114439],[-77.609571,43.114927],[-77.60472300000001,43.115091],[-77.60206599999999,43.115177],[-77.60179599999999,43.115187],[-77.600438,43.11523],[-77.597002,43.115339],[-77.591883,43.115428],[-77.59101,43.115452],[-77.58546699999999,43.115601],[-77.579578,43.115758],[-77.574868,43.115886],[-77.57137400000001,43.115957],[-77.57205500000001,43.114797],[-77.57307299999999,43.112829],[-77.573432,43.112144],[-77.57358000000001,43.111862],[-77.574732,43.109805],[-77.575459,43.108506],[-77.575613,43.10823],[-77.575637,43.108188],[-77.575765,43.10792],[-77.57578599999999,43.107875],[-77.57599399999999,43.107456],[-77.576156,43.107142],[-77.576256,43.106943],[-77.57678199999999,43.105902],[-77.577823,43.104008],[-77.57881999999999,43.102125],[-77.57946200000001,43.100913],[-77.580072,43.099737],[-77.580144,43.099593],[-77.580225,43.099432],[-77.580258,43.099366],[-77.580322,43.099231],[-77.580172,43.099181],[-77.579876,43.099094],[-77.5796,43.099014],[-77.576329,43.098062],[-77.573403,43.097136],[-77.573205,43.096974],[-77.573108,43.096896],[-77.572231,43.096193],[-77.572993,43.096155],[-77.575822,43.096098],[-77.57641099999999,43.096056],[-77.57702,43.096035],[-77.577083,43.096033],[-77.57987199999999,43.095928],[-77.579983,43.095931],[-77.580269,43.095938],[-77.580686,43.095949],[-77.58076699999999,43.095936],[-77.58080699999999,43.095929],[-77.58082,43.095927],[-77.58131299999999,43.095911],[-77.581964,43.095889],[-77.58604200000001,43.095752],[-77.586448,43.095739],[-77.588201,43.095682],[-77.597038,43.095383],[-77.59872300000001,43.095325],[-77.60104699999999,43.09523],[-77.60124500000001,43.095222],[-77.601585,43.095214],[-77.601634,43.095213],[-77.60205000000001,43.095203],[-77.602082,43.095202],[-77.60325,43.09516],[-77.604077,43.095131],[-77.606003,43.095054],[-77.60626999999999,43.095043],[-77.611237,43.094855],[-77.611318,43.094852],[-77.61179799999999,43.094836],[-77.61223099999999,43.095947],[-77.61224799999999,43.09599],[-77.61227100000001,43.096049],[-77.612296,43.096089],[-77.612517,43.096441],[-77.612691,43.096735],[-77.61286,43.097024],[-77.613032,43.097383],[-77.613382,43.098179],[-77.61396499999999,43.099658],[-77.61424700000001,43.100472],[-77.614902,43.102221],[-77.615109,43.102773],[-77.615246,43.10322],[-77.615447,43.103808],[-77.61554,43.104135],[-77.615605,43.104402],[-77.615649,43.104669],[-77.615675,43.104846],[-77.61573,43.106055],[-77.615774,43.106521],[-77.61579,43.106733],[-77.615848,43.106867],[-77.615864,43.107095],[-77.61588399999999,43.107387],[-77.615909,43.107734],[-77.61591300000001,43.107791],[-77.615923,43.107944],[-77.615928,43.108012],[-77.615944,43.108216],[-77.615954,43.108361],[-77.61596900000001,43.108562],[-77.615972,43.108677],[-77.61597999999999,43.110131],[-77.61599,43.110355],[-77.615993,43.110447],[-77.615998,43.110539],[-77.616,43.110593]]],"type":"Polygon"}
}