{
  "id": "360470218001",
  "type": "Feature",
  "properties": {
    "area_land":56493,
    "area_water":0,
    "geoid":"360470218001",
    "name":"Block Group 1",
    "state":"ny"
},
  "bbox": [
    -73.997813,
    40.631667,
    -73.993866,
    40.634673
],
  "geometry": {"coordinates":[[[-73.997231,40.633556],[-73.99665,40.634115],[-73.996067,40.634673],[-73.995075,40.634077],[-73.993866,40.633347],[-73.994451,40.632785],[-73.995034,40.63223],[-73.995394,40.631881],[-73.995617,40.631667],[-73.99781299999999,40.632996],[-73.997231,40.633556]]],"type":"Polygon"}
}