{
  "id": "361031699023",
  "type": "Feature",
  "properties": {
    "area_land":1794786,
    "area_water":8537597,
    "geoid":"361031699023",
    "name":"Block Group 3",
    "state":"ny"
},
  "bbox": [
    -72.598282,
    40.920771,
    -72.534573,
    40.953324
],
  "geometry": {"coordinates":[[[-72.598282,40.923579],[-72.597127,40.927216],[-72.59611200000001,40.930777],[-72.59562099999999,40.93232],[-72.59553699999999,40.932381],[-72.596355,40.932728],[-72.595674,40.933331],[-72.59584700000001,40.933445],[-72.59586,40.93347],[-72.595851,40.933509],[-72.595838,40.933527],[-72.595776,40.93359],[-72.59565600000001,40.934314],[-72.594964,40.933719],[-72.594885,40.933651],[-72.594713,40.933513],[-72.59439399999999,40.933241],[-72.594247,40.933121],[-72.59374699999999,40.933405],[-72.593227,40.933705],[-72.592696,40.933997],[-72.59196,40.934418],[-72.59120799999999,40.934851],[-72.590513,40.935312],[-72.58862000000001,40.936345],[-72.588058,40.936676],[-72.587574,40.936971],[-72.586843,40.937393],[-72.586704,40.937472],[-72.586564,40.93755],[-72.58592,40.937932],[-72.58578300000001,40.938014],[-72.585269,40.938295],[-72.585049,40.938415],[-72.584502,40.938718],[-72.583956,40.939022],[-72.583314,40.939393],[-72.583101,40.939517],[-72.581822,40.940245],[-72.581115,40.940619],[-72.580748,40.940807],[-72.580501,40.940935],[-72.5802,40.941094],[-72.579655,40.941392],[-72.57897,40.941741],[-72.578869,40.941762],[-72.578772,40.941779],[-72.577297,40.94195],[-72.576713,40.942023],[-72.576257,40.942266],[-72.576032,40.942404],[-72.57577999999999,40.942553],[-72.575305,40.942815],[-72.57446299999999,40.943284],[-72.573686,40.943665],[-72.57326999999999,40.943862],[-72.572802,40.944077],[-72.57246499999999,40.944244],[-72.571654,40.944629],[-72.571235,40.944834],[-72.571096,40.944912],[-72.57089999999999,40.945049],[-72.57069300000001,40.945212],[-72.570482,40.945376],[-72.570362,40.945485],[-72.570239,40.945579],[-72.569884,40.945733],[-72.569503,40.94588],[-72.569326,40.945949],[-72.568972,40.946081],[-72.56808599999999,40.946415],[-72.567857,40.946498],[-72.56725900000001,40.946715],[-72.567058,40.946791],[-72.56687100000001,40.946863],[-72.56665,40.946947],[-72.566463,40.947019],[-72.566226,40.94711],[-72.56591400000001,40.94723],[-72.56568,40.947315],[-72.565535,40.947369],[-72.565371,40.947429],[-72.56510299999999,40.947527],[-72.56469199999999,40.947689],[-72.564314,40.947826],[-72.56416900000001,40.94788],[-72.563604,40.948089],[-72.56321199999999,40.948236],[-72.562856,40.948367],[-72.56205300000001,40.948683],[-72.56147,40.949076],[-72.56141700000001,40.949113],[-72.560682,40.949606],[-72.559577,40.95035],[-72.558909,40.950799],[-72.558521,40.951058],[-72.558187,40.951279],[-72.557984,40.951415],[-72.557796,40.951539],[-72.557562,40.951696],[-72.55677,40.952223],[-72.556449,40.952433],[-72.556095,40.952666],[-72.55579899999999,40.952862],[-72.555549,40.953034],[-72.555395,40.953135],[-72.555109,40.953324],[-72.55412800000001,40.952114],[-72.554024,40.95194],[-72.54217,40.937516],[-72.541346,40.93648],[-72.540048,40.93471],[-72.538909,40.933021],[-72.537834,40.931283],[-72.53691499999999,40.93004],[-72.536315,40.929051],[-72.53558700000001,40.928047],[-72.53506400000001,40.927298],[-72.53457299999999,40.926724],[-72.53609299999999,40.926548],[-72.537629,40.926468],[-72.54635,40.926468],[-72.54922999999999,40.926356],[-72.552142,40.926372],[-72.55499,40.926308],[-72.562991,40.926308],[-72.564431,40.92554],[-72.565951,40.924804],[-72.56711900000001,40.924195],[-72.56846299999999,40.923443],[-72.569647,40.923027],[-72.571183,40.922723],[-72.572335,40.922563],[-72.573201,40.922519],[-72.573919,40.922483],[-72.57495900000001,40.922259],[-72.575974,40.921924],[-72.576367,40.921795],[-72.577871,40.921443],[-72.579247,40.921235],[-72.580944,40.921059],[-72.583376,40.920819],[-72.58472,40.920803],[-72.58687999999999,40.920771],[-72.588224,40.920835],[-72.589456,40.921123],[-72.59063999999999,40.921379],[-72.59195200000001,40.921891],[-72.59347200000001,40.922355],[-72.59504,40.922787],[-72.596176,40.923139],[-72.5972,40.923395],[-72.598282,40.923579]]],"type":"Polygon"}
}