{
  "id": "360379512001",
  "type": "Feature",
  "properties": {
    "area_land":7402166,
    "area_water":76111,
    "geoid":"360379512001",
    "name":"Block Group 1",
    "state":"ny"
},
  "bbox": [
    -77.992264,
    42.974467,
    -77.95425,
    43.006376
],
  "geometry": {"coordinates":[[[-77.992262,42.982466],[-77.992261,42.982534],[-77.992257,42.982845],[-77.992255,42.982957],[-77.992249,42.983221],[-77.992249,42.983296],[-77.99225,42.983665],[-77.99223600000001,42.984372],[-77.992214,42.984628],[-77.99216300000001,42.984852],[-77.992081,42.985056],[-77.991343,42.986478],[-77.990827,42.987451],[-77.990464,42.988166],[-77.99039999999999,42.988289],[-77.990314,42.988456],[-77.990211,42.988652],[-77.990184,42.988703],[-77.990043,42.988972],[-77.98993900000001,42.989169],[-77.989739,42.989546],[-77.989699,42.989621],[-77.98907800000001,42.990785],[-77.988743,42.991445],[-77.98832400000001,42.992249],[-77.98689899999999,42.995025],[-77.986733,42.995379],[-77.986175,42.996569],[-77.98600399999999,42.996911],[-77.985327,42.998374],[-77.98420299999999,43.000517],[-77.983457,43.001913],[-77.983227,43.002309],[-77.982891,43.00283],[-77.982589,43.003239],[-77.98246899999999,43.003379],[-77.982438,43.003427],[-77.981916,43.004013],[-77.981498,43.004427],[-77.98061,43.005208],[-77.979668,43.006024],[-77.97957,43.006109],[-77.97926099999999,43.006376],[-77.979157,43.006295],[-77.978855,43.006146],[-77.976607,43.005487],[-77.976203,43.00536],[-77.975945,43.005244],[-77.975646,43.005069],[-77.975184,43.004738],[-77.97493299999999,43.004643],[-77.97378,43.004303],[-77.973439,43.004105],[-77.972117,43.003863],[-77.971177,43.003789],[-77.970213,43.003734],[-77.95425,43.003836],[-77.95425299999999,43.003604],[-77.954274,43.002356],[-77.954329,42.999915],[-77.954415,42.997249],[-77.95442300000001,42.996405],[-77.95447900000001,42.995164],[-77.954492,42.994838],[-77.954534,42.993544],[-77.954593,42.99195],[-77.9546,42.991551],[-77.954633,42.990787],[-77.954695,42.989338],[-77.95473200000001,42.988145],[-77.954756,42.986923],[-77.954802,42.985333],[-77.954843,42.983511],[-77.954846,42.983429],[-77.954849,42.98335],[-77.954854,42.983235],[-77.954863,42.983046],[-77.954871,42.982867],[-77.954876,42.982741],[-77.954922,42.980486],[-77.954953,42.979887],[-77.955854,42.979947],[-77.957121,42.979995],[-77.95913,42.980088],[-77.961032,42.980185],[-77.96583,42.980464],[-77.9679,42.980588],[-77.96896700000001,42.980648],[-77.969632,42.980674],[-77.969826,42.980682],[-77.97032900000001,42.980682],[-77.97094800000001,42.980662],[-77.971249,42.980644],[-77.97168499999999,42.980603],[-77.972246,42.980515],[-77.97377299999999,42.980229],[-77.974313,42.980127],[-77.97649699999999,42.979722],[-77.978219,42.979405],[-77.978798,42.979301],[-77.980576,42.978957],[-77.981526,42.978777],[-77.98265000000001,42.978567],[-77.982804,42.97854],[-77.984308,42.978277],[-77.984281,42.978165],[-77.98427100000001,42.977755],[-77.984263,42.976249],[-77.984262,42.976151],[-77.984273,42.975397],[-77.984275,42.974467],[-77.98527300000001,42.974483],[-77.98576799999999,42.974483],[-77.986501,42.974528],[-77.987486,42.974572],[-77.98771000000001,42.974589],[-77.987847,42.974611],[-77.987983,42.97467],[-77.98828,42.974848],[-77.988609,42.975069],[-77.988395,42.975261],[-77.98812599999999,42.975539],[-77.987945,42.975759],[-77.987756,42.97604],[-77.98770399999999,42.976147],[-77.98759200000001,42.976452],[-77.987543,42.976683],[-77.98752500000001,42.976865],[-77.987521,42.977156],[-77.987531,42.977347],[-77.987539,42.977493],[-77.987593,42.97768],[-77.987646,42.97787],[-77.987669,42.978222],[-77.98782,42.97955],[-77.987894,42.980313],[-77.98792400000001,42.981945],[-77.987905,42.982686],[-77.987899,42.982766],[-77.988283,42.982664],[-77.988766,42.982566],[-77.989249,42.982494],[-77.989862,42.982435],[-77.990497,42.982372],[-77.991264,42.982304],[-77.991381,42.982293],[-77.99226400000001,42.982206],[-77.992262,42.982466]]],"type":"Polygon"}
}