{
  "id": "360810512001",
  "type": "Feature",
  "properties": {
    "area_land":176695,
    "area_water":0,
    "geoid":"360810512001",
    "name":"Block Group 1",
    "state":"ny"
},
  "bbox": [
    -73.754037,
    40.710317,
    -73.747778,
    40.715145
],
  "geometry": {"coordinates":[[[-73.754037,40.71388],[-73.75309300000001,40.714096],[-73.7522,40.714365],[-73.75132499999999,40.714634],[-73.75045299999999,40.714879],[-73.74934500000001,40.715145],[-73.74903399999999,40.714461],[-73.748797,40.7139],[-73.747778,40.711437],[-73.74884299999999,40.711183],[-73.749387,40.711052],[-73.749741,40.710965],[-73.75065600000001,40.710747],[-73.751566,40.71053],[-73.75246,40.710317],[-73.753184,40.712055],[-73.753607,40.713071],[-73.753708,40.713325],[-73.754037,40.71388]]],"type":"Polygon"}
}