{
  "id": "360610137003",
  "type": "Feature",
  "properties": {
    "area_land":53462,
    "area_water":0,
    "geoid":"360610137003",
    "name":"Block Group 3",
    "state":"ny"
},
  "bbox": [
    -73.984283,
    40.763594,
    -73.980528,
    40.766715
],
  "geometry": {"coordinates":[[[-73.983822,40.765418],[-73.983367,40.766045],[-73.982877,40.766715],[-73.981848,40.766287],[-73.981988,40.76546],[-73.98052800000001,40.764844],[-73.980981,40.764223],[-73.98143399999999,40.763594],[-73.98247000000001,40.764033],[-73.984283,40.764792],[-73.983822,40.765418]]],"type":"Polygon"}
}