{
  "id": "360930329024",
  "type": "Feature",
  "properties": {
    "area_land":460496,
    "area_water":0,
    "geoid":"360930329024",
    "name":"Block Group 4",
    "state":"ny"
},
  "bbox": [
    -73.955465,
    42.771902,
    -73.945112,
    42.78057
],
  "geometry": {"coordinates":[[[-73.954818,42.779305],[-73.953731,42.779472],[-73.95262200000001,42.779655],[-73.951533,42.779838],[-73.950402,42.780035],[-73.94926,42.780211],[-73.948195,42.780394],[-73.947119,42.78057],[-73.946601,42.778808],[-73.946163,42.777413],[-73.94511199999999,42.773995],[-73.94619,42.773825],[-73.947188,42.773641],[-73.948347,42.773441],[-73.94807,42.772278],[-73.94853500000001,42.771902],[-73.949315,42.77243],[-73.949842,42.772726],[-73.950501,42.773262],[-73.951245,42.773752],[-73.95164,42.774047],[-73.952056,42.774394],[-73.952275,42.774774],[-73.95246400000001,42.775008],[-73.953335,42.776218],[-73.953705,42.776691],[-73.954251,42.777508],[-73.954646,42.778062],[-73.955465,42.779163],[-73.954818,42.779305]]],"type":"Polygon"}
}