{
  "id": "360470075002",
  "type": "Feature",
  "properties": {
    "area_land":56532,
    "area_water":0,
    "geoid":"360470075002",
    "name":"Block Group 2",
    "state":"ny"
},
  "bbox": [
    -73.995558,
    40.680172,
    -73.987668,
    40.683741
],
  "geometry": {"coordinates":[[[-73.995232,40.683741],[-73.99305200000001,40.682909],[-73.99086699999999,40.682058],[-73.988699,40.681217],[-73.987668,40.680818],[-73.98808,40.680172],[-73.98912900000001,40.680581],[-73.991297,40.681425],[-73.99348000000001,40.682274],[-73.995558,40.683069],[-73.995232,40.683741]]],"type":"Polygon"}
}