{
  "id": "360470104003",
  "type": "Feature",
  "properties": {
    "area_land":56557,
    "area_water":0,
    "geoid":"360470104003",
    "name":"Block Group 3",
    "state":"ny"
},
  "bbox": [
    -74.011154,
    40.636075,
    -74.007206,
    40.639085
],
  "geometry": {"coordinates":[[[-74.010572,40.637965],[-74.009989,40.638524],[-74.00940900000001,40.639085],[-74.007206,40.637755],[-74.00778800000001,40.637195],[-74.008371,40.636635],[-74.00895300000001,40.636075],[-74.011154,40.637404],[-74.010572,40.637965]]],"type":"Polygon"}
}