{
  "id": "360670163003",
  "type": "Feature",
  "properties": {
    "area_land":2346557,
    "area_water":0,
    "geoid":"360670163003",
    "name":"Block Group 3",
    "state":"ny"
},
  "bbox": [
    -76.211538,
    42.997655,
    -76.178777,
    43.01309
],
  "geometry": {"coordinates":[[[-76.211538,43.012733],[-76.209135,43.012856],[-76.20816000000001,43.012915],[-76.20551399999999,43.013048],[-76.20480999999999,43.01309],[-76.204596,43.013006],[-76.20317799999999,43.012496],[-76.202557,43.012291],[-76.201888,43.0121],[-76.2012,43.011927],[-76.199988,43.011616],[-76.19937299999999,43.011459],[-76.196806,43.010798],[-76.194959,43.010325],[-76.194678,43.010255],[-76.193523,43.010047],[-76.191242,43.009666],[-76.19098700000001,43.009614],[-76.190505,43.009491],[-76.189151,43.009081],[-76.18833600000001,43.008826],[-76.187016,43.008394],[-76.18490199999999,43.007699],[-76.184326,43.007505],[-76.18416999999999,43.007461],[-76.18379899999999,43.007349],[-76.182118,43.006885],[-76.181104,43.006599],[-76.18067000000001,43.00646],[-76.179771,43.006147],[-76.179507,43.00604],[-76.179311,43.005937],[-76.179193,43.005876],[-76.17910999999999,43.005829],[-76.178777,43.005644],[-76.179298,43.005617],[-76.179737,43.005566],[-76.181156,43.005306],[-76.182255,43.005121],[-76.183375,43.004929],[-76.18382800000001,43.004847],[-76.18431699999999,43.004748],[-76.187005,43.004179],[-76.188081,43.003958],[-76.189081,43.003729],[-76.190624,43.003362],[-76.191575,43.00314],[-76.192099,43.002989],[-76.19234,43.002906],[-76.192846,43.002699],[-76.193118,43.002568],[-76.19356000000001,43.002325],[-76.19393700000001,43.002092],[-76.19412800000001,43.001952],[-76.19428600000001,43.001841],[-76.195076,43.001201],[-76.195328,43.001013],[-76.19569300000001,43.000733],[-76.196168,43.000403],[-76.196404,43.000267],[-76.197011,42.999964],[-76.19719499999999,42.999882],[-76.19751100000001,42.999758],[-76.19775,42.999675],[-76.198055,42.999581],[-76.200791,42.998864],[-76.20175,42.998615],[-76.202032,42.998541],[-76.20270600000001,42.998364],[-76.203001,42.99828],[-76.20358899999999,42.998109],[-76.204959,42.997655],[-76.205142,42.997992],[-76.205403,42.998399],[-76.205541,42.998552],[-76.20568900000001,42.998662],[-76.20590199999999,42.998765],[-76.206022,42.998803],[-76.206202,42.998815],[-76.20644,42.998811],[-76.206552,42.998797],[-76.206687,42.998767],[-76.2069,42.9987],[-76.20720900000001,42.998581],[-76.207284,42.998569],[-76.207391,42.998606],[-76.207499,42.998692],[-76.207629,42.99887],[-76.207669,42.998935],[-76.208035,42.999551],[-76.208203,42.999833],[-76.208536,43.000437],[-76.208647,43.000596],[-76.208943,43.000943],[-76.208946,43.001005],[-76.208882,43.001085],[-76.208709,43.001174],[-76.20853099999999,43.00125],[-76.20845,43.001285],[-76.208249,43.001371],[-76.207954,43.001472],[-76.20733,43.001656],[-76.206896,43.001732],[-76.20648,43.001796],[-76.20608900000001,43.001834],[-76.20589099999999,43.00186],[-76.20589099999999,43.001926],[-76.20595899999999,43.002244],[-76.20604299999999,43.002639],[-76.20611700000001,43.002807],[-76.20618,43.002887],[-76.206345,43.002982],[-76.206501,43.003027],[-76.206796,43.003046],[-76.209047,43.00294],[-76.209329,43.002997],[-76.20945399999999,43.003064],[-76.209597,43.003238],[-76.20969700000001,43.003885],[-76.20976899999999,43.004699],[-76.209836,43.005063],[-76.20995000000001,43.005688],[-76.210245,43.007136],[-76.21051199999999,43.00851],[-76.210562,43.008718],[-76.210891,43.009789],[-76.211078,43.010337],[-76.211243,43.010902],[-76.211457,43.011812],[-76.211477,43.012053],[-76.211538,43.012733]]],"type":"Polygon"}
}