{
  "id": "360179704004",
  "type": "Feature",
  "properties": {
    "area_land":759313,
    "area_water":0,
    "geoid":"360179704004",
    "name":"Block Group 4",
    "state":"ny"
},
  "bbox": [
    -75.524959,
    42.534213,
    -75.513381,
    42.545023
],
  "geometry": {"coordinates":[[[-75.524959,42.54468],[-75.521731,42.544843],[-75.519006,42.544997],[-75.518505,42.545023],[-75.518604,42.544967],[-75.518658,42.544902],[-75.518675,42.544804],[-75.518627,42.544669],[-75.51858,42.544596],[-75.51847600000001,42.544505],[-75.51836,42.544428],[-75.518192,42.544345],[-75.517816,42.54413],[-75.517707,42.544042],[-75.51755199999999,42.543831],[-75.517523,42.543747],[-75.517461,42.543416],[-75.51742400000001,42.543314],[-75.51734399999999,42.543153],[-75.51720899999999,42.543011],[-75.51689,42.542807],[-75.516351,42.542549],[-75.516167,42.542436],[-75.515922,42.542246],[-75.515838,42.542155],[-75.515789,42.542038],[-75.515782,42.541966],[-75.515837,42.541386],[-75.515804,42.541332],[-75.515756,42.541284],[-75.515676,42.541252],[-75.515581,42.541237],[-75.515372,42.541252],[-75.515244,42.541284],[-75.51513799999999,42.541332],[-75.513822,42.542159],[-75.51372000000001,42.542184],[-75.51363600000001,42.542188],[-75.513538,42.542162],[-75.513447,42.542104],[-75.513396,42.542035],[-75.513381,42.541907],[-75.513407,42.541773],[-75.51348299999999,42.541663],[-75.514112,42.540949],[-75.514269,42.540734],[-75.514511,42.540286],[-75.514723,42.539783],[-75.514748,42.539649],[-75.51475600000001,42.539488],[-75.514748,42.539273],[-75.514703,42.538858],[-75.51465,42.538632],[-75.51458100000001,42.538414],[-75.514533,42.53833],[-75.514413,42.538177],[-75.51431100000001,42.538108],[-75.513859,42.537923],[-75.513745,42.537877],[-75.514003,42.537776],[-75.514386,42.537632],[-75.514593,42.537575],[-75.514887,42.537525],[-75.51569600000001,42.53745],[-75.5159,42.537432],[-75.51617400000001,42.53741],[-75.516492,42.537384],[-75.519216,42.53713],[-75.519087,42.535905],[-75.519064,42.535673],[-75.518942,42.534532],[-75.52020400000001,42.534453],[-75.52059300000001,42.53443],[-75.521316,42.534384],[-75.521962,42.534343],[-75.52274800000001,42.534293],[-75.52403200000001,42.534213],[-75.52416100000001,42.535822],[-75.524243,42.536673],[-75.52431,42.537456],[-75.52440900000001,42.538733],[-75.524486,42.539613],[-75.524579,42.540562],[-75.524619,42.540973],[-75.52483599999999,42.543162],[-75.5249,42.543885],[-75.524919,42.544168],[-75.52494799999999,42.54457],[-75.524959,42.54468]]],"type":"Polygon"}
}