{
  "id": "360811291023",
  "type": "Feature",
  "properties": {
    "area_land":250577,
    "area_water":0,
    "geoid":"360811291023",
    "name":"Block Group 3",
    "state":"ny"
},
  "bbox": [
    -73.765551,
    40.728235,
    -73.750158,
    40.732971
],
  "geometry": {"coordinates":[[[-73.765551,40.732544],[-73.764917,40.732655],[-73.764807,40.732674],[-73.764268,40.732767],[-73.7637,40.732864],[-73.763488,40.732623],[-73.763367,40.732484],[-73.76301599999999,40.732113],[-73.762649,40.731752],[-73.762265,40.7314],[-73.761866,40.731059],[-73.76149700000001,40.730635],[-73.760662,40.730864],[-73.759745,40.731116],[-73.75886199999999,40.731358],[-73.75797900000001,40.7316],[-73.757099,40.731842],[-73.756215,40.732084],[-73.755332,40.732326],[-73.75437599999999,40.732574],[-73.753418,40.732821],[-73.753288,40.732879],[-73.75314400000001,40.732924],[-73.75299,40.732956],[-73.75283,40.732971],[-73.752668,40.73297],[-73.75250800000001,40.732951],[-73.75235499999999,40.732917],[-73.752213,40.732869],[-73.75208499999999,40.732809],[-73.750158,40.731799],[-73.750281,40.73169],[-73.75042000000001,40.731589],[-73.750575,40.731499],[-73.750743,40.731421],[-73.75092100000001,40.731356],[-73.75110599999999,40.731306],[-73.751296,40.731272],[-73.751486,40.731253],[-73.75167500000001,40.73125],[-73.751913,40.731236],[-73.752149,40.731208],[-73.752381,40.731163],[-73.752606,40.731103],[-73.753556,40.730843],[-73.75450600000001,40.730583],[-73.75538899999999,40.730341],[-73.756272,40.7301],[-73.757153,40.729856],[-73.75803500000001,40.729613],[-73.75891799999999,40.729371],[-73.75986399999999,40.729117],[-73.759882,40.728235],[-73.760029,40.72829],[-73.76018500000001,40.728369],[-73.760661,40.728616],[-73.761094,40.728869],[-73.76158,40.729156],[-73.762038,40.729452],[-73.762263,40.729605],[-73.763413,40.730466],[-73.764246,40.731211],[-73.764535,40.731469],[-73.765387,40.732365],[-73.765551,40.732544]]],"type":"Polygon"}
}