{
  "id": "360290037001",
  "type": "Feature",
  "properties": {
    "area_land":226582,
    "area_water":0,
    "geoid":"360290037001",
    "name":"Block Group 1",
    "state":"ny"
},
  "bbox": [
    -78.808789,
    42.914956,
    -78.80397,
    42.922729
],
  "geometry": {"coordinates":[[[-78.80875,42.917836],[-78.808727,42.918295],[-78.808725,42.918628],[-78.808722,42.919114],[-78.808719,42.920294],[-78.808707,42.922417],[-78.808718,42.9227],[-78.808414,42.922703],[-78.80776400000001,42.92271],[-78.806828,42.922721],[-78.80588299999999,42.922729],[-78.80589999999999,42.920267],[-78.805904,42.91908],[-78.80497099999999,42.91907],[-78.80493,42.91907],[-78.80397000000001,42.919066],[-78.803971,42.918791],[-78.803995,42.917944],[-78.804007,42.91767],[-78.804014,42.91733],[-78.804033,42.916518],[-78.804796,42.916217],[-78.804979,42.916145],[-78.80587,42.915794],[-78.807147,42.915278],[-78.807953,42.914956],[-78.807941,42.91521],[-78.807885,42.917005],[-78.808358,42.917008],[-78.808789,42.917016],[-78.80875,42.917836]]],"type":"Polygon"}
}