{
  "id": "360610125001",
  "type": "Feature",
  "properties": {
    "area_land":121011,
    "area_water":0,
    "geoid":"360610125001",
    "name":"Block Group 1",
    "state":"ny"
},
  "bbox": [
    -73.986561,
    40.757387,
    -73.980426,
    40.76229
],
  "geometry": {"coordinates":[[[-73.986104,40.76229],[-73.98405,40.761424],[-73.98326299999999,40.761094],[-73.98042599999999,40.759899],[-73.980886,40.75927],[-73.981341,40.758645],[-73.98179399999999,40.758021],[-73.98225600000001,40.757387],[-73.985085,40.758589],[-73.985322,40.758687],[-73.985072,40.759391],[-73.984808,40.760104],[-73.98472,40.760274],[-73.984464,40.760773],[-73.98656099999999,40.76166],[-73.986104,40.76229]]],"type":"Polygon"}
}