{
  "id": "361031462043",
  "type": "Feature",
  "properties": {
    "area_land":423451,
    "area_water":0,
    "geoid":"361031462043",
    "name":"Block Group 3",
    "state":"ny"
},
  "bbox": [
    -73.225968,
    40.767442,
    -73.211104,
    40.771875
],
  "geometry": {"coordinates":[[[-73.22596799999999,40.770787],[-73.225819,40.770809],[-73.22355,40.77101],[-73.221496,40.771165],[-73.22123000000001,40.771188],[-73.218959,40.77137],[-73.217145,40.771513],[-73.21557,40.771598],[-73.214399,40.771736],[-73.213939,40.771773],[-73.212666,40.771875],[-73.21248799999999,40.771545],[-73.21188600000001,40.770373],[-73.211725,40.77006],[-73.21128,40.769212],[-73.21110400000001,40.768864],[-73.212568,40.76874],[-73.214108,40.768621],[-73.215592,40.768492],[-73.217485,40.768345],[-73.21744200000001,40.76816],[-73.218519,40.768073],[-73.218667,40.768061],[-73.219989,40.767952],[-73.220766,40.767896],[-73.223313,40.767694],[-73.22345900000001,40.767645],[-73.22360399999999,40.76759],[-73.225483,40.767442],[-73.22560300000001,40.768279],[-73.22564800000001,40.768589],[-73.22571499999999,40.769099],[-73.22584000000001,40.769915],[-73.225948,40.770654],[-73.22596799999999,40.770787]]],"type":"Polygon"}
}