{
  "id": "360050211001",
  "type": "Feature",
  "properties": {
    "area_land":39958,
    "area_water":0,
    "geoid":"360050211001",
    "name":"Block Group 1",
    "state":"ny"
},
  "bbox": [
    -73.925268,
    40.839271,
    -73.921945,
    40.841837
],
  "geometry": {"coordinates":[[[-73.92509200000001,40.841088],[-73.92501300000001,40.841245],[-73.924848,40.841495],[-73.92399500000001,40.841132],[-73.923196,40.840788],[-73.922422,40.841837],[-73.92194499999999,40.841045],[-73.922387,40.840426],[-73.92255900000001,40.839271],[-73.92391000000001,40.839831],[-73.924182,40.839954],[-73.924466,40.840042],[-73.92478199999999,40.840104],[-73.925268,40.840176],[-73.92509200000001,40.841088]]],"type":"Polygon"}
}