{
  "id": "360470732001",
  "type": "Feature",
  "properties": {
    "area_land":75677,
    "area_water":0,
    "geoid":"360470732001",
    "name":"Block Group 1",
    "state":"ny"
},
  "bbox": [
    -73.935549,
    40.625468,
    -73.931494,
    40.62793
],
  "geometry": {"coordinates":[[[-73.93554899999999,40.627692],[-73.93461600000001,40.62775],[-73.933646,40.627811],[-73.93281500000001,40.627862],[-73.932664,40.627872],[-73.932506,40.627882],[-73.931743,40.62793],[-73.931494,40.625594],[-73.93242499999999,40.625534],[-73.93289900000001,40.625501],[-73.93312899999999,40.625521],[-73.93334400000001,40.625629],[-73.93335999999999,40.625595],[-73.933421,40.625468],[-73.933449,40.625704],[-73.93373200000001,40.625928],[-73.934415,40.625892],[-73.935349,40.625835],[-73.93554899999999,40.627692]]],"type":"Polygon"}
}