{
  "id": "360290080014",
  "type": "Feature",
  "properties": {
    "area_land":200998,
    "area_water":0,
    "geoid":"360290080014",
    "name":"Block Group 4",
    "state":"ny"
},
  "bbox": [
    -78.832346,
    42.969103,
    -78.823294,
    42.971713
],
  "geometry": {"coordinates":[[[-78.832346,42.97164],[-78.831096,42.97164],[-78.82989999999999,42.97164],[-78.828711,42.97164],[-78.827665,42.97164],[-78.826621,42.971639],[-78.825575,42.971638],[-78.82486400000001,42.971644],[-78.824511,42.971683],[-78.824303,42.971705],[-78.82408700000001,42.971713],[-78.823294,42.971699],[-78.823348,42.970319],[-78.823374,42.969676],[-78.823398,42.969103],[-78.82353500000001,42.969105],[-78.824437,42.969122],[-78.824562,42.969124],[-78.825507,42.969141],[-78.82557199999999,42.969142],[-78.825947,42.969146],[-78.82656799999999,42.969155],[-78.826618,42.969157],[-78.827619,42.969177],[-78.82766599999999,42.969178],[-78.82870699999999,42.969198],[-78.82984,42.969219],[-78.829899,42.96922],[-78.831,42.969241],[-78.831096,42.969243],[-78.83233,42.969273],[-78.832346,42.97164]]],"type":"Polygon"}
}