{
  "id": "360957407003",
  "type": "Feature",
  "properties": {
    "area_land":43049118,
    "area_water":148024,
    "geoid":"360957407003",
    "name":"Block Group 3",
    "state":"ny"
},
  "bbox": [
    -74.431363,
    42.592651,
    -74.321224,
    42.673029
],
  "geometry": {"coordinates":[[[-74.431363,42.644895],[-74.429548,42.64639],[-74.426259,42.649119],[-74.423214,42.651644],[-74.416219,42.657446],[-74.409728,42.662831],[-74.408585,42.663721],[-74.407674,42.664176],[-74.40523,42.665271],[-74.40183500000001,42.666774],[-74.39973999999999,42.667713],[-74.399297,42.667911],[-74.395459,42.669631],[-74.39482700000001,42.669915],[-74.388554,42.672712],[-74.387827,42.673029],[-74.38768399999999,42.672956],[-74.38749,42.672858],[-74.387288,42.672756],[-74.37963999999999,42.668878],[-74.375468,42.666745],[-74.37457999999999,42.666231],[-74.361611,42.659659],[-74.344846,42.651159],[-74.342449,42.649931],[-74.342234,42.649816],[-74.33991899999999,42.648631],[-74.336949,42.647101],[-74.335294,42.646245],[-74.33334000000001,42.645748],[-74.331873,42.645376],[-74.331874,42.645366],[-74.32868499999999,42.644537],[-74.327609,42.644257],[-74.321224,42.642651],[-74.32143499999999,42.642268],[-74.321584,42.642051],[-74.322236,42.641223],[-74.322366,42.641063],[-74.322979,42.6403],[-74.32383,42.639228],[-74.32387300000001,42.639174],[-74.32433399999999,42.638576],[-74.324404,42.638486],[-74.32480700000001,42.637968],[-74.32569100000001,42.636872],[-74.326286,42.636131],[-74.327321,42.634637],[-74.328225,42.633315],[-74.32868999999999,42.632642],[-74.329843,42.631007],[-74.33109399999999,42.629185],[-74.331287,42.628904],[-74.33162,42.628427],[-74.3317,42.628316],[-74.331721,42.628286],[-74.331898,42.628034],[-74.332042,42.627834],[-74.332238,42.627597],[-74.332249,42.627584],[-74.33253999999999,42.627267],[-74.333939,42.625894],[-74.33474099999999,42.625091],[-74.33482600000001,42.625006],[-74.335077,42.624746],[-74.335291,42.624486],[-74.335587,42.624084],[-74.33580000000001,42.623742],[-74.335987,42.623475],[-74.336158,42.623171],[-74.33631800000001,42.622937],[-74.336456,42.622678],[-74.336563,42.622464],[-74.336673,42.622211],[-74.336787,42.62179],[-74.336832,42.621464],[-74.336873,42.620574],[-74.336928,42.619613],[-74.337007,42.617835],[-74.337018,42.616689],[-74.337019,42.616586],[-74.33703800000001,42.615975],[-74.337045,42.615045],[-74.337073,42.61373],[-74.337081,42.61343],[-74.337125,42.612861],[-74.33717,42.612602],[-74.33725200000001,42.612297],[-74.337496,42.611333],[-74.33771400000001,42.610597],[-74.33807299999999,42.609312],[-74.338123,42.609124],[-74.338471,42.60784],[-74.338599,42.60738],[-74.338669,42.607066],[-74.338703,42.60676],[-74.338702,42.606536],[-74.338674,42.606285],[-74.338599,42.605962],[-74.338486,42.605649],[-74.338335,42.605373],[-74.338086,42.605011],[-74.337132,42.603684],[-74.336955,42.603413],[-74.336777,42.603085],[-74.336366,42.602109],[-74.336275,42.601865],[-74.336127,42.601309],[-74.336021,42.600919],[-74.335977,42.600652],[-74.33597899999999,42.600499],[-74.33602999999999,42.599965],[-74.336127,42.5993],[-74.336294,42.599402],[-74.33641900000001,42.599446],[-74.33679600000001,42.599495],[-74.336946,42.599514],[-74.337204,42.599546],[-74.337301,42.599558],[-74.338044,42.599646],[-74.338182,42.599643],[-74.33829799999999,42.599616],[-74.338373,42.599585],[-74.338584,42.599474],[-74.338775,42.599354],[-74.34024599999999,42.598442],[-74.340772,42.59812],[-74.344092,42.596085],[-74.344441,42.595868],[-74.345029,42.595493],[-74.34569,42.595028],[-74.346311,42.594554],[-74.34662299999999,42.594299],[-74.34727100000001,42.593729],[-74.347532,42.593483],[-74.348163,42.592847],[-74.348359,42.592651],[-74.34863900000001,42.593035],[-74.348759,42.593136],[-74.348893,42.593196],[-74.34898,42.593216],[-74.349019,42.593236],[-74.349087,42.593282],[-74.34922,42.593649],[-74.34926,42.593689],[-74.349407,42.59377],[-74.349588,42.593856],[-74.349852,42.593954],[-74.349946,42.594007],[-74.350053,42.594094],[-74.350086,42.594134],[-74.35015300000001,42.594348],[-74.350213,42.594441],[-74.350273,42.594501],[-74.35037699999999,42.594555],[-74.350413,42.594574],[-74.350514,42.594581],[-74.350787,42.594541],[-74.350894,42.594548],[-74.350988,42.594568],[-74.351061,42.594594],[-74.35118799999999,42.594661],[-74.351242,42.594701],[-74.35136199999999,42.594761],[-74.35154900000001,42.594781],[-74.351642,42.594781],[-74.35187000000001,42.594728],[-74.35204299999999,42.594721],[-74.352137,42.594735],[-74.35225,42.594768],[-74.352457,42.594775],[-74.352671,42.594748],[-74.35290500000001,42.594695],[-74.353219,42.594588],[-74.353319,42.594574],[-74.35344600000001,42.594594],[-74.353506,42.594634],[-74.353559,42.594654],[-74.353633,42.594668],[-74.3537,42.594668],[-74.353827,42.594715],[-74.353887,42.594748],[-74.354106,42.594988],[-74.35427900000001,42.595082],[-74.354533,42.595108],[-74.354707,42.595102],[-74.354767,42.595075],[-74.355081,42.594861],[-74.355148,42.594828],[-74.355234,42.594808],[-74.355475,42.594815],[-74.355769,42.594895],[-74.355842,42.594908],[-74.35596200000001,42.594901],[-74.356149,42.594848],[-74.35631600000001,42.594841],[-74.35647,42.594901],[-74.356601,42.594964],[-74.356759,42.595023],[-74.356938,42.595061],[-74.357118,42.595068],[-74.35727199999999,42.595048],[-74.35745900000001,42.595001],[-74.35792600000001,42.594975],[-74.35834,42.594988],[-74.35845999999999,42.594981],[-74.358554,42.594961],[-74.358728,42.594881],[-74.358813,42.594828],[-74.35889299999999,42.594808],[-74.359621,42.594788],[-74.35982199999999,42.594774],[-74.35997500000001,42.594774],[-74.360135,42.594754],[-74.36036900000001,42.594674],[-74.360556,42.594661],[-74.360636,42.594668],[-74.36081,42.594728],[-74.360984,42.594754],[-74.361304,42.594754],[-74.361418,42.594728],[-74.361799,42.594721],[-74.36201199999999,42.594761],[-74.36208600000001,42.594788],[-74.362179,42.594794],[-74.362593,42.594868],[-74.362827,42.594968],[-74.36297500000001,42.595074],[-74.363101,42.595155],[-74.363235,42.595268],[-74.363288,42.595281],[-74.363342,42.595281],[-74.363589,42.595215],[-74.363916,42.595081],[-74.36446100000001,42.594786],[-74.364797,42.594658],[-74.365005,42.594628],[-74.365252,42.594638],[-74.36547899999999,42.594598],[-74.365667,42.594598],[-74.365785,42.594618],[-74.365944,42.594677],[-74.36604199999999,42.594727],[-74.366112,42.594776],[-74.366181,42.594904],[-74.36623,42.595052],[-74.36626,42.595428],[-74.366299,42.595516],[-74.366359,42.595595],[-74.366517,42.595684],[-74.36697100000001,42.595872],[-74.36720200000001,42.596004],[-74.367519,42.596201],[-74.36765699999999,42.59631],[-74.367795,42.596497],[-74.367845,42.596537],[-74.368174,42.59652],[-74.368438,42.596517],[-74.368793,42.596665],[-74.368922,42.596803],[-74.36899099999999,42.596942],[-74.36906999999999,42.59707],[-74.369129,42.597119],[-74.36947499999999,42.597336],[-74.369623,42.597415],[-74.369692,42.597425],[-74.36987000000001,42.597484],[-74.370028,42.597573],[-74.370216,42.59781],[-74.370285,42.597879],[-74.370345,42.597919],[-74.37056200000001,42.597998],[-74.370661,42.598018],[-74.37074,42.598057],[-74.370908,42.598175],[-74.371613,42.598505],[-74.371781,42.598653],[-74.372117,42.599019],[-74.372552,42.599117],[-74.372631,42.599186],[-74.37272,42.599325],[-74.37272900000001,42.599423],[-74.37271,42.599749],[-74.37267,42.600104],[-74.37269000000001,42.600361],[-74.372739,42.600499],[-74.372838,42.600608],[-74.372957,42.600707],[-74.373115,42.600894],[-74.37325300000001,42.601032],[-74.37342099999999,42.601082],[-74.373653,42.601095],[-74.37373700000001,42.601101],[-74.373994,42.6012],[-74.374123,42.601259],[-74.37432,42.601388],[-74.374409,42.601457],[-74.374636,42.601802],[-74.374706,42.601921],[-74.37490699999999,42.601997],[-74.375451,42.602103],[-74.375822,42.602192],[-74.37594799999999,42.602282],[-74.376085,42.602353],[-74.376603,42.602558],[-74.376846,42.602727],[-74.37698399999999,42.602829],[-74.377635,42.603392],[-74.37862800000001,42.604315],[-74.37865600000001,42.604382],[-74.378699,42.604442],[-74.378868,42.604615],[-74.378958,42.604686],[-74.37925300000001,42.604866],[-74.379519,42.604984],[-74.379834,42.605068],[-74.38029299999999,42.605162],[-74.38091300000001,42.605225],[-74.381207,42.605241],[-74.381349,42.605223],[-74.38143100000001,42.605196],[-74.381867,42.604964],[-74.381933,42.604953],[-74.38200399999999,42.604956],[-74.38210599999999,42.604988],[-74.382193,42.605031],[-74.38243199999999,42.605211],[-74.38252199999999,42.605247],[-74.38258500000001,42.605247],[-74.382734,42.6052],[-74.382766,42.605211],[-74.382805,42.605247],[-74.382895,42.605376],[-74.382938,42.605392],[-74.383174,42.605437],[-74.383264,42.605472],[-74.383551,42.605641],[-74.383613,42.605664],[-74.383708,42.605676],[-74.383916,42.605652],[-74.384351,42.605635],[-74.384446,42.605651],[-74.384512,42.60569],[-74.38484200000001,42.605968],[-74.384956,42.606047],[-74.38508899999999,42.606121],[-74.38530900000001,42.6062],[-74.385407,42.606227],[-74.385509,42.606239],[-74.385698,42.606292],[-74.38636099999999,42.606602],[-74.38654200000001,42.60666],[-74.386601,42.606711],[-74.38663200000001,42.606754],[-74.386785,42.606864],[-74.386824,42.606927],[-74.386934,42.607035],[-74.38704,42.60718],[-74.38708699999999,42.607219],[-74.387225,42.607294],[-74.387291,42.607298],[-74.38739,42.607266],[-74.38743700000001,42.607341],[-74.387488,42.607454],[-74.38754299999999,42.607521],[-74.387719,42.607635],[-74.38822999999999,42.607841],[-74.388445,42.607911],[-74.388485,42.607931],[-74.388504,42.607954],[-74.388496,42.608002],[-74.38842200000001,42.608041],[-74.38840999999999,42.608064],[-74.38840999999999,42.608127],[-74.388457,42.608256],[-74.38851200000001,42.608323],[-74.388559,42.608362],[-74.38874,42.608433],[-74.388814,42.608437],[-74.38892,42.608417],[-74.38901799999999,42.608433],[-74.389101,42.608476],[-74.389313,42.608692],[-74.38948600000001,42.608796],[-74.389571,42.608815],[-74.38967100000001,42.608838],[-74.389768,42.608839],[-74.38982300000001,42.608807],[-74.38987,42.608792],[-74.38992500000001,42.608788],[-74.390184,42.608827],[-74.390271,42.608796],[-74.390292,42.608774],[-74.39030200000001,42.608745],[-74.390275,42.608662],[-74.390196,42.608521],[-74.390196,42.608498],[-74.39021200000001,42.608474],[-74.390255,42.608451],[-74.390333,42.608431],[-74.390604,42.608451],[-74.390671,42.608447],[-74.390804,42.608411],[-74.390867,42.60838],[-74.39091000000001,42.608341],[-74.39095,42.608278],[-74.391024,42.608103],[-74.391064,42.608072],[-74.391487,42.607931],[-74.391554,42.6079],[-74.391621,42.607888],[-74.391676,42.607896],[-74.391841,42.607966],[-74.391915,42.607978],[-74.391974,42.607974],[-74.392061,42.607943],[-74.39228799999999,42.607839],[-74.392343,42.607796],[-74.39250800000001,42.607611],[-74.392539,42.6076],[-74.392571,42.607611],[-74.392696,42.607737],[-74.39275499999999,42.607772],[-74.393136,42.607858],[-74.393277,42.607854],[-74.393717,42.607864],[-74.39381899999999,42.607888],[-74.394051,42.608002],[-74.394125,42.60799],[-74.394188,42.607951],[-74.39424699999999,42.607868],[-74.394282,42.607864],[-74.394341,42.607892],[-74.39451800000001,42.608021],[-74.394588,42.608096],[-74.394792,42.608402],[-74.39489500000001,42.608582],[-74.395083,42.608788],[-74.395236,42.609054],[-74.395369,42.609196],[-74.395538,42.609341],[-74.39561500000001,42.609448],[-74.395656,42.609515],[-74.39572699999999,42.609719],[-74.39575000000001,42.60988],[-74.39575000000001,42.609998],[-74.39577,42.610053],[-74.395852,42.610158],[-74.39600900000001,42.610439],[-74.396174,42.610792],[-74.396264,42.610882],[-74.39668,42.611153],[-74.396979,42.61139],[-74.39713999999999,42.611558],[-74.397418,42.611915],[-74.397513,42.612233],[-74.39761900000001,42.612866],[-74.397587,42.61309],[-74.397603,42.613196],[-74.397638,42.613243],[-74.397823,42.613356],[-74.398121,42.613919],[-74.398247,42.613998],[-74.39828199999999,42.614041],[-74.39827,42.614325],[-74.398298,42.61447],[-74.398325,42.614537],[-74.398364,42.614588],[-74.398521,42.614713],[-74.398572,42.614772],[-74.3986,42.614827],[-74.398612,42.614886],[-74.398612,42.614972],[-74.398565,42.615217],[-74.398584,42.615362],[-74.398612,42.615421],[-74.39878,42.615633],[-74.398859,42.615766],[-74.398871,42.6159],[-74.398855,42.616243],[-74.398875,42.616298],[-74.398934,42.616384],[-74.398957,42.616435],[-74.398945,42.616521],[-74.398859,42.616682],[-74.39885099999999,42.616737],[-74.39891799999999,42.617174],[-74.398989,42.617354],[-74.39904,42.617405],[-74.399193,42.617515],[-74.399208,42.617554],[-74.39922799999999,42.617988],[-74.399263,42.618184],[-74.399255,42.618392],[-74.39927900000001,42.6186],[-74.399389,42.618939],[-74.399393,42.61908],[-74.399377,42.619127],[-74.39931,42.619241],[-74.399322,42.619327],[-74.399342,42.619362],[-74.39952599999999,42.619503],[-74.39960499999999,42.61966],[-74.39966,42.619719],[-74.399738,42.619774],[-74.400119,42.619964],[-74.40027600000001,42.619976],[-74.40035399999999,42.619996],[-74.400445,42.620051],[-74.40047199999999,42.620098],[-74.400547,42.620317],[-74.400802,42.620509],[-74.400873,42.620588],[-74.40092799999999,42.620674],[-74.400994,42.620809],[-74.401053,42.620982],[-74.401163,42.621143],[-74.401563,42.621562],[-74.401921,42.621929],[-74.401976,42.622],[-74.402058,42.622176],[-74.402129,42.622262],[-74.40217199999999,42.622337],[-74.402243,42.622505],[-74.40227400000001,42.622537],[-74.40236,42.622592],[-74.402451,42.622631],[-74.402545,42.622658],[-74.40314100000001,42.622758],[-74.403216,42.622794],[-74.403357,42.622923],[-74.403514,42.623092],[-74.40366299999999,42.623217],[-74.40418200000001,42.623472],[-74.404268,42.623554],[-74.40428,42.62359],[-74.404264,42.623641],[-74.404087,42.623729],[-74.404056,42.623764],[-74.404028,42.623819],[-74.40401300000001,42.623921],[-74.404025,42.624019],[-74.404037,42.624035],[-74.404115,42.624066],[-74.404178,42.624078],[-74.40425999999999,42.624129],[-74.404354,42.624239],[-74.40450300000001,42.624321],[-74.404554,42.624368],[-74.404566,42.624425],[-74.404562,42.624541],[-74.404515,42.624623],[-74.40450300000001,42.624847],[-74.40451899999999,42.624878],[-74.404554,42.624913],[-74.40467700000001,42.625],[-74.40479499999999,42.625092],[-74.405072,42.625308],[-74.405097,42.625397],[-74.405214,42.625443],[-74.405387,42.625574],[-74.40547599999999,42.625659],[-74.405529,42.625737],[-74.40562799999999,42.625946],[-74.405688,42.626038],[-74.405738,42.626147],[-74.40580199999999,42.626246],[-74.405879,42.626335],[-74.405901,42.626388],[-74.405897,42.626657],[-74.405929,42.626714],[-74.406053,42.626809],[-74.406099,42.626855],[-74.406127,42.626937],[-74.406138,42.627007],[-74.406166,42.627071],[-74.406223,42.627131],[-74.406308,42.627181],[-74.4064,42.627213],[-74.40670799999999,42.627255],[-74.406818,42.627266],[-74.406921,42.627312],[-74.406953,42.627415],[-74.406949,42.627496],[-74.40691,42.627546],[-74.406903,42.627606],[-74.40691700000001,42.627666],[-74.40700200000001,42.627825],[-74.407163,42.62804],[-74.407393,42.62824],[-74.407505,42.628333],[-74.407574,42.628359],[-74.407644,42.628372],[-74.408278,42.628303],[-74.408495,42.62831],[-74.408619,42.628388],[-74.40881400000001,42.62842],[-74.408874,42.628445],[-74.408906,42.62847],[-74.40901599999999,42.62881],[-74.409097,42.628951],[-74.40913399999999,42.629044],[-74.40915,42.629164],[-74.40923600000001,42.629295],[-74.40936000000001,42.62961],[-74.409367,42.629695],[-74.409448,42.629801],[-74.409508,42.629847],[-74.409767,42.629907],[-74.40983799999999,42.629907],[-74.40988,42.629939],[-74.409919,42.630151],[-74.40996199999999,42.63019],[-74.41005699999999,42.630254],[-74.41010300000001,42.630314],[-74.41016,42.630456],[-74.410235,42.630548],[-74.410259,42.630594],[-74.410291,42.630732],[-74.41035100000001,42.630792],[-74.41052500000001,42.630831],[-74.410599,42.630859],[-74.410631,42.630882],[-74.410653,42.630898],[-74.41073400000001,42.631004],[-74.410833,42.631089],[-74.41086900000001,42.631153],[-74.410911,42.631326],[-74.410932,42.631362],[-74.41098599999999,42.63139],[-74.411106,42.631404],[-74.411294,42.631404],[-74.41134700000001,42.631411],[-74.411418,42.631443],[-74.41148200000001,42.631507],[-74.411517,42.631564],[-74.411602,42.631645],[-74.411856,42.631713],[-74.412014,42.631773],[-74.412064,42.631837],[-74.412064,42.631928],[-74.412035,42.631999],[-74.411979,42.632055],[-74.411979,42.632111],[-74.412014,42.632189],[-74.41224,42.632203],[-74.41238800000001,42.632231],[-74.412494,42.632295],[-74.41255700000001,42.632372],[-74.412592,42.632457],[-74.412599,42.632534],[-74.412656,42.632633],[-74.412747,42.632682],[-74.41289500000001,42.632717],[-74.412987,42.63276],[-74.412994,42.63283],[-74.412966,42.632914],[-74.41289500000001,42.632985],[-74.41289500000001,42.633084],[-74.412931,42.63314],[-74.412975,42.633177],[-74.413043,42.633253],[-74.413044,42.63334],[-74.413028,42.633391],[-74.41296699999999,42.633587],[-74.412981,42.633699],[-74.413051,42.633819],[-74.413157,42.633904],[-74.413291,42.633967],[-74.413411,42.634101],[-74.413467,42.6342],[-74.41353100000001,42.634566],[-74.413573,42.634643],[-74.41364299999999,42.634707],[-74.41372800000001,42.634869],[-74.413742,42.634981],[-74.413742,42.635094],[-74.413721,42.6352],[-74.413686,42.635291],[-74.413686,42.635467],[-74.41370000000001,42.635524],[-74.413822,42.635635],[-74.413899,42.635727],[-74.413949,42.635854],[-74.413977,42.635973],[-74.414174,42.636206],[-74.414202,42.636255],[-74.414213,42.636377],[-74.414216,42.636403],[-74.414249,42.636456],[-74.414329,42.636558],[-74.4144,42.636593],[-74.41443599999999,42.636721],[-74.41449799999999,42.636854],[-74.41455499999999,42.636946],[-74.41461099999999,42.637079],[-74.41461099999999,42.637199],[-74.414597,42.637263],[-74.414513,42.637467],[-74.414513,42.637565],[-74.41452700000001,42.63765],[-74.414576,42.637727],[-74.414682,42.637847],[-74.41481899999999,42.637923],[-74.41492100000001,42.638002],[-74.41499899999999,42.638101],[-74.415098,42.638199],[-74.415182,42.638263],[-74.415288,42.638368],[-74.415471,42.638601],[-74.415718,42.63884],[-74.415924,42.638978],[-74.416383,42.63938],[-74.416509,42.639464],[-74.41661499999999,42.639549],[-74.416664,42.639602],[-74.416679,42.639618],[-74.416802,42.639745],[-74.417064,42.639736],[-74.417096,42.639756],[-74.417373,42.639946],[-74.41762300000001,42.640134],[-74.417862,42.640331],[-74.417985,42.640465],[-74.41809499999999,42.640618],[-74.41839299999999,42.641009],[-74.418474,42.64109],[-74.418639,42.641209],[-74.41903600000001,42.641396],[-74.420641,42.642013],[-74.42100499999999,42.64222],[-74.421178,42.642331],[-74.421539,42.642597],[-74.421969,42.642679],[-74.42270499999999,42.643198],[-74.422804,42.643304],[-74.422918,42.643363],[-74.42301,42.6434],[-74.42323399999999,42.643466],[-74.423508,42.643605],[-74.423821,42.643716],[-74.42474,42.64404],[-74.42598599999999,42.644212],[-74.42642499999999,42.644272],[-74.42721299999999,42.644578],[-74.427938,42.645036],[-74.428271,42.645204],[-74.42841799999999,42.645301],[-74.429928,42.64522],[-74.430066,42.645219],[-74.43047300000001,42.645137],[-74.430598,42.645116],[-74.43076600000001,42.645019],[-74.430864,42.644964],[-74.43125999999999,42.644861],[-74.431363,42.644895]]],"type":"Polygon"}
}