{
  "id": "361070203004",
  "type": "Feature",
  "properties": {
    "area_land":15981002,
    "area_water":523262,
    "geoid":"361070203004",
    "name":"Block Group 4",
    "state":"ny"
},
  "bbox": [
    -76.229211,
    42.082302,
    -76.108562,
    42.116061
],
  "geometry": {"coordinates":[[[-76.229072,42.091561],[-76.228656,42.091921],[-76.22851799999999,42.092041],[-76.228504,42.09206],[-76.228466,42.092118],[-76.228454,42.092138],[-76.228343,42.09231],[-76.228196,42.092594],[-76.228111,42.092762],[-76.228076,42.092882],[-76.228031,42.093204],[-76.22794500000001,42.09346],[-76.227895,42.093535],[-76.227825,42.0936],[-76.227739,42.093651],[-76.22763399999999,42.093691],[-76.22752300000001,42.093691],[-76.22744299999999,42.093681],[-76.227366,42.093678],[-76.227277,42.093676],[-76.227206,42.093706],[-76.227051,42.093856],[-76.22698,42.093897],[-76.22692000000001,42.093902],[-76.226874,42.094043],[-76.226831,42.094133],[-76.226771,42.094214],[-76.22669,42.09427],[-76.226608,42.094287],[-76.22626099999999,42.094287],[-76.226192,42.094317],[-76.22605900000001,42.09442],[-76.22595699999999,42.094433],[-76.225931,42.094471],[-76.225931,42.094527],[-76.22595699999999,42.094583],[-76.226021,42.094664],[-76.22613699999999,42.094745],[-76.226209,42.094767],[-76.22638999999999,42.094775],[-76.22642399999999,42.094733],[-76.226437,42.094523],[-76.22645799999999,42.094476],[-76.22651399999999,42.09445],[-76.226668,42.094437],[-76.226722,42.094475],[-76.22672799999999,42.094493],[-76.22671099999999,42.094531],[-76.226591,42.094664],[-76.226552,42.094745],[-76.226535,42.09484],[-76.226552,42.094861],[-76.226612,42.094887],[-76.22669399999999,42.094908],[-76.226878,42.094917],[-76.227024,42.094852],[-76.227084,42.094852],[-76.227234,42.094904],[-76.22762,42.095064],[-76.22756200000001,42.09509],[-76.227277,42.09516],[-76.227057,42.095189],[-76.22600199999999,42.095268],[-76.225662,42.095309],[-76.22552899999999,42.095337],[-76.22543,42.095343],[-76.224943,42.095384],[-76.22484900000001,42.095391],[-76.22430199999999,42.095422],[-76.224008,42.095435],[-76.223913,42.095432],[-76.223662,42.095424],[-76.223451,42.095404],[-76.223237,42.095369],[-76.22293500000001,42.095294],[-76.222696,42.095217],[-76.222364,42.095085],[-76.221299,42.094513],[-76.220788,42.094239],[-76.220697,42.094189],[-76.22047600000001,42.094067],[-76.22041900000001,42.094037],[-76.220251,42.093949],[-76.220195,42.09392],[-76.219672,42.093627],[-76.219643,42.093612],[-76.2192,42.093379],[-76.21813,42.092816],[-76.217962,42.092737],[-76.21775100000001,42.092638],[-76.21738499999999,42.092482],[-76.217113,42.09262],[-76.216877,42.092784],[-76.21672100000001,42.092873],[-76.21628699999999,42.093092],[-76.21614,42.093134],[-76.216014,42.093159],[-76.21588300000001,42.093167],[-76.215765,42.093184],[-76.21545399999999,42.093285],[-76.215074,42.093453],[-76.21476,42.093594],[-76.21453700000001,42.093704],[-76.214449,42.093758],[-76.21425499999999,42.093855],[-76.214162,42.093884],[-76.213897,42.093931],[-76.21356,42.094011],[-76.213421,42.094057],[-76.21324,42.094145],[-76.212834,42.09437],[-76.212784,42.094417],[-76.212729,42.094497],[-76.212658,42.094686],[-76.21245500000001,42.095098],[-76.212405,42.095149],[-76.21234200000001,42.095178],[-76.21227,42.095187],[-76.212186,42.095182],[-76.21211,42.095153],[-76.212034,42.09514],[-76.211853,42.095149],[-76.21177299999999,42.095178],[-76.211702,42.095229],[-76.21163799999999,42.0953],[-76.211596,42.095393],[-76.211592,42.095485],[-76.211626,42.095536],[-76.211714,42.095607],[-76.211832,42.095654],[-76.212177,42.095738],[-76.212363,42.095818],[-76.21262,42.095868],[-76.21267400000001,42.095893],[-76.212717,42.095944],[-76.212754,42.096015],[-76.212784,42.096104],[-76.21279199999999,42.096205],[-76.21278,42.096351],[-76.212751,42.096401],[-76.212637,42.096515],[-76.212507,42.096586],[-76.212418,42.09662],[-76.211997,42.096733],[-76.211862,42.096754],[-76.211635,42.096775],[-76.21133399999999,42.096777],[-76.211071,42.09678],[-76.210883,42.096835],[-76.210286,42.097087],[-76.209245,42.097399],[-76.208916,42.097475],[-76.20863300000001,42.097543],[-76.208262,42.097564],[-76.20806399999999,42.097594],[-76.207854,42.097669],[-76.20737,42.097892],[-76.207172,42.098002],[-76.207032,42.098094],[-76.206906,42.098199],[-76.206658,42.098469],[-76.2062,42.099098],[-76.206036,42.099271],[-76.205855,42.099347],[-76.205763,42.099372],[-76.205556,42.099456],[-76.205371,42.099582],[-76.205186,42.099746],[-76.20511399999999,42.099835],[-76.205017,42.099999],[-76.204984,42.100197],[-76.204982,42.100211],[-76.204945,42.100552],[-76.204785,42.100943],[-76.204582,42.101288],[-76.204481,42.101558],[-76.204426,42.101889],[-76.204397,42.101964],[-76.2043,42.102124],[-76.204026,42.102751],[-76.203988,42.102856],[-76.203879,42.103413],[-76.20379,42.103699],[-76.203748,42.103796],[-76.203491,42.104131],[-76.203441,42.104177],[-76.203352,42.104228],[-76.203247,42.104253],[-76.20309899999999,42.104261],[-76.20296,42.104257],[-76.202741,42.104198],[-76.202628,42.104139],[-76.2024,42.103996],[-76.20227800000001,42.103895],[-76.202084,42.103597],[-76.201983,42.103483],[-76.201767,42.103321],[-76.20167600000001,42.103265],[-76.201095,42.103031],[-76.20040299999999,42.102816],[-76.200322,42.1028],[-76.20015100000001,42.102788],[-76.199967,42.102827],[-76.199636,42.103028],[-76.19934499999999,42.103196],[-76.199155,42.103263],[-76.198622,42.10342],[-76.19821899999999,42.103633],[-76.19807400000001,42.103694],[-76.197934,42.103739],[-76.197777,42.103772],[-76.197642,42.103772],[-76.19731,42.103798],[-76.19716699999999,42.103826],[-76.19677900000001,42.103938],[-76.19654300000001,42.104022],[-76.19646299999999,42.10407],[-76.19639100000001,42.104166],[-76.196355,42.104354],[-76.196275,42.104557],[-76.19625000000001,42.104679],[-76.196286,42.104767],[-76.196286,42.104835],[-76.19626599999999,42.104919],[-76.19622200000001,42.105003],[-76.19614199999999,42.105111],[-76.195942,42.105259],[-76.19582200000001,42.105307],[-76.195706,42.105339],[-76.195582,42.105391],[-76.195318,42.105522],[-76.195166,42.105618],[-76.19477000000001,42.105826],[-76.19460599999999,42.105878],[-76.194506,42.105886],[-76.194418,42.10591],[-76.194368,42.105936],[-76.19417199999999,42.106039],[-76.193744,42.106052],[-76.19362,42.106087],[-76.193476,42.106111],[-76.192724,42.106199],[-76.192544,42.106207],[-76.192464,42.106227],[-76.192376,42.10627],[-76.190803,42.106776],[-76.190679,42.106828],[-76.190375,42.106927],[-76.190095,42.107079],[-76.189865,42.107288],[-76.189678,42.107488],[-76.189313,42.107499],[-76.188221,42.107534],[-76.18785699999999,42.107547],[-76.18461600000001,42.107658],[-76.184562,42.10766],[-76.183279,42.107752],[-76.18276,42.107804],[-76.18170600000001,42.107957],[-76.181262,42.108004],[-76.18003299999999,42.10807],[-76.176669,42.10822],[-76.174916,42.108306],[-76.172425,42.108429],[-76.171678,42.108458],[-76.171153,42.108483],[-76.169577,42.108559],[-76.16905300000001,42.108585],[-76.168398,42.108618],[-76.166434,42.108719],[-76.16578,42.108753],[-76.165227,42.108788],[-76.163639,42.108889],[-76.16357000000001,42.108893],[-76.16301799999999,42.108933],[-76.16250700000001,42.108967],[-76.161265,42.109052],[-76.16097600000001,42.10907],[-76.160466,42.109104],[-76.16001300000001,42.109134],[-76.15862199999999,42.109219],[-76.156094,42.109375],[-76.153093,42.109568],[-76.15201399999999,42.109638],[-76.15138399999999,42.109702],[-76.151253,42.109721],[-76.151149,42.109741],[-76.15104100000001,42.109764],[-76.15084400000001,42.109821],[-76.15074300000001,42.109851],[-76.15052900000001,42.109925],[-76.14959,42.110313],[-76.14834999999999,42.110827],[-76.14792199999999,42.111015],[-76.14749399999999,42.11121],[-76.147195,42.111372],[-76.146962,42.111516],[-76.146607,42.111738],[-76.14576099999999,42.112282],[-76.14546,42.112453],[-76.14518200000001,42.112582],[-76.14478099999999,42.112727],[-76.144474,42.112812],[-76.144018,42.112904],[-76.143697,42.112944],[-76.142686,42.113039],[-76.141302,42.113135],[-76.139843,42.113208],[-76.138862,42.113263],[-76.13798199999999,42.113339],[-76.13740199999999,42.11341],[-76.13700300000001,42.113481],[-76.136765,42.113536],[-76.1361,42.113724],[-76.135728,42.113846],[-76.13523000000001,42.114025],[-76.135024,42.11411],[-76.1345,42.114329],[-76.133915,42.114617],[-76.132391,42.115437],[-76.13195899999999,42.115627],[-76.13164399999999,42.11574],[-76.131277,42.115834],[-76.131157,42.115856],[-76.13093499999999,42.115881],[-76.130613,42.115919],[-76.129904,42.115945],[-76.12956,42.115958],[-76.129355,42.115965],[-76.12884200000001,42.115985],[-76.12874100000001,42.115987],[-76.12853699999999,42.115992],[-76.12819399999999,42.115999],[-76.12716899999999,42.11602],[-76.12682700000001,42.116028],[-76.12644400000001,42.116032],[-76.125299,42.116047],[-76.124917,42.116052],[-76.12418,42.116061],[-76.123661,42.11605],[-76.123206,42.116012],[-76.12281,42.115948],[-76.122107,42.11579],[-76.120589,42.115418],[-76.120329,42.115362],[-76.11945299999999,42.115149],[-76.118934,42.115013],[-76.118757,42.114953],[-76.118313,42.114788],[-76.117665,42.114502],[-76.11694799999999,42.114192],[-76.11662800000001,42.114075],[-76.116181,42.113953],[-76.115359,42.113789],[-76.114942,42.113676],[-76.11447,42.113475],[-76.113653,42.113047],[-76.11332299999999,42.112896],[-76.113118,42.112823],[-76.112836,42.112736],[-76.112634,42.112686],[-76.112284,42.112614],[-76.111628,42.112504],[-76.11132600000001,42.112465],[-76.111127,42.112439],[-76.11110600000001,42.112436],[-76.111098,42.112292],[-76.11100999999999,42.112292],[-76.109461,42.112284],[-76.109415,42.111729],[-76.10856200000001,42.101256],[-76.11153400000001,42.10117],[-76.11149399999999,42.100442],[-76.111047,42.096295],[-76.11102700000001,42.095806],[-76.110935,42.095331],[-76.111189,42.095391],[-76.11128600000001,42.095413],[-76.111392,42.095437],[-76.112345,42.095645],[-76.11269799999999,42.095723],[-76.11306999999999,42.095805],[-76.11321700000001,42.095831],[-76.113482,42.095878],[-76.113709,42.0959],[-76.113985,42.095905],[-76.114602,42.095872],[-76.11480400000001,42.095854],[-76.115334,42.095808],[-76.115571,42.095787],[-76.116049,42.095746],[-76.116282,42.095722],[-76.116519,42.095699],[-76.11713399999999,42.095638],[-76.117862,42.095594],[-76.118123,42.095592],[-76.118443,42.095591],[-76.119761,42.095646],[-76.12212700000001,42.095706],[-76.12272,42.095699],[-76.12294900000001,42.095687],[-76.123046,42.095682],[-76.123254,42.095658],[-76.124213,42.09549],[-76.124537,42.09543],[-76.125339,42.095282],[-76.125561,42.095233],[-76.125658,42.095213],[-76.126228,42.095065],[-76.12652799999999,42.094952],[-76.12692300000001,42.09475],[-76.127768,42.094248],[-76.12808,42.094058],[-76.128354,42.093874],[-76.12925,42.09334],[-76.12956800000001,42.093149],[-76.130116,42.092823],[-76.130499,42.092606],[-76.13052999999999,42.092589],[-76.13086,42.09242],[-76.131558,42.092075],[-76.132041,42.091873],[-76.13223000000001,42.091795],[-76.132711,42.091623],[-76.13314099999999,42.091493],[-76.133499,42.091385],[-76.133957,42.091288],[-76.134266,42.091246],[-76.13584899999999,42.091104],[-76.137035,42.090984],[-76.137145,42.090967],[-76.137359,42.090945],[-76.137737,42.090877],[-76.13801100000001,42.090807],[-76.138071,42.090786],[-76.138194,42.090745],[-76.138908,42.09047],[-76.13913700000001,42.090399],[-76.139357,42.090354],[-76.139476,42.09034],[-76.139645,42.090333],[-76.139938,42.090348],[-76.140826,42.090461],[-76.14093,42.090475],[-76.14116199999999,42.090489],[-76.141409,42.090498],[-76.14165300000001,42.090494],[-76.14177100000001,42.090486],[-76.141955,42.090472],[-76.14251,42.090432],[-76.142695,42.090419],[-76.14306000000001,42.090395],[-76.143084,42.090394],[-76.144254,42.090375],[-76.144645,42.090369],[-76.145645,42.090301],[-76.14642000000001,42.090249],[-76.148646,42.090074],[-76.148838,42.090059],[-76.149643,42.089962],[-76.14946,42.089532],[-76.149297,42.089148],[-76.148915,42.088242],[-76.148735,42.087812],[-76.148725,42.087789],[-76.148695,42.08772],[-76.148686,42.087697],[-76.14861999999999,42.087543],[-76.14842299999999,42.087083],[-76.148358,42.08693],[-76.147989,42.086051],[-76.147791,42.085578],[-76.147126,42.084002],[-76.146986,42.08364],[-76.146907,42.083407],[-76.146877,42.083316],[-76.146619,42.0825],[-76.14696499999999,42.082444],[-76.147147,42.082437],[-76.14724,42.082434],[-76.148742,42.082557],[-76.14878400000001,42.082561],[-76.149126,42.082595],[-76.14927400000001,42.082593],[-76.14932399999999,42.082589],[-76.149535,42.082576],[-76.149945,42.082555],[-76.150564,42.082534],[-76.151354,42.082508],[-76.153313,42.082414],[-76.15363000000001,42.082388],[-76.15443399999999,42.082346],[-76.154718,42.082332],[-76.155074,42.082316],[-76.155725,42.082302],[-76.155812,42.082456],[-76.15583700000001,42.08254],[-76.156015,42.083121],[-76.15605499999999,42.08315],[-76.156193,42.083163],[-76.156277,42.083172],[-76.156458,42.083175],[-76.156609,42.083423],[-76.15706299999999,42.08417],[-76.15721499999999,42.084419],[-76.15725999999999,42.084416],[-76.157398,42.084409],[-76.157444,42.084407],[-76.157875,42.086363],[-76.15613500000001,42.093868],[-76.15644899999999,42.094153],[-76.160421,42.097759],[-76.167699,42.099362],[-76.180673,42.099266],[-76.184646,42.096935],[-76.193387,42.09181],[-76.194652,42.091074],[-76.197851,42.089628],[-76.20066199999999,42.088359],[-76.200852,42.088274],[-76.20187199999999,42.088274],[-76.211152,42.088274],[-76.214147,42.085927],[-76.21929,42.084019],[-76.221552,42.085199],[-76.22293999999999,42.086381],[-76.223753,42.087074],[-76.22921100000001,42.091442],[-76.229072,42.091561]]],"type":"Polygon"}
}