{
  "id": "360594122003",
  "type": "Feature",
  "properties": {
    "area_land":939294,
    "area_water":261801,
    "geoid":"360594122003",
    "name":"Block Group 3",
    "state":"ny"
},
  "bbox": [
    -73.677403,
    40.622164,
    -73.657269,
    40.636395
],
  "geometry": {"coordinates":[[[-73.676255,40.62896],[-73.675264,40.628709],[-73.67202,40.628276],[-73.67166,40.628459],[-73.67144999999999,40.628665],[-73.67142,40.628939],[-73.671252,40.629314],[-73.67094899999999,40.629991],[-73.670676,40.630603],[-73.67036400000001,40.6313],[-73.67009899999999,40.631893],[-73.66983,40.632494],[-73.66950799999999,40.633213],[-73.66921000000001,40.63388],[-73.668942,40.63448],[-73.668841,40.634706],[-73.668837,40.6346],[-73.668859,40.6345],[-73.66884400000001,40.634506],[-73.668313,40.634396],[-73.667835,40.635701],[-73.66728500000001,40.635516],[-73.66689599999999,40.63618],[-73.666792,40.636357],[-73.66669400000001,40.636395],[-73.66634000000001,40.636272],[-73.666465,40.6361],[-73.66608100000001,40.635975],[-73.66593,40.636267],[-73.665447,40.636114],[-73.665661,40.635752],[-73.665261,40.635626],[-73.665198,40.635765],[-73.665127,40.635779],[-73.66503899999999,40.63582],[-73.66497,40.635944],[-73.664607,40.635814],[-73.66461200000001,40.635762],[-73.66427400000001,40.63567],[-73.664258,40.635579],[-73.663449,40.635272],[-73.662628,40.635014],[-73.66177999999999,40.634766],[-73.660903,40.634481],[-73.660186,40.634275],[-73.66008600000001,40.634269],[-73.659936,40.634562],[-73.659598,40.635197],[-73.659373,40.635628],[-73.65933099999999,40.63568],[-73.65839800000001,40.635675],[-73.65826800000001,40.635654],[-73.65819500000001,40.635638],[-73.65794699999999,40.635566],[-73.65769899999999,40.635497],[-73.65764299999999,40.635433],[-73.657611,40.635331],[-73.657269,40.635201],[-73.657447,40.635029],[-73.657853,40.634627],[-73.658359,40.634399],[-73.65871199999999,40.63424],[-73.65900999999999,40.634524],[-73.65902699999999,40.634414],[-73.659083,40.63425],[-73.65921,40.633883],[-73.659733,40.630459],[-73.659747,40.629827],[-73.66032,40.628973],[-73.66087899999999,40.6284],[-73.661097,40.62751],[-73.66124499999999,40.62684],[-73.661835,40.624169],[-73.66190400000001,40.623858],[-73.66194299999999,40.623054],[-73.66214600000001,40.622877],[-73.66221299999999,40.622686],[-73.66237599999999,40.622402],[-73.662555,40.622201],[-73.66518600000001,40.622164],[-73.66692500000001,40.622704],[-73.667648,40.623114],[-73.668925,40.62558],[-73.670468,40.626232],[-73.675574,40.628003],[-73.677403,40.628768],[-73.676255,40.62896]]],"type":"Polygon"}
}