{
  "id": "360050373004",
  "type": "Feature",
  "properties": {
    "area_land":32032,
    "area_water":0,
    "geoid":"360050373004",
    "name":"Block Group 4",
    "state":"ny"
},
  "bbox": [
    -73.892421,
    40.84747,
    -73.8899,
    40.850477
],
  "geometry": {"coordinates":[[[-73.891544,40.849467],[-73.890936,40.850477],[-73.8899,40.849869],[-73.89046,40.848933],[-73.891334,40.84747],[-73.892421,40.848003],[-73.891544,40.849467]]],"type":"Polygon"}
}