{
  "id": "361031118022",
  "type": "Feature",
  "properties": {
    "area_land":995252,
    "area_water":0,
    "geoid":"361031118022",
    "name":"Block Group 2",
    "state":"ny"
},
  "bbox": [
    -73.303981,
    40.859141,
    -73.289705,
    40.869521
],
  "geometry": {"coordinates":[[[-73.30398099999999,40.863978],[-73.30369899999999,40.864051],[-73.302967,40.864318],[-73.301952,40.864714],[-73.301548,40.864863],[-73.301227,40.864989],[-73.301311,40.865138],[-73.301394,40.865309],[-73.30144900000001,40.86547],[-73.301509,40.865737],[-73.30153199999999,40.86595],[-73.301669,40.866748],[-73.301708,40.866896],[-73.301799,40.867179],[-73.301877,40.867472],[-73.302036,40.867984],[-73.30095900000001,40.868167],[-73.29891600000001,40.868521],[-73.29848,40.868617],[-73.297297,40.868823],[-73.296909,40.868884],[-73.296657,40.868903],[-73.295564,40.868911],[-73.29376499999999,40.868903],[-73.293513,40.868899],[-73.292537,40.8688],[-73.290476,40.869448],[-73.290263,40.869521],[-73.28996600000001,40.869395],[-73.289973,40.869178],[-73.28995,40.868781],[-73.289897,40.868232],[-73.289821,40.867816],[-73.28975199999999,40.867499],[-73.289705,40.867202],[-73.289776,40.866881],[-73.29020300000001,40.865687],[-73.29030899999999,40.865199],[-73.29037099999999,40.864913],[-73.290577,40.862155],[-73.290645,40.861167],[-73.291341,40.861068],[-73.293368,40.860778],[-73.293964,40.860686],[-73.29648899999999,40.860289],[-73.29777900000001,40.860095],[-73.29845,40.85998],[-73.300403,40.859683],[-73.303898,40.859141],[-73.303944,40.859294],[-73.303967,40.859442],[-73.30395799999999,40.85961],[-73.30393599999999,40.85979],[-73.303904,40.859957],[-73.303859,40.860144],[-73.303775,40.860275],[-73.303386,40.860816],[-73.303326,40.86093],[-73.303273,40.86106],[-73.303258,40.861197],[-73.30328799999999,40.861354],[-73.30354699999999,40.862338],[-73.30367699999999,40.862784],[-73.303731,40.862986],[-73.303845,40.863486],[-73.30398099999999,40.863978]]],"type":"Polygon"}
}