{
  "id": "360690501022",
  "type": "Feature",
  "properties": {
    "area_land":3037300,
    "area_water":0,
    "geoid":"360690501022",
    "name":"Block Group 2",
    "state":"ny"
},
  "bbox": [
    -77.42308,
    42.979992,
    -77.396616,
    43.000275
],
  "geometry": {"coordinates":[[[-77.42308,43.000275],[-77.422814,43.000206],[-77.420737,42.999716],[-77.418539,42.999252],[-77.417773,42.999103],[-77.416197,42.998824],[-77.414029,42.998494],[-77.413488,42.998421],[-77.412989,42.998361],[-77.411889,42.99823],[-77.411169,42.998148],[-77.409677,42.998011],[-77.408587,42.997931],[-77.406747,42.997815],[-77.40344399999999,42.997648],[-77.40039400000001,42.997482],[-77.39881699999999,42.99739],[-77.39782200000001,42.997339],[-77.39781600000001,42.997265],[-77.397811,42.997194],[-77.39778800000001,42.996841],[-77.397755,42.996316],[-77.397756,42.995967],[-77.397806,42.995444],[-77.39782200000001,42.995348],[-77.397864,42.995107],[-77.397907,42.994857],[-77.39769800000001,42.994731],[-77.397639,42.994675],[-77.397571,42.994555],[-77.397555,42.994474],[-77.397255,42.992866],[-77.397156,42.992331],[-77.397143,42.99227],[-77.39710599999999,42.99209],[-77.397094,42.99203],[-77.396998,42.991553],[-77.396906,42.990981],[-77.396781,42.990203],[-77.39664,42.989056],[-77.39661599999999,42.988541],[-77.396632,42.988038],[-77.39663899999999,42.987805],[-77.39665599999999,42.987251],[-77.396677,42.986741],[-77.396715,42.986051],[-77.39673000000001,42.985799],[-77.396765,42.985472],[-77.39680300000001,42.985246],[-77.396868,42.984976],[-77.39704,42.984454],[-77.39721,42.984089],[-77.397223,42.984061],[-77.39728599999999,42.983927],[-77.397515,42.983435],[-77.39782200000001,42.982751],[-77.39789500000001,42.982589],[-77.39818099999999,42.981954],[-77.39836699999999,42.981577],[-77.398489,42.981377],[-77.39868300000001,42.981111],[-77.398715,42.981043],[-77.398751,42.980882],[-77.39876,42.980731],[-77.398791,42.980251],[-77.398765,42.980105],[-77.398725,42.979992],[-77.39881699999999,42.980005],[-77.398929,42.980021],[-77.399057,42.980045],[-77.39909299999999,42.980052],[-77.399153,42.980064],[-77.399185,42.980072],[-77.400789,42.980471],[-77.401561,42.980664],[-77.40276,42.980952],[-77.403021,42.981015],[-77.405188,42.981516],[-77.405618,42.98161],[-77.407234,42.981967],[-77.407286,42.981978],[-77.407445,42.982012],[-77.407498,42.982024],[-77.407904,42.982114],[-77.409047,42.98237],[-77.409122,42.982392],[-77.409522,42.98251],[-77.409721,42.98259],[-77.40996699999999,42.982705],[-77.410257,42.982841],[-77.41090199999999,42.983143],[-77.411292,42.983321],[-77.411736,42.983524],[-77.412126,42.983701],[-77.413296,42.984233],[-77.413687,42.984411],[-77.413742,42.984583],[-77.41380100000001,42.984669],[-77.41448,42.985352],[-77.41463299999999,42.98552],[-77.414756,42.985655],[-77.414963,42.985931],[-77.415049,42.986093],[-77.415237,42.986757],[-77.41545000000001,42.987395],[-77.415567,42.987659],[-77.415691,42.987835],[-77.415847,42.987995],[-77.416628,42.988665],[-77.41679000000001,42.988827],[-77.417025,42.98908],[-77.41704,42.9891],[-77.417371,42.989541],[-77.417872,42.99032],[-77.418136,42.990732],[-77.41875400000001,42.991698],[-77.418927,42.991972],[-77.41919,42.992386],[-77.41966499999999,42.993111],[-77.42009899999999,42.9938],[-77.42036,42.994307],[-77.421021,42.995688],[-77.422025,42.997882],[-77.42207000000001,42.997983],[-77.422996,43.000087],[-77.423029,43.000161],[-77.42308,43.000275]]],"type":"Polygon"}
}