{
  "id": "360910606022",
  "type": "Feature",
  "properties": {
    "area_land":25432009,
    "area_water":4168,
    "geoid":"360910606022",
    "name":"Block Group 2",
    "state":"ny"
},
  "bbox": [
    -73.920722,
    43.083497,
    -73.829092,
    43.136374
],
  "geometry": {"coordinates":[[[-73.920483,43.087224],[-73.919884,43.087718],[-73.917777,43.089488],[-73.91748,43.089671],[-73.917203,43.089802],[-73.916978,43.089891],[-73.91654800000001,43.09002],[-73.916759,43.090649],[-73.916794,43.090788],[-73.91679999999999,43.090908],[-73.91676200000001,43.091197],[-73.916703,43.091515],[-73.91645200000001,43.092445],[-73.916202,43.093131],[-73.916089,43.093372],[-73.915971,43.093569],[-73.915828,43.093755],[-73.915696,43.093944],[-73.91525900000001,43.09441],[-73.91488699999999,43.094718],[-73.914582,43.094939],[-73.91436299999999,43.095125],[-73.91412,43.095362],[-73.913832,43.095799],[-73.913713,43.096003],[-73.913466,43.096541],[-73.913066,43.097486],[-73.912811,43.098064],[-73.91252799999999,43.098707],[-73.91228700000001,43.09929],[-73.91222999999999,43.099501],[-73.912176,43.099851],[-73.912128,43.100253],[-73.91198300000001,43.100792],[-73.911811,43.101495],[-73.911778,43.101978],[-73.911714,43.102511],[-73.911643,43.102872],[-73.911559,43.103138],[-73.911469,43.103338],[-73.91137500000001,43.103578],[-73.911179,43.104015],[-73.910894,43.104463],[-73.910713,43.104722],[-73.91050300000001,43.104951],[-73.91008100000001,43.105361],[-73.909824,43.105564],[-73.909547,43.105758],[-73.9093,43.10592],[-73.90879200000001,43.106209],[-73.90855999999999,43.106305],[-73.90832,43.106373],[-73.907533,43.106538],[-73.907106,43.106601],[-73.906898,43.106646],[-73.906115,43.106779],[-73.90556599999999,43.106885],[-73.904704,43.107103],[-73.90104700000001,43.107985],[-73.900482,43.108155],[-73.900333,43.108207],[-73.90010100000001,43.108311],[-73.900023,43.108352],[-73.899913,43.108429],[-73.899618,43.108699],[-73.899175,43.109249],[-73.899024,43.109437],[-73.898743,43.109823],[-73.89867599999999,43.109944],[-73.89863200000001,43.110058],[-73.898607,43.110192],[-73.89861500000001,43.110395],[-73.89868800000001,43.110669],[-73.89881800000001,43.11088],[-73.899362,43.111851],[-73.899478,43.112171],[-73.89953199999999,43.112345],[-73.899569,43.112626],[-73.899569,43.112932],[-73.899557,43.113044],[-73.89943700000001,43.113395],[-73.899342,43.113613],[-73.89874399999999,43.114834],[-73.898568,43.115193],[-73.89841300000001,43.115545],[-73.898365,43.115688],[-73.89818,43.116663],[-73.89803499999999,43.117062],[-73.89796200000001,43.117203],[-73.897818,43.117421],[-73.89688599999999,43.118686],[-73.896671,43.119035],[-73.895861,43.120538],[-73.895763,43.120691],[-73.895646,43.120841],[-73.895515,43.120985],[-73.89483300000001,43.121544],[-73.894435,43.121827],[-73.893598,43.122472],[-73.89301500000001,43.122943],[-73.89285700000001,43.123092],[-73.89273,43.123228],[-73.892584,43.123384],[-73.892054,43.124054],[-73.891526,43.12472],[-73.89151200000001,43.124738],[-73.891454,43.124967],[-73.89145000000001,43.125036],[-73.891459,43.125154],[-73.89154000000001,43.125444],[-73.891645,43.125666],[-73.88966499999999,43.126026],[-73.885676,43.126769],[-73.884856,43.126895],[-73.882229,43.127182],[-73.881922,43.127271],[-73.88167199999999,43.12733],[-73.88122199999999,43.127503],[-73.879566,43.128114],[-73.87898800000001,43.128359],[-73.87870599999999,43.128465],[-73.878516,43.128537],[-73.87810899999999,43.128713],[-73.877898,43.128821],[-73.877769,43.128897],[-73.877522,43.129087],[-73.876897,43.129643],[-73.876045,43.130315],[-73.874756,43.131564],[-73.87459800000001,43.131711],[-73.87326400000001,43.132945],[-73.87252700000001,43.133662],[-73.87245799999999,43.133602],[-73.872377,43.133561],[-73.872204,43.133502],[-73.87164900000001,43.133281],[-73.870752,43.132828],[-73.870002,43.132483],[-73.869275,43.132164],[-73.868782,43.132027],[-73.868606,43.131979],[-73.86800599999999,43.131894],[-73.865943,43.131774],[-73.864313,43.131702],[-73.864163,43.131724],[-73.864109,43.13174],[-73.86399900000001,43.131766],[-73.86370700000001,43.131921],[-73.86304800000001,43.132301],[-73.86207400000001,43.132881],[-73.860716,43.13367],[-73.859899,43.13417],[-73.85925400000001,43.134526],[-73.858002,43.135278],[-73.857904,43.135338],[-73.856894,43.135958],[-73.85664,43.136096],[-73.856309,43.136263],[-73.85599000000001,43.136352],[-73.855575,43.136365],[-73.85494300000001,43.136374],[-73.854145,43.13636],[-73.85336100000001,43.136326],[-73.852689,43.136288],[-73.849986,43.136105],[-73.848668,43.13597],[-73.848232,43.135931],[-73.847872,43.135873],[-73.847312,43.1358],[-73.84733799999999,43.135134],[-73.847397,43.13488],[-73.847421,43.13468],[-73.847469,43.134531],[-73.847469,43.134302],[-73.84708500000001,43.131533],[-73.84675799999999,43.129349],[-73.846592,43.128396],[-73.846486,43.127186],[-73.84647699999999,43.12708],[-73.84634800000001,43.125593],[-73.846317,43.125074],[-73.846233,43.122725],[-73.846189,43.122367],[-73.84617,43.122215],[-73.846064,43.121778],[-73.845303,43.119216],[-73.845106,43.118744],[-73.844983,43.118416],[-73.844517,43.117417],[-73.844027,43.116475],[-73.84387599999999,43.116096],[-73.84381999999999,43.115877],[-73.843795,43.115681],[-73.843777,43.115093],[-73.84391599999999,43.113126],[-73.84334,43.113108],[-73.843014,43.113116],[-73.843056,43.112844],[-73.843141,43.112546],[-73.84323500000001,43.112364],[-73.843003,43.112386],[-73.842349,43.112366],[-73.841973,43.112364],[-73.84157999999999,43.112418],[-73.841536,43.112481],[-73.84148999999999,43.112529],[-73.841371,43.1124],[-73.84134899999999,43.112362],[-73.841341,43.112212],[-73.841368,43.111979],[-73.84267,43.112047],[-73.84350499999999,43.11217],[-73.843559,43.112019],[-73.84376,43.111783],[-73.843701,43.111737],[-73.843467,43.111642],[-73.843435,43.111637],[-73.84279600000001,43.111581],[-73.842105,43.111554],[-73.841527,43.111516],[-73.841421,43.111517],[-73.84139399999999,43.111493],[-73.841302,43.111262],[-73.841239,43.111099],[-73.841162,43.110898],[-73.841044,43.110651],[-73.84166399999999,43.110623],[-73.84234600000001,43.110659],[-73.843011,43.110676],[-73.842915,43.110208],[-73.843126,43.110153],[-73.84352,43.110016],[-73.841357,43.107081],[-73.841206,43.106851],[-73.841007,43.106512],[-73.84085899999999,43.106214],[-73.84066900000001,43.105717],[-73.840509,43.105198],[-73.84023500000001,43.104216],[-73.839825,43.102886],[-73.839766,43.102724],[-73.83969,43.102514],[-73.839136,43.100693],[-73.8391,43.100559],[-73.83902500000001,43.100285],[-73.838596,43.098942],[-73.83825899999999,43.097775],[-73.837907,43.096557],[-73.83775,43.096114],[-73.837458,43.095562],[-73.837101,43.095152],[-73.83696999999999,43.095019],[-73.836831,43.094878],[-73.83587300000001,43.094162],[-73.83510699999999,43.093504],[-73.834895,43.093281],[-73.834824,43.093219],[-73.834504,43.093392],[-73.834462,43.093173],[-73.83434,43.093061],[-73.834227,43.09295],[-73.83402100000001,43.092669],[-73.833804,43.092571],[-73.833702,43.092385],[-73.833806,43.092309],[-73.83355,43.092105],[-73.83309300000001,43.091764],[-73.832669,43.091492],[-73.83224,43.091255],[-73.83213600000001,43.091207],[-73.83191600000001,43.091299],[-73.831604,43.091414],[-73.83153799999999,43.091414],[-73.83148199999999,43.091377],[-73.831378,43.091373],[-73.831222,43.09141],[-73.83116699999999,43.091411],[-73.83114399999999,43.091393],[-73.831115,43.091385],[-73.831046,43.091396],[-73.83099300000001,43.092253],[-73.83080099999999,43.091962],[-73.830626,43.091777],[-73.830427,43.091643],[-73.83027,43.091448],[-73.830214,43.091296],[-73.830196,43.091189],[-73.830242,43.091059],[-73.830032,43.090982],[-73.829252,43.090757],[-73.829092,43.090696],[-73.830344,43.090542],[-73.83040800000001,43.090534],[-73.830538,43.090541],[-73.830748,43.090535],[-73.830898,43.090544],[-73.83116,43.090576],[-73.831434,43.090529],[-73.83327800000001,43.090382],[-73.837114,43.090113],[-73.83727500000001,43.09008],[-73.837552,43.09004],[-73.83911500000001,43.08979],[-73.83923299999999,43.089875],[-73.839337,43.089903],[-73.840942,43.089763],[-73.841042,43.089754],[-73.841239,43.089756],[-73.841403,43.089745],[-73.841582,43.089728],[-73.84195200000001,43.089707],[-73.84209199999999,43.089698],[-73.842409,43.089678],[-73.844702,43.089471],[-73.845693,43.089379],[-73.84615100000001,43.089346],[-73.846512,43.089308],[-73.847876,43.089172],[-73.84881300000001,43.089075],[-73.852051,43.088796],[-73.860732,43.087942],[-73.86211299999999,43.08783],[-73.86582900000001,43.08763],[-73.866062,43.087589],[-73.867119,43.087492],[-73.869265,43.087353],[-73.871364,43.087202],[-73.87238000000001,43.087174],[-73.872773,43.087182],[-73.872945,43.087212],[-73.87329200000001,43.087193],[-73.87393299999999,43.087127],[-73.874769,43.087015],[-73.87917899999999,43.086428],[-73.88588,43.085825],[-73.889225,43.085529],[-73.897216,43.084842],[-73.897642,43.084818],[-73.913746,43.083497],[-73.914192,43.083744],[-73.914738,43.084035],[-73.915267,43.084276],[-73.915859,43.084502],[-73.91661999999999,43.084761],[-73.917479,43.085034],[-73.917613,43.085077],[-73.91764999999999,43.085088],[-73.917721,43.085109],[-73.9181,43.085243],[-73.91843799999999,43.085395],[-73.918735,43.085563],[-73.919596,43.086184],[-73.919911,43.086422],[-73.92003800000001,43.086516],[-73.920722,43.087026],[-73.920483,43.087224]]],"type":"Polygon"}
}