{
  "id": "360290019003",
  "type": "Feature",
  "properties": {
    "area_land":134476,
    "area_water":0,
    "geoid":"360290019003",
    "name":"Block Group 3",
    "state":"ny"
},
  "bbox": [
    -78.809684,
    42.868673,
    -78.804917,
    42.871892
],
  "geometry": {"coordinates":[[[-78.80962700000001,42.870954],[-78.80961499999999,42.871367],[-78.809594,42.871892],[-78.808645,42.871877],[-78.807712,42.871866],[-78.806775,42.871853],[-78.80585600000001,42.87184],[-78.804968,42.871828],[-78.804918,42.871827],[-78.804917,42.871735],[-78.80493300000001,42.871401],[-78.80493300000001,42.871326],[-78.804962,42.868673],[-78.80591,42.868687],[-78.80594000000001,42.868687],[-78.806862,42.8687],[-78.8078,42.868717],[-78.808733,42.868727],[-78.809684,42.868738],[-78.80962700000001,42.870954]]],"type":"Polygon"}
}