{
  "id": "361031584051",
  "type": "Feature",
  "properties": {
    "area_land":13166184,
    "area_water":223833,
    "geoid":"361031584051",
    "name":"Block Group 1",
    "state":"ny"
},
  "bbox": [
    -72.883241,
    40.89603,
    -72.842526,
    40.944455
],
  "geometry": {"coordinates":[[[-72.88318,40.896345],[-72.88315900000001,40.896453],[-72.88306300000001,40.896957],[-72.88297300000001,40.897559],[-72.88289,40.898524],[-72.882801,40.900078],[-72.882696,40.90153],[-72.882666,40.901789],[-72.88259100000001,40.902229],[-72.882547,40.902442],[-72.88241600000001,40.902922],[-72.882154,40.903661],[-72.882026,40.903933],[-72.881647,40.904831],[-72.881529,40.905094],[-72.879672,40.909487],[-72.879513,40.909931],[-72.879277,40.910701],[-72.879048,40.911859],[-72.87888700000001,40.912792],[-72.87887499999999,40.91312],[-72.878984,40.914659],[-72.879271,40.916823],[-72.879407,40.917855],[-72.879627,40.9195],[-72.879762,40.920625],[-72.879845,40.921789],[-72.879868,40.922719],[-72.87985399999999,40.923788],[-72.87981600000001,40.924933],[-72.878744,40.93286],[-72.878034,40.938289],[-72.877627,40.941341],[-72.877545,40.941784],[-72.877461,40.942111],[-72.87737,40.942368],[-72.87777,40.942727],[-72.87787899999999,40.942849],[-72.87799699999999,40.943006],[-72.87812099999999,40.943229],[-72.878289,40.943887],[-72.878309,40.944237],[-72.87830099999999,40.944369],[-72.878282,40.944455],[-72.878232,40.944448],[-72.877326,40.944342],[-72.87634300000001,40.944226],[-72.875484,40.944138],[-72.874279,40.944052],[-72.873913,40.944013],[-72.87382100000001,40.944036],[-72.87178400000001,40.943809],[-72.866753,40.943208],[-72.86612100000001,40.94321],[-72.863026,40.943435],[-72.86227,40.94355],[-72.86192699999999,40.943573],[-72.86174200000001,40.943582],[-72.861141,40.943615],[-72.860058,40.943653],[-72.854786,40.943863],[-72.85065899999999,40.943992],[-72.847594,40.944122],[-72.847578,40.944018],[-72.847258,40.942258],[-72.84723700000001,40.942133],[-72.847227,40.942085],[-72.846666,40.938994],[-72.846632,40.938794],[-72.846576,40.938591],[-72.846298,40.937586],[-72.845879,40.933951],[-72.84531699999999,40.928534],[-72.84498499999999,40.926699],[-72.844685,40.924617],[-72.844666,40.924481],[-72.844644,40.92438],[-72.844514,40.923767],[-72.844486,40.923652],[-72.844463,40.923504],[-72.844351,40.9229],[-72.844341,40.922848],[-72.84433199999999,40.922797],[-72.844216,40.922039],[-72.844211,40.922007],[-72.844204,40.921963],[-72.844086,40.921181],[-72.84407299999999,40.92111],[-72.843924,40.920122],[-72.843851,40.919639],[-72.843833,40.919522],[-72.84380899999999,40.919366],[-72.843586,40.917853],[-72.842885,40.913615],[-72.842685,40.911834],[-72.84252600000001,40.910914],[-72.84284599999999,40.910819],[-72.84295299999999,40.910773],[-72.843221,40.910633],[-72.8437,40.91035],[-72.845928,40.908954],[-72.846845,40.908375],[-72.847615,40.907917],[-72.848378,40.907535],[-72.849773,40.906894],[-72.850459,40.906607],[-72.851147,40.906321],[-72.85198699999999,40.906028],[-72.85435099999999,40.90531],[-72.856663,40.904392],[-72.857052,40.904255],[-72.85761599999999,40.904037],[-72.85879199999999,40.903583],[-72.85893,40.903526],[-72.859562,40.903285],[-72.86059299999999,40.902897],[-72.861068,40.902709],[-72.86119600000001,40.90266],[-72.861592,40.902491],[-72.862425,40.902172],[-72.86326200000001,40.9019],[-72.864148,40.901626],[-72.864575,40.901485],[-72.86506300000001,40.901313],[-72.865444,40.901184],[-72.86584999999999,40.901027],[-72.866421,40.900783],[-72.86731399999999,40.900416],[-72.867749,40.900257],[-72.868504,40.900032],[-72.868841,40.899974],[-72.86919899999999,40.899905],[-72.86969499999999,40.899837],[-72.870846,40.89965],[-72.871358,40.899574],[-72.87281900000001,40.899377],[-72.873784,40.899225],[-72.873819,40.899236],[-72.874112,40.899212],[-72.874876,40.899124],[-72.87543599999999,40.899007],[-72.875968,40.898856],[-72.876811,40.898577],[-72.87757499999999,40.898289],[-72.878987,40.897696],[-72.87920200000001,40.897605],[-72.88049700000001,40.897064],[-72.88056899999999,40.897034],[-72.88161700000001,40.896602],[-72.88204500000001,40.896429],[-72.882768,40.896175],[-72.883241,40.89603],[-72.88318,40.896345]]],"type":"Polygon"}
}