{
  "id": "361031467041",
  "type": "Feature",
  "properties": {
    "area_land":1162833,
    "area_water":26721,
    "geoid":"361031467041",
    "name":"Block Group 1",
    "state":"ny"
},
  "bbox": [
    -73.309698,
    40.73311,
    -73.284973,
    40.741467
],
  "geometry": {"coordinates":[[[-73.30950300000001,40.733755],[-73.309264,40.734199],[-73.308561,40.736198],[-73.30846200000001,40.736698],[-73.30835999999999,40.737498],[-73.307858,40.738597],[-73.307967,40.7393],[-73.306479,40.741467],[-73.30601799999999,40.74124],[-73.305207,40.740896],[-73.304545,40.740697],[-73.303985,40.740582],[-73.303572,40.740516],[-73.302741,40.740417],[-73.30247300000001,40.7404],[-73.30184800000001,40.740339],[-73.301475,40.740298],[-73.300667,40.74022],[-73.30021600000001,40.740177],[-73.29991699999999,40.740148],[-73.298924,40.739981],[-73.297759,40.739747],[-73.297049,40.739606],[-73.29526799999999,40.739235],[-73.29338199999999,40.738831],[-73.29187,40.738524],[-73.29154699999999,40.738461],[-73.291088,40.738389],[-73.290583,40.738332],[-73.29012,40.73831],[-73.289742,40.738303],[-73.289326,40.738317],[-73.28896899999999,40.738322],[-73.28888000000001,40.738295],[-73.288044,40.738304],[-73.287812,40.7383],[-73.28742099999999,40.738287],[-73.28734300000001,40.738275],[-73.286739,40.738181],[-73.28646999999999,40.738128],[-73.285645,40.737894],[-73.285312,40.737759],[-73.28518,40.737706],[-73.28497299999999,40.737623],[-73.28546799999999,40.737191],[-73.28601399999999,40.736765],[-73.286742,40.736251],[-73.287133,40.736004],[-73.28737,40.735862],[-73.287471,40.735807],[-73.288195,40.735416],[-73.288732,40.735168],[-73.289278,40.734958],[-73.290565,40.734611],[-73.291702,40.734366],[-73.29225099999999,40.734205],[-73.292897,40.734056],[-73.293347,40.733972],[-73.294111,40.733856],[-73.294529,40.733783],[-73.29509,40.733694],[-73.29561200000001,40.733592],[-73.295807,40.733565],[-73.296041,40.733518],[-73.29634900000001,40.733473],[-73.29794800000001,40.73343],[-73.299464,40.733231],[-73.300093,40.733163],[-73.300793,40.733118],[-73.30143700000001,40.73311],[-73.302256,40.733142],[-73.30362,40.73324],[-73.304123,40.733278],[-73.30483700000001,40.733317],[-73.306279,40.733402],[-73.307236,40.733434],[-73.308195,40.733443],[-73.309698,40.733408],[-73.30950300000001,40.733755]]],"type":"Polygon"}
}