{
  "id": "360359713002",
  "type": "Feature",
  "properties": {
    "area_land":883456,
    "area_water":0,
    "geoid":"360359713002",
    "name":"Block Group 2",
    "state":"ny"
},
  "bbox": [
    -74.380996,
    42.989281,
    -74.368292,
    43.006412
],
  "geometry": {"coordinates":[[[-74.380996,42.992685],[-74.38084499999999,42.993248],[-74.38029899999999,42.993994],[-74.380037,42.994405],[-74.37980399999999,42.994809],[-74.37969699999999,42.995],[-74.379554,42.995254],[-74.379394,42.995534],[-74.379147,42.995954],[-74.379001,42.996251],[-74.37895899999999,42.996355],[-74.37891500000001,42.996563],[-74.378899,42.996756],[-74.378913,42.99699],[-74.37902200000001,42.997826],[-74.37907800000001,42.998306],[-74.379136,42.998773],[-74.37915,42.999001],[-74.37914499999999,42.999438],[-74.379144,42.999506],[-74.37894300000001,42.999544],[-74.37880699999999,42.999595],[-74.378213,42.999843],[-74.377751,43.000024],[-74.37695600000001,43.000347],[-74.375784,43.000847],[-74.375382,43.000988],[-74.375489,43.002618],[-74.37558300000001,43.004252],[-74.375635,43.005198],[-74.375685,43.006302],[-74.374201,43.006359],[-74.372697,43.006412],[-74.372637,43.005415],[-74.37258,43.004352],[-74.37254299999999,43.003754],[-74.37249799999999,43.002715],[-74.37240799999999,43.001329],[-74.372321,42.999981],[-74.37226099999999,42.998849],[-74.372197,42.997765],[-74.372156,42.997001],[-74.371953,42.99688],[-74.370741,42.996997],[-74.370679,42.995816],[-74.37067,42.99561],[-74.370644,42.995044],[-74.370637,42.994831],[-74.370628,42.994637],[-74.37062400000001,42.994566],[-74.370572,42.993655],[-74.370548,42.99328],[-74.370535,42.993073],[-74.370475,42.99289],[-74.370419,42.992784],[-74.37033700000001,42.992669],[-74.370217,42.9925],[-74.370116,42.99238],[-74.370013,42.99227],[-74.369953,42.992227],[-74.369868,42.992192],[-74.36847299999999,42.990779],[-74.368292,42.989281],[-74.374323,42.989564],[-74.374347,42.989667],[-74.374619,42.990862],[-74.37476700000001,42.991517],[-74.37482300000001,42.991774],[-74.37503100000001,42.992723],[-74.375038,42.992757],[-74.374786,42.992781],[-74.374588,42.992797],[-74.372648,42.992969],[-74.371915,42.993033],[-74.371166,42.993099],[-74.371191,42.993214],[-74.371916,42.993129],[-74.372145,42.993102],[-74.373243,42.992976],[-74.37457999999999,42.992843],[-74.37479399999999,42.992822],[-74.376859,42.992556],[-74.37696200000001,42.992887],[-74.377031,42.993301],[-74.377709,42.993132],[-74.37881899999999,42.992876],[-74.378981,42.992877],[-74.379355,42.992819],[-74.37996800000001,42.992744],[-74.38033,42.992682],[-74.380556,42.992625],[-74.38077800000001,42.992592],[-74.380875,42.99261],[-74.38098599999999,42.992674],[-74.380996,42.992685]]],"type":"Polygon"}
}