{
  "id": "360179707001",
  "type": "Feature",
  "properties": {
    "area_land":68169659,
    "area_water":81781,
    "geoid":"360179707001",
    "name":"Block Group 1",
    "state":"ny"
},
  "bbox": [
    -75.728363,
    42.42694,
    -75.582033,
    42.511497
],
  "geometry": {"coordinates":[[[-75.728258,42.427592],[-75.72823200000001,42.427834],[-75.72822499999999,42.428203],[-75.728268,42.428633],[-75.72828199999999,42.428883],[-75.72830999999999,42.429085],[-75.728303,42.429291],[-75.728219,42.430628],[-75.728177,42.430875],[-75.727846,42.431764],[-75.727644,42.432292],[-75.727338,42.433028],[-75.727272,42.433236],[-75.727253,42.433338],[-75.72721300000001,42.433564],[-75.727194,42.433933],[-75.727143,42.434547],[-75.727052,42.434992],[-75.726815,42.435791],[-75.72656499999999,42.436724],[-75.72636799999999,42.437499],[-75.72526000000001,42.441438],[-75.72497199999999,42.442443],[-75.72496099999999,42.442503],[-75.724873,42.442984],[-75.724868,42.443359],[-75.724937,42.444244],[-75.725024,42.446073],[-75.725101,42.446954],[-75.72246800000001,42.447068],[-75.72141999999999,42.447107],[-75.719251,42.447208],[-75.717276,42.44726],[-75.71618700000001,42.447266],[-75.71566799999999,42.447293],[-75.71408599999999,42.447423],[-75.71394600000001,42.447427],[-75.71305099999999,42.447444],[-75.710843,42.447542],[-75.70856000000001,42.447628],[-75.707222,42.447665],[-75.706165,42.447751],[-75.70595400000001,42.447756],[-75.70557700000001,42.44774],[-75.704868,42.447698],[-75.70387100000001,42.447787],[-75.703115,42.447853],[-75.702592,42.447899],[-75.702376,42.447908],[-75.70243000000001,42.448223],[-75.702428,42.448374],[-75.702426,42.448471],[-75.702338,42.44894],[-75.701836,42.451321],[-75.701474,42.453303],[-75.701425,42.45363],[-75.70132099999999,42.454797],[-75.70133800000001,42.45496],[-75.70137,42.455049],[-75.701536,42.455365],[-75.70162500000001,42.455545],[-75.701696,42.455688],[-75.701728,42.455801],[-75.701746,42.456199],[-75.701685,42.456526],[-75.701491,42.457243],[-75.701498,42.457383],[-75.70155800000001,42.457578],[-75.701612,42.457677],[-75.701875,42.458069],[-75.702032,42.45834],[-75.702124,42.458613],[-75.702218,42.459075],[-75.702414,42.460443],[-75.702527,42.461031],[-75.70257700000001,42.461231],[-75.702658,42.461429],[-75.702704,42.461534],[-75.70280200000001,42.461698],[-75.702906,42.461843],[-75.70301000000001,42.461961],[-75.703444,42.462399],[-75.703767,42.462736],[-75.703885,42.46292],[-75.703996,42.463172],[-75.704053,42.463427],[-75.704072,42.463773],[-75.704059,42.463889],[-75.70397699999999,42.464065],[-75.703862,42.464234],[-75.70379200000001,42.464303],[-75.70371400000001,42.464358],[-75.703418,42.464533],[-75.70312699999999,42.464727],[-75.70296399999999,42.464847],[-75.70274999999999,42.465023],[-75.702245,42.465506],[-75.70215,42.465616],[-75.702043,42.465763],[-75.701792,42.466167],[-75.70114100000001,42.467334],[-75.69971200000001,42.469721],[-75.69959799999999,42.469893],[-75.699208,42.470199],[-75.699134,42.470138],[-75.69882200000001,42.469934],[-75.698435,42.469744],[-75.69795000000001,42.469536],[-75.696873,42.469099],[-75.695802,42.468697],[-75.695623,42.468643],[-75.695066,42.468519],[-75.693201,42.468202],[-75.690437,42.467657],[-75.688362,42.46723],[-75.687499,42.467068],[-75.687307,42.467039],[-75.68662,42.466935],[-75.686471,42.466929],[-75.68582499999999,42.466816],[-75.685405,42.466742],[-75.68549400000001,42.466836],[-75.68555600000001,42.466956],[-75.685575,42.467054],[-75.685575,42.467246],[-75.685496,42.468347],[-75.6854,42.468845],[-75.685284,42.469672],[-75.68527899999999,42.469821],[-75.685312,42.470122],[-75.68553199999999,42.471303],[-75.68561800000001,42.471998],[-75.68592200000001,42.474811],[-75.685987,42.475254],[-75.68604000000001,42.475717],[-75.68604999999999,42.476084],[-75.68604000000001,42.476256],[-75.685716,42.478511],[-75.68558899999999,42.47949],[-75.685513,42.480175],[-75.68664800000001,42.48098],[-75.687348,42.481572],[-75.687499,42.481692],[-75.687814,42.481825],[-75.68886999999999,42.4822],[-75.69098099999999,42.482922],[-75.694203,42.484048],[-75.69529199999999,42.4844],[-75.69675599999999,42.484909],[-75.69714500000001,42.485037],[-75.69748,42.485161],[-75.697948,42.48532],[-75.698139,42.48538],[-75.699676,42.485863],[-75.70076299999999,42.486218],[-75.70123,42.486378],[-75.70185499999999,42.486582],[-75.70304299999999,42.486941],[-75.70514799999999,42.487602],[-75.705567,42.487709],[-75.705685,42.487729],[-75.70587500000001,42.487735],[-75.706165,42.487687],[-75.706878,42.487517],[-75.707595,42.487362],[-75.707802,42.487328],[-75.708021,42.487305],[-75.708495,42.487288],[-75.708743,42.487309],[-75.709176,42.487373],[-75.709525,42.487465],[-75.709603,42.487497],[-75.709661,42.487534],[-75.70986000000001,42.487745],[-75.709979,42.487944],[-75.710097,42.488225],[-75.710157,42.488384],[-75.710424,42.489093],[-75.71046699999999,42.489165],[-75.71057,42.489265],[-75.71065,42.489314],[-75.710975,42.489428],[-75.712069,42.489755],[-75.712221,42.489807],[-75.712501,42.489911],[-75.71274699999999,42.49003],[-75.712932,42.490152],[-75.713155,42.490352],[-75.713235,42.490455],[-75.71329,42.490577],[-75.713393,42.490931],[-75.713792,42.492421],[-75.71399599999999,42.49312],[-75.714209,42.493903],[-75.714665,42.495506],[-75.71467,42.495613],[-75.71463799999999,42.495711],[-75.713977,42.49517],[-75.713784,42.495037],[-75.713579,42.494936],[-75.713431,42.494887],[-75.713301,42.494856],[-75.713154,42.494833],[-75.712763,42.494818],[-75.712311,42.49484],[-75.71206599999999,42.494866],[-75.71184599999999,42.494901],[-75.711393,42.495008],[-75.710559,42.495241],[-75.709858,42.495406],[-75.709298,42.495529],[-75.708584,42.495711],[-75.70730500000001,42.496084],[-75.70684900000001,42.496188],[-75.706687,42.49622],[-75.70650500000001,42.496242],[-75.70558699999999,42.496302],[-75.700188,42.496565],[-75.69995400000001,42.496591],[-75.699709,42.496647],[-75.699499,42.496719],[-75.69926100000001,42.496813],[-75.698239,42.497261],[-75.697861,42.497413],[-75.697568,42.497503],[-75.69737000000001,42.49754],[-75.697107,42.497567],[-75.696977,42.497564],[-75.696681,42.497521],[-75.696521,42.497485],[-75.696054,42.497356],[-75.695802,42.497323],[-75.695649,42.497318],[-75.695505,42.497326],[-75.695132,42.497394],[-75.694568,42.497529],[-75.693388,42.497837],[-75.693118,42.497914],[-75.692978,42.497945],[-75.692768,42.497968],[-75.69266399999999,42.497968],[-75.692482,42.497939],[-75.692397,42.497905],[-75.69208999999999,42.497721],[-75.691721,42.497473],[-75.691523,42.497336],[-75.69117900000001,42.497097],[-75.69100299999999,42.497012],[-75.69084599999999,42.496967],[-75.69067099999999,42.496951],[-75.690516,42.496948],[-75.68989500000001,42.49697],[-75.68920199999999,42.497018],[-75.688722,42.497081],[-75.688519,42.497115],[-75.688267,42.497185],[-75.687758,42.497349],[-75.6875,42.49738],[-75.68737400000001,42.497375],[-75.687276,42.497376],[-75.686722,42.497316],[-75.68625900000001,42.497242],[-75.68608500000001,42.497227],[-75.685661,42.497213],[-75.68478899999999,42.497246],[-75.68260600000001,42.497363],[-75.68183399999999,42.497405],[-75.68109699999999,42.497432],[-75.680831,42.497412],[-75.680393,42.497322],[-75.680336,42.497408],[-75.680277,42.497464],[-75.68021899999999,42.497494],[-75.68011300000001,42.49751],[-75.67876800000001,42.497592],[-75.678489,42.497623],[-75.678067,42.497656],[-75.676407,42.497717],[-75.675055,42.497781],[-75.67469,42.497798],[-75.673445,42.497828],[-75.673284,42.497829],[-75.671998,42.497841],[-75.670044,42.497883],[-75.668353,42.49796],[-75.667855,42.497963],[-75.666613,42.497997],[-75.665116,42.498024],[-75.66484800000001,42.498033],[-75.662582,42.498108],[-75.660031,42.498168],[-75.658655,42.49821],[-75.65802100000001,42.498213],[-75.65765,42.498229],[-75.657408,42.498259],[-75.656924,42.498318],[-75.655339,42.49868],[-75.652053,42.499497],[-75.651213,42.499739],[-75.65076000000001,42.499869],[-75.65042800000001,42.5],[-75.64963299999999,42.500337],[-75.64866000000001,42.500788],[-75.647243,42.501518],[-75.646006,42.502127],[-75.642724,42.504023],[-75.640224,42.505502],[-75.639875,42.505683],[-75.639752,42.505725],[-75.63947400000001,42.505773],[-75.63849,42.505826],[-75.63509999999999,42.506037],[-75.63471,42.506069],[-75.634439,42.506098],[-75.633444,42.506261],[-75.63173399999999,42.506582],[-75.630449,42.506781],[-75.630095,42.506843],[-75.62981600000001,42.506911],[-75.629555,42.506986],[-75.62896499999999,42.507176],[-75.628761,42.50724],[-75.62827,42.507413],[-75.62696800000001,42.507845],[-75.62532,42.508473],[-75.624999,42.508635],[-75.624995,42.508653],[-75.624551,42.508855],[-75.623575,42.509337],[-75.622635,42.50976],[-75.62159,42.510196],[-75.62116399999999,42.510385],[-75.620738,42.510556],[-75.62056200000001,42.510605],[-75.620232,42.510668],[-75.62006599999999,42.510686],[-75.61987999999999,42.510693],[-75.61899,42.510688],[-75.61829899999999,42.510712],[-75.61738099999999,42.510769],[-75.616958,42.510817],[-75.61694300000001,42.510891],[-75.61673500000001,42.510873],[-75.61632299999999,42.51088],[-75.614841,42.51097],[-75.613117,42.511055],[-75.612032,42.511126],[-75.610556,42.511196],[-75.609268,42.511276],[-75.60903999999999,42.511283],[-75.60885500000001,42.511261],[-75.608797,42.511249],[-75.60860700000001,42.51121],[-75.608396,42.511193],[-75.60795400000001,42.511224],[-75.60720499999999,42.511283],[-75.605069,42.511411],[-75.603793,42.511477],[-75.602903,42.511497],[-75.602338,42.510631],[-75.60208799999999,42.510315],[-75.60177400000001,42.509998],[-75.601636,42.509882],[-75.60145,42.509743],[-75.600961,42.50945],[-75.598294,42.508177],[-75.59810299999999,42.508075],[-75.598028,42.508017],[-75.597853,42.507824],[-75.59779399999999,42.507733],[-75.597711,42.507549],[-75.597685,42.507437],[-75.59756899999999,42.506275],[-75.59747900000001,42.505492],[-75.597279,42.503579],[-75.597239,42.503277],[-75.597162,42.502949],[-75.596862,42.501966],[-75.59622,42.5],[-75.59599799999999,42.499355],[-75.59572300000001,42.498652],[-75.595669,42.498535],[-75.595016,42.49711],[-75.594877,42.496783],[-75.594589,42.496157],[-75.594312,42.495596],[-75.593936,42.494893],[-75.593526,42.494193],[-75.59318,42.493741],[-75.592947,42.493475],[-75.592609,42.493104],[-75.591605,42.491949],[-75.59149600000001,42.491803],[-75.591266,42.491406],[-75.59122000000001,42.491279],[-75.591082,42.490721],[-75.591015,42.490022],[-75.591002,42.489829],[-75.59094399999999,42.489253],[-75.590907,42.488878],[-75.590823,42.488383],[-75.59068600000001,42.487807],[-75.590245,42.486306],[-75.590037,42.485678],[-75.589995,42.485552],[-75.589921,42.485294],[-75.589651,42.484284],[-75.588847,42.480925],[-75.588696,42.480058],[-75.588674,42.47976],[-75.588646,42.479199],[-75.588663,42.478958],[-75.588717,42.478503],[-75.58881,42.478],[-75.588894,42.477683],[-75.589066,42.477206],[-75.58955400000001,42.476058],[-75.58974000000001,42.475552],[-75.589788,42.475341],[-75.58980200000001,42.475224],[-75.5898,42.475071],[-75.58981900000001,42.474547],[-75.589804,42.474332],[-75.589775,42.474117],[-75.58965999999999,42.473559],[-75.58954900000001,42.473199],[-75.589448,42.472951],[-75.58918799999999,42.472481],[-75.588639,42.471712],[-75.58839999999999,42.471323],[-75.588335,42.471199],[-75.58824,42.470893],[-75.588218,42.470743],[-75.588194,42.470332],[-75.58819200000001,42.468791],[-75.588207,42.468496],[-75.58819099999999,42.467049],[-75.588156,42.466689],[-75.588058,42.466255],[-75.58792099999999,42.465822],[-75.587844,42.465647],[-75.587622,42.46521],[-75.58741999999999,42.464874],[-75.58727,42.464663],[-75.587121,42.464474],[-75.58694,42.464244],[-75.586798,42.464051],[-75.586235,42.46318],[-75.586078,42.462958],[-75.585892,42.462761],[-75.58566999999999,42.462598],[-75.58549499999999,42.462496],[-75.585382,42.462448],[-75.585132,42.462375],[-75.584357,42.462237],[-75.58381799999999,42.462088],[-75.58301400000001,42.4618],[-75.58249600000001,42.46157],[-75.58226999999999,42.461457],[-75.582157,42.461384],[-75.582033,42.461283],[-75.601254,42.46047],[-75.604957,42.460252],[-75.614223,42.459793],[-75.614182,42.459558],[-75.614164,42.459285],[-75.614166,42.459077],[-75.614144,42.4588],[-75.61412199999999,42.458739],[-75.614075,42.458669],[-75.613767,42.458362],[-75.613743,42.458338],[-75.613696,42.458258],[-75.61366099999999,42.458159],[-75.613668,42.45809],[-75.613803,42.457704],[-75.613865,42.457409],[-75.61386,42.457263],[-75.613809,42.456833],[-75.61377899999999,42.456702],[-75.613732,42.456615],[-75.613677,42.456542],[-75.613564,42.456422],[-75.613533,42.456334],[-75.613533,42.456243],[-75.613581,42.455653],[-75.61357,42.455423],[-75.61355,42.455267],[-75.613524,42.455172],[-75.613451,42.45499],[-75.613291,42.45479],[-75.61312700000001,42.454644],[-75.612877,42.454451],[-75.61267700000001,42.454283],[-75.61256,42.454167],[-75.612487,42.45408],[-75.61248000000001,42.454072],[-75.612312,42.453835],[-75.612199,42.453729],[-75.612036,42.45361],[-75.612003,42.45356],[-75.612002,42.453491],[-75.612106,42.453282],[-75.612128,42.453197],[-75.612385,42.453219],[-75.613761,42.453338],[-75.61438200000001,42.453361],[-75.61471899999999,42.453358],[-75.614739,42.453358],[-75.615415,42.453324],[-75.615933,42.453273],[-75.616229,42.453227],[-75.61734300000001,42.453017],[-75.618032,42.452904],[-75.618315,42.452884],[-75.618691,42.452889],[-75.61872,42.452776],[-75.61891,42.452473],[-75.61937500000001,42.451872],[-75.619557,42.451654],[-75.62029200000001,42.450714],[-75.621404,42.449413],[-75.621994,42.448794],[-75.62206399999999,42.448736],[-75.622195,42.448652],[-75.62253,42.448506],[-75.622665,42.448466],[-75.622806,42.448437],[-75.62321,42.448382],[-75.623637,42.448313],[-75.623812,42.448266],[-75.624227,42.448135],[-75.624432,42.448054],[-75.624591,42.44802],[-75.62454700000001,42.447902],[-75.62452999999999,42.447702],[-75.62458599999999,42.447229],[-75.624774,42.446081],[-75.624825,42.445691],[-75.624895,42.445367],[-75.624914,42.445317],[-75.624999,42.445129],[-75.625258,42.444786],[-75.625657,42.444227],[-75.62604899999999,42.44365],[-75.62632499999999,42.443261],[-75.626434,42.443087],[-75.62647200000001,42.443003],[-75.62651700000001,42.442811],[-75.626525,42.44254],[-75.626484,42.441974],[-75.626439,42.441031],[-75.62633599999999,42.439837],[-75.626285,42.439162],[-75.62615599999999,42.438166],[-75.626003,42.436455],[-75.625945,42.435676],[-75.625961,42.435335],[-75.626057,42.43464],[-75.626093,42.433958],[-75.62608,42.433359],[-75.626047,42.432704],[-75.625986,42.43239],[-75.625851,42.43205],[-75.625609,42.431545],[-75.625501,42.43132],[-75.625395,42.431141],[-75.625308,42.431033],[-75.625141,42.430862],[-75.62398899999999,42.430064],[-75.62370900000001,42.429887],[-75.62311200000001,42.429534],[-75.62296600000001,42.429427],[-75.62278000000001,42.429265],[-75.622652,42.429101],[-75.623323,42.428868],[-75.623571,42.42879],[-75.624824,42.428383],[-75.626254,42.427926],[-75.62638099999999,42.428055],[-75.62651,42.428171],[-75.626598,42.428221],[-75.626751,42.428271],[-75.62684299999999,42.428289],[-75.627104,42.428312],[-75.627888,42.428339],[-75.628325,42.428362],[-75.62882399999999,42.428384],[-75.62921,42.428413],[-75.62938800000001,42.42844],[-75.629546,42.428488],[-75.629965,42.428683],[-75.630252,42.428836],[-75.63037199999999,42.428909],[-75.63049100000001,42.428996],[-75.630612,42.429101],[-75.630752,42.429271],[-75.63099699999999,42.429667],[-75.631117,42.4298],[-75.631269,42.429915],[-75.631361,42.429968],[-75.631495,42.430019],[-75.63171,42.430065],[-75.632205,42.430105],[-75.63276,42.430136],[-75.634259,42.430289],[-75.635015,42.430381],[-75.63647899999999,42.430581],[-75.636758,42.430622],[-75.637179,42.430664],[-75.637721,42.430664],[-75.63866899999999,42.430581],[-75.639915,42.430459],[-75.64037999999999,42.430444],[-75.64333600000001,42.43057],[-75.643986,42.430609],[-75.647374,42.430753],[-75.64809700000001,42.430798],[-75.649551,42.430873],[-75.650437,42.43095],[-75.65078099999999,42.430962],[-75.65207100000001,42.430931],[-75.652762,42.430891],[-75.653064,42.430859],[-75.65397400000001,42.430701],[-75.654618,42.430629],[-75.655187,42.430594],[-75.65627000000001,42.43057],[-75.656864,42.430545],[-75.65865700000001,42.430448],[-75.65895399999999,42.430436],[-75.659251,42.430423],[-75.65957400000001,42.43041],[-75.66126,42.430333],[-75.662345,42.430284],[-75.662689,42.430262],[-75.66334999999999,42.430235],[-75.66414899999999,42.430244],[-75.66497200000001,42.430279],[-75.665254,42.430309],[-75.66651400000001,42.430516],[-75.667509,42.43067],[-75.667733,42.430691],[-75.66835,42.430719],[-75.669572,42.430747],[-75.670154,42.430766],[-75.672113,42.430888],[-75.673828,42.430953],[-75.674863,42.430953],[-75.67556,42.430932],[-75.67598099999999,42.430911],[-75.67684,42.430843],[-75.677392,42.430782],[-75.680752,42.430457],[-75.681264,42.430389],[-75.68211700000001,42.430234],[-75.682226,42.430214],[-75.682593,42.430142],[-75.68338,42.430002],[-75.683707,42.42993],[-75.68402500000001,42.429843],[-75.68420399999999,42.429777],[-75.68432300000001,42.429723],[-75.68466100000001,42.429537],[-75.68481800000001,42.429421],[-75.68507,42.429436],[-75.68567400000001,42.429499],[-75.686088,42.429587],[-75.68707000000001,42.429844],[-75.687258,42.429867],[-75.687685,42.429888],[-75.688121,42.429884],[-75.68834099999999,42.429862],[-75.688515,42.429831],[-75.689031,42.429764],[-75.691911,42.429572],[-75.69394200000001,42.429454],[-75.694672,42.429404],[-75.694784,42.429399],[-75.695353,42.429351],[-75.69686900000001,42.429186],[-75.69792700000001,42.429089],[-75.698948,42.429052],[-75.699996,42.428992],[-75.700596,42.42898],[-75.70065099999999,42.42898],[-75.70105,42.428986],[-75.70219,42.429117],[-75.70280099999999,42.429144],[-75.70317900000001,42.429182],[-75.703498,42.42924],[-75.704491,42.429457],[-75.70469199999999,42.429486],[-75.705192,42.429508],[-75.705545,42.429501],[-75.70681999999999,42.429412],[-75.707587,42.429363],[-75.70863,42.42932],[-75.70907800000001,42.429288],[-75.709524,42.429233],[-75.709987,42.429141],[-75.71034400000001,42.429055],[-75.71111000000001,42.428835],[-75.711585,42.428716],[-75.71419,42.428258],[-75.714381,42.428217],[-75.714612,42.428186],[-75.717466,42.427954],[-75.71928699999999,42.427753],[-75.72073899999999,42.42757],[-75.721661,42.427466],[-75.722983,42.427354],[-75.724756,42.427236],[-75.725526,42.427187],[-75.72786000000001,42.426974],[-75.728363,42.42694],[-75.728258,42.427592]]],"type":"Polygon"}
}