{
  "id": "360470916001",
  "type": "Feature",
  "properties": {
    "area_land":42121,
    "area_water":0,
    "geoid":"360470916001",
    "name":"Block Group 1",
    "state":"ny"
},
  "bbox": [
    -73.911727,
    40.660597,
    -73.908524,
    40.662554
],
  "geometry": {"coordinates":[[[-73.911727,40.662135],[-73.910776,40.662278],[-73.909857,40.662412],[-73.90891999999999,40.662554],[-73.908524,40.661014],[-73.90946099999999,40.660876],[-73.91038,40.660739],[-73.91133499999999,40.660597],[-73.911727,40.662135]]],"type":"Polygon"}
}