{
  "id": "360390802021",
  "type": "Feature",
  "properties": {
    "area_land":79597332,
    "area_water":14148,
    "geoid":"360390802021",
    "name":"Block Group 1",
    "state":"ny"
},
  "bbox": [
    -74.254303,
    42.314848,
    -74.105911,
    42.422984
],
  "geometry": {"coordinates":[[[-74.25430299999999,42.408207],[-74.25330200000001,42.408325],[-74.24958700000001,42.408762],[-74.244809,42.40928],[-74.240915,42.409712],[-74.232356,42.410663],[-74.225652,42.411408],[-74.217558,42.412307],[-74.21704,42.412365],[-74.201993,42.414036],[-74.201584,42.414081],[-74.20147,42.414093],[-74.198521,42.414417],[-74.19818600000001,42.414453],[-74.194844,42.41482],[-74.194807,42.414824],[-74.19464600000001,42.414841],[-74.190614,42.415284],[-74.190568,42.415289],[-74.17542400000001,42.416955],[-74.174014,42.417109],[-74.164963,42.418106],[-74.160253,42.418624],[-74.157858,42.418932],[-74.156361,42.419128],[-74.14965599999999,42.419995],[-74.147496,42.420275],[-74.147402,42.420294],[-74.139101,42.421363],[-74.138266,42.421471],[-74.137404,42.421581],[-74.130067,42.422515],[-74.129645,42.422569],[-74.126722,42.422938],[-74.126442,42.422984],[-74.12625800000001,42.422806],[-74.12623600000001,42.422755],[-74.12619599999999,42.42267],[-74.12619599999999,42.422551],[-74.126215,42.422484],[-74.126279,42.422379],[-74.12651099999999,42.422103],[-74.12653,42.422047],[-74.12653,42.421973],[-74.126518,42.421924],[-74.126485,42.421868],[-74.126105,42.421509],[-74.125867,42.421262],[-74.125781,42.42106],[-74.125758,42.420951],[-74.125755,42.420795],[-74.125777,42.420705],[-74.126058,42.420258],[-74.126204,42.420079],[-74.126428,42.419919],[-74.126457,42.419907],[-74.126735,42.419819],[-74.12720899999999,42.41968],[-74.12755300000001,42.41959],[-74.128199,42.419359],[-74.129198,42.418984],[-74.129367,42.41895],[-74.129795,42.418861],[-74.129941,42.418801],[-74.13007899999999,42.418715],[-74.130143,42.418648],[-74.130161,42.418611],[-74.130135,42.418409],[-74.13001800000001,42.418098],[-74.129868,42.417728],[-74.12982700000001,42.417493],[-74.129834,42.417264],[-74.129931,42.416962],[-74.130025,42.416555],[-74.130036,42.416417],[-74.130036,42.416081],[-74.129959,42.415878],[-74.129806,42.415658],[-74.129468,42.415357],[-74.129379,42.415193],[-74.12933,42.415022],[-74.129338,42.414798],[-74.12938200000001,42.414641],[-74.129498,42.414339],[-74.129636,42.414151],[-74.129791,42.414002],[-74.13001199999999,42.41402],[-74.13036200000001,42.414033],[-74.130546,42.414018],[-74.13065899999999,42.414003],[-74.130753,42.413986],[-74.131035,42.413896],[-74.131091,42.413866],[-74.13119,42.413814],[-74.13125700000001,42.413769],[-74.131354,42.413694],[-74.131479,42.413578],[-74.131643,42.413401],[-74.131967,42.413029],[-74.132103,42.412906],[-74.132266,42.412778],[-74.132975,42.412372],[-74.133392,42.412121],[-74.133742,42.411882],[-74.13412,42.411625],[-74.134238,42.411535],[-74.13442999999999,42.411369],[-74.13452700000001,42.411295],[-74.13442000000001,42.411263],[-74.134276,42.411203],[-74.13383,42.411005],[-74.13356400000001,42.410864],[-74.13344600000001,42.410769],[-74.13336099999999,42.410674],[-74.133286,42.410517],[-74.133264,42.410145],[-74.13336099999999,42.409308],[-74.133403,42.409119],[-74.133568,42.408809],[-74.13374899999999,42.408609],[-74.133951,42.408471],[-74.134541,42.408117],[-74.13484,42.407897],[-74.13506,42.407709],[-74.13574,42.406786],[-74.135863,42.406625],[-74.136095,42.406321],[-74.135946,42.406242],[-74.135935,42.406236],[-74.135758,42.40615],[-74.135531,42.406042],[-74.13522500000001,42.405897],[-74.134811,42.405689],[-74.13459,42.405563],[-74.133038,42.404559],[-74.132811,42.404449],[-74.13260099999999,42.404368],[-74.13267,42.404254],[-74.132695,42.404179],[-74.132891,42.403185],[-74.13301800000001,42.402693],[-74.133071,42.402524],[-74.133116,42.402436],[-74.133276,42.402213],[-74.13366000000001,42.401723],[-74.133747,42.401621],[-74.134118,42.401142],[-74.134435,42.400707],[-74.13455999999999,42.400495],[-74.134647,42.400331],[-74.13468399999999,42.400158],[-74.13470599999999,42.399865],[-74.134716,42.399548],[-74.13471699999999,42.399344],[-74.13469499999999,42.399095],[-74.134676,42.398958],[-74.13466099999999,42.398852],[-74.13422799999999,42.396966],[-74.133989,42.395768],[-74.133573,42.393834],[-74.133534,42.393588],[-74.13351299999999,42.393415],[-74.133501,42.393057],[-74.133528,42.392837],[-74.133628,42.392423],[-74.13367700000001,42.392134],[-74.133166,42.392037],[-74.133014,42.391996],[-74.13266,42.391878],[-74.132291,42.391732],[-74.132082,42.391634],[-74.131862,42.391517],[-74.13155999999999,42.39133],[-74.129712,42.390177],[-74.12936000000001,42.389959],[-74.128056,42.389152],[-74.12774400000001,42.388959],[-74.12757499999999,42.388857],[-74.124983,42.387282],[-74.124208,42.386803],[-74.12368600000001,42.386457],[-74.122798,42.385943],[-74.12207600000001,42.385534],[-74.12177699999999,42.385364],[-74.121393,42.385147],[-74.120352,42.384558],[-74.119314,42.383941],[-74.119086,42.383793],[-74.11886800000001,42.38363],[-74.118644,42.383442],[-74.118171,42.382982],[-74.11797300000001,42.38277],[-74.117773,42.382508],[-74.117608,42.382303],[-74.11838400000001,42.381599],[-74.118539,42.381451],[-74.118662,42.381348],[-74.11957200000001,42.380675],[-74.120378,42.380002],[-74.120756,42.379645],[-74.12093299999999,42.379485],[-74.12115,42.379309],[-74.122227,42.378492],[-74.122427,42.378356],[-74.12257700000001,42.378262],[-74.123249,42.377946],[-74.124155,42.377532],[-74.12436599999999,42.377445],[-74.124916,42.37726],[-74.125066,42.377211],[-74.125726,42.377025],[-74.12639299999999,42.376838],[-74.127516,42.376533],[-74.127442,42.376276],[-74.12734399999999,42.375999],[-74.12720400000001,42.375645],[-74.12698899999999,42.375006],[-74.12678,42.374446],[-74.126721,42.37428],[-74.126588,42.373947],[-74.126474,42.373711],[-74.12637599999999,42.373559],[-74.12600999999999,42.373083],[-74.125981,42.373022],[-74.125969,42.37296],[-74.125939,42.372855],[-74.125956,42.372757],[-74.125981,42.372693],[-74.12604,42.372607],[-74.12625300000001,42.37234],[-74.126276,42.372287],[-74.126293,42.372181],[-74.126293,42.372133],[-74.126284,42.372078],[-74.126265,42.372039],[-74.125868,42.371381],[-74.125208,42.370341],[-74.124899,42.369797],[-74.124681,42.369442],[-74.12467100000001,42.369422],[-74.12455300000001,42.368745],[-74.124482,42.368236],[-74.124431,42.367822],[-74.124388,42.367348],[-74.124371,42.367105],[-74.124362,42.366766],[-74.12436700000001,42.366665],[-74.12444000000001,42.366337],[-74.1247,42.365588],[-74.125238,42.364185],[-74.125264,42.364038],[-74.125281,42.363839],[-74.12529000000001,42.36364],[-74.12519500000001,42.36291],[-74.125186,42.362686],[-74.125203,42.362552],[-74.125229,42.362481],[-74.12529000000001,42.362404],[-74.12543700000001,42.362289],[-74.125671,42.362129],[-74.125828,42.362014],[-74.12601600000001,42.361921],[-74.126735,42.361579],[-74.12738299999999,42.361309],[-74.12753600000001,42.361239],[-74.12766499999999,42.36116],[-74.12778900000001,42.361037],[-74.12788999999999,42.360906],[-74.127976,42.360721],[-74.128084,42.360516],[-74.12822799999999,42.360273],[-74.128428,42.359958],[-74.129009,42.359249],[-74.12933,42.358912],[-74.12944,42.358775],[-74.12955100000001,42.358612],[-74.129615,42.358456],[-74.129666,42.358263],[-74.12973700000001,42.357758],[-74.129831,42.357206],[-74.129902,42.356727],[-74.130036,42.356088],[-74.130177,42.355521],[-74.130202,42.355312],[-74.130225,42.355168],[-74.130229,42.355006],[-74.130194,42.354847],[-74.130093,42.354644],[-74.129859,42.354286],[-74.12973,42.354058],[-74.12964700000001,42.353873],[-74.129617,42.353795],[-74.129604,42.35372],[-74.12960099999999,42.353645],[-74.129608,42.353558],[-74.129643,42.353365],[-74.129819,42.352692],[-74.12989,42.352499],[-74.130021,42.352232],[-74.130137,42.352038],[-74.13032200000001,42.351797],[-74.130409,42.351666],[-74.130454,42.351549],[-74.130454,42.351421],[-74.130392,42.351228],[-74.130301,42.350977],[-74.12999000000001,42.350239],[-74.129873,42.34999],[-74.1298,42.349869],[-74.129713,42.349748],[-74.129598,42.349622],[-74.129493,42.349521],[-74.129385,42.349426],[-74.129058,42.349176],[-74.128894,42.34903],[-74.128626,42.348762],[-74.12841,42.34852],[-74.12797399999999,42.348002],[-74.12772699999999,42.347735],[-74.127539,42.347514],[-74.12744000000001,42.347382],[-74.12728300000001,42.347119],[-74.127229,42.346957],[-74.127177,42.346687],[-74.1271,42.346195],[-74.12694399999999,42.345441],[-74.126937,42.345366],[-74.12694,42.345299],[-74.126954,42.345238],[-74.1268,42.34521],[-74.126716,42.345184],[-74.126577,42.345126],[-74.126496,42.345092],[-74.126417,42.345072],[-74.126345,42.34507],[-74.126284,42.345085],[-74.126211,42.3449],[-74.12615099999999,42.344701],[-74.126046,42.344216],[-74.125967,42.344014],[-74.125823,42.343775],[-74.125693,42.343642],[-74.125559,42.343554],[-74.125435,42.343499],[-74.125276,42.343447],[-74.12474899999999,42.343387],[-74.124562,42.343357],[-74.124421,42.343317],[-74.12421999999999,42.343213],[-74.123893,42.342937],[-74.12369700000001,42.342738],[-74.123574,42.342563],[-74.123492,42.342368],[-74.12341499999999,42.342116],[-74.123374,42.341927],[-74.123355,42.341668],[-74.12331500000001,42.341554],[-74.12325800000001,42.341474],[-74.123087,42.34129],[-74.12299899999999,42.341168],[-74.12293699999999,42.341069],[-74.122911,42.340973],[-74.122891,42.340721],[-74.12286,42.340568],[-74.12281299999999,42.340461],[-74.12274600000001,42.34035],[-74.12262699999999,42.34017],[-74.12242999999999,42.339975],[-74.122286,42.339891],[-74.122148,42.33984],[-74.121546,42.339729],[-74.12058500000001,42.339618],[-74.120113,42.33954],[-74.119924,42.339492],[-74.11970599999999,42.339405],[-74.11944,42.339326],[-74.11908099999999,42.339246],[-74.11880499999999,42.339188],[-74.118549,42.339134],[-74.118284,42.339047],[-74.118112,42.33896],[-74.11791100000001,42.338843],[-74.11768499999999,42.338691],[-74.117615,42.338621],[-74.117563,42.338545],[-74.117536,42.338478],[-74.117492,42.338368],[-74.117492,42.338246],[-74.11753,42.338128],[-74.1176,42.338014],[-74.117198,42.337806],[-74.11689699999999,42.3376],[-74.11646,42.337229],[-74.11623,42.336907],[-74.115939,42.336325],[-74.11584000000001,42.336097],[-74.11560299999999,42.335595],[-74.11435400000001,42.332586],[-74.114155,42.332064],[-74.113861,42.331165],[-74.113635,42.330395],[-74.113429,42.329717],[-74.11319,42.329123],[-74.112977,42.328696],[-74.112758,42.328338],[-74.112512,42.328014],[-74.112233,42.327685],[-74.112026,42.327493],[-74.111921,42.327395],[-74.111878,42.327358],[-74.111476,42.327012],[-74.11077400000001,42.326546],[-74.110401,42.326324],[-74.11029499999999,42.326272],[-74.110055,42.326153],[-74.10945,42.32591],[-74.10890000000001,42.325716],[-74.10852199999999,42.325605],[-74.108065,42.325499],[-74.107663,42.32542],[-74.107275,42.325367],[-74.10591100000001,42.325242],[-74.11386299999999,42.322983],[-74.124543,42.320017],[-74.135217,42.317191],[-74.14312200000001,42.314848],[-74.14341,42.315515],[-74.143438,42.316451],[-74.143315,42.317085],[-74.142912,42.317938],[-74.142714,42.31911],[-74.142426,42.320055],[-74.141963,42.320786],[-74.141792,42.320989],[-74.140972,42.321964],[-74.140708,42.322595],[-74.14066699999999,42.322812],[-74.140726,42.322966],[-74.141121,42.323128],[-74.141947,42.323373],[-74.142702,42.323694],[-74.14393099999999,42.324216],[-74.14452199999999,42.324678],[-74.144994,42.325046],[-74.146017,42.326053],[-74.146505,42.326322],[-74.148081,42.327067],[-74.14953199999999,42.328252],[-74.151614,42.329927],[-74.15293699999999,42.331038],[-74.154062,42.331691],[-74.154984,42.332775],[-74.156278,42.334086],[-74.157236,42.334543],[-74.15834700000001,42.334705],[-74.15937,42.334713],[-74.159758,42.334705],[-74.16131300000001,42.334901],[-74.162265,42.335161],[-74.16276000000001,42.335257],[-74.164467,42.335288],[-74.165711,42.335677],[-74.16807900000001,42.33737],[-74.168605,42.337629],[-74.16921600000001,42.337511],[-74.16935599999999,42.337388],[-74.17118000000001,42.336225],[-74.172039,42.335896],[-74.17876699999999,42.3367],[-74.17963,42.336784],[-74.181499,42.336662],[-74.183189,42.337213],[-74.185022,42.338297],[-74.186195,42.339311],[-74.187214,42.339763],[-74.189728,42.340589],[-74.191373,42.341195],[-74.19185899999999,42.341245],[-74.193381,42.341195],[-74.194698,42.341062],[-74.195149,42.341231],[-74.195347,42.341477],[-74.19584,42.343598],[-74.196093,42.346315],[-74.196299,42.34726],[-74.196602,42.347775],[-74.198367,42.348353],[-74.20181599999999,42.349541],[-74.203963,42.350121],[-74.204729,42.350647],[-74.205439,42.351282],[-74.20670800000001,42.352754],[-74.207671,42.353872],[-74.209896,42.354782],[-74.21306,42.357963],[-74.21860599999999,42.358827],[-74.218824,42.359441],[-74.21906300000001,42.361618],[-74.22205700000001,42.366189],[-74.22564,42.368412],[-74.22824300000001,42.371031],[-74.229985,42.372685],[-74.230296,42.372979],[-74.230633,42.373252],[-74.232561,42.374247],[-74.232787,42.37436],[-74.23403500000001,42.375081],[-74.234917,42.375888],[-74.23590900000001,42.376424],[-74.23810400000001,42.376924],[-74.24053000000001,42.377168],[-74.244692,42.377159],[-74.245195,42.378799],[-74.247846,42.387446],[-74.247893,42.3876],[-74.24958599999999,42.393224],[-74.251965,42.400783],[-74.252053,42.401062],[-74.25424,42.408007],[-74.25427000000001,42.408102],[-74.25430299999999,42.408207]]],"type":"Polygon"}
}