{
  "id": "361031582072",
  "type": "Feature",
  "properties": {
    "area_land":2641182,
    "area_water":747050,
    "geoid":"361031582072",
    "name":"Block Group 2",
    "state":"ny"
},
  "bbox": [
    -73.061214,
    40.946152,
    -73.040401,
    40.974434
],
  "geometry": {"coordinates":[[[-73.061162,40.959756],[-73.06086500000001,40.960318],[-73.06014500000001,40.961018],[-73.059594,40.961467],[-73.05898999999999,40.961938],[-73.059106,40.962154],[-73.059438,40.96277],[-73.059493,40.962916],[-73.059472,40.963208],[-73.06020700000001,40.963019],[-73.06014999999999,40.963576],[-73.060219,40.964004],[-73.060395,40.964218],[-73.060525,40.964409],[-73.060586,40.96468],[-73.06063899999999,40.965145],[-73.06057800000001,40.965389],[-73.060455,40.965633],[-73.060135,40.965694],[-73.059922,40.965701],[-73.059296,40.966148],[-73.058486,40.966536],[-73.054717,40.974434],[-73.046987,40.966501],[-73.04501,40.964472],[-73.043719,40.963146],[-73.044556,40.962401],[-73.04318000000001,40.962103],[-73.042571,40.961971],[-73.04274700000001,40.961426],[-73.042587,40.960514],[-73.041084,40.958851],[-73.040401,40.958135],[-73.040508,40.957613],[-73.041438,40.957425],[-73.041359,40.957348],[-73.04231299999999,40.956149],[-73.042563,40.955845],[-73.04262900000001,40.955645],[-73.04327000000001,40.953834],[-73.043381,40.953533],[-73.04351800000001,40.953621],[-73.04521200000001,40.954708],[-73.045929,40.955523],[-73.045608,40.954819],[-73.04544,40.954197],[-73.045227,40.953357],[-73.04497499999999,40.952755],[-73.044397,40.951942],[-73.04383799999999,40.951595],[-73.043243,40.95085],[-73.043075,40.950218],[-73.04267900000001,40.949881],[-73.042029,40.949413],[-73.041991,40.949157],[-73.041961,40.948886],[-73.041955,40.948475],[-73.041961,40.948294],[-73.042084,40.947788],[-73.04222900000001,40.947379],[-73.042374,40.946811],[-73.04259500000001,40.946632],[-73.042923,40.946567],[-73.043098,40.94659],[-73.043465,40.94664],[-73.04394600000001,40.94672],[-73.044556,40.946837],[-73.044831,40.947136],[-73.04521200000001,40.947429],[-73.045967,40.947883],[-73.04671500000001,40.947955],[-73.047257,40.948027],[-73.04753100000001,40.948077],[-73.047844,40.948135],[-73.049363,40.948386],[-73.050286,40.948387],[-73.051339,40.948231],[-73.05156700000001,40.948081],[-73.051727,40.947979],[-73.05184300000001,40.947895],[-73.051964,40.947834],[-73.052369,40.947719],[-73.05255200000001,40.947674],[-73.052781,40.947651],[-73.052965,40.947657],[-73.053201,40.947753],[-73.053383,40.947844],[-73.05417,40.947922],[-73.054345,40.947921],[-73.05445899999999,40.947914],[-73.054588,40.947891],[-73.055413,40.947695],[-73.05585499999999,40.94767],[-73.05619900000001,40.94768],[-73.056619,40.947341],[-73.056816,40.94725],[-73.056954,40.947159],[-73.057237,40.946994],[-73.057733,40.94667],[-73.05817399999999,40.946331],[-73.058457,40.946152],[-73.058908,40.946555],[-73.05967800000001,40.94723],[-73.060338,40.947815],[-73.06036899999999,40.948182],[-73.060363,40.949675],[-73.060852,40.94984],[-73.061187,40.949959],[-73.06097200000001,40.950649],[-73.060147,40.950776],[-73.059335,40.952445],[-73.05883799999999,40.955906],[-73.06002599999999,40.957362],[-73.060158,40.957506],[-73.06121400000001,40.959394],[-73.061162,40.959756]]],"type":"Polygon"}
}