{
  "id": "360610161003",
  "type": "Feature",
  "properties": {
    "area_land":22096,
    "area_water":0,
    "geoid":"360610161003",
    "name":"Block Group 3",
    "state":"ny"
},
  "bbox": [
    -73.977369,
    40.778168,
    -73.974067,
    40.779997
],
  "geometry": {"coordinates":[[[-73.97690299999999,40.779997],[-73.97406700000001,40.778805],[-73.974532,40.778168],[-73.975111,40.778412],[-73.977369,40.779364],[-73.97690299999999,40.779997]]],"type":"Polygon"}
}