{
  "id": "360610086020",
  "type": "Feature",
  "properties": {
    "area_land":0,
    "area_water":317001,
    "geoid":"360610086020",
    "name":"Block Group 0",
    "state":"ny"
},
  "bbox": [
    -73.967697,
    40.744511,
    -73.957732,
    40.751717
],
  "geometry": {"coordinates":[[[-73.964715,40.751717],[-73.961634,40.749448],[-73.96156000000001,40.749458],[-73.961491,40.749494],[-73.95773199999999,40.747775],[-73.95821599999999,40.747212],[-73.958327,40.747081],[-73.95871099999999,40.746635],[-73.959124,40.746119],[-73.959193,40.746035],[-73.95972500000001,40.745261],[-73.959778,40.745178],[-73.960211,40.744511],[-73.967697,40.747866],[-73.964715,40.751717]]],"type":"Polygon"}
}