{
  "id": "360811451021",
  "type": "Feature",
  "properties": {
    "area_land":172136,
    "area_water":0,
    "geoid":"360811451021",
    "name":"Block Group 1",
    "state":"ny"
},
  "bbox": [
    -73.780532,
    40.748745,
    -73.774336,
    40.753484
],
  "geometry": {"coordinates":[[[-73.780131,40.753395],[-73.779482,40.753481],[-73.77919799999999,40.753484],[-73.77845000000001,40.753413],[-73.778226,40.753393],[-73.77739699999999,40.753316],[-73.776258,40.753205],[-73.77587800000001,40.753261],[-73.775757,40.752923],[-73.775645,40.752629],[-73.775603,40.752536],[-73.77522399999999,40.751691],[-73.77508899999999,40.751409],[-73.774975,40.75117],[-73.774417,40.750005],[-73.77433600000001,40.74983],[-73.77469499999999,40.749728],[-73.775593,40.749487],[-73.776475,40.749245],[-73.77736,40.749004],[-73.778312,40.748745],[-73.779066,40.750333],[-73.77944100000001,40.751123],[-73.77980599999999,40.751895],[-73.78008800000001,40.752494],[-73.78053199999999,40.753329],[-73.780131,40.753395]]],"type":"Polygon"}
}