{
  "id": "360470034002",
  "type": "Feature",
  "properties": {
    "area_land":65610,
    "area_water":0,
    "geoid":"360470034002",
    "name":"Block Group 2",
    "state":"ny"
},
  "bbox": [
    -74.036108,
    40.635993,
    -74.031268,
    40.638821
],
  "geometry": {"coordinates":[[[-74.03609899999999,40.638264],[-74.036072,40.638442],[-74.03601999999999,40.63865],[-74.03595799999999,40.638821],[-74.035764,40.638759],[-74.034857,40.638474],[-74.034161,40.638255],[-74.03388,40.638167],[-74.033607,40.638082],[-74.03209,40.637614],[-74.031268,40.637357],[-74.03140500000001,40.637019],[-74.031547,40.636673],[-74.031826,40.635993],[-74.03250300000001,40.636198],[-74.034441,40.6368],[-74.03607100000001,40.637306],[-74.036108,40.638086],[-74.03609899999999,40.638264]]],"type":"Polygon"}
}