{
  "id": "360811187002",
  "type": "Feature",
  "properties": {
    "area_land":122088,
    "area_water":0,
    "geoid":"360811187002",
    "name":"Block Group 2",
    "state":"ny"
},
  "bbox": [
    -73.817288,
    40.75747,
    -73.811202,
    40.76113
],
  "geometry": {"coordinates":[[[-73.817288,40.759776],[-73.81508700000001,40.760372],[-73.813999,40.760665],[-73.813132,40.760898],[-73.812268,40.76113],[-73.811864,40.760234],[-73.81151800000001,40.759495],[-73.81120199999999,40.75882],[-73.814013,40.758063],[-73.816215,40.75747],[-73.81653,40.758144],[-73.816864,40.758867],[-73.817288,40.759776]]],"type":"Polygon"}
}