{
  "id": "360359706001",
  "type": "Feature",
  "properties": {
    "area_land":26545792,
    "area_water":0,
    "geoid":"360359706001",
    "name":"Block Group 1",
    "state":"ny"
},
  "bbox": [
    -74.431171,
    42.984383,
    -74.289304,
    43.03032
],
  "geometry": {"coordinates":[[[-74.43117100000001,42.985972],[-74.43112000000001,42.986016],[-74.43109699999999,42.986068],[-74.431054,42.986122],[-74.430988,42.986173],[-74.430864,42.986246],[-74.430474,42.986563],[-74.430201,42.986741],[-74.429935,42.986939],[-74.429767,42.987073],[-74.429726,42.987138],[-74.42964600000001,42.98739],[-74.429602,42.98747],[-74.42955499999999,42.987721],[-74.42954400000001,42.987805],[-74.429519,42.987878],[-74.42949299999999,42.987912],[-74.42941500000001,42.987966],[-74.429293,42.987987],[-74.42904799999999,42.987994],[-74.428735,42.988097],[-74.42853100000001,42.988122],[-74.428122,42.988133],[-74.427863,42.98822],[-74.42777599999999,42.988239],[-74.427313,42.988282],[-74.42715200000001,42.988279],[-74.426675,42.988239],[-74.42637999999999,42.988188],[-74.42616099999999,42.988122],[-74.42601500000001,42.988049],[-74.425669,42.987783],[-74.425468,42.987678],[-74.42532199999999,42.987583],[-74.42511399999999,42.987401],[-74.424943,42.987197],[-74.42479,42.987033],[-74.424626,42.986913],[-74.424465,42.986832],[-74.42435999999999,42.986789],[-74.424093,42.98673],[-74.42400600000001,42.986679],[-74.423867,42.986548],[-74.423813,42.986519],[-74.423743,42.986505],[-74.42361200000001,42.986512],[-74.423404,42.986592],[-74.423255,42.98661],[-74.423062,42.986581],[-74.42288600000001,42.986519],[-74.422584,42.986297],[-74.422529,42.986268],[-74.422453,42.98625],[-74.422303,42.986257],[-74.422161,42.986279],[-74.421887,42.986298],[-74.421783,42.986298],[-74.421538,42.986271],[-74.42142699999999,42.986247],[-74.421223,42.986163],[-74.421105,42.986096],[-74.420857,42.986018],[-74.420711,42.985996],[-74.42064499999999,42.985994],[-74.420337,42.98603],[-74.420027,42.98609],[-74.41990699999999,42.986089],[-74.41953100000001,42.986052],[-74.41943999999999,42.986089],[-74.419406,42.986089],[-74.41936,42.986061],[-74.41933299999999,42.98603],[-74.419254,42.986001],[-74.41918,42.985998],[-74.419096,42.986041],[-74.41904599999999,42.986047],[-74.418892,42.985988],[-74.418374,42.985972],[-74.41830299999999,42.985992],[-74.41815699999999,42.98607],[-74.41806,42.986134],[-74.417896,42.986267],[-74.41765599999999,42.986387],[-74.417433,42.986553],[-74.41736400000001,42.98658],[-74.417216,42.986588],[-74.417101,42.98659],[-74.416996,42.986619],[-74.416875,42.986682],[-74.416731,42.98683],[-74.416647,42.986972],[-74.41660400000001,42.987229],[-74.416562,42.987347],[-74.41650199999999,42.987404],[-74.416274,42.98752],[-74.416152,42.987562],[-74.41584899999999,42.987628],[-74.415767,42.987633],[-74.41564099999999,42.987624],[-74.415525,42.987599],[-74.41539,42.987535],[-74.415344,42.987509],[-74.414981,42.987469],[-74.41486999999999,42.987437],[-74.414659,42.987287],[-74.41423,42.987052],[-74.414117,42.987014],[-74.414033,42.987003],[-74.413645,42.987021],[-74.41330600000001,42.987056],[-74.41309099999999,42.987065],[-74.41290499999999,42.987039],[-74.412781,42.987067],[-74.41270299999999,42.987111],[-74.412626,42.987185],[-74.412564,42.987282],[-74.41241599999999,42.987335],[-74.412384,42.987355],[-74.41234,42.987424],[-74.412305,42.987514],[-74.41224699999999,42.987664],[-74.41221899999999,42.987749],[-74.412161,42.987937],[-74.412143,42.987956],[-74.412043,42.98799],[-74.411997,42.988014],[-74.41192599999999,42.988116],[-74.411829,42.988291],[-74.41173999999999,42.988504],[-74.411525,42.988755],[-74.41142499999999,42.98883],[-74.411372,42.988855],[-74.410858,42.988994],[-74.410776,42.989038],[-74.410552,42.989213],[-74.410479,42.989285],[-74.41042,42.989364],[-74.410282,42.989502],[-74.410202,42.989539],[-74.40995700000001,42.98956],[-74.40991,42.989579],[-74.409848,42.989619],[-74.40979,42.989702],[-74.409702,42.989947],[-74.40964,42.990304],[-74.409651,42.990544],[-74.40963600000001,42.990723],[-74.409639,42.990872],[-74.40964700000001,42.991259],[-74.409644,42.991539],[-74.40961799999999,42.991659],[-74.409589,42.991713],[-74.409542,42.991768],[-74.40944,42.991845],[-74.409356,42.991881],[-74.409108,42.991921],[-74.40857800000001,42.991976],[-74.408024,42.99206],[-74.407324,42.992141],[-74.407217,42.99216],[-74.406987,42.992238],[-74.406589,42.992316],[-74.405642,42.992449],[-74.40556599999999,42.992464],[-74.405496,42.992489],[-74.40539800000001,42.99254],[-74.405108,42.992735],[-74.404673,42.992956],[-74.404399,42.993067],[-74.404246,42.993111],[-74.404189,42.993136],[-74.40401799999999,42.993264],[-74.40391200000001,42.993322],[-74.40380500000001,42.993344],[-74.403566,42.993336],[-74.403458,42.993329],[-74.403294,42.993291],[-74.40309000000001,42.993218],[-74.402776,42.993048],[-74.40240900000001,42.992906],[-74.402232,42.992846],[-74.402064,42.992823],[-74.40194700000001,42.992843],[-74.401836,42.992821],[-74.401601,42.992752],[-74.401481,42.99275],[-74.40116,42.992779],[-74.401039,42.992815],[-74.400857,42.992888],[-74.40062,42.992928],[-74.40017899999999,42.992952],[-74.39974100000001,42.992963],[-74.399648,42.992981],[-74.399557,42.993038],[-74.398872,42.993183],[-74.398646,42.993238],[-74.398538,42.993256],[-74.39842,42.99326],[-74.39828300000001,42.993276],[-74.398174,42.993316],[-74.39791700000001,42.993427],[-74.39770300000001,42.993491],[-74.397516,42.993511],[-74.397406,42.993553],[-74.39735,42.993584],[-74.397173,42.993746],[-74.396936,42.994059],[-74.396755,42.994242],[-74.39649799999999,42.99444],[-74.39644699999999,42.99452],[-74.396389,42.99467],[-74.396316,42.994775],[-74.396165,42.994886],[-74.39601500000001,42.994978],[-74.395831,42.995109],[-74.39558100000001,42.995207],[-74.39546799999999,42.99528],[-74.395321,42.995386],[-74.395206,42.995444],[-74.39502,42.995519],[-74.39474800000001,42.995604],[-74.394459,42.995648],[-74.394059,42.995679],[-74.393766,42.995659],[-74.393317,42.995579],[-74.39325700000001,42.995559],[-74.39317,42.995506],[-74.39311499999999,42.995491],[-74.392949,42.995489],[-74.39277,42.995498],[-74.39250199999999,42.995544],[-74.39228199999999,42.995562],[-74.392145,42.99556],[-74.39201199999999,42.995568],[-74.391773,42.99561],[-74.39167500000001,42.995635],[-74.391493,42.995712],[-74.391374,42.995823],[-74.39129800000001,42.995866],[-74.391035,42.995968],[-74.39073999999999,42.996052],[-74.390581,42.996218],[-74.390505,42.996271],[-74.390415,42.996315],[-74.39037,42.996353],[-74.390226,42.996575],[-74.38997999999999,42.996905],[-74.38982799999999,42.997258],[-74.389759,42.997566],[-74.389655,42.997876],[-74.38962600000001,42.998007],[-74.389562,42.998152],[-74.38952399999999,42.998198],[-74.389465,42.998236],[-74.389398,42.998264],[-74.38903000000001,42.998356],[-74.38897299999999,42.99838],[-74.38886599999999,42.99846],[-74.388734,42.998537],[-74.388435,42.998772],[-74.38829699999999,42.998916],[-74.38814600000001,42.999132],[-74.388096,42.999229],[-74.388007,42.999313],[-74.387659,42.99951],[-74.38758,42.998967],[-74.387557,42.998804],[-74.387709,42.997423],[-74.387507,42.997092],[-74.388047,42.997094],[-74.387939,42.996793],[-74.387441,42.996958],[-74.38737999999999,42.996965],[-74.387078,42.995639],[-74.38682,42.994651],[-74.386257,42.994637],[-74.385695,42.994631],[-74.385321,42.994637],[-74.38475800000001,42.991774],[-74.384726,42.991701],[-74.382643,42.991916],[-74.382304,42.991939],[-74.382209,42.991938],[-74.382119,42.991917],[-74.38192100000001,42.991816],[-74.38182,42.991913],[-74.38175099999999,42.991979],[-74.381451,42.992003],[-74.381246,42.992014],[-74.37975900000001,42.992187],[-74.379701,42.992196],[-74.37949500000001,42.992231],[-74.378827,42.992311],[-74.376859,42.992556],[-74.37479399999999,42.992822],[-74.37457999999999,42.992843],[-74.373243,42.992976],[-74.372145,42.993102],[-74.371916,42.993129],[-74.371191,42.993214],[-74.371166,42.993099],[-74.371915,42.993033],[-74.372648,42.992969],[-74.374588,42.992797],[-74.374786,42.992781],[-74.375038,42.992757],[-74.37503100000001,42.992723],[-74.37482300000001,42.991774],[-74.37476700000001,42.991517],[-74.374619,42.990862],[-74.374347,42.989667],[-74.374323,42.989564],[-74.368292,42.989281],[-74.36847299999999,42.990779],[-74.36861399999999,42.991584],[-74.36864199999999,42.991801],[-74.368695,42.992198],[-74.36873900000001,42.992526],[-74.368782,42.992849],[-74.368836,42.993255],[-74.368853,42.993386],[-74.36877699999999,42.993398],[-74.368779,42.993454],[-74.368561,42.993473],[-74.366634,42.993707],[-74.36622199999999,42.993757],[-74.36601899999999,42.993784],[-74.36486499999999,42.993924],[-74.364227,42.993995],[-74.36403799999999,42.9942],[-74.363984,42.994261],[-74.36396999999999,42.994276],[-74.36394799999999,42.994301],[-74.363901,42.994353],[-74.363838,42.994423],[-74.363688,42.994589],[-74.363387,42.994925],[-74.36290200000001,42.995439],[-74.362516,42.995895],[-74.36235000000001,42.996079],[-74.36224900000001,42.996194],[-74.36052100000001,42.998129],[-74.36042399999999,42.998239],[-74.360409,42.998143],[-74.360218,42.998163],[-74.359613,42.998227],[-74.359257,42.998265],[-74.358655,42.998328],[-74.35700199999999,42.998324],[-74.356663,42.998354],[-74.35553,42.998444],[-74.355532,42.998457],[-74.355537,42.99848],[-74.355582,42.998707],[-74.356323,42.998955],[-74.356573,42.998976],[-74.35694599999999,42.999006],[-74.35732,42.999036],[-74.35801499999999,42.999092],[-74.358152,42.999103],[-74.358183,42.999064],[-74.358243,42.998987],[-74.358289,42.998929],[-74.35833,42.998877],[-74.358339,42.998865],[-74.35854,42.998612],[-74.35865800000001,42.99846],[-74.358825,42.998458],[-74.358976,42.998455],[-74.35900599999999,42.998455],[-74.35966500000001,42.998774],[-74.35979,42.998831],[-74.35986800000001,42.998873],[-74.359295,42.999515],[-74.359238,42.999578],[-74.35914099999999,42.999687],[-74.358441,43.00047],[-74.358402,43.000514],[-74.35796499999999,43.001004],[-74.357934,43.001038],[-74.357812,43.001175],[-74.35725100000001,43.001803],[-74.357186,43.001879],[-74.35714,43.001927],[-74.357133,43.001935],[-74.35681200000001,43.002295],[-74.356797,43.002311],[-74.356628,43.002523],[-74.35656,43.002815],[-74.356544,43.002883],[-74.356533,43.002929],[-74.3565,43.003069],[-74.356493,43.003098],[-74.35647400000001,43.003191],[-74.35641800000001,43.003454],[-74.356345,43.003799],[-74.35628699999999,43.004072],[-74.356257,43.004212],[-74.35624300000001,43.004277],[-74.356234,43.004322],[-74.35622499999999,43.004363],[-74.356194,43.00451],[-74.356174,43.004606],[-74.356165,43.004648],[-74.35615900000001,43.004676],[-74.35613600000001,43.004782],[-74.35611400000001,43.004885],[-74.356106,43.004926],[-74.35607400000001,43.005077],[-74.356015,43.005352],[-74.355895,43.005919],[-74.355875,43.006015],[-74.35584299999999,43.006163],[-74.355836,43.006202],[-74.35574099999999,43.006649],[-74.35571400000001,43.006771],[-74.355705,43.006815],[-74.35568600000001,43.006906],[-74.355655,43.00705],[-74.355628,43.007179],[-74.355611,43.00726],[-74.355603,43.007298],[-74.35559499999999,43.007335],[-74.35555600000001,43.007519],[-74.355542,43.007584],[-74.355515,43.00771],[-74.355512,43.007723],[-74.355503,43.007769],[-74.35550000000001,43.007782],[-74.355496,43.007796],[-74.355492,43.00782],[-74.355485,43.007854],[-74.355479,43.007881],[-74.355456,43.007988],[-74.35545399999999,43.008],[-74.355394,43.008282],[-74.35539199999999,43.008292],[-74.35512300000001,43.009543],[-74.355018,43.01003],[-74.354972,43.010246],[-74.35469399999999,43.01154],[-74.354636,43.011809],[-74.35427300000001,43.013497],[-74.354264,43.013535],[-74.354253,43.013588],[-74.35388500000001,43.015301],[-74.353737,43.015357],[-74.35362600000001,43.015388],[-74.353595,43.015404],[-74.35321500000001,43.015597],[-74.353239,43.015726],[-74.353345,43.016291],[-74.35337699999999,43.016459],[-74.351615,43.017268],[-74.35140800000001,43.01736],[-74.35092299999999,43.017577],[-74.350134,43.01787],[-74.349982,43.017909],[-74.34996700000001,43.017913],[-74.34899,43.018154],[-74.348933,43.018221],[-74.34901499999999,43.018785],[-74.349042,43.018784],[-74.349147,43.01878],[-74.349366,43.018766],[-74.349671,43.018754],[-74.349801,43.01923],[-74.34981500000001,43.019278],[-74.349284,43.019316],[-74.349098,43.01933],[-74.348969,43.019355],[-74.348922,43.019045],[-74.348896,43.018847],[-74.34886899999999,43.018629],[-74.348857,43.01839],[-74.348857,43.018309],[-74.348855,43.017996],[-74.348519,43.018052],[-74.34797,43.018123],[-74.346074,43.018287],[-74.345022,43.018386],[-74.342506,43.018604],[-74.340858,43.018756],[-74.33942999999999,43.018875],[-74.33735799999999,43.019063],[-74.33667800000001,43.01912],[-74.336117,43.019168],[-74.33581599999999,43.019196],[-74.334581,43.019312],[-74.33398699999999,43.01939],[-74.333566,43.01946],[-74.333066,43.019556],[-74.332329,43.019712],[-74.330321,43.02021],[-74.32938300000001,43.020436],[-74.32815600000001,43.020746],[-74.327619,43.020871],[-74.326702,43.021037],[-74.326185,43.021112],[-74.325249,43.021212],[-74.323615,43.021367],[-74.32213,43.021538],[-74.321169,43.021681],[-74.319756,43.021911],[-74.31799100000001,43.022195],[-74.316869,43.022362],[-74.315909,43.022541],[-74.31464699999999,43.02283],[-74.313743,43.02307],[-74.31294800000001,43.023314],[-74.31268300000001,43.0234],[-74.310463,43.024118],[-74.309821,43.024329],[-74.30896,43.024627],[-74.308035,43.024961],[-74.307216,43.025274],[-74.30497699999999,43.02617],[-74.303674,43.02672],[-74.301706,43.027604],[-74.300043,43.028354],[-74.29794,43.029297],[-74.296334,43.030014],[-74.295739,43.030264],[-74.295601,43.03032],[-74.29532500000001,43.027725],[-74.294146,43.019698],[-74.292886,43.010873],[-74.29237500000001,43.006978],[-74.29219500000001,43.00567],[-74.29179000000001,43.00272],[-74.291715,43.001583],[-74.291585,43.001205],[-74.291326,42.999946],[-74.291245,42.999734],[-74.290744,42.995952],[-74.29042200000001,42.993111],[-74.290407,42.992996],[-74.289993,42.989532],[-74.289918,42.989004],[-74.289383,42.985025],[-74.289362,42.984853],[-74.289304,42.984415],[-74.28988699999999,42.984417],[-74.290267,42.98442],[-74.294257,42.984438],[-74.295743,42.984383],[-74.295986,42.984388],[-74.296121,42.984404],[-74.296189,42.984408],[-74.29661900000001,42.984452],[-74.301434,42.984465],[-74.30467,42.984474],[-74.306285,42.984479],[-74.307739,42.984439],[-74.307931,42.984442],[-74.310839,42.984486],[-74.315269,42.984494],[-74.319817,42.984495],[-74.319971,42.984495],[-74.320171,42.984496],[-74.32133899999999,42.984507],[-74.328429,42.98458],[-74.331689,42.984551],[-74.331726,42.984551],[-74.33229799999999,42.98455],[-74.332489,42.984549],[-74.33413400000001,42.984544],[-74.335474,42.984577],[-74.33687999999999,42.984592],[-74.33740299999999,42.984598],[-74.34144499999999,42.984605],[-74.341973,42.984607],[-74.344223,42.984544],[-74.34433199999999,42.98455],[-74.344887,42.984583],[-74.345129,42.984597],[-74.345378,42.984556],[-74.345394,42.984553],[-74.35395699999999,42.984589],[-74.363631,42.984593],[-74.36366099999999,42.984591],[-74.363854,42.984592],[-74.364222,42.984597],[-74.365112,42.984631],[-74.365351,42.98464],[-74.374256,42.984617],[-74.38836499999999,42.984569],[-74.388519,42.98457],[-74.40569499999999,42.98473],[-74.408644,42.984736],[-74.408704,42.984736],[-74.410836,42.984736],[-74.410928,42.984736],[-74.411474,42.984736],[-74.415149,42.984736],[-74.415389,42.984736],[-74.41580500000001,42.984736],[-74.41588900000001,42.984735],[-74.416507,42.98475],[-74.41670000000001,42.984754],[-74.417366,42.984774],[-74.426847,42.98479],[-74.42929700000001,42.984731],[-74.429417,42.984732],[-74.429474,42.984766],[-74.42988699999999,42.985087],[-74.430154,42.985229],[-74.430381,42.985327],[-74.43062500000001,42.985449],[-74.43083799999999,42.985574],[-74.430994,42.985685],[-74.431112,42.985835],[-74.43114300000001,42.985889],[-74.43117100000001,42.985972]]],"type":"Polygon"}
}