{
  "id": "360811032024",
  "type": "Feature",
  "properties": {
    "area_land":125634,
    "area_water":0,
    "geoid":"360811032024",
    "name":"Block Group 4",
    "state":"ny"
},
  "bbox": [
    -73.75285,
    40.60259,
    -73.747562,
    40.607147
],
  "geometry": {"coordinates":[[[-73.75285,40.60426],[-73.75183699999999,40.605285],[-73.751131,40.605869],[-73.750254,40.606599],[-73.74959200000001,40.607147],[-73.748886,40.60663],[-73.748216,40.60485],[-73.747562,40.603078],[-73.74878099999999,40.602802],[-73.74970500000001,40.60259],[-73.750355,40.602893],[-73.751051,40.603273],[-73.751746,40.603603],[-73.752121,40.603809],[-73.75285,40.60426]]],"type":"Polygon"}
}