{
  "id": "360470101002",
  "type": "Feature",
  "properties": {
    "area_land":88449,
    "area_water":0,
    "geoid":"360470101002",
    "name":"Block Group 2",
    "state":"ny"
},
  "bbox": [
    -74.004465,
    40.654629,
    -73.998671,
    40.658185
],
  "geometry": {"coordinates":[[[-74.003874,40.657627],[-74.003288,40.658185],[-74.00151200000001,40.657109],[-74.000924,40.657667],[-73.998982,40.656495],[-73.998671,40.656307],[-73.999256,40.655745],[-73.999837,40.655186],[-74.00041299999999,40.654629],[-74.00267700000001,40.65599],[-74.004465,40.657072],[-74.003874,40.657627]]],"type":"Polygon"}
}