{
  "id": "360810621003",
  "type": "Feature",
  "properties": {
    "area_land":58569,
    "area_water":0,
    "geoid":"360810621003",
    "name":"Block Group 3",
    "state":"ny"
},
  "bbox": [
    -73.875353,
    40.709685,
    -73.870321,
    40.711246
],
  "geometry": {"coordinates":[[[-73.875353,40.711015],[-73.873436,40.71114],[-73.87094500000001,40.711246],[-73.870633,40.710578],[-73.870321,40.709899],[-73.873333,40.709769],[-73.87489600000001,40.709685],[-73.875242,40.710349],[-73.875353,40.711015]]],"type":"Polygon"}
}