{
  "id": "360179710001",
  "type": "Feature",
  "properties": {
    "area_land":82566489,
    "area_water":310967,
    "geoid":"360179710001",
    "name":"Block Group 1",
    "state":"ny"
},
  "bbox": [
    -75.779165,
    42.247735,
    -75.635322,
    42.327672
],
  "geometry": {"coordinates":[[[-75.77916500000001,42.249305],[-75.77902400000001,42.249305],[-75.778699,42.249311],[-75.77566,42.249391],[-75.774089,42.249391],[-75.773872,42.249592],[-75.77357499999999,42.249891],[-75.772881,42.250533],[-75.77137999999999,42.251996],[-75.769954,42.253478],[-75.76951200000001,42.25397],[-75.76908299999999,42.254424],[-75.769053,42.254456],[-75.767741,42.255853],[-75.767206,42.256429],[-75.766256,42.257399],[-75.766063,42.257561],[-75.7658,42.257755],[-75.765608,42.257881],[-75.765287,42.25806],[-75.76495199999999,42.258215],[-75.764804,42.258274],[-75.76539699999999,42.259711],[-75.76551600000001,42.259904],[-75.76576,42.260306],[-75.76568,42.260967],[-75.76567799999999,42.26102],[-75.76568,42.262794],[-75.76567300000001,42.264751],[-75.765637,42.265353],[-75.765479,42.266963],[-75.765418,42.267923],[-75.765294,42.268901],[-75.76523899999999,42.26912],[-75.765101,42.269378],[-75.765039,42.269465],[-75.76481099999999,42.269712],[-75.764184,42.270266],[-75.76369,42.270665],[-75.763306,42.270956],[-75.762947,42.271183],[-75.76281299999999,42.271252],[-75.76254400000001,42.271359],[-75.761944,42.271525],[-75.761703,42.271612],[-75.761594,42.27167],[-75.761465,42.271784],[-75.76139999999999,42.271882],[-75.761315,42.272097],[-75.761161,42.272963],[-75.760824,42.275395],[-75.760763,42.276015],[-75.760696,42.276963],[-75.760785,42.278138],[-75.76082,42.278257],[-75.760895,42.27838],[-75.761212,42.278777],[-75.76134399999999,42.278965],[-75.761437,42.279177],[-75.76146,42.279261],[-75.76146799999999,42.279359],[-75.761431,42.28023],[-75.761438,42.280612],[-75.761431,42.281213],[-75.761523,42.28317],[-75.761606,42.284291],[-75.76168800000001,42.285607],[-75.76176,42.286535],[-75.761852,42.287338],[-75.76190099999999,42.287851],[-75.762019,42.288832],[-75.762173,42.290293],[-75.762204,42.290724],[-75.76226800000001,42.291274],[-75.762552,42.293242],[-75.762683,42.294299],[-75.762821,42.294684],[-75.762963,42.295032],[-75.762992,42.295167],[-75.762986,42.295356],[-75.76286899999999,42.295871],[-75.762878,42.296355],[-75.76300000000001,42.297811],[-75.76302699999999,42.298298],[-75.76310700000001,42.299115],[-75.763222,42.301414],[-75.763266,42.301934],[-75.763594,42.304366],[-75.76364599999999,42.304847],[-75.763831,42.306041],[-75.76395100000001,42.306387],[-75.764049,42.306562],[-75.764478,42.307116],[-75.764539,42.307224],[-75.764562,42.307329],[-75.76455,42.307465],[-75.764523,42.307531],[-75.764118,42.3082],[-75.763403,42.309265],[-75.763186,42.309538],[-75.762861,42.30991],[-75.76230099999999,42.31049],[-75.762265,42.310556],[-75.76224999999999,42.310634],[-75.762269,42.310715],[-75.762306,42.310756],[-75.762439,42.310846],[-75.76254900000001,42.310897],[-75.76285,42.31099],[-75.76310700000001,42.311016],[-75.763733,42.31099],[-75.763834,42.311004],[-75.763907,42.311036],[-75.764022,42.311128],[-75.764094,42.311222],[-75.764145,42.31136],[-75.76418200000001,42.311569],[-75.764224,42.312308],[-75.76428900000001,42.312856],[-75.764332,42.312976],[-75.76446199999999,42.313192],[-75.764838,42.313673],[-75.76525100000001,42.314162],[-75.76567799999999,42.314649],[-75.766401,42.315606],[-75.766662,42.315945],[-75.76729400000001,42.316745],[-75.767413,42.316875],[-75.767506,42.316966],[-75.76761399999999,42.317058],[-75.767754,42.317146],[-75.76786199999999,42.317203],[-75.768017,42.317275],[-75.76983300000001,42.317952],[-75.770746,42.318351],[-75.77151499999999,42.318729],[-75.77171199999999,42.31884],[-75.771794,42.318912],[-75.771856,42.318985],[-75.771897,42.31905],[-75.771923,42.31913],[-75.771939,42.319214],[-75.77199,42.319588],[-75.77206200000001,42.320503],[-75.772139,42.320721],[-75.77217,42.32077],[-75.772217,42.320835],[-75.771702,42.321799],[-75.77168899999999,42.321824],[-75.77143700000001,42.322264],[-75.77134100000001,42.322407],[-75.771276,42.322506],[-75.77109400000001,42.322732],[-75.77072099999999,42.323202],[-75.77065399999999,42.323279],[-75.76961900000001,42.324451],[-75.767864,42.326448],[-75.766775,42.327672],[-75.765423,42.326935],[-75.765102,42.326776],[-75.76482799999999,42.326658],[-75.764601,42.326576],[-75.764363,42.326512],[-75.764081,42.326457],[-75.76387200000001,42.326432],[-75.763462,42.326408],[-75.762686,42.326442],[-75.762477,42.32645],[-75.762282,42.326446],[-75.76200900000001,42.326428],[-75.761827,42.326404],[-75.760603,42.326245],[-75.76045999999999,42.326227],[-75.75702200000001,42.325794],[-75.756855,42.325773],[-75.756446,42.325741],[-75.756094,42.325733],[-75.755788,42.325747],[-75.755126,42.325835],[-75.754745,42.32592],[-75.753665,42.32612],[-75.753308,42.326151],[-75.752853,42.32615],[-75.752571,42.326124],[-75.752274,42.326069],[-75.751987,42.325993],[-75.75183,42.325939],[-75.75151,42.325814],[-75.751249,42.325676],[-75.751035,42.325533],[-75.750821,42.325366],[-75.750681,42.325222],[-75.750534,42.325053],[-75.75036799999999,42.324801],[-75.75025100000001,42.324535],[-75.75018300000001,42.324295],[-75.75014899999999,42.324109],[-75.750124,42.323885],[-75.75008800000001,42.323173],[-75.75005899999999,42.32282],[-75.75002499999999,42.322681],[-75.749888,42.322349],[-75.749782,42.322136],[-75.749701,42.322001],[-75.74959,42.321858],[-75.74939500000001,42.321639],[-75.74927700000001,42.321532],[-75.74907399999999,42.321373],[-75.748912,42.321266],[-75.748571,42.32107],[-75.748293,42.320948],[-75.748093,42.320878],[-75.74784699999999,42.320809],[-75.74752700000001,42.320742],[-75.747286,42.3207],[-75.741905,42.32011],[-75.74045599999999,42.319944],[-75.74022100000001,42.319902],[-75.740015,42.319852],[-75.739707,42.31976],[-75.739411,42.319641],[-75.739073,42.31948],[-75.73869500000001,42.319261],[-75.738253,42.318985],[-75.73791900000001,42.318804],[-75.73754099999999,42.31865],[-75.737064,42.318513],[-75.73683,42.318466],[-75.73614499999999,42.318399],[-75.73421,42.318327],[-75.733448,42.318324],[-75.7328,42.318354],[-75.73232400000001,42.318399],[-75.7317,42.318474],[-75.727307,42.319127],[-75.725362,42.319397],[-75.724583,42.319505],[-75.72392499999999,42.319557],[-75.72329999999999,42.319601],[-75.723005,42.319611],[-75.722464,42.319619],[-75.722137,42.319624],[-75.721388,42.319601],[-75.720851,42.319572],[-75.719472,42.31944],[-75.718025,42.319274],[-75.717612,42.319244],[-75.71691199999999,42.319211],[-75.716284,42.319204],[-75.715441,42.319221],[-75.715074,42.319239],[-75.71350200000001,42.319348],[-75.71288199999999,42.319413],[-75.712467,42.319467],[-75.712154,42.319532],[-75.710886,42.319854],[-75.71032200000001,42.319989],[-75.709875,42.320064],[-75.70934699999999,42.320126],[-75.708352,42.320168],[-75.70797,42.320173],[-75.705496,42.320146],[-75.703182,42.320143],[-75.702718,42.320153],[-75.702026,42.320212],[-75.701663,42.320254],[-75.700953,42.320382],[-75.700642,42.320446],[-75.70023500000001,42.320545],[-75.69968299999999,42.320695],[-75.69887900000001,42.320946],[-75.698116,42.321197],[-75.698018,42.321229],[-75.697299,42.321437],[-75.697018,42.3215],[-75.696534,42.321574],[-75.69610299999999,42.321616],[-75.695864,42.321639],[-75.69464499999999,42.321671],[-75.694164,42.321688],[-75.69335599999999,42.321711],[-75.692241,42.321785],[-75.691098,42.321912],[-75.689919,42.322111],[-75.687887,42.322543],[-75.68702,42.32273],[-75.685633,42.323018],[-75.68525699999999,42.323083],[-75.684849,42.32314],[-75.684254,42.323185],[-75.68371500000001,42.3232],[-75.68287599999999,42.32316],[-75.682332,42.323095],[-75.68168900000001,42.322986],[-75.681274,42.322882],[-75.680755,42.322733],[-75.680466,42.322635],[-75.68024200000001,42.322549],[-75.679695,42.322319],[-75.679075,42.322057],[-75.6782,42.321667],[-75.67785499999999,42.321493],[-75.677584,42.321344],[-75.67723700000001,42.321115],[-75.676951,42.320899],[-75.676187,42.320228],[-75.675732,42.319888],[-75.675455,42.319716],[-75.675012,42.3195],[-75.674592,42.319341],[-75.674229,42.319234],[-75.672079,42.318675],[-75.66846700000001,42.317723],[-75.667586,42.317493],[-75.665783,42.317028],[-75.665521,42.316971],[-75.665114,42.316909],[-75.664726,42.316879],[-75.664457,42.316872],[-75.663895,42.316886],[-75.663112,42.316926],[-75.661778,42.316978],[-75.659081,42.317142],[-75.655021,42.317341],[-75.654078,42.317358],[-75.653786,42.317363],[-75.65223,42.317368],[-75.652089,42.317363],[-75.65132199999999,42.317334],[-75.65079299999999,42.317315],[-75.64951600000001,42.317254],[-75.648145,42.317142],[-75.646762,42.317007],[-75.646643,42.316994],[-75.645329,42.316849],[-75.644507,42.316745],[-75.644193,42.316706],[-75.643939,42.316674],[-75.642009,42.316444],[-75.639561,42.316145],[-75.638474,42.316013],[-75.63850499999999,42.314839],[-75.63850600000001,42.314481],[-75.638514,42.31233],[-75.63852,42.31059],[-75.63850600000001,42.308715],[-75.638464,42.307444],[-75.638425,42.307207],[-75.638369,42.307036],[-75.638293,42.306812],[-75.638181,42.306563],[-75.637911,42.306087],[-75.637811,42.305877],[-75.637704,42.305591],[-75.637629,42.305242],[-75.637619,42.305104],[-75.637631,42.304719],[-75.637877,42.30301],[-75.638019,42.301934],[-75.63802699999999,42.301712],[-75.638013,42.301315],[-75.637987,42.301095],[-75.637942,42.300874],[-75.63778000000001,42.300371],[-75.63763,42.299938],[-75.637579,42.299751],[-75.637548,42.299494],[-75.637565,42.299146],[-75.637615,42.298895],[-75.637704,42.298659],[-75.637863,42.298355],[-75.638187,42.297851],[-75.638301,42.297672],[-75.638481,42.297347],[-75.63864,42.296998],[-75.638853,42.296373],[-75.639276,42.294981],[-75.639382,42.294666],[-75.639471,42.294454],[-75.639696,42.294052],[-75.640152,42.293326],[-75.640269,42.293091],[-75.640388,42.292797],[-75.640489,42.292402],[-75.640539,42.292056],[-75.640548,42.291763],[-75.640533,42.29158],[-75.64052700000001,42.291533],[-75.640512,42.291421],[-75.64039099999999,42.290961],[-75.64026,42.290626],[-75.640113,42.290356],[-75.639886,42.290036],[-75.639532,42.289604],[-75.639269,42.289268],[-75.639151,42.289117],[-75.638964,42.28885],[-75.6387,42.288398],[-75.63839299999999,42.287802],[-75.63827499999999,42.287503],[-75.63821,42.287283],[-75.638144,42.286892],[-75.638114,42.286452],[-75.638125,42.285737],[-75.638158,42.285205],[-75.638214,42.284935],[-75.638231,42.284887],[-75.638321,42.284632],[-75.638496,42.284287],[-75.639021,42.283526],[-75.639166,42.283283],[-75.639415,42.282763],[-75.64032,42.280565],[-75.64034100000001,42.280511],[-75.640564,42.279934],[-75.64066699999999,42.279592],[-75.64069000000001,42.279477],[-75.640755,42.278969],[-75.640762,42.278729],[-75.64075200000001,42.278461],[-75.640636,42.27728],[-75.640575,42.276845],[-75.640573,42.276831],[-75.64049199999999,42.276506],[-75.64039699999999,42.276236],[-75.640232,42.275884],[-75.639932,42.27533],[-75.63968199999999,42.274801],[-75.63958,42.27452],[-75.639483,42.274152],[-75.639458,42.273996],[-75.63940100000001,42.273631],[-75.639358,42.273088],[-75.639323,42.272048],[-75.63932200000001,42.272025],[-75.63928199999999,42.271453],[-75.63924900000001,42.271229],[-75.63915799999999,42.270864],[-75.639087,42.27068],[-75.638881,42.270303],[-75.638772,42.270158],[-75.638615,42.269978],[-75.638278,42.269638],[-75.637716,42.269128],[-75.637258,42.268691],[-75.637096,42.268517],[-75.63677300000001,42.268159],[-75.63651400000001,42.267844],[-75.636487,42.26781],[-75.63608600000001,42.267318],[-75.635884,42.267037],[-75.63569099999999,42.266736],[-75.63550600000001,42.26634],[-75.63542200000001,42.266058],[-75.63533700000001,42.265557],[-75.635322,42.265352],[-75.635338,42.264993],[-75.635418,42.264854],[-75.63579900000001,42.264279],[-75.635935,42.26409],[-75.636049,42.263952],[-75.636205,42.263787],[-75.63633799999999,42.263681],[-75.63645,42.263618],[-75.636681,42.263553],[-75.636944,42.26351],[-75.637612,42.26344],[-75.637753,42.263425],[-75.63787000000001,42.263388],[-75.637923,42.26335],[-75.637947,42.263279],[-75.63808,42.26281],[-75.638201,42.262097],[-75.63834300000001,42.261166],[-75.638434,42.26069],[-75.638554,42.259966],[-75.638593,42.259756],[-75.638721,42.259544],[-75.638818,42.259373],[-75.63890000000001,42.259199],[-75.639028,42.258843],[-75.639088,42.258632],[-75.639256,42.257727],[-75.639449,42.256937],[-75.639493,42.256679],[-75.63949700000001,42.256459],[-75.639489,42.256062],[-75.639431,42.255224],[-75.63937799999999,42.25491],[-75.63932800000001,42.254661],[-75.639236,42.254328],[-75.63904599999999,42.253738],[-75.63903000000001,42.253652],[-75.63901799999999,42.253542],[-75.63910799999999,42.251879],[-75.639146,42.250379],[-75.639123,42.249719],[-75.63906799999999,42.248829],[-75.639055,42.248675],[-75.639242,42.248674],[-75.647914,42.24856],[-75.648098,42.248558],[-75.65892700000001,42.248416],[-75.663392,42.248368],[-75.671976,42.248276],[-75.67214800000001,42.248274],[-75.672319,42.248272],[-75.677746,42.248113],[-75.67956,42.248063],[-75.683173,42.247958],[-75.68326,42.247974],[-75.683588,42.247972],[-75.683604,42.247972],[-75.683635,42.247972],[-75.68369300000001,42.247972],[-75.683797,42.247972],[-75.683965,42.247972],[-75.6842,42.247972],[-75.68434999999999,42.247973],[-75.684369,42.247973],[-75.684404,42.247973],[-75.684466,42.247973],[-75.685121,42.247974],[-75.68607299999999,42.247971],[-75.686116,42.24797],[-75.686132,42.24797],[-75.686182,42.24797],[-75.68623700000001,42.24797],[-75.686277,42.24797],[-75.68652400000001,42.247969],[-75.68791299999999,42.247965],[-75.688305,42.247963],[-75.692725,42.247933],[-75.697399,42.247901],[-75.703153,42.247863],[-75.710419,42.247814],[-75.714122,42.247789],[-75.72205599999999,42.247735],[-75.722112,42.247867],[-75.722183,42.248071],[-75.722228,42.248261],[-75.722252,42.248558],[-75.72227599999999,42.249085],[-75.72227700000001,42.249113],[-75.722286,42.249318],[-75.722286,42.249341],[-75.73025699999999,42.249329],[-75.73334800000001,42.249324],[-75.737617,42.249287],[-75.747187,42.249204],[-75.749635,42.249183],[-75.749635,42.249165],[-75.76467599999999,42.249292],[-75.76474399999999,42.249292],[-75.768344,42.249278],[-75.768916,42.249276],[-75.772053,42.249245],[-75.772116,42.249244],[-75.77566,42.249235],[-75.77817,42.249229],[-75.778436,42.249228],[-75.77849000000001,42.249228],[-75.778606,42.249228],[-75.778667,42.249228],[-75.778711,42.249235],[-75.779028,42.249284],[-75.77916500000001,42.249305]]],"type":"Polygon"}
}