{
  "id": "360850187022",
  "type": "Feature",
  "properties": {
    "area_land":312588,
    "area_water":0,
    "geoid":"360850187022",
    "name":"Block Group 2",
    "state":"ny"
},
  "bbox": [
    -74.127323,
    40.602958,
    -74.120686,
    40.609899
],
  "geometry": {"coordinates":[[[-74.127323,40.608661],[-74.125845,40.608862],[-74.124195,40.60921],[-74.123178,40.609419],[-74.12138400000001,40.609899],[-74.12133900000001,40.609684],[-74.121273,40.609362],[-74.12117000000001,40.608834],[-74.12092,40.606359],[-74.120835,40.605215],[-74.12078200000001,40.604531],[-74.12073700000001,40.603846],[-74.12068600000001,40.603084],[-74.121584,40.602989],[-74.122483,40.602972],[-74.123389,40.602958],[-74.123392,40.603445],[-74.123684,40.603989],[-74.123722,40.604395],[-74.124692,40.604351],[-74.125676,40.604301],[-74.12661,40.604241],[-74.12690600000001,40.606006],[-74.127233,40.608156],[-74.127297,40.608449],[-74.127323,40.608661]]],"type":"Polygon"}
}