{
  "id": "360259706001",
  "type": "Feature",
  "properties": {
    "area_land":88151402,
    "area_water":47591,
    "geoid":"360259706001",
    "name":"Block Group 1",
    "state":"ny"
},
  "bbox": [
    -75.197411,
    42.15312,
    -75.027156,
    42.268179
],
  "geometry": {"coordinates":[[[-75.197411,42.252876],[-75.196404,42.252941],[-75.193264,42.253168],[-75.190214,42.253383],[-75.18874700000001,42.253485],[-75.18025799999999,42.25409],[-75.179091,42.254174],[-75.17145600000001,42.254746],[-75.165142,42.255237],[-75.165057,42.255238],[-75.156845,42.25582],[-75.154903,42.255957],[-75.14242,42.256907],[-75.14188900000001,42.256949],[-75.133909,42.257585],[-75.133276,42.257641],[-75.128209,42.258001],[-75.127223,42.258077],[-75.12463099999999,42.258267],[-75.11781999999999,42.258811],[-75.11312,42.259186],[-75.109908,42.259447],[-75.10844,42.25954],[-75.10778999999999,42.259579],[-75.091151,42.268179],[-75.087695,42.264583],[-75.07645599999999,42.252912],[-75.073734,42.250084],[-75.069802,42.245851],[-75.066751,42.242523],[-75.06571099999999,42.241503],[-75.060692,42.236286],[-75.06044,42.236029],[-75.05454400000001,42.229944],[-75.054441,42.229833],[-75.046104,42.221227],[-75.04353999999999,42.218595],[-75.033379,42.208121],[-75.031988,42.206668],[-75.02715600000001,42.20162],[-75.03151800000001,42.197737],[-75.041026,42.189273],[-75.041088,42.189218],[-75.04571300000001,42.185101],[-75.05229199999999,42.179244],[-75.052654,42.178925],[-75.054084,42.177731],[-75.051919,42.175109],[-75.05177999999999,42.174941],[-75.05078399999999,42.173786],[-75.043412,42.164972],[-75.04345499999999,42.16489],[-75.043763,42.164062],[-75.04384400000001,42.163864],[-75.043933,42.16367],[-75.044038,42.163481],[-75.044158,42.163301],[-75.044293,42.163129],[-75.04444100000001,42.162963],[-75.0446,42.162801],[-75.04477300000001,42.162652],[-75.04495799999999,42.162517],[-75.045154,42.162386],[-75.045359,42.162264],[-75.045573,42.162152],[-75.045795,42.162048],[-75.046024,42.161958],[-75.046263,42.161877],[-75.04650599999999,42.161809],[-75.046755,42.16175],[-75.04700699999999,42.161701],[-75.047263,42.161669],[-75.047522,42.161647],[-75.047786,42.161637],[-75.048053,42.161637],[-75.048322,42.161651],[-75.048603,42.161674],[-75.04966400000001,42.161781],[-75.049922,42.161821],[-75.050175,42.161866],[-75.050422,42.161924],[-75.050662,42.161996],[-75.050893,42.162077],[-75.051117,42.162167],[-75.051333,42.162262],[-75.051542,42.162365],[-75.05234400000001,42.162779],[-75.052547,42.162874],[-75.052756,42.162959],[-75.052971,42.163036],[-75.053111,42.163082],[-75.053191,42.163108],[-75.05341799999999,42.163162],[-75.053456,42.163169],[-75.053652,42.163206],[-75.053892,42.163242],[-75.054137,42.163269],[-75.05438599999999,42.163283],[-75.054637,42.163287],[-75.05500000000001,42.163277],[-75.055154,42.163273],[-75.05542,42.163255],[-75.05568700000001,42.163228],[-75.05595099999999,42.163192],[-75.05627800000001,42.163138],[-75.05647500000001,42.163093],[-75.056989,42.162962],[-75.057243,42.162885],[-75.058502,42.162479],[-75.059015,42.162326],[-75.05927800000001,42.162267],[-75.05954699999999,42.162217],[-75.059819,42.162177],[-75.060096,42.162145],[-75.06037499999999,42.162127],[-75.06065599999999,42.162118],[-75.060939,42.162118],[-75.061061,42.162124],[-75.061223,42.162131],[-75.06179,42.162185],[-75.062073,42.16222],[-75.06219900000001,42.162234],[-75.06263800000001,42.162283],[-75.06291899999999,42.162319],[-75.063197,42.16235],[-75.063474,42.162391],[-75.063749,42.16244],[-75.064296,42.162548],[-75.064571,42.162593],[-75.064849,42.162629],[-75.06513,42.162651],[-75.065414,42.162655],[-75.065698,42.162646],[-75.06598099999999,42.162624],[-75.06626300000001,42.162592],[-75.066337,42.162581],[-75.066543,42.162551],[-75.06737800000001,42.162398],[-75.06794499999999,42.162298],[-75.06880200000001,42.162137],[-75.069096,42.162077],[-75.06966799999999,42.161937],[-75.070505,42.161702],[-75.07078300000001,42.16163],[-75.07106400000001,42.161567],[-75.071348,42.161517],[-75.071635,42.161481],[-75.071924,42.161467],[-75.072213,42.161458],[-75.072502,42.161462],[-75.073078,42.16148],[-75.073365,42.161475],[-75.073651,42.161462],[-75.07374799999999,42.161451],[-75.07393500000001,42.16143],[-75.07421600000001,42.161385],[-75.07449099999999,42.16133],[-75.074763,42.161263],[-75.07503,42.161191],[-75.076358,42.160789],[-75.07662500000001,42.160703],[-75.077157,42.160518],[-75.077208,42.160499],[-75.07741900000001,42.160419],[-75.077512,42.160378],[-75.078158,42.160119],[-75.07921899999999,42.159693],[-75.079736,42.159481],[-75.080258,42.159273],[-75.08260900000001,42.158321],[-75.083378,42.158015],[-75.08363300000001,42.157906],[-75.08388600000001,42.157807],[-75.08439300000001,42.157599],[-75.086977,42.156562],[-75.08723500000001,42.156454],[-75.08749,42.156341],[-75.087738,42.156223],[-75.087977,42.156097],[-75.088207,42.155962],[-75.088429,42.155822],[-75.088849,42.155525],[-75.089663,42.154912],[-75.090073,42.15461],[-75.090682,42.15415],[-75.090892,42.154005],[-75.09111300000001,42.15387],[-75.091345,42.153744],[-75.091588,42.153631],[-75.09184,42.153527],[-75.092101,42.153442],[-75.092372,42.153369],[-75.092651,42.153311],[-75.092935,42.153265],[-75.093221,42.153225],[-75.093509,42.153193],[-75.094088,42.153143],[-75.09438,42.153129],[-75.094566,42.153123],[-75.094674,42.15312],[-75.09496799999999,42.15312],[-75.095264,42.153128],[-75.095585,42.153155],[-75.095856,42.153177],[-75.09644400000001,42.153258],[-75.098178,42.153531],[-75.099565,42.15376],[-75.100656,42.15393],[-75.10199900000001,42.154154],[-75.102268,42.154194],[-75.10276500000001,42.154277],[-75.103078,42.154324],[-75.10362499999999,42.154413],[-75.103899,42.154463],[-75.104175,42.154503],[-75.105003,42.154637],[-75.105278,42.154687],[-75.10555100000001,42.154727],[-75.107153,42.154996],[-75.10817400000001,42.155157],[-75.108422,42.155206],[-75.108665,42.15526],[-75.108902,42.155323],[-75.109133,42.155395],[-75.109358,42.15548],[-75.109478,42.155532],[-75.109576,42.155574],[-75.109787,42.155682],[-75.10999099999999,42.155799],[-75.11011000000001,42.155875],[-75.11018900000001,42.155925],[-75.110382,42.15606],[-75.110572,42.156204],[-75.11090799999999,42.15647],[-75.111141,42.156654],[-75.11172000000001,42.157103],[-75.11292299999999,42.158048],[-75.113231,42.158291],[-75.11326800000001,42.158318],[-75.113361,42.158392],[-75.114535,42.159325],[-75.11528199999999,42.159905],[-75.11622699999999,42.160665],[-75.116974,42.161277],[-75.11807,42.16219],[-75.118942,42.162905],[-75.11928399999999,42.163175],[-75.119461,42.163305],[-75.11982999999999,42.163548],[-75.120025,42.163661],[-75.120424,42.163872],[-75.12058399999999,42.163951],[-75.120626,42.163971],[-75.12071400000001,42.164009],[-75.12144000000001,42.164326],[-75.121639,42.164406],[-75.122005,42.164564],[-75.122399,42.164734],[-75.12291999999999,42.16499],[-75.12340500000001,42.165251],[-75.124314,42.165768],[-75.124892,42.166083],[-75.125263,42.166271],[-75.12519899999999,42.16633],[-75.125111,42.166393],[-75.124758,42.166686],[-75.12470500000001,42.166758],[-75.124633,42.166803],[-75.12451,42.16689],[-75.12441200000001,42.16697],[-75.124261,42.167083],[-75.124195,42.167155],[-75.124117,42.1672],[-75.124045,42.167254],[-75.12391599999999,42.167376],[-75.123863,42.167444],[-75.123819,42.167511],[-75.12378200000001,42.167579],[-75.12376999999999,42.16761],[-75.12366,42.167939],[-75.123459,42.168444],[-75.123437,42.168525],[-75.12338800000001,42.168669],[-75.123357,42.168728],[-75.12333599999999,42.1688],[-75.12334199999999,42.168872],[-75.123287,42.168935],[-75.123206,42.169133],[-75.123114,42.16939],[-75.123088,42.169444],[-75.123053,42.169494],[-75.122983,42.169669],[-75.12297,42.169725],[-75.122958,42.169773],[-75.122964,42.169818],[-75.12298800000001,42.169863],[-75.12303199999999,42.169899],[-75.123085,42.169926],[-75.12332499999999,42.170029],[-75.123453,42.170078],[-75.123504,42.170105],[-75.12334,42.170299],[-75.12318,42.17048],[-75.123099,42.170565],[-75.122872,42.170827],[-75.12243599999999,42.171295],[-75.122096,42.171715],[-75.121968,42.171859],[-75.121905,42.171922],[-75.12182300000001,42.172026],[-75.12177699999999,42.172071],[-75.12170500000001,42.172152],[-75.121681,42.172179],[-75.121617,42.172219],[-75.121573,42.172296],[-75.121455,42.172413],[-75.121386,42.172458],[-75.12123,42.17249],[-75.121058,42.172468],[-75.120848,42.172567],[-75.120767,42.172599],[-75.120625,42.172693],[-75.120285,42.172878],[-75.119786,42.17313],[-75.119664,42.174283],[-75.119586,42.175258],[-75.119528,42.175696],[-75.119508,42.175856],[-75.119314,42.177355],[-75.119433,42.177305],[-75.119612,42.177234],[-75.11972400000001,42.177184],[-75.11975700000001,42.177171],[-75.120042,42.177062],[-75.120248,42.176994],[-75.12035400000001,42.176963],[-75.12051200000001,42.176922],[-75.120814,42.176845],[-75.12105200000001,42.176795],[-75.121151,42.176786],[-75.121364,42.17675],[-75.121459,42.176754],[-75.12154200000001,42.176772],[-75.121618,42.176804],[-75.12168200000001,42.176849],[-75.121726,42.176907],[-75.121785,42.177006],[-75.121804,42.177051],[-75.121837,42.177083],[-75.12196900000001,42.177294],[-75.122004,42.177362],[-75.122265,42.177834],[-75.122308,42.17792],[-75.122406,42.178079],[-75.122474,42.178189],[-75.122658,42.178487],[-75.123008,42.179072],[-75.123048,42.179126],[-75.123075,42.179175],[-75.12316300000001,42.179337],[-75.123319,42.17954],[-75.12365800000001,42.180143],[-75.123822,42.180485],[-75.12395100000001,42.180847],[-75.12397799999999,42.180925],[-75.124093,42.181259],[-75.124273,42.181705],[-75.124455,42.182186],[-75.12456899999999,42.182691],[-75.124557,42.183191],[-75.124393,42.183695],[-75.12429299999999,42.183974],[-75.124213,42.184195],[-75.124144,42.184713],[-75.124202,42.185235],[-75.124211,42.185767],[-75.124151,42.186298],[-75.12405,42.187384],[-75.124021,42.187774],[-75.12401,42.187915],[-75.123981,42.188442],[-75.12398,42.188757],[-75.12397900000001,42.188969],[-75.124032,42.1895],[-75.124202,42.190234],[-75.124295,42.190635],[-75.12439000000001,42.191197],[-75.12434500000001,42.191751],[-75.12411299999999,42.192315],[-75.123822,42.192878],[-75.123548,42.193441],[-75.12328599999999,42.194],[-75.123059,42.194554],[-75.122823,42.195103],[-75.12253699999999,42.195649],[-75.12195,42.196698],[-75.121633,42.19723],[-75.121223,42.19819],[-75.12122100000001,42.198383],[-75.12121999999999,42.198469],[-75.121447,42.198757],[-75.12185700000001,42.198964],[-75.12235800000001,42.199139],[-75.122891,42.199309],[-75.123409,42.199484],[-75.12388799999999,42.199659],[-75.124289,42.199893],[-75.124548,42.200235],[-75.124781,42.20064],[-75.12504,42.201077],[-75.125263,42.20154],[-75.12528500000001,42.202027],[-75.12524500000001,42.202522],[-75.12536799999999,42.203031],[-75.12560000000001,42.203544],[-75.12585199999999,42.204066],[-75.125919,42.204177],[-75.126161,42.204579],[-75.126546,42.205074],[-75.126969,42.205551],[-75.127439,42.206023],[-75.127948,42.206518],[-75.128433,42.207044],[-75.12873500000001,42.207638],[-75.12908,42.208201],[-75.129597,42.20865],[-75.130214,42.208929],[-75.131181,42.209104],[-75.131669,42.209193],[-75.132406,42.209354],[-75.133078,42.209633],[-75.133751,42.209983],[-75.13448,42.210302],[-75.135239,42.210567],[-75.135959,42.210832],[-75.13653499999999,42.211186],[-75.13655199999999,42.211196],[-75.137103,42.211623],[-75.13770700000001,42.212032],[-75.138363,42.212409],[-75.13906799999999,42.212769],[-75.13981699999999,42.21307],[-75.14053699999999,42.213384],[-75.141166,42.213775],[-75.141707,42.21422],[-75.142211,42.214679],[-75.142493,42.21505],[-75.142608,42.215201],[-75.14285599999999,42.21579],[-75.14312,42.216389],[-75.143462,42.216947],[-75.143621,42.217121],[-75.143925,42.217455],[-75.145045,42.218408],[-75.14546199999999,42.218775],[-75.146131,42.219362],[-75.14664500000001,42.219735],[-75.146933,42.219815],[-75.147227,42.219896],[-75.147346,42.219896],[-75.14787200000001,42.219895],[-75.148523,42.219885],[-75.149152,42.219948],[-75.14975800000001,42.22015],[-75.15034,42.220432],[-75.15069800000001,42.220658],[-75.15267299999999,42.221906],[-75.15327499999999,42.22232],[-75.153839,42.222769],[-75.15440700000001,42.223206],[-75.15505,42.223556],[-75.15570099999999,42.22387],[-75.15630400000001,42.224243],[-75.15688,42.224648],[-75.157443,42.225052],[-75.157996,42.225412],[-75.158362,42.225568],[-75.15858299999999,42.225663],[-75.159167,42.225833],[-75.159644,42.225828],[-75.15967499999999,42.225828],[-75.16005800000001,42.225593],[-75.160398,42.225291],[-75.160793,42.225016],[-75.161293,42.224817],[-75.16188699999999,42.224749],[-75.162522,42.224784],[-75.163162,42.224923],[-75.163819,42.225115],[-75.16441,42.225434],[-75.164813,42.225776],[-75.164897,42.225848],[-75.16526,42.226266],[-75.16563499999999,42.22668],[-75.166462,42.227516],[-75.166899,42.227948],[-75.16736400000001,42.228357],[-75.167923,42.228721],[-75.16857,42.229008],[-75.169197,42.229309],[-75.16978899999999,42.229641],[-75.170361,42.229987],[-75.17086999999999,42.230369],[-75.171339,42.230747],[-75.171826,42.231111],[-75.172363,42.231413],[-75.172399,42.231434],[-75.17304900000001,42.231703],[-75.173704,42.231946],[-75.174342,42.232174],[-75.17497299999999,42.232385],[-75.17561600000001,42.232605],[-75.176264,42.232838],[-75.177205,42.233188],[-75.177519,42.233322],[-75.177734,42.23345],[-75.177836,42.233511],[-75.178175,42.233762],[-75.178539,42.23405],[-75.17905,42.234472],[-75.17931799999999,42.234693],[-75.180668,42.235862],[-75.18113099999999,42.236298],[-75.1815,42.236783],[-75.18164,42.237315],[-75.181697,42.237877],[-75.18180099999999,42.238499],[-75.181828,42.238736],[-75.18186,42.239016],[-75.18206000000001,42.239574],[-75.18242600000001,42.240087],[-75.182834,42.240586],[-75.183634,42.24154],[-75.185283,42.243564],[-75.18541,42.243708],[-75.18573499999999,42.244076],[-75.18676600000001,42.244953],[-75.187228,42.245416],[-75.187687,42.245901],[-75.18772,42.245937],[-75.188148,42.246396],[-75.18850999999999,42.246824],[-75.18875300000001,42.247111],[-75.188968,42.247363],[-75.18941,42.247681],[-75.189429,42.247695],[-75.190016,42.247816],[-75.19128000000001,42.247913],[-75.19195000000001,42.24797],[-75.192663,42.248059],[-75.1934,42.248215],[-75.19354199999999,42.24827],[-75.193611,42.248297],[-75.19399,42.248444],[-75.194092,42.248484],[-75.194684,42.248871],[-75.19566500000001,42.249797],[-75.19595700000001,42.250328],[-75.196454,42.251421],[-75.196727,42.251979],[-75.19708900000001,42.252523],[-75.197411,42.252876]]],"type":"Polygon"}
}