{
  "id": "360470510022",
  "type": "Feature",
  "properties": {
    "area_land":26111,
    "area_water":0,
    "geoid":"360470510022",
    "name":"Block Group 2",
    "state":"ny"
},
  "bbox": [
    -73.963075,
    40.648402,
    -73.960737,
    40.650082
],
  "geometry": {"coordinates":[[[-73.963075,40.64944],[-73.962186,40.649789],[-73.96100800000001,40.650082],[-73.96073699999999,40.648644],[-73.961935,40.648511],[-73.96287599999999,40.648402],[-73.963075,40.64944]]],"type":"Polygon"}
}