{
  "id": "360570703001",
  "type": "Feature",
  "properties": {
    "area_land":226940,
    "area_water":0,
    "geoid":"360570703001",
    "name":"Block Group 1",
    "state":"ny"
},
  "bbox": [
    -74.194197,
    42.939612,
    -74.186572,
    42.947408
],
  "geometry": {"coordinates":[[[-74.193342,42.941542],[-74.192841,42.941844],[-74.19243,42.94209],[-74.191962,42.942371],[-74.19173000000001,42.942507],[-74.191171,42.942839],[-74.191374,42.943043],[-74.19191600000001,42.943573],[-74.19109400000001,42.944277],[-74.191005,42.944328],[-74.190378,42.944798],[-74.189761,42.945279],[-74.189122,42.945764],[-74.188321,42.946373],[-74.187673,42.946867],[-74.18696,42.947408],[-74.186572,42.947162],[-74.18671500000001,42.946229],[-74.18681599999999,42.945572],[-74.186841,42.945391],[-74.186993,42.944482],[-74.18709200000001,42.944285],[-74.187459,42.943632],[-74.18781799999999,42.943008],[-74.188211,42.942341],[-74.188541,42.941772],[-74.188796,42.94133],[-74.18901,42.941019],[-74.189206,42.940746],[-74.189306,42.940575],[-74.189335,42.940487],[-74.189367,42.940817],[-74.189628,42.940583],[-74.189897,42.940372],[-74.190048,42.940255],[-74.19026599999999,42.940116],[-74.190365,42.940049],[-74.19053599999999,42.939956],[-74.19073,42.939872],[-74.191177,42.939726],[-74.191565,42.939654],[-74.191868,42.939631],[-74.192396,42.939612],[-74.192673,42.939838],[-74.193155,42.940199],[-74.194197,42.940999],[-74.193342,42.941542]]],"type":"Polygon"}
}