{
  "id": "360470257003",
  "type": "Feature",
  "properties": {
    "area_land":80327,
    "area_water":0,
    "geoid":"360470257003",
    "name":"Block Group 3",
    "state":"ny"
},
  "bbox": [
    -73.950091,
    40.69831,
    -73.944096,
    40.700425
],
  "geometry": {"coordinates":[[[-73.950091,40.699791],[-73.949794,40.699823],[-73.948133,40.700006],[-73.947248,40.700105],[-73.94712800000001,40.700123],[-73.946316,40.700215],[-73.94461699999999,40.700405],[-73.944388,40.700425],[-73.94430800000001,40.700024],[-73.944243,40.699699],[-73.944096,40.698973],[-73.945626,40.698792],[-73.94695900000001,40.698641],[-73.949788,40.69831],[-73.949944,40.699047],[-73.950091,40.699791]]],"type":"Polygon"}
}