{
  "id": "360810694001",
  "type": "Feature",
  "properties": {
    "area_land":284653,
    "area_water":4775,
    "geoid":"360810694001",
    "name":"Block Group 1",
    "state":"ny"
},
  "bbox": [
    -73.751539,
    40.652509,
    -73.743287,
    40.657535
],
  "geometry": {"coordinates":[[[-73.75098300000001,40.65517],[-73.7508,40.655117],[-73.750108,40.656211],[-73.74986,40.656128],[-73.749511,40.656666],[-73.749185,40.656619],[-73.74883699999999,40.657151],[-73.74831,40.657198],[-73.748062,40.657535],[-73.747052,40.657489],[-73.746796,40.657474],[-73.74618,40.657439],[-73.74506,40.657407],[-73.744923,40.656479],[-73.744874,40.656145],[-73.74377,40.656139],[-73.743287,40.656135],[-73.743298,40.655424],[-73.743307,40.654709],[-73.743312,40.653994],[-73.743318,40.653281],[-73.743325,40.652538],[-73.746549,40.652554],[-73.747843,40.652539],[-73.74804399999999,40.652509],[-73.74840500000001,40.652663],[-73.75153899999999,40.654295],[-73.75098300000001,40.65517]]],"type":"Polygon"}
}