{
  "id": "360471166001",
  "type": "Feature",
  "properties": {
    "area_land":52472,
    "area_water":0,
    "geoid":"360471166001",
    "name":"Block Group 1",
    "state":"ny"
},
  "bbox": [
    -73.884854,
    40.674889,
    -73.880199,
    40.676766
],
  "geometry": {"coordinates":[[[-73.884854,40.676129],[-73.88404,40.67625],[-73.88322599999999,40.67637],[-73.88233099999999,40.676501],[-73.881427,40.676634],[-73.880505,40.676766],[-73.880199,40.675525],[-73.881119,40.675392],[-73.88202200000001,40.67526],[-73.882908,40.67513],[-73.88372200000001,40.675009],[-73.88453699999999,40.674889],[-73.884854,40.676129]]],"type":"Polygon"}
}