{
  "id": "360610279001",
  "type": "Feature",
  "properties": {
    "area_land":22684,
    "area_water":0,
    "geoid":"360610279001",
    "name":"Block Group 1",
    "state":"ny"
},
  "bbox": [
    -73.934627,
    40.854169,
    -73.932761,
    40.856783
],
  "geometry": {"coordinates":[[[-73.93426599999999,40.855581],[-73.93370299999999,40.856737],[-73.93368100000001,40.856783],[-73.932761,40.856503],[-73.932872,40.856265],[-73.933312,40.855335],[-73.933705,40.854169],[-73.93462700000001,40.854501],[-73.93426599999999,40.855581]]],"type":"Polygon"}
}