{
  "id": "360710121005",
  "type": "Feature",
  "properties": {
    "area_land":5643538,
    "area_water":70272,
    "geoid":"360710121005",
    "name":"Block Group 5",
    "state":"ny"
},
  "bbox": [
    -74.329617,
    41.358037,
    -74.290921,
    41.387758
],
  "geometry": {"coordinates":[[[-74.32928099999999,41.371446],[-74.32911300000001,41.371604],[-74.328704,41.372002],[-74.32805500000001,41.372645],[-74.32649600000001,41.374127],[-74.32634299999999,41.37429],[-74.326194,41.374484],[-74.32614,41.374595],[-74.326116,41.374736],[-74.326087,41.375014],[-74.326083,41.375549],[-74.326092,41.376013],[-74.326133,41.376864],[-74.326322,41.379792],[-74.32639500000001,41.381122],[-74.323685,41.379569],[-74.322075,41.378644],[-74.32154199999999,41.378339],[-74.321245,41.37817],[-74.320716,41.378979],[-74.31832300000001,41.382646],[-74.315299,41.387288],[-74.3151,41.387586],[-74.314986,41.387758],[-74.314555,41.387506],[-74.31360100000001,41.386944],[-74.31296500000001,41.386566],[-74.31215899999999,41.386087],[-74.310486,41.3851],[-74.308779,41.384112],[-74.307672,41.383494],[-74.30700899999999,41.383148],[-74.30624,41.382761],[-74.304731,41.38206],[-74.303662,41.381573],[-74.30256799999999,41.381067],[-74.302105,41.380839],[-74.301382,41.380449],[-74.300225,41.37976],[-74.299291,41.379168],[-74.298489,41.378595],[-74.29813300000001,41.378328],[-74.297442,41.377778],[-74.296634,41.377081],[-74.29598900000001,41.376467],[-74.29559,41.376068],[-74.29478899999999,41.375189],[-74.294679,41.375053],[-74.294494,41.374832],[-74.294437,41.374763],[-74.293892,41.374068],[-74.293403,41.373376],[-74.292799,41.372417],[-74.292633,41.372128],[-74.29236400000001,41.371637],[-74.292213,41.371344],[-74.292035,41.37099],[-74.290921,41.368626],[-74.29112000000001,41.36849],[-74.294014,41.366513],[-74.294915,41.366015],[-74.295091,41.365918],[-74.295828,41.365512],[-74.29735100000001,41.364434],[-74.297442,41.364346],[-74.297676,41.364037],[-74.298012,41.363595],[-74.298063,41.363529],[-74.298157,41.363366],[-74.30215800000001,41.360946],[-74.30641199999999,41.358037],[-74.306451,41.358058],[-74.306613,41.358153],[-74.30777999999999,41.358925],[-74.307985,41.359047],[-74.308457,41.359318],[-74.308843,41.359555],[-74.309696,41.360047],[-74.31053,41.360514],[-74.310689,41.360572],[-74.31076299999999,41.360588],[-74.31088099999999,41.360619],[-74.310969,41.360656],[-74.31106800000001,41.360715],[-74.31144999999999,41.360985],[-74.312023,41.361336],[-74.312333,41.361512],[-74.312501,41.361608],[-74.313183,41.361974],[-74.313925,41.362388],[-74.31422999999999,41.362567],[-74.3145,41.362725],[-74.31462000000001,41.362797],[-74.314993,41.363016],[-74.315248,41.363153],[-74.315742,41.363386],[-74.315935,41.363488],[-74.316834,41.36405],[-74.317081,41.364204],[-74.31902599999999,41.365275],[-74.31974599999999,41.365683],[-74.320381,41.366089],[-74.320948,41.366468],[-74.321153,41.366589],[-74.322474,41.36731],[-74.32271799999999,41.367434],[-74.32316899999999,41.367708],[-74.32350599999999,41.367955],[-74.32493700000001,41.368794],[-74.325399,41.369085],[-74.32604000000001,41.369458],[-74.326859,41.369912],[-74.327387,41.370216],[-74.328276,41.370693],[-74.328491,41.370822],[-74.32879800000001,41.371048],[-74.329128,41.371118],[-74.329617,41.371143],[-74.32928099999999,41.371446]]],"type":"Polygon"}
}