{
  "id": "360290100012",
  "type": "Feature",
  "properties": {
    "area_land":7860783,
    "area_water":105687,
    "geoid":"360290100012",
    "name":"Block Group 2",
    "state":"ny"
},
  "bbox": [
    -78.754233,
    42.92707,
    -78.696923,
    42.953551
],
  "geometry": {"coordinates":[[[-78.754233,42.940693],[-78.75385900000001,42.940685],[-78.75349,42.940689],[-78.753196,42.940726],[-78.75293600000001,42.940779],[-78.75266000000001,42.940868],[-78.752556,42.940917],[-78.752458,42.940787],[-78.75224300000001,42.940486],[-78.752197,42.940486],[-78.75125300000001,42.940497],[-78.75002000000001,42.940501],[-78.749115,42.940499],[-78.74741,42.940507],[-78.747101,42.9409],[-78.746825,42.940808],[-78.74654099999999,42.94073],[-78.74625,42.940668],[-78.745955,42.940619],[-78.746205,42.940264],[-78.74624799999999,42.94022],[-78.746365,42.940082],[-78.74646199999999,42.939937],[-78.74654,42.939785],[-78.746596,42.939628],[-78.74663200000001,42.939468],[-78.746585,42.938008],[-78.746559,42.93719],[-78.746544,42.936716],[-78.74654099999999,42.93667],[-78.74651,42.935697],[-78.746493,42.934987],[-78.744454,42.935032],[-78.74413699999999,42.935042],[-78.744162,42.935743],[-78.744218,42.936818],[-78.74422,42.936846],[-78.744327,42.940076],[-78.744371,42.941442],[-78.744389,42.942272],[-78.744518,42.945495],[-78.74457700000001,42.948636],[-78.744589,42.949095],[-78.744589,42.949157],[-78.737736,42.949158],[-78.735951,42.949158],[-78.734253,42.949158],[-78.73425,42.949254],[-78.734279,42.950766],[-78.73428199999999,42.950946],[-78.734317,42.951419],[-78.734347,42.951697],[-78.734548,42.953551],[-78.734413,42.953503],[-78.73390499999999,42.953016],[-78.733817,42.952921],[-78.733487,42.952572],[-78.73239100000001,42.951083],[-78.73224500000001,42.950878],[-78.732248,42.950848],[-78.732214,42.950834],[-78.7321,42.950666],[-78.73200799999999,42.950532],[-78.73140600000001,42.949847],[-78.73125899999999,42.949502],[-78.73126600000001,42.948924],[-78.731163,42.948455],[-78.73065,42.947872],[-78.7299,42.947258],[-78.729238,42.947033],[-78.728576,42.946915],[-78.727915,42.946681],[-78.727756,42.94661],[-78.727451,42.946437],[-78.726483,42.945971],[-78.726207,42.945849],[-78.725846,42.945777],[-78.725544,42.945771],[-78.72521999999999,42.945771],[-78.724993,42.945784],[-78.72473100000001,42.945821],[-78.724732,42.945848],[-78.724733,42.94688],[-78.72471400000001,42.950644],[-78.724712,42.950861],[-78.72444400000001,42.950866],[-78.721706,42.950867],[-78.71973300000001,42.950872],[-78.717495,42.950885],[-78.710773,42.950897],[-78.710497,42.950902],[-78.70877,42.950909],[-78.707201,42.950885],[-78.703722,42.950654],[-78.703371,42.950628],[-78.70293599999999,42.951072],[-78.700159,42.950903],[-78.697028,42.950775],[-78.697007,42.950343],[-78.69692499999999,42.949898],[-78.69692499999999,42.949866],[-78.696926,42.949717],[-78.696926,42.949682],[-78.69692499999999,42.949293],[-78.696923,42.948728],[-78.696928,42.947662],[-78.696932,42.947003],[-78.69694,42.945505],[-78.696941,42.944816],[-78.696945,42.942539],[-78.69693700000001,42.941227],[-78.69695400000001,42.940179],[-78.696988,42.938679],[-78.69697499999999,42.937933],[-78.697513,42.93775],[-78.698037,42.937615],[-78.699183,42.937368],[-78.700374,42.937188],[-78.70246,42.936978],[-78.70254,42.93697],[-78.70272900000001,42.936952],[-78.703171,42.936917],[-78.703298,42.93691],[-78.70373600000001,42.936882],[-78.70440499999999,42.93687],[-78.705986,42.936822],[-78.70728200000001,42.936884],[-78.70749000000001,42.936901],[-78.708022,42.936953],[-78.70855299999999,42.937009],[-78.709244,42.937048],[-78.709602,42.937035],[-78.709861,42.937014],[-78.710176,42.936962],[-78.710561,42.936875],[-78.710815,42.936793],[-78.711113,42.936673],[-78.711338,42.936556],[-78.711603,42.936415],[-78.71181300000001,42.936256],[-78.71214999999999,42.935985],[-78.712282,42.935876],[-78.71252200000001,42.935677],[-78.712817,42.935471],[-78.712996,42.935356],[-78.713353,42.935196],[-78.713534,42.935131],[-78.713741,42.935068],[-78.71404200000001,42.934995],[-78.71543699999999,42.93473],[-78.716447,42.934538],[-78.717201,42.934395],[-78.71742,42.934402],[-78.718318,42.934249],[-78.720675,42.933794],[-78.721943,42.93355],[-78.72385199999999,42.933182],[-78.725178,42.932897],[-78.72583299999999,42.93276],[-78.726805,42.932563],[-78.727632,42.932389],[-78.72927900000001,42.932079],[-78.73027399999999,42.931877],[-78.730954,42.931742],[-78.731927,42.931562],[-78.73426000000001,42.931118],[-78.735581,42.930843],[-78.736186,42.93072],[-78.736727,42.93061],[-78.737236,42.930507],[-78.738809,42.930203],[-78.739013,42.930163],[-78.739491,42.930065],[-78.74028300000001,42.929912],[-78.74115500000001,42.929734],[-78.742125,42.929518],[-78.742634,42.929345],[-78.74356,42.929159],[-78.74365400000001,42.929141],[-78.74371600000001,42.929127],[-78.743801,42.929113],[-78.74432400000001,42.929026],[-78.74594999999999,42.928722],[-78.746298,42.928652],[-78.747007,42.928496],[-78.747418,42.928407],[-78.748186,42.928252],[-78.749289,42.928032],[-78.749458,42.927998],[-78.74964900000001,42.92796],[-78.75062800000001,42.927768],[-78.750714,42.927752],[-78.751499,42.927601],[-78.75198,42.927502],[-78.75286699999999,42.92732],[-78.754139,42.92707],[-78.754133,42.929323],[-78.754136,42.92974],[-78.754137,42.929909],[-78.754137,42.929952],[-78.754139,42.930098],[-78.75414000000001,42.930164],[-78.754141,42.93024],[-78.754141,42.930253],[-78.754143,42.93036],[-78.754144,42.930475],[-78.75415,42.930958],[-78.754142,42.93284],[-78.754143,42.933032],[-78.754143,42.933193],[-78.754147,42.934504],[-78.754154,42.934982],[-78.754182,42.936659],[-78.754182,42.93669],[-78.754184,42.936761],[-78.75419100000001,42.937058],[-78.75418999999999,42.938143],[-78.754212,42.939815],[-78.754233,42.940693]]],"type":"Polygon"}
}