{
  "id": "360870130021",
  "type": "Feature",
  "properties": {
    "area_land":3562754,
    "area_water":71023,
    "geoid":"360870130021",
    "name":"Block Group 1",
    "state":"ny"
},
  "bbox": [
    -73.975542,
    41.063307,
    -73.947815,
    41.085448
],
  "geometry": {"coordinates":[[[-73.975353,41.070451],[-73.975253,41.07056],[-73.975132,41.070668],[-73.974997,41.070772],[-73.974777,41.070862],[-73.974504,41.071174],[-73.972977,41.071095],[-73.97237800000001,41.071395],[-73.97197799999999,41.071793],[-73.972641,41.072577],[-73.971684,41.072789],[-73.971585,41.073688],[-73.97078399999999,41.073688],[-73.970884,41.074188],[-73.970084,41.074587],[-73.969684,41.074587],[-73.968985,41.075986],[-73.96828499999999,41.076086],[-73.96818500000001,41.076885],[-73.967586,41.077085],[-73.967586,41.077585],[-73.967353,41.077747],[-73.967411,41.078058],[-73.967158,41.078258],[-73.967045,41.078323],[-73.96684399999999,41.078442],[-73.966696,41.078503],[-73.966527,41.078559],[-73.96648,41.078569],[-73.966157,41.078641],[-73.965914,41.0787],[-73.965827,41.078743],[-73.96577499999999,41.078795],[-73.96574,41.07886],[-73.965684,41.079063],[-73.96557799999999,41.079797],[-73.96557,41.079925],[-73.965554,41.080184],[-73.96551100000001,41.080501],[-73.965463,41.080622],[-73.96539799999999,41.080734],[-73.96532000000001,41.080812],[-73.965216,41.080856],[-73.965103,41.080864],[-73.96498200000001,41.080847],[-73.964462,41.080665],[-73.96430599999999,41.080626],[-73.96404800000001,41.080607],[-73.964021,41.080611],[-73.96393999999999,41.080624],[-73.963831,41.080663],[-73.963753,41.080724],[-73.963701,41.080806],[-73.96367499999999,41.080933],[-73.963645,41.081079],[-73.963618,41.081923],[-73.961797,41.082173],[-73.96166599999999,41.082192],[-73.959985,41.082468],[-73.959757,41.082505],[-73.959546,41.08254],[-73.958258,41.08281],[-73.95755800000001,41.08295],[-73.95272,41.084193],[-73.94788699999999,41.085448],[-73.947863,41.085352],[-73.947836,41.085267],[-73.947819,41.085001],[-73.94781500000001,41.084662],[-73.94783200000001,41.084422],[-73.947863,41.084127],[-73.947937,41.083772],[-73.948061,41.083299],[-73.948081,41.083205],[-73.948055,41.083164],[-73.94836100000001,41.081988],[-73.948452,41.081749],[-73.948649,41.081299],[-73.948913,41.080881],[-73.949119,41.080533],[-73.94998200000001,41.079187],[-73.950188,41.078835],[-73.950391,41.078445],[-73.950526,41.078114],[-73.95065,41.077718],[-73.95074,41.077252],[-73.95096599999999,41.07548],[-73.951025,41.074999],[-73.95104600000001,41.074392],[-73.951014,41.073946],[-73.950948,41.073548],[-73.950839,41.07301],[-73.950459,41.071124],[-73.950242,41.069326],[-73.95012699999999,41.068421],[-73.95009,41.068152],[-73.94996500000001,41.067591],[-73.94986,41.067238],[-73.94925600000001,41.064488],[-73.949151,41.063725],[-73.94993599999999,41.063643],[-73.950397,41.063594],[-73.95062,41.063589],[-73.95195699999999,41.063547],[-73.95326300000001,41.063494],[-73.955322,41.063392],[-73.956451,41.063318],[-73.957769,41.063309],[-73.958625,41.063307],[-73.959112,41.063319],[-73.959338,41.06333],[-73.96001099999999,41.063383],[-73.960781,41.06347],[-73.96099700000001,41.063494],[-73.961434,41.063501],[-73.96158,41.063494],[-73.96178399999999,41.063471],[-73.961934,41.063442],[-73.962385,41.063389],[-73.962575,41.063374],[-73.96333300000001,41.063369],[-73.96376600000001,41.063367],[-73.96492600000001,41.063372],[-73.965356,41.063374],[-73.96556099999999,41.063373],[-73.965767,41.063372],[-73.966696,41.063367],[-73.967337,41.063379],[-73.96775599999999,41.063387],[-73.96901800000001,41.063404],[-73.970652,41.063399],[-73.970641,41.063867],[-73.970624,41.065105],[-73.970617,41.065653],[-73.97062099999999,41.066153],[-73.970625,41.066488],[-73.970687,41.066827],[-73.970716,41.067164],[-73.970681,41.067683],[-73.972238,41.068507],[-73.97501699999999,41.069949],[-73.975542,41.070232],[-73.975353,41.070451]]],"type":"Polygon"}
}