{
  "id": "360595189002",
  "type": "Feature",
  "properties": {
    "area_land":759924,
    "area_water":0,
    "geoid":"360595189002",
    "name":"Block Group 2",
    "state":"ny"
},
  "bbox": [
    -73.536865,
    40.765343,
    -73.525661,
    40.776226
],
  "geometry": {"coordinates":[[[-73.53686500000001,40.774502],[-73.53637000000001,40.774536],[-73.535877,40.774564],[-73.53483300000001,40.774629],[-73.534746,40.774645],[-73.53421,40.774807],[-73.534167,40.774818],[-73.533399,40.775042],[-73.532594,40.775279],[-73.532568,40.775289],[-73.532539,40.775292],[-73.531783,40.775514],[-73.53134,40.775641],[-73.530976,40.77575],[-73.53039699999999,40.775917],[-73.530158,40.775988],[-73.529348,40.776226],[-73.52919199999999,40.77589],[-73.528757,40.774958],[-73.528465,40.774331],[-73.52811800000001,40.77364],[-73.527866,40.773122],[-73.527484,40.772369],[-73.527383,40.772169],[-73.527236,40.771899],[-73.52706999999999,40.771527],[-73.527001,40.771355],[-73.52679000000001,40.77088],[-73.52642299999999,40.770011],[-73.52622700000001,40.769476],[-73.526285,40.769469],[-73.526178,40.769252],[-73.526123,40.769106],[-73.526076,40.769015],[-73.525938,40.768629],[-73.525768,40.768157],[-73.525661,40.767862],[-73.527478,40.767461],[-73.52764000000001,40.767425],[-73.528581,40.767192],[-73.530462,40.766724],[-73.53403299999999,40.765789],[-73.53483799999999,40.765553],[-73.535556,40.765343],[-73.53577300000001,40.765861],[-73.535796,40.765965],[-73.535872,40.766545],[-73.535967,40.767219],[-73.535916,40.767361],[-73.53597499999999,40.767741],[-73.535988,40.767906],[-73.536044,40.768473],[-73.536131,40.76913],[-73.53620600000001,40.76971],[-73.536224,40.769749],[-73.53622,40.769795],[-73.536304,40.770408],[-73.53640300000001,40.77109],[-73.536501,40.771772],[-73.536603,40.772523],[-73.53668999999999,40.773175],[-73.536779,40.773836],[-73.53686500000001,40.774502]]],"type":"Polygon"}
}