{
  "id": "360811157001",
  "type": "Feature",
  "properties": {
    "area_land":160153,
    "area_water":0,
    "geoid":"360811157001",
    "name":"Block Group 1",
    "state":"ny"
},
  "bbox": [
    -73.817368,
    40.767287,
    -73.813004,
    40.771573
],
  "geometry": {"coordinates":[[[-73.817339,40.769103],[-73.817317,40.770289],[-73.81729300000001,40.771478],[-73.81585800000001,40.771512],[-73.81486599999999,40.771538],[-73.814065,40.771554],[-73.813227,40.771573],[-73.813123,40.770156],[-73.813057,40.768755],[-73.813031,40.768036],[-73.81300400000001,40.767287],[-73.813276,40.767314],[-73.814356,40.767416],[-73.81541799999999,40.767509],[-73.81646499999999,40.767612],[-73.817368,40.767672],[-73.817339,40.769103]]],"type":"Polygon"}
}