{
  "id": "360610132005",
  "type": "Feature",
  "properties": {
    "area_land":24453,
    "area_water":0,
    "geoid":"360610132005",
    "name":"Block Group 5",
    "state":"ny"
},
  "bbox": [
    -73.950932,
    40.769512,
    -73.947502,
    40.771391
],
  "geometry": {"coordinates":[[[-73.95093199999999,40.770709],[-73.950435,40.771391],[-73.95012199999999,40.771259],[-73.949984,40.7712],[-73.94871500000001,40.770664],[-73.948644,40.770635],[-73.94823100000001,40.77046],[-73.94807299999999,40.770394],[-73.947794,40.770249],[-73.947716,40.770216],[-73.947615,40.77017],[-73.947502,40.770121],[-73.947973,40.769512],[-73.94820199999999,40.769544],[-73.948302,40.769595],[-73.948393,40.769634],[-73.949454,40.770085],[-73.95044,40.7705],[-73.95063500000001,40.770583],[-73.95093199999999,40.770709]]],"type":"Polygon"}
}