{
  "id": "360470593002",
  "type": "Feature",
  "properties": {
    "area_land":42831,
    "area_water":0,
    "geoid":"360470593002",
    "name":"Block Group 2",
    "state":"ny"
},
  "bbox": [
    -73.941043,
    40.722892,
    -73.938912,
    40.727929
],
  "geometry": {"coordinates":[[[-73.94104299999999,40.727841],[-73.94011500000001,40.727929],[-73.93980500000001,40.726062],[-73.939397,40.723544],[-73.938912,40.723579],[-73.939311,40.723348],[-73.94022099999999,40.722892],[-73.94032300000001,40.723454],[-73.940738,40.725973],[-73.94104299999999,40.727841]]],"type":"Polygon"}
}