{
  "id": "361032011001",
  "type": "Feature",
  "properties": {
    "area_land":2071380,
    "area_water":0,
    "geoid":"361032011001",
    "name":"Block Group 1",
    "state":"ny"
},
  "bbox": [
    -73.287155,
    40.792688,
    -73.257216,
    40.805807
],
  "geometry": {"coordinates":[[[-73.287155,40.804349],[-73.286186,40.804606],[-73.283866,40.804583],[-73.28148899999999,40.804559],[-73.28147800000001,40.80472],[-73.28147199999999,40.804803],[-73.281465,40.804918],[-73.28146099999999,40.804983],[-73.28145600000001,40.805078],[-73.28126399999999,40.805111],[-73.28093699999999,40.80517],[-73.280529,40.805171],[-73.280192,40.805157],[-73.279963,40.805153],[-73.274659,40.80507],[-73.27546700000001,40.805442],[-73.275014,40.805469],[-73.269936,40.80578],[-73.26938699999999,40.805807],[-73.269363,40.8057],[-73.269339,40.805593],[-73.26920800000001,40.804995],[-73.269176,40.804845],[-73.26875200000001,40.804838],[-73.26706799999999,40.804819],[-73.26501,40.8048],[-73.263867,40.804802],[-73.263131,40.80481],[-73.260875,40.804876],[-73.25972400000001,40.804925],[-73.25801199999999,40.80502],[-73.25733200000001,40.805067],[-73.257322,40.804994],[-73.257311,40.80491],[-73.257296,40.804799],[-73.257265,40.804563],[-73.257256,40.80449],[-73.257216,40.80406],[-73.25957200000001,40.803917],[-73.25988700000001,40.803902],[-73.260133,40.803882],[-73.260094,40.8035],[-73.26005000000001,40.803188],[-73.259961,40.802497],[-73.259868,40.801802],[-73.259793,40.8011],[-73.259709,40.800431],[-73.25962,40.799747],[-73.259587,40.799514],[-73.259536,40.799061],[-73.259439,40.798281],[-73.259354,40.797686],[-73.26257,40.796683],[-73.26314499999999,40.796503],[-73.26545,40.795789],[-73.26662899999999,40.795421],[-73.266887,40.795153],[-73.27439699999999,40.792688],[-73.274733,40.793095],[-73.27507300000001,40.793517],[-73.27596200000001,40.794616],[-73.276324,40.795069],[-73.27695,40.795854],[-73.277293,40.79621],[-73.277457,40.796402],[-73.278234,40.797189],[-73.27833200000001,40.797207],[-73.278744,40.797612],[-73.27891200000001,40.797753],[-73.279758,40.798545],[-73.280457,40.799249],[-73.280987,40.799763],[-73.28155599999999,40.800334],[-73.282635,40.801318],[-73.28286,40.801545],[-73.283023,40.801694],[-73.283355,40.801919],[-73.28433,40.802429],[-73.285633,40.803097],[-73.28609,40.803386],[-73.28636899999999,40.803597],[-73.28661200000001,40.803837],[-73.287155,40.804349]]],"type":"Polygon"}
}