{
  "id": "360710134003",
  "type": "Feature",
  "properties": {
    "area_land":8691074,
    "area_water":4484,
    "geoid":"360710134003",
    "name":"Block Group 3",
    "state":"ny"
},
  "bbox": [
    -74.189775,
    41.355023,
    -74.144483,
    41.397634
],
  "geometry": {"coordinates":[[[-74.189768,41.36487],[-74.189697,41.365023],[-74.188986,41.366286],[-74.188874,41.366411],[-74.18864000000001,41.366613],[-74.188334,41.366855],[-74.188024,41.367105],[-74.187791,41.36735],[-74.187718,41.367442],[-74.187629,41.367603],[-74.188642,41.367985],[-74.18893300000001,41.368042],[-74.18759799999999,41.368858],[-74.18737,41.368995],[-74.186503,41.369525],[-74.18549,41.370134],[-74.184943,41.370484],[-74.18446,41.370864],[-74.18431,41.370982],[-74.183818,41.371417],[-74.18286500000001,41.372199],[-74.18220100000001,41.372755],[-74.18135100000001,41.373472],[-74.180927,41.373822],[-74.180333,41.374331],[-74.179784,41.374799],[-74.17947700000001,41.37504],[-74.178636,41.375761],[-74.177874,41.376383],[-74.177483,41.376645],[-74.177256,41.376764],[-74.176531,41.377082],[-74.176362,41.377164],[-74.175825,41.377439],[-74.17510299999999,41.377838],[-74.174857,41.378],[-74.174707,41.378125],[-74.174471,41.378374],[-74.174331,41.378563],[-74.174064,41.379002],[-74.17390399999999,41.379323],[-74.173751,41.379736],[-74.173597,41.380222],[-74.173557,41.380372],[-74.17354,41.380436],[-74.17351499999999,41.380713],[-74.17352099999999,41.380824],[-74.173596,41.381099],[-74.173682,41.381294],[-74.173785,41.38145],[-74.174116,41.381874],[-74.17501799999999,41.383049],[-74.17540700000001,41.383552],[-74.175597,41.383727],[-74.175769,41.383846],[-74.175898,41.383929],[-74.176999,41.38464],[-74.17718600000001,41.384781],[-74.177458,41.385051],[-74.178498,41.386165],[-74.178568,41.386242],[-74.17880700000001,41.3865],[-74.178996,41.386749],[-74.179047,41.386817],[-74.17917199999999,41.387024],[-74.17925099999999,41.387244],[-74.179287,41.387346],[-74.179294,41.387364],[-74.17948800000001,41.388206],[-74.17970200000001,41.389176],[-74.179805,41.389644],[-74.180052,41.390674],[-74.180151,41.391137],[-74.180189,41.391314],[-74.18026399999999,41.39186],[-74.18058499999999,41.394633],[-74.18073800000001,41.395932],[-74.180909,41.397412],[-74.18093,41.397593],[-74.180688,41.397629],[-74.180525,41.397634],[-74.180313,41.397612],[-74.180226,41.397587],[-74.18006800000001,41.397499],[-74.179855,41.397345],[-74.179501,41.397028],[-74.179329,41.396899],[-74.179193,41.396818],[-74.17910999999999,41.396783],[-74.17886900000001,41.396705],[-74.17845800000001,41.396656],[-74.177859,41.396603],[-74.177635,41.396568],[-74.177463,41.396522],[-74.17724800000001,41.396483],[-74.176621,41.396441],[-74.176314,41.396405],[-74.175453,41.396223],[-74.173805,41.395863],[-74.17334200000001,41.395724],[-74.172764,41.395513],[-74.172197,41.395291],[-74.17178800000001,41.395152],[-74.171256,41.394992],[-74.170795,41.394887],[-74.17035300000001,41.394772],[-74.169776,41.394584],[-74.16965999999999,41.394526],[-74.16913,41.3942],[-74.16886,41.394008],[-74.168801,41.39392],[-74.168762,41.393806],[-74.168684,41.393372],[-74.168618,41.393198],[-74.16855,41.393091],[-74.168402,41.392956],[-74.16828700000001,41.392894],[-74.16768399999999,41.392671],[-74.167407,41.392554],[-74.167276,41.392498],[-74.16685699999999,41.392313],[-74.16673400000001,41.39224],[-74.166465,41.392151],[-74.165898,41.392033],[-74.165763,41.391998],[-74.165559,41.391923],[-74.165319,41.391812],[-74.16499,41.391668],[-74.164548,41.391531],[-74.164079,41.391392],[-74.163985,41.391349],[-74.163929,41.391314],[-74.16385699999999,41.391252],[-74.16367200000001,41.390943],[-74.16343000000001,41.390615],[-74.163167,41.390406],[-74.162819,41.390656],[-74.16247199999999,41.390852],[-74.162088,41.391026],[-74.16202199999999,41.391059],[-74.161728,41.391175],[-74.16116,41.391338],[-74.16088999999999,41.391395],[-74.16001,41.391523],[-74.159589,41.391569],[-74.15839,41.391734],[-74.157466,41.391884],[-74.157433,41.391752],[-74.15740099999999,41.39139],[-74.157343,41.390985],[-74.157281,41.390619],[-74.157217,41.390497],[-74.156723,41.38994],[-74.156156,41.389336],[-74.15602699999999,41.389239],[-74.15582000000001,41.389115],[-74.156029,41.388772],[-74.155569,41.387971],[-74.155343,41.387767],[-74.15474500000001,41.387272],[-74.15454099999999,41.387133],[-74.154461,41.386995],[-74.154402,41.386732],[-74.15437300000001,41.38631],[-74.154324,41.385838],[-74.154308,41.385683],[-74.154217,41.385355],[-74.154107,41.385166],[-74.153954,41.385027],[-74.153538,41.384758],[-74.15342200000001,41.384656],[-74.15337100000001,41.384539],[-74.153341,41.384335],[-74.15334900000001,41.38419],[-74.153312,41.384102],[-74.153203,41.384066],[-74.152933,41.384051],[-74.15255399999999,41.383956],[-74.15231300000001,41.383847],[-74.151985,41.38349],[-74.150902,41.382528],[-74.150887,41.382508],[-74.150434,41.382763],[-74.14918400000001,41.383469],[-74.147156,41.384632],[-74.146827,41.384207],[-74.14675699999999,41.384059],[-74.146694,41.383857],[-74.146627,41.383368],[-74.14658,41.383166],[-74.146484,41.382902],[-74.146445,41.382792],[-74.14640900000001,41.382692],[-74.14621099999999,41.382268],[-74.146034,41.381976],[-74.146024,41.381963],[-74.145724,41.381578],[-74.14546300000001,41.381689],[-74.14528199999999,41.38178],[-74.14509099999999,41.3819],[-74.144654,41.382217],[-74.14456300000001,41.382287],[-74.14448299999999,41.382236],[-74.145319,41.380891],[-74.14590699999999,41.379946],[-74.146196,41.379483],[-74.147282,41.375621],[-74.147977,41.372302],[-74.149773,41.371612],[-74.150792,41.371221],[-74.15112000000001,41.371098],[-74.15364700000001,41.37013],[-74.155535,41.369408],[-74.160765,41.366109],[-74.166157,41.362708],[-74.169687,41.360482],[-74.173581,41.356255],[-74.174711,41.355023],[-74.17522700000001,41.355286],[-74.176812,41.356145],[-74.179098,41.35742],[-74.18179499999999,41.359236],[-74.18409800000001,41.360788],[-74.184589,41.361119],[-74.18405300000001,41.360843],[-74.18402,41.360917],[-74.184023,41.36101],[-74.18404200000001,41.361128],[-74.184071,41.361229],[-74.18414199999999,41.361233],[-74.184243,41.361268],[-74.184388,41.361344],[-74.18499,41.36176],[-74.185095,41.36186],[-74.185278,41.362154],[-74.185503,41.362545],[-74.185661,41.362783],[-74.1858,41.362707],[-74.185897,41.362683],[-74.186063,41.362676],[-74.186274,41.362707],[-74.18651699999999,41.362783],[-74.187275,41.363224],[-74.18788600000001,41.363579],[-74.18805500000001,41.363667],[-74.188627,41.363902],[-74.188866,41.364014],[-74.189103,41.364146],[-74.189424,41.364338],[-74.189633,41.364478],[-74.189718,41.364566],[-74.18976000000001,41.364647],[-74.189775,41.364716],[-74.189768,41.36487]]],"type":"Polygon"}
}