{
  "id": "360594113023",
  "type": "Feature",
  "properties": {
    "area_land":308694,
    "area_water":0,
    "geoid":"360594113023",
    "name":"Block Group 3",
    "state":"ny"
},
  "bbox": [
    -73.722685,
    40.630049,
    -73.714004,
    40.637857
],
  "geometry": {"coordinates":[[[-73.72257399999999,40.633965],[-73.722227,40.634286],[-73.722106,40.634373],[-73.72124700000001,40.635022],[-73.719993,40.635941],[-73.719855,40.636056],[-73.719189,40.63664],[-73.719112,40.636704],[-73.71904600000001,40.636759],[-73.718998,40.636819],[-73.718597,40.637189],[-73.71840899999999,40.637342],[-73.718008,40.637624],[-73.71783499999999,40.637733],[-73.717608,40.637857],[-73.717359,40.637499],[-73.716937,40.637012],[-73.71677,40.63685],[-73.716483,40.636505],[-73.716295,40.636283],[-73.7162,40.636186],[-73.716026,40.635992],[-73.71557,40.635477],[-73.715138,40.634986],[-73.714579,40.634352],[-73.714004,40.633694],[-73.715047,40.633187],[-73.715192,40.633085],[-73.715272,40.633007],[-73.71535799999999,40.632929],[-73.71583200000001,40.632453],[-73.71593300000001,40.632363],[-73.71598899999999,40.632267],[-73.716071,40.632196],[-73.716419,40.631759],[-73.716469,40.631694],[-73.716651,40.631459],[-73.716876,40.631191],[-73.71692899999999,40.63111],[-73.717483,40.630444],[-73.717831,40.630049],[-73.71844900000001,40.630526],[-73.71859600000001,40.630649],[-73.719234,40.631145],[-73.720271,40.631954],[-73.720716,40.632305],[-73.72137499999999,40.632815],[-73.72216,40.633433],[-73.72256400000001,40.633749],[-73.722685,40.63385],[-73.72257399999999,40.633965]]],"type":"Polygon"}
}