{
  "id": "361031464023",
  "type": "Feature",
  "properties": {
    "area_land":884363,
    "area_water":0,
    "geoid":"361031464023",
    "name":"Block Group 3",
    "state":"ny"
},
  "bbox": [
    -73.187111,
    40.75537,
    -73.171713,
    40.763447
],
  "geometry": {"coordinates":[[[-73.18682,40.757916],[-73.186542,40.758075],[-73.186498,40.758511],[-73.186562,40.760222],[-73.18662999999999,40.760402],[-73.18688899999999,40.76199],[-73.18180599999999,40.762522],[-73.17732100000001,40.763003],[-73.17304900000001,40.763447],[-73.17291400000001,40.76323],[-73.17265,40.762044],[-73.17259799999999,40.761693],[-73.172369,40.760463],[-73.172151,40.759267],[-73.172071,40.758812],[-73.171938,40.758038],[-73.171713,40.756801],[-73.175926,40.75621],[-73.176072,40.756175],[-73.17622799999999,40.756135],[-73.177691,40.755931],[-73.178533,40.755814],[-73.17985899999999,40.755623],[-73.18173299999999,40.75537],[-73.182017,40.755576],[-73.182343,40.755789],[-73.182654,40.755975],[-73.18306200000001,40.756174],[-73.18379299999999,40.756477],[-73.184133,40.756593],[-73.18449699999999,40.756709],[-73.184983,40.756831],[-73.18604499999999,40.757089],[-73.186521,40.757198],[-73.18679299999999,40.757282],[-73.187111,40.757398],[-73.18682,40.757916]]],"type":"Polygon"}
}