{
  "id": "360594163004",
  "type": "Feature",
  "properties": {
    "area_land":789135,
    "area_water":1077656,
    "geoid":"360594163004",
    "name":"Block Group 4",
    "state":"ny"
},
  "bbox": [
    -73.755701,
    40.578688,
    -73.735996,
    40.59417
],
  "geometry": {"coordinates":[[[-73.75557000000001,40.583094],[-73.755567,40.583186],[-73.75550200000001,40.585387],[-73.755183,40.585649],[-73.752371,40.587965],[-73.752121,40.588182],[-73.750978,40.589049],[-73.747749,40.591503],[-73.744469,40.592904],[-73.74382900000001,40.592871],[-73.743604,40.592859],[-73.74338,40.592847],[-73.74323699999999,40.592839],[-73.74162800000001,40.592872],[-73.740019,40.592906],[-73.738468,40.592937],[-73.73839,40.592939],[-73.73723200000001,40.592964],[-73.737185,40.592965],[-73.73722600000001,40.593048],[-73.737414,40.593425],[-73.73745099999999,40.593604],[-73.737521,40.59392],[-73.73752,40.59417],[-73.73716,40.594135],[-73.737027,40.594122],[-73.73713100000001,40.592596],[-73.73715799999999,40.592231],[-73.737173,40.592057],[-73.7372,40.591616],[-73.73718,40.591416],[-73.737154,40.591307],[-73.737049,40.591056],[-73.736774,40.590551],[-73.736739,40.590477],[-73.736521,40.590084],[-73.736339,40.589769],[-73.735996,40.589512],[-73.736147,40.587297],[-73.737143,40.58734],[-73.738838,40.587413],[-73.740207,40.587471],[-73.74029400000001,40.587482],[-73.74034399999999,40.587521],[-73.740499,40.587667],[-73.740651,40.587741],[-73.74015300000001,40.586687],[-73.73984,40.585624],[-73.738184,40.580184],[-73.755701,40.578688],[-73.75557000000001,40.583094]]],"type":"Polygon"}
}