{
  "id": "360670052001",
  "type": "Feature",
  "properties": {
    "area_land":264223,
    "area_water":0,
    "geoid":"360670052001",
    "name":"Block Group 1",
    "state":"ny"
},
  "bbox": [
    -76.16016,
    43.030289,
    -76.153989,
    43.036379
],
  "geometry": {"coordinates":[[[-76.16016,43.036008],[-76.158942,43.036189],[-76.158652,43.036217],[-76.157113,43.036286],[-76.156654,43.036303],[-76.156402,43.036313],[-76.15619599999999,43.036319],[-76.15588099999999,43.03633],[-76.15529100000001,43.036354],[-76.15466000000001,43.036379],[-76.15466600000001,43.034802],[-76.15472800000001,43.034429],[-76.154741,43.033942],[-76.154753,43.033316],[-76.15477199999999,43.033084],[-76.154668,43.033024],[-76.154601,43.032967],[-76.154492,43.032822],[-76.153989,43.031752],[-76.154494,43.031615],[-76.156397,43.031109],[-76.157005,43.030959],[-76.157473,43.030831],[-76.15770000000001,43.030769],[-76.15827400000001,43.03058],[-76.158618,43.030467],[-76.158677,43.030672],[-76.15871799999999,43.030834],[-76.15923100000001,43.030597],[-76.159712,43.030361],[-76.159876,43.030289],[-76.15992199999999,43.030363],[-76.15994600000001,43.030448],[-76.159942,43.030551],[-76.159986,43.031799],[-76.160056,43.033419],[-76.16016,43.036008]]],"type":"Polygon"}
}