{
  "id": "360550115052",
  "type": "Feature",
  "properties": {
    "area_land":16227414,
    "area_water":29401,
    "geoid":"360550115052",
    "name":"Block Group 2",
    "state":"ny"
},
  "bbox": [
    -77.433697,
    43.122804,
    -77.373244,
    43.160358
],
  "geometry": {"coordinates":[[[-77.433007,43.154033],[-77.43253799999999,43.154796],[-77.43186799999999,43.156046],[-77.431674,43.156584],[-77.431618,43.157743],[-77.43162700000001,43.158532],[-77.43158200000001,43.159629],[-77.43157100000001,43.160005],[-77.42836,43.15996],[-77.426047,43.159927],[-77.42578,43.159924],[-77.41995799999999,43.159817],[-77.41980100000001,43.159814],[-77.412398,43.159725],[-77.412261,43.159723],[-77.40648,43.15969],[-77.405159,43.159681],[-77.400549,43.159651],[-77.393108,43.159648],[-77.39282300000001,43.15965],[-77.386352,43.159688],[-77.385402,43.159694],[-77.384767,43.159698],[-77.38472400000001,43.159698],[-77.380796,43.159728],[-77.378891,43.159742],[-77.377869,43.159754],[-77.37756400000001,43.159763],[-77.377239,43.159783],[-77.376907,43.159809],[-77.376471,43.159865],[-77.376069,43.159929],[-77.375811,43.15998],[-77.37536900000001,43.160082],[-77.375148,43.160145],[-77.374859,43.160243],[-77.37471600000001,43.160297],[-77.374573,43.160358],[-77.37457000000001,43.160331],[-77.374521,43.159867],[-77.37451900000001,43.159852],[-77.374396,43.158653],[-77.374351,43.152584],[-77.37435000000001,43.152547],[-77.374326,43.149601],[-77.374178,43.145392],[-77.374178,43.14538],[-77.37417000000001,43.145139],[-77.37398,43.139676],[-77.373949,43.138344],[-77.373577,43.131041],[-77.373564,43.129705],[-77.37349399999999,43.127604],[-77.37348299999999,43.127072],[-77.373313,43.12341],[-77.373249,43.123076],[-77.373244,43.122804],[-77.374623,43.122885],[-77.376233,43.122961],[-77.383296,43.122813],[-77.392338,43.122845],[-77.396484,43.12286],[-77.400631,43.122874],[-77.40055700000001,43.123047],[-77.40048299999999,43.123244],[-77.400429,43.123464],[-77.40039899999999,43.123661],[-77.40045000000001,43.128721],[-77.40048,43.130565],[-77.404881,43.130534],[-77.40928700000001,43.130488],[-77.409333,43.130483],[-77.409434,43.130471],[-77.40982200000001,43.130368],[-77.41278200000001,43.129453],[-77.416178,43.128435],[-77.418279,43.127801],[-77.418605,43.127718],[-77.418892,43.127659],[-77.41920500000001,43.127626],[-77.41957499999999,43.127613],[-77.41986,43.127632],[-77.42011100000001,43.12766],[-77.420395,43.12772],[-77.420698,43.127813],[-77.42094,43.127914],[-77.421272,43.128085],[-77.422202,43.128602],[-77.422892,43.129009],[-77.42455200000001,43.12995],[-77.424823,43.130112],[-77.42506400000001,43.130237],[-77.42525999999999,43.130327],[-77.425451,43.130401],[-77.425663,43.130463],[-77.425843,43.1305],[-77.42604300000001,43.130523],[-77.426231,43.130531],[-77.426709,43.130534],[-77.426644,43.132589],[-77.426575,43.134631],[-77.426574,43.134719],[-77.426535,43.135303],[-77.426374,43.13881],[-77.426368,43.138975],[-77.42619000000001,43.143621],[-77.426124,43.14623],[-77.426061,43.147871],[-77.426035,43.148536],[-77.425916,43.151614],[-77.42588000000001,43.152763],[-77.433697,43.152894],[-77.433007,43.154033]]],"type":"Polygon"}
}