{
  "id": "360130351004",
  "type": "Feature",
  "properties": {
    "area_land":2233628,
    "area_water":165715,
    "geoid":"360130351004",
    "name":"Block Group 4",
    "state":"ny"
},
  "bbox": [
    -79.143276,
    42.552113,
    -79.104213,
    42.570267
],
  "geometry": {"coordinates":[[[-79.143272,42.55398],[-79.143225,42.554664],[-79.14314299999999,42.555073],[-79.14308200000001,42.555196],[-79.142949,42.555369],[-79.142867,42.555523],[-79.142858,42.555627],[-79.142809,42.555796],[-79.14276700000001,42.555884],[-79.14254800000001,42.556379],[-79.142397,42.556643],[-79.142034,42.556983],[-79.14229,42.557343],[-79.142214,42.557441],[-79.142122,42.557471],[-79.14206799999999,42.557389],[-79.14203500000001,42.557536],[-79.142026,42.557576],[-79.142054,42.557985],[-79.14201199999999,42.558372],[-79.141845,42.558829],[-79.14177599999999,42.5591],[-79.141756,42.55925],[-79.141766,42.559536],[-79.141659,42.559929],[-79.141524,42.560154],[-79.141475,42.56026],[-79.141475,42.560337],[-79.14154000000001,42.560527],[-79.141425,42.560639],[-79.141317,42.560718],[-79.141245,42.560785],[-79.141121,42.560973],[-79.14100999999999,42.561215],[-79.140517,42.562305],[-79.140428,42.562501],[-79.14031300000001,42.562698],[-79.140118,42.562945],[-79.14010500000001,42.562961],[-79.139978,42.563106],[-79.13966600000001,42.563609],[-79.13917499999999,42.564338],[-79.138935,42.564811],[-79.13856800000001,42.565493],[-79.13802,42.566687],[-79.137888,42.567023],[-79.137799,42.56731],[-79.137715,42.567638],[-79.137613,42.567937],[-79.137484,42.568269],[-79.137389,42.568615],[-79.137342,42.568942],[-79.137291,42.569054],[-79.13723400000001,42.569117],[-79.137173,42.569152],[-79.13711000000001,42.569172],[-79.136876,42.569788],[-79.136799,42.56974],[-79.136696,42.569675],[-79.136594,42.569609],[-79.135267,42.56873],[-79.134199,42.568164],[-79.134034,42.568089],[-79.13225,42.567277],[-79.13204399999999,42.567194],[-79.12966,42.56623],[-79.127145,42.565201],[-79.125798,42.565092],[-79.124759,42.56526],[-79.123969,42.565257],[-79.123606,42.565255],[-79.12230099999999,42.565463],[-79.121938,42.565614],[-79.121292,42.565865],[-79.12057299999999,42.566297],[-79.11989199999999,42.566742],[-79.11855300000001,42.567728],[-79.117814,42.568287],[-79.117118,42.568857],[-79.116347,42.569412],[-79.115886,42.569712],[-79.114929,42.570046],[-79.114379,42.570122],[-79.11385199999999,42.570117],[-79.113451,42.570062],[-79.113343,42.570048],[-79.11315,42.570021],[-79.11302000000001,42.570003],[-79.11282,42.569976],[-79.112404,42.569888],[-79.112341,42.569874],[-79.11230500000001,42.569866],[-79.111994,42.569765],[-79.111953,42.569759],[-79.111715,42.569724],[-79.111375,42.56972],[-79.11084200000001,42.569829],[-79.109871,42.570203],[-79.10937699999999,42.570267],[-79.108557,42.570201],[-79.107778,42.569965],[-79.10547,42.568895],[-79.104287,42.56826],[-79.104213,42.568189],[-79.104305,42.568128],[-79.108069,42.565713],[-79.108739,42.565298],[-79.10945599999999,42.564869],[-79.109803,42.564686],[-79.11014400000001,42.564536],[-79.11038600000001,42.564436],[-79.110928,42.56426],[-79.111659,42.564026],[-79.113276,42.56354],[-79.113533,42.563462],[-79.114379,42.563203],[-79.115875,42.562727],[-79.116626,42.56251],[-79.11669000000001,42.562491],[-79.116738,42.562477],[-79.11704,42.56239],[-79.11891,42.56183],[-79.11903599999999,42.561792],[-79.119776,42.56157],[-79.121269,42.561111],[-79.122829,42.560633],[-79.123639,42.5604],[-79.12444499999999,42.560168],[-79.124641,42.56011],[-79.125146,42.559959],[-79.12525100000001,42.559928],[-79.12782900000001,42.559154],[-79.128579,42.558927],[-79.12944400000001,42.558666],[-79.130627,42.558315],[-79.13158,42.558033],[-79.132966,42.557607],[-79.134533,42.557133],[-79.13485,42.557031],[-79.135335,42.556877],[-79.135876,42.55666],[-79.136059,42.55657],[-79.13665399999999,42.556214],[-79.137637,42.555549],[-79.141155,42.553198],[-79.141687,42.552871],[-79.141823,42.55279],[-79.143209,42.552113],[-79.143174,42.552266],[-79.14316100000001,42.552382],[-79.143137,42.552603],[-79.143083,42.553031],[-79.143072,42.553115],[-79.14308200000001,42.553238],[-79.143147,42.553463],[-79.14319500000001,42.553628],[-79.143276,42.553927],[-79.143272,42.55398]]],"type":"Polygon"}
}