{
  "id": "360811161001",
  "type": "Feature",
  "properties": {
    "area_land":86405,
    "area_water":0,
    "geoid":"360811161001",
    "name":"Block Group 1",
    "state":"ny"
},
  "bbox": [
    -73.827537,
    40.766464,
    -73.82395,
    40.770407
],
  "geometry": {"coordinates":[[[-73.82735099999999,40.766856],[-73.82705799999999,40.767529],[-73.826848,40.767987],[-73.826778,40.768226],[-73.82672700000001,40.768468],[-73.826695,40.768712],[-73.826683,40.768957],[-73.826572,40.769961],[-73.82655800000001,40.770137],[-73.826049,40.770211],[-73.825569,40.770282],[-73.824669,40.770407],[-73.824443,40.769286],[-73.824212,40.768169],[-73.82395,40.766887],[-73.825883,40.766659],[-73.82753700000001,40.766464],[-73.82735099999999,40.766856]]],"type":"Polygon"}
}