{
  "id": "360470277001",
  "type": "Feature",
  "properties": {
    "area_land":41150,
    "area_water":0,
    "geoid":"360470277001",
    "name":"Block Group 1",
    "state":"ny"
},
  "bbox": [
    -73.939097,
    40.686825,
    -73.935879,
    40.688627
],
  "geometry": {"coordinates":[[[-73.939097,40.688289],[-73.936172,40.688627],[-73.936027,40.687892],[-73.935879,40.68716],[-73.938805,40.686825],[-73.93895000000001,40.687557],[-73.939097,40.688289]]],"type":"Polygon"}
}