{
  "id": "360471168002",
  "type": "Feature",
  "properties": {
    "area_land":63949,
    "area_water":0,
    "geoid":"360471168002",
    "name":"Block Group 2",
    "state":"ny"
},
  "bbox": [
    -73.884893,
    40.67637,
    -73.882331,
    40.681085
],
  "geometry": {"coordinates":[[[-73.88489300000001,40.680811],[-73.883972,40.680947],[-73.883031,40.681085],[-73.882885,40.680508],[-73.882605,40.679384],[-73.88240999999999,40.678598],[-73.882818,40.67848],[-73.88233099999999,40.676501],[-73.88322599999999,40.67637],[-73.883701,40.67823],[-73.88419500000001,40.678089],[-73.884671,40.67994],[-73.88489300000001,40.680811]]],"type":"Polygon"}
}