{
  "id": "360271300042",
  "type": "Feature",
  "properties": {
    "area_land":11176785,
    "area_water":136215,
    "geoid":"360271300042",
    "name":"Block Group 2",
    "state":"ny"
},
  "bbox": [
    -73.862287,
    41.748829,
    -73.817219,
    41.794048
],
  "geometry": {"coordinates":[[[-73.862258,41.792872],[-73.862172,41.792901],[-73.86164100000001,41.793031],[-73.86037399999999,41.793376],[-73.859971,41.793509],[-73.85968,41.793611],[-73.859312,41.793729],[-73.859151,41.793762],[-73.858617,41.793833],[-73.85746899999999,41.793967],[-73.85701899999999,41.794004],[-73.85655,41.794044],[-73.856106,41.794048],[-73.855799,41.794011],[-73.855355,41.793912],[-73.85518999999999,41.793861],[-73.85488700000001,41.793738],[-73.854788,41.793686],[-73.854585,41.793565],[-73.854427,41.793449],[-73.854302,41.793344],[-73.85413800000001,41.79318],[-73.85397399999999,41.79297],[-73.853713,41.792525],[-73.853373,41.791826],[-73.852884,41.790917],[-73.852784,41.790699],[-73.85272500000001,41.79055],[-73.85262,41.790149],[-73.852383,41.789571],[-73.852125,41.789152],[-73.851902,41.78882],[-73.85175,41.78861],[-73.85156000000001,41.788389],[-73.851388,41.788264],[-73.85110299999999,41.788075],[-73.85087300000001,41.787953],[-73.850335,41.787703],[-73.849182,41.787204],[-73.848855,41.787082],[-73.848443,41.786928],[-73.84829999999999,41.786879],[-73.84795800000001,41.786782],[-73.847508,41.786696],[-73.84714099999999,41.786655],[-73.846965,41.786648],[-73.846566,41.786659],[-73.845894,41.786707],[-73.845082,41.78674],[-73.84459,41.786749],[-73.844038,41.786716],[-73.84367899999999,41.786672],[-73.84326299999999,41.786606],[-73.842456,41.786507],[-73.842196,41.786494],[-73.842029,41.786499],[-73.84142799999999,41.786552],[-73.84102,41.786622],[-73.840795,41.786675],[-73.840537,41.786752],[-73.839906,41.786897],[-73.839564,41.786954],[-73.83942999999999,41.786967],[-73.838848,41.786967],[-73.837733,41.787013],[-73.837434,41.787042],[-73.83721199999999,41.787098],[-73.83693100000001,41.787189],[-73.83667699999999,41.787312],[-73.83648599999999,41.787422],[-73.836082,41.787702],[-73.836055,41.787721],[-73.835601,41.788061],[-73.835386,41.788264],[-73.83477499999999,41.788929],[-73.834551,41.789173],[-73.83410499999999,41.78958],[-73.833225,41.790235],[-73.832718,41.790637],[-73.832353,41.790958],[-73.83199999999999,41.791213],[-73.83185899999999,41.791298],[-73.831593,41.791458],[-73.831503,41.791062],[-73.831142,41.791331],[-73.83102,41.791394],[-73.830921,41.791419],[-73.830837,41.791427],[-73.83074499999999,41.791405],[-73.83068299999999,41.791375],[-73.83061600000001,41.791368],[-73.830569,41.791375],[-73.830517,41.791405],[-73.83049200000001,41.791438],[-73.83039599999999,41.791482],[-73.83017599999999,41.791518],[-73.830099,41.791551],[-73.829933,41.791672],[-73.829695,41.791889],[-73.829617,41.791918],[-73.829551,41.791926],[-73.829474,41.791907],[-73.829397,41.791871],[-73.82928,41.791742],[-73.82921,41.791584],[-73.82915800000001,41.791401],[-73.82911799999999,41.79135],[-73.828901,41.791144],[-73.82883200000001,41.791089],[-73.82858899999999,41.791001],[-73.828523,41.790957],[-73.828453,41.790865],[-73.828391,41.79081],[-73.828299,41.790777],[-73.82802700000001,41.790748],[-73.827946,41.790759],[-73.82789099999999,41.790781],[-73.82784700000001,41.790825],[-73.827803,41.791001],[-73.827759,41.791056],[-73.827476,41.791192],[-73.82729999999999,41.791287],[-73.827208,41.791305],[-73.82709699999999,41.791382],[-73.827043,41.791471],[-73.82691800000001,41.791603],[-73.82683,41.79165],[-73.82681100000001,41.791656],[-73.82669,41.791694],[-73.826444,41.791746],[-73.82637099999999,41.791794],[-73.826323,41.791871],[-73.826279,41.79197],[-73.826224,41.792043],[-73.826139,41.792102],[-73.82604000000001,41.792153],[-73.825952,41.792179],[-73.82584199999999,41.79219],[-73.825614,41.792183],[-73.825581,41.792197],[-73.82557,41.792241],[-73.82557199999999,41.792267],[-73.825563,41.792326],[-73.82546000000001,41.792362],[-73.82536399999999,41.792381],[-73.825056,41.792414],[-73.82495299999999,41.792439],[-73.82446899999999,41.792644],[-73.824237,41.792527],[-73.824101,41.792512],[-73.824071,41.792516],[-73.824038,41.792532],[-73.823752,41.792769],[-73.82357500000001,41.792868],[-73.82324300000001,41.792927],[-73.823133,41.79275],[-73.823044,41.792633],[-73.822975,41.792563],[-73.822692,41.792365],[-73.822159,41.792068],[-73.82173299999999,41.791877],[-73.821612,41.791734],[-73.821568,41.791657],[-73.821484,41.791363],[-73.821414,41.791286],[-73.821348,41.791239],[-73.821241,41.791139],[-73.821186,41.791044],[-73.82114199999999,41.790905],[-73.821157,41.790861],[-73.821197,41.790805],[-73.82131099999999,41.79071],[-73.82134000000001,41.790673],[-73.821348,41.790629],[-73.82131099999999,41.790486],[-73.821223,41.790299],[-73.82114900000001,41.789917],[-73.821116,41.789862],[-73.821068,41.78984],[-73.82096199999999,41.789807],[-73.820903,41.789782],[-73.820859,41.789705],[-73.820826,41.78951],[-73.82079299999999,41.789429],[-73.820617,41.789132],[-73.820272,41.788435],[-73.820139,41.788204],[-73.81997,41.787866],[-73.81988200000001,41.787719],[-73.819688,41.787477],[-73.819577,41.7874],[-73.819497,41.787371],[-73.819423,41.787356],[-73.819192,41.787286],[-73.818861,41.787136],[-73.81842399999999,41.786971],[-73.818167,41.78685],[-73.81739899999999,41.786556],[-73.81723,41.786513],[-73.81721899999999,41.78635],[-73.817263,41.786119],[-73.81723,41.785965],[-73.81723,41.785895],[-73.8173,41.78564],[-73.817313,41.785464],[-73.817374,41.785146],[-73.81740499999999,41.785102],[-73.81748899999999,41.785057],[-73.817497,41.785029],[-73.817475,41.784965],[-73.817471,41.784913],[-73.81752400000001,41.784842],[-73.81756799999999,41.784721],[-73.817572,41.78457],[-73.81759,41.784493],[-73.817629,41.784468],[-73.81766,41.784449],[-73.81771500000001,41.784394],[-73.817734,41.784313],[-73.81773699999999,41.784229],[-73.81772599999999,41.784159],[-73.817697,41.784096],[-73.817688,41.784078],[-73.81809800000001,41.78352],[-73.818804,41.782545],[-73.819316,41.781856],[-73.819698,41.781331],[-73.81984799999999,41.781119],[-73.819958,41.780958],[-73.82005100000001,41.780808],[-73.82018100000001,41.780587],[-73.820373,41.780268],[-73.82046099999999,41.780113],[-73.820571,41.779929],[-73.82070400000001,41.779689],[-73.82077200000001,41.779564],[-73.820831,41.779451],[-73.820868,41.779369],[-73.82090700000001,41.779262],[-73.820947,41.779169],[-73.820984,41.779056],[-73.82102,41.778948],[-73.821094,41.778722],[-73.821145,41.77855],[-73.82118699999999,41.778408],[-73.821258,41.778171],[-73.821313,41.777992],[-73.821377,41.777764],[-73.82150300000001,41.777358],[-73.821664,41.776643],[-73.82171200000001,41.776391],[-73.82177900000001,41.77598],[-73.821826,41.775679],[-73.821895,41.775385],[-73.822007,41.775082],[-73.822383,41.774164],[-73.822507,41.773864],[-73.822586,41.773669],[-73.82267899999999,41.773446],[-73.822773,41.773228],[-73.822869,41.772982],[-73.82290500000001,41.772886],[-73.822962,41.772751],[-73.82304999999999,41.77253],[-73.823103,41.7724],[-73.823199,41.772109],[-73.823352,41.771682],[-73.82352400000001,41.771213],[-73.823584,41.771044],[-73.823618,41.770973],[-73.823668,41.770852],[-73.823714,41.770758],[-73.823762,41.770662],[-73.823801,41.770597],[-73.823863,41.770496],[-73.823926,41.770408],[-73.82402999999999,41.770269],[-73.824118,41.770159],[-73.824191,41.77006],[-73.824287,41.769942],[-73.824412,41.769792],[-73.824499,41.769673],[-73.824697,41.769424],[-73.824752,41.76935],[-73.82478,41.76932],[-73.824926,41.769124],[-73.825025,41.768996],[-73.825155,41.768827],[-73.825307,41.76862],[-73.825472,41.768407],[-73.825714,41.768087],[-73.825866,41.767889],[-73.82596100000001,41.767764],[-73.826041,41.767655],[-73.82614599999999,41.767519],[-73.82625899999999,41.767369],[-73.82637699999999,41.767208],[-73.82647299999999,41.767073],[-73.826588,41.766906],[-73.82669300000001,41.766752],[-73.82677700000001,41.766606],[-73.82682200000001,41.766531],[-73.82724399999999,41.76588],[-73.827507,41.76556],[-73.82768799999999,41.765364],[-73.828395,41.764615],[-73.828546,41.764461],[-73.828981,41.763986],[-73.82914700000001,41.763763],[-73.829292,41.763527],[-73.829621,41.762863],[-73.83005199999999,41.761951],[-73.830511,41.761001],[-73.830592,41.760792],[-73.830646,41.760617],[-73.83068400000001,41.760494],[-73.830748,41.760151],[-73.830766,41.759836],[-73.830793,41.759733],[-73.83087999999999,41.759616],[-73.83094699999999,41.759556],[-73.83106100000001,41.759494],[-73.831307,41.759442],[-73.831751,41.759395],[-73.83243,41.759338],[-73.83313200000001,41.759265],[-73.833844,41.759196],[-73.835296,41.759068],[-73.83565299999999,41.759006],[-73.83584399999999,41.758962],[-73.836185,41.758791],[-73.836967,41.758314],[-73.83789400000001,41.757788],[-73.838718,41.757361],[-73.839401,41.756974],[-73.84044299999999,41.756351],[-73.840728,41.756181],[-73.841397,41.755796],[-73.842793,41.754967],[-73.843186,41.754719],[-73.843507,41.754472],[-73.843943,41.754048],[-73.844223,41.753742],[-73.844374,41.753573],[-73.844675,41.753167],[-73.84475,41.753085],[-73.844773,41.753044],[-73.84490700000001,41.752882],[-73.845052,41.752731],[-73.845141,41.752656],[-73.845292,41.752553],[-73.845569,41.752429],[-73.84613899999999,41.752231],[-73.846335,41.752129],[-73.846598,41.75194],[-73.846817,41.751738],[-73.847596,41.750945],[-73.847859,41.750634],[-73.847988,41.750449],[-73.848102,41.750302],[-73.848281,41.749995],[-73.848473,41.749617],[-73.848647,41.749313],[-73.848736,41.749209],[-73.84884700000001,41.749136],[-73.84901499999999,41.749042],[-73.84913899999999,41.749],[-73.849299,41.748956],[-73.849465,41.748916],[-73.849633,41.748882],[-73.849811,41.748853],[-73.849971,41.748834],[-73.85011799999999,41.748829],[-73.85023099999999,41.748838],[-73.850341,41.748859],[-73.85046699999999,41.748895],[-73.850618,41.748949],[-73.85073199999999,41.748998],[-73.85086800000001,41.749054],[-73.851303,41.749235],[-73.851765,41.749411],[-73.852125,41.74954],[-73.852478,41.749659],[-73.852976,41.749823],[-73.85329299999999,41.749902],[-73.853483,41.749948],[-73.853768,41.749988],[-73.853908,41.75],[-73.85429999999999,41.750005],[-73.854821,41.750004],[-73.854896,41.750467],[-73.85536999999999,41.753406],[-73.855903,41.756536],[-73.857455,41.765721],[-73.858723,41.773037],[-73.858769,41.773346],[-73.861158,41.786753],[-73.861845,41.790603],[-73.86228699999999,41.792862],[-73.862258,41.792872]]],"type":"Polygon"}
}