{
  "id": "360750202003",
  "type": "Feature",
  "properties": {
    "area_land":9757970,
    "area_water":13474628,
    "geoid":"360750202003",
    "name":"Block Group 3",
    "state":"ny"
},
  "bbox": [
    -76.20381,
    43.611042,
    -76.149116,
    43.680411
],
  "geometry": {"coordinates":[[[-76.202946,43.62506],[-76.200889,43.653914],[-76.201638,43.662852],[-76.20371400000001,43.680411],[-76.20194600000001,43.680312],[-76.200273,43.680218],[-76.199907,43.680202],[-76.19914900000001,43.680168],[-76.19868200000001,43.680148],[-76.19516,43.679947],[-76.183142,43.679261],[-76.18287100000001,43.679246],[-76.173309,43.678754],[-76.173303,43.67874],[-76.173005,43.678385],[-76.172635,43.677885],[-76.172156,43.677296],[-76.17202899999999,43.677134],[-76.17116,43.676017],[-76.17058400000001,43.6752],[-76.170405,43.674859],[-76.170186,43.674368],[-76.170074,43.67402],[-76.170012,43.673798],[-76.169916,43.67326],[-76.169882,43.672886],[-76.16985,43.672107],[-76.16982400000001,43.671118],[-76.169757,43.669721],[-76.16972199999999,43.669282],[-76.16961499999999,43.668784],[-76.169535,43.668515],[-76.16944599999999,43.668265],[-76.169257,43.667866],[-76.169186,43.667732],[-76.169169,43.6677],[-76.168961,43.667339],[-76.16862999999999,43.666848],[-76.168055,43.666211],[-76.16758900000001,43.665788],[-76.167169,43.665473],[-76.166821,43.665236],[-76.166259,43.664909],[-76.16598999999999,43.664763],[-76.165734,43.664645],[-76.165206,43.664423],[-76.164867,43.664292],[-76.16468,43.664234],[-76.163963,43.664023],[-76.16352999999999,43.663917],[-76.162798,43.66378],[-76.16262500000001,43.663747],[-76.16242099999999,43.663709],[-76.16227499999999,43.663683],[-76.161618,43.663567],[-76.161365,43.663522],[-76.161147,43.663482],[-76.160022,43.66329],[-76.159283,43.66314],[-76.15875800000001,43.663053],[-76.15786,43.662884],[-76.15589199999999,43.662522],[-76.15511100000001,43.662364],[-76.15458700000001,43.662228],[-76.153983,43.662033],[-76.153786,43.661967],[-76.153093,43.661671],[-76.1528,43.661532],[-76.152416,43.661317],[-76.151867,43.66098],[-76.15166000000001,43.660827],[-76.15160899999999,43.660789],[-76.15130600000001,43.660562],[-76.150948,43.660243],[-76.150683,43.659991],[-76.150339,43.659588],[-76.15013500000001,43.659335],[-76.149951,43.659067],[-76.149688,43.658608],[-76.149511,43.658238],[-76.149333,43.65778],[-76.149219,43.657287],[-76.14913,43.656721],[-76.149118,43.656461],[-76.149118,43.6564],[-76.14911600000001,43.65617],[-76.14926,43.65481],[-76.149427,43.653536],[-76.14945299999999,43.65335],[-76.149541,43.652649],[-76.149565,43.652435],[-76.149861,43.652413],[-76.149928,43.652403],[-76.150283,43.652393],[-76.15097900000001,43.652377],[-76.156577,43.652115],[-76.156859,43.65211],[-76.156786,43.652034],[-76.15674300000001,43.651849],[-76.15670900000001,43.651467],[-76.156632,43.65038],[-76.156606,43.649926],[-76.156645,43.649842],[-76.156684,43.64982],[-76.156774,43.649809],[-76.156992,43.649809],[-76.157582,43.649842],[-76.158385,43.649859],[-76.158992,43.649893],[-76.15952900000001,43.649988],[-76.159892,43.650071],[-76.160186,43.650126],[-76.160303,43.650003],[-76.160421,43.649922],[-76.16063200000001,43.649801],[-76.16091400000001,43.649656],[-76.161259,43.649501],[-76.16149299999999,43.649405],[-76.161614,43.649356],[-76.162391,43.649129],[-76.16280500000001,43.649029],[-76.16311399999999,43.648966],[-76.16386799999999,43.648766],[-76.163978,43.648676],[-76.165943,43.647093],[-76.16634999999999,43.646767],[-76.16651899999999,43.646631],[-76.16721,43.6463],[-76.167053,43.646036],[-76.16702100000001,43.645813],[-76.167247,43.645356],[-76.167267,43.645242],[-76.167267,43.645128],[-76.167247,43.645045],[-76.167205,43.644972],[-76.167081,43.644822],[-76.166831,43.64463],[-76.16624899999999,43.644248],[-76.165775,43.643912],[-76.164805,43.643177],[-76.16439200000001,43.64284],[-76.162513,43.641412],[-76.162335,43.641325],[-76.16198199999999,43.641206],[-76.161726,43.641145],[-76.161295,43.641084],[-76.160659,43.641033],[-76.16011399999999,43.640977],[-76.15921400000001,43.640902],[-76.15822,43.640831],[-76.157003,43.64071],[-76.155554,43.640605],[-76.154607,43.640518],[-76.15321,43.640413],[-76.15094000000001,43.640229],[-76.150492,43.640175],[-76.15142299999999,43.637794],[-76.152191,43.635788],[-76.152845,43.634153],[-76.153175,43.633354],[-76.15327000000001,43.633063],[-76.153723,43.633128],[-76.154585,43.633222],[-76.15495900000001,43.633082],[-76.15530099999999,43.632939],[-76.15638300000001,43.632451],[-76.15714199999999,43.632089],[-76.15816,43.63158],[-76.159007,43.63118],[-76.16195999999999,43.629899],[-76.163586,43.629178],[-76.165238,43.628432],[-76.166042,43.628085],[-76.166922,43.627687],[-76.167157,43.627603],[-76.167599,43.627534],[-76.1678,43.627514],[-76.168994,43.627505],[-76.16908599999999,43.627229],[-76.169552,43.626114],[-76.16976,43.625641],[-76.170056,43.624879],[-76.17028000000001,43.62434],[-76.170355,43.624124],[-76.17047700000001,43.623572],[-76.170798,43.621768],[-76.171001,43.62065],[-76.171097,43.620349],[-76.17125,43.620096],[-76.17134,43.619996],[-76.17169800000001,43.619676],[-76.17310500000001,43.618504],[-76.174441,43.617486],[-76.175393,43.616774],[-76.177364,43.61535],[-76.178134,43.614758],[-76.178783,43.614288],[-76.17913299999999,43.614046],[-76.179394,43.61388],[-76.181017,43.612984],[-76.181719,43.612616],[-76.18234699999999,43.612275],[-76.18341100000001,43.611724],[-76.183961,43.611428],[-76.18434499999999,43.611206],[-76.184443,43.611132],[-76.18454,43.611042],[-76.185563,43.611283],[-76.187511,43.611759],[-76.18826,43.611926],[-76.190001,43.612317],[-76.190242,43.612371],[-76.19223,43.612823],[-76.194401,43.613308],[-76.195621,43.613595],[-76.196298,43.61374],[-76.197569,43.614048],[-76.19815,43.61416],[-76.20381,43.615337],[-76.202946,43.62506]]],"type":"Polygon"}
}