{
  "id": "360550132061",
  "type": "Feature",
  "properties": {
    "area_land":9040743,
    "area_water":4761,
    "geoid":"360550132061",
    "name":"Block Group 1",
    "state":"ny"
},
  "bbox": [
    -77.708695,
    43.017321,
    -77.65803,
    43.047466
],
  "geometry": {"coordinates":[[[-77.708685,43.017463],[-77.708646,43.017647],[-77.708591,43.017818],[-77.708502,43.017992],[-77.70576800000001,43.023045],[-77.70566700000001,43.023282],[-77.705609,43.023462],[-77.705579,43.023646],[-77.705398,43.025797],[-77.70532900000001,43.026123],[-77.705251,43.026442],[-77.705167,43.026717],[-77.70493,43.027373],[-77.70484,43.027564],[-77.704114,43.028718],[-77.70331899999999,43.029964],[-77.702629,43.030726],[-77.70243499999999,43.03094],[-77.70178799999999,43.031672],[-77.70148,43.032005],[-77.70061200000001,43.032945],[-77.70038700000001,43.033238],[-77.700208,43.033519],[-77.70009899999999,43.033692],[-77.69936300000001,43.035061],[-77.69915899999999,43.035491],[-77.698881,43.036079],[-77.69871999999999,43.036418],[-77.698178,43.037623],[-77.697479,43.03926],[-77.697318,43.039634],[-77.697155,43.040013],[-77.697138,43.040053],[-77.69638399999999,43.041827],[-77.69626,43.04218],[-77.696234,43.042181],[-77.69567600000001,43.042225],[-77.694682,43.04227],[-77.692785,43.042456],[-77.69146499999999,43.042649],[-77.690135,43.042875],[-77.68763800000001,43.043299],[-77.685202,43.043773],[-77.682149,43.044337],[-77.68070400000001,43.044604],[-77.677091,43.045286],[-77.671522,43.046262],[-77.67059999999999,43.046405],[-77.668603,43.046647],[-77.665924,43.046968],[-77.664704,43.047079],[-77.662631,43.047247],[-77.65964099999999,43.047408],[-77.65803,43.047466],[-77.658507,43.046659],[-77.65904500000001,43.045753],[-77.660871,43.04242],[-77.660895,43.042377],[-77.66197200000001,43.040381],[-77.66225799999999,43.039845],[-77.663751,43.037061],[-77.66448099999999,43.035741],[-77.666629,43.031791],[-77.667407,43.030337],[-77.667418,43.030316],[-77.667682,43.029805],[-77.66806200000001,43.029097],[-77.668077,43.029059],[-77.66825300000001,43.028623],[-77.66835,43.028292],[-77.668374,43.028186],[-77.668426,43.027895],[-77.668491,43.027415],[-77.668503,43.027217],[-77.66850700000001,43.026928],[-77.668395,43.025666],[-77.668295,43.024591],[-77.668132,43.02266],[-77.667883,43.019802],[-77.667693,43.017746],[-77.69207,43.017521],[-77.69389200000001,43.017504],[-77.694594,43.017485],[-77.698235,43.017446],[-77.698519,43.017446],[-77.70869500000001,43.017321],[-77.708685,43.017463]]],"type":"Polygon"}
}