{
  "id": "360210010004",
  "type": "Feature",
  "properties": {
    "area_land":32435399,
    "area_water":141667,
    "geoid":"360210010004",
    "name":"Block Group 4",
    "state":"ny"
},
  "bbox": [
    -73.766739,
    42.165629,
    -73.671519,
    42.237159
],
  "geometry": {"coordinates":[[[-73.766732,42.204903],[-73.766706,42.204943],[-73.766659,42.204972],[-73.766508,42.205023],[-73.766143,42.205111],[-73.76603,42.20518],[-73.76599400000001,42.205224],[-73.765959,42.205333],[-73.76596600000001,42.205479],[-73.765992,42.205552],[-73.766094,42.205734],[-73.76611200000001,42.205825],[-73.766105,42.205909],[-73.76607199999999,42.205992],[-73.766025,42.206062],[-73.76597,42.206113],[-73.76589300000001,42.206149],[-73.765806,42.20616],[-73.76552,42.206153],[-73.76545400000001,42.206167],[-73.76540300000001,42.206207],[-73.765091,42.20663],[-73.764916,42.206954],[-73.76468800000001,42.207304],[-73.76464799999999,42.207431],[-73.764645,42.207559],[-73.764674,42.207858],[-73.764667,42.207945],[-73.76463699999999,42.207996],[-73.764594,42.208032],[-73.76436200000001,42.208116],[-73.76428199999999,42.208156],[-73.764184,42.208222],[-73.76408499999999,42.20832],[-73.76401199999999,42.208415],[-73.763925,42.208604],[-73.763817,42.208954],[-73.76382099999999,42.209052],[-73.763839,42.209129],[-73.76387200000001,42.209191],[-73.76408000000001,42.209453],[-73.764116,42.209475],[-73.764216,42.209497],[-73.764741,42.209493],[-73.764847,42.209522],[-73.76489100000001,42.209544],[-73.76496400000001,42.209705],[-73.764956,42.209825],[-73.764938,42.209901],[-73.764894,42.209945],[-73.764543,42.210102],[-73.764422,42.210229],[-73.764364,42.210331],[-73.764313,42.210459],[-73.764098,42.210859],[-73.763958,42.211071],[-73.763914,42.211169],[-73.763859,42.211435],[-73.763783,42.211519],[-73.763644,42.211581],[-73.763604,42.21161],[-73.763575,42.21165],[-73.763515,42.21181],[-73.763518,42.211927],[-73.763533,42.211992],[-73.763642,42.212185],[-73.76366,42.212251],[-73.76367999999999,42.212623],[-73.763715,42.212841],[-73.763323,42.213028],[-73.763047,42.213105],[-73.76264999999999,42.213177],[-73.76236900000001,42.213192],[-73.761892,42.213148],[-73.761624,42.213148],[-73.76149599999999,42.213159],[-73.761274,42.213232],[-73.761157,42.213283],[-73.761066,42.213338],[-73.76100700000001,42.2134],[-73.76070900000001,42.213815],[-73.76049500000001,42.214059],[-73.760419,42.214132],[-73.76004,42.214358],[-73.759923,42.214453],[-73.759835,42.21454],[-73.75967900000001,42.214769],[-73.759637,42.214886],[-73.75962199999999,42.214988],[-73.759618,42.21521],[-73.759586,42.215334],[-73.759542,42.215447],[-73.759491,42.215524],[-73.75944699999999,42.215564],[-73.759325,42.215647],[-73.75920499999999,42.21568],[-73.75908200000001,42.215689],[-73.75881800000001,42.215706],[-73.75775899999999,42.215637],[-73.757526,42.215593],[-73.75674600000001,42.215389],[-73.756569,42.215363],[-73.756489,42.215363],[-73.756423,42.215389],[-73.756361,42.215465],[-73.756328,42.215542],[-73.75622199999999,42.216103],[-73.756153,42.216217],[-73.755944,42.216397],[-73.75581200000001,42.216469],[-73.755668,42.216513],[-73.75543999999999,42.216583],[-73.754684,42.216984],[-73.754426,42.217062],[-73.754259,42.217068],[-73.753795,42.217022],[-73.753441,42.216968],[-73.753219,42.216962],[-73.75309300000001,42.216974],[-73.752925,42.21704],[-73.752746,42.217136],[-73.752386,42.217418],[-73.752296,42.21752],[-73.752224,42.217645],[-73.75217000000001,42.217807],[-73.75215799999999,42.217915],[-73.75216399999999,42.218005],[-73.752188,42.218053],[-73.752284,42.218149],[-73.753364,42.21908],[-73.753405,42.21914],[-73.75345299999999,42.219278],[-73.75345900000001,42.219554],[-73.753429,42.219698],[-73.753274,42.220021],[-73.752681,42.221097],[-73.752633,42.221253],[-73.752651,42.221343],[-73.75269299999999,42.221433],[-73.752825,42.221529],[-73.75295699999999,42.221607],[-73.75317200000001,42.221691],[-73.753316,42.221727],[-73.75342999999999,42.221733],[-73.75355,42.221727],[-73.75388599999999,42.221637],[-73.75418000000001,42.221595],[-73.75426400000001,42.221595],[-73.75433,42.221613],[-73.754408,42.221661],[-73.754779,42.222068],[-73.754833,42.222116],[-73.75509700000001,42.222248],[-73.75517499999999,42.222296],[-73.755295,42.222422],[-73.755343,42.222529],[-73.755439,42.222835],[-73.75546900000001,42.222985],[-73.75578,42.223195],[-73.756024,42.223385],[-73.75626099999999,42.22352],[-73.757277,42.223891],[-73.757375,42.223971],[-73.757457,42.224062],[-73.757546,42.224234],[-73.7577,42.224667],[-73.75779300000001,42.224988],[-73.75784400000001,42.225217],[-73.757873,42.225454],[-73.75788900000001,42.225895],[-73.757875,42.226051],[-73.757842,42.226183],[-73.757783,42.226328],[-73.75771400000001,42.226456],[-73.757605,42.226729],[-73.75759600000001,42.226784],[-73.757603,42.226919],[-73.757625,42.22701],[-73.757865,42.227571],[-73.75795100000001,42.227913],[-73.757955,42.228092],[-73.75793299999999,42.228339],[-73.757896,42.228467],[-73.757752,42.228715],[-73.757614,42.228857],[-73.757435,42.22897],[-73.757217,42.229108],[-73.756201,42.229684],[-73.75587299999999,42.229811],[-73.755492,42.229898],[-73.75506900000001,42.23003],[-73.754938,42.230106],[-73.75488,42.23015],[-73.754814,42.230234],[-73.754777,42.230328],[-73.754788,42.230434],[-73.75482100000001,42.230485],[-73.755439,42.230813],[-73.75597500000001,42.230962],[-73.756055,42.23101],[-73.756106,42.231057],[-73.756146,42.231119],[-73.756157,42.231214],[-73.75615000000001,42.231301],[-73.756092,42.231403],[-73.756023,42.231469],[-73.75593499999999,42.231527],[-73.755837,42.23156],[-73.755189,42.231614],[-73.75511299999999,42.231614],[-73.754491,42.231669],[-73.75436000000001,42.231716],[-73.754189,42.231833],[-73.754057,42.231964],[-73.754014,42.232103],[-73.754003,42.232175],[-73.754008,42.232215],[-73.75405600000001,42.232299],[-73.754139,42.232372],[-73.754694,42.23262],[-73.75482100000001,42.232715],[-73.754865,42.23278],[-73.75490499999999,42.232871],[-73.75490499999999,42.232988],[-73.75488300000001,42.233086],[-73.754839,42.233152],[-73.754431,42.233582],[-73.754417,42.233625],[-73.754417,42.233673],[-73.754435,42.233713],[-73.754475,42.233753],[-73.754537,42.233789],[-73.75472600000001,42.23384],[-73.75479900000001,42.233869],[-73.75483199999999,42.233895],[-73.754991,42.234124],[-73.755354,42.234729],[-73.755394,42.234817],[-73.755419,42.234915],[-73.755454,42.235312],[-73.755516,42.235534],[-73.755658,42.235833],[-73.75568,42.235935],[-73.755707,42.23646],[-73.755735,42.2367],[-73.75582900000001,42.236962],[-73.755921,42.237159],[-73.75563699999999,42.237024],[-73.755287,42.236829],[-73.755043,42.236669],[-73.75476500000001,42.236457],[-73.754448,42.23616],[-73.7542,42.235855],[-73.754047,42.235615],[-73.753865,42.235253],[-73.753424,42.234242],[-73.753281,42.233916],[-73.752927,42.233129],[-73.752899,42.233081],[-73.752819,42.232942],[-73.75246799999999,42.232472],[-73.751878,42.231779],[-73.749591,42.229042],[-73.74925,42.228638],[-73.74915,42.228519],[-73.748589,42.227853],[-73.74807800000001,42.22723],[-73.74698100000001,42.22588],[-73.746692,42.225552],[-73.74660799999999,42.22546],[-73.74643399999999,42.225298],[-73.74608499999999,42.225031],[-73.745103,42.224351],[-73.744573,42.223996],[-73.74424999999999,42.223808],[-73.743163,42.223243],[-73.742774,42.223056],[-73.74259499999999,42.222983],[-73.742272,42.222873],[-73.74202,42.22281],[-73.741696,42.222746],[-73.74129600000001,42.222692],[-73.740923,42.222654],[-73.73967500000001,42.222575],[-73.738829,42.22254],[-73.73735000000001,42.222498],[-73.73723099999999,42.222495],[-73.735722,42.222458],[-73.734971,42.222454],[-73.734593,42.222466],[-73.73451,42.222469],[-73.73423,42.22251],[-73.733638,42.222639],[-73.73326,42.222727],[-73.73178900000001,42.223061],[-73.73159800000001,42.223102],[-73.729764,42.223525],[-73.72765200000001,42.224012],[-73.727349,42.224087],[-73.726831,42.224208],[-73.72671200000001,42.224236],[-73.726044,42.224382],[-73.725568,42.224495],[-73.72505700000001,42.224587],[-73.7247,42.224621],[-73.72423499999999,42.224631],[-73.723606,42.224609],[-73.723354,42.224601],[-73.72290700000001,42.224601],[-73.721896,42.224625],[-73.721452,42.224642],[-73.72081,42.224672],[-73.720314,42.224691],[-73.719859,42.224708],[-73.719679,42.224715],[-73.718656,42.224751],[-73.718251,42.224754],[-73.71786400000001,42.22471],[-73.717726,42.224689],[-73.71726200000001,42.224587],[-73.717066,42.224532],[-73.71669,42.224413],[-73.716416,42.224313],[-73.71606,42.224108],[-73.715703,42.223853],[-73.715368,42.223589],[-73.71463,42.223006],[-73.714378,42.222802],[-73.713885,42.222422],[-73.713064,42.221773],[-73.712569,42.221388],[-73.71231400000001,42.221189],[-73.712259,42.221146],[-73.712118,42.221035],[-73.711527,42.220571],[-73.71133399999999,42.220415],[-73.711034,42.220173],[-73.709273,42.21851],[-73.707414,42.2167],[-73.706689,42.215982],[-73.706441,42.215716],[-73.706215,42.215464],[-73.70619600000001,42.215443],[-73.70563300000001,42.21483],[-73.704913,42.214092],[-73.703721,42.212931],[-73.703678,42.21289],[-73.70316800000001,42.212398],[-73.702713,42.211974],[-73.70162000000001,42.21083],[-73.70134299999999,42.210569],[-73.700864,42.209979],[-73.69884399999999,42.207886],[-73.696555,42.205548],[-73.696403,42.205393],[-73.696259,42.205272],[-73.69617599999999,42.205217],[-73.696072,42.205168],[-73.695999,42.20512],[-73.695342,42.204998],[-73.69519,42.205008],[-73.695082,42.205015],[-73.694283,42.205069],[-73.69323300000001,42.205201],[-73.692373,42.205332],[-73.692179,42.205353],[-73.691823,42.205374],[-73.69159999999999,42.205374],[-73.691463,42.205374],[-73.69131299999999,42.20536],[-73.690977,42.205298],[-73.68977700000001,42.205],[-73.689627,42.204975],[-73.689385,42.204965],[-73.68929799999999,42.204972],[-73.689215,42.204996],[-73.688999,42.2051],[-73.688878,42.205171],[-73.68871799999999,42.20534],[-73.688626,42.205401],[-73.688478,42.205467],[-73.68821199999999,42.205556],[-73.68752600000001,42.205821],[-73.68736,42.205899],[-73.686668,42.206257],[-73.686464,42.206333],[-73.68635399999999,42.206361],[-73.686172,42.206378],[-73.68606200000001,42.20637],[-73.686031,42.206368],[-73.68582000000001,42.206323],[-73.685042,42.206056],[-73.684603,42.205921],[-73.684046,42.205762],[-73.683367,42.205614],[-73.68156,42.20526],[-73.681398,42.20525],[-73.68121600000001,42.205256],[-73.680993,42.205291],[-73.68087300000001,42.205318],[-73.68042199999999,42.20548],[-73.68015,42.205618],[-73.68004999999999,42.205669],[-73.679776,42.205848],[-73.679344,42.20621],[-73.679154,42.206353],[-73.67905,42.206426],[-73.678854,42.206544],[-73.678639,42.206659],[-73.678434,42.206749],[-73.677519,42.207085],[-73.67685400000001,42.207307],[-73.676647,42.207359],[-73.67656100000001,42.207372],[-73.676331,42.20571],[-73.676272,42.205488],[-73.676029,42.204805],[-73.67591299999999,42.204413],[-73.675704,42.203708],[-73.67540700000001,42.202705],[-73.67532799999999,42.202504],[-73.675167,42.202154],[-73.674961,42.201651],[-73.674871,42.201384],[-73.674722,42.200746],[-73.674612,42.200209],[-73.67458000000001,42.199836],[-73.67456199999999,42.19962],[-73.674578,42.199373],[-73.674612,42.198812],[-73.67462999999999,42.197887],[-73.674648,42.197563],[-73.67466400000001,42.19727],[-73.674674,42.196513],[-73.674727,42.196313],[-73.675135,42.195634],[-73.67524,42.195427],[-73.67527200000001,42.195338],[-73.67540700000001,42.194875],[-73.67546900000001,42.194597],[-73.67554199999999,42.19442],[-73.675586,42.194358],[-73.67571,42.194214],[-73.67586300000001,42.194095],[-73.676264,42.193811],[-73.67746200000001,42.193145],[-73.677662,42.193034],[-73.677898,42.192864],[-73.678054,42.192729],[-73.678473,42.192327],[-73.678704,42.192071],[-73.678797,42.19195],[-73.678888,42.191734],[-73.678932,42.191527],[-73.67893599999999,42.191506],[-73.679016,42.190976],[-73.679053,42.190706],[-73.679078,42.19052],[-73.67905500000001,42.189741],[-73.679008,42.189523],[-73.67895900000001,42.18937],[-73.6789,42.189239],[-73.67883,42.18912],[-73.67872,42.188989],[-73.678665,42.188941],[-73.67851,42.188809],[-73.677795,42.188351],[-73.67746200000001,42.188119],[-73.67718499999999,42.187873],[-73.677165,42.187845],[-73.67710099999999,42.187752],[-73.676997,42.187499],[-73.676914,42.187122],[-73.676878,42.186769],[-73.676892,42.186412],[-73.676941,42.186167],[-73.677035,42.185821],[-73.677057,42.185742],[-73.677193,42.184997],[-73.67722000000001,42.184703],[-73.677204,42.183608],[-73.677183,42.183269],[-73.677076,42.182551],[-73.676952,42.182005],[-73.676948,42.181992],[-73.676914,42.181885],[-73.676776,42.181622],[-73.676585,42.181352],[-73.676175,42.1808],[-73.675602,42.179986],[-73.675494,42.17984],[-73.675212,42.179493],[-73.675183,42.179457],[-73.67482099999999,42.179025],[-73.674756,42.178931],[-73.674606,42.178665],[-73.674526,42.178478],[-73.674212,42.177608],[-73.674052,42.177057],[-73.67393300000001,42.176525],[-73.673813,42.176084],[-73.673513,42.175109],[-73.673272,42.174453],[-73.67247500000001,42.172722],[-73.672318,42.172287],[-73.672104,42.171453],[-73.67200800000001,42.171248],[-73.671835,42.170914],[-73.671755,42.170709],[-73.67169800000001,42.170439],[-73.67165300000001,42.17012],[-73.671556,42.168942],[-73.671519,42.168317],[-73.67153500000001,42.168196],[-73.671752,42.167385],[-73.671842,42.167129],[-73.67197400000001,42.1669],[-73.67224299999999,42.16655],[-73.672381,42.166345],[-73.67247500000001,42.166144],[-73.672534,42.165975],[-73.672557,42.16577],[-73.67254,42.165629],[-73.673919,42.165919],[-73.67480999999999,42.166107],[-73.685953,42.168452],[-73.69785,42.170957],[-73.700087,42.171374],[-73.717386,42.175],[-73.71781900000001,42.175096],[-73.71861,42.175262],[-73.7195,42.175458],[-73.720146,42.175674],[-73.720236,42.175717],[-73.720311,42.175717],[-73.72110499999999,42.175851],[-73.724071,42.176391],[-73.725562,42.176671],[-73.726927,42.176946],[-73.727547,42.177081],[-73.72873300000001,42.177315],[-73.728855,42.177332],[-73.729208,42.177367],[-73.729574,42.177377],[-73.730073,42.177511],[-73.74172299999999,42.180089],[-73.742345,42.180228],[-73.744393,42.180683],[-73.744398,42.180771],[-73.744449,42.181034],[-73.744474,42.181096],[-73.744518,42.181147],[-73.744591,42.181194],[-73.744671,42.181227],[-73.744817,42.181252],[-73.744883,42.181252],[-73.74494799999999,42.181241],[-73.744992,42.181216],[-73.745225,42.180979],[-73.745327,42.180892],[-73.74537100000001,42.180877],[-73.745513,42.18087],[-73.74568499999999,42.180906],[-73.74608000000001,42.181041],[-73.74636099999999,42.18115],[-73.74643399999999,42.181194],[-73.74647,42.181234],[-73.74648500000001,42.181267],[-73.74651900000001,42.181613],[-73.746505,42.181766],[-73.746447,42.181872],[-73.746359,42.181992],[-73.74629299999999,42.182167],[-73.746261,42.182225],[-73.746162,42.182287],[-73.746089,42.182312],[-73.746016,42.18232],[-73.745925,42.182309],[-73.74575400000001,42.182214],[-73.745593,42.18217],[-73.745114,42.182141],[-73.74506700000001,42.182181],[-73.74505600000001,42.182221],[-73.745063,42.182298],[-73.74515,42.182425],[-73.745318,42.1826],[-73.745575,42.182826],[-73.74566299999999,42.182935],[-73.74567399999999,42.182994],[-73.74567,42.183045],[-73.74565200000001,42.183088],[-73.745648,42.183139],[-73.74575400000001,42.183278],[-73.745863,42.183453],[-73.745925,42.183511],[-73.74603500000001,42.183642],[-73.74609700000001,42.18378],[-73.746149,42.183977],[-73.74615300000001,42.184196],[-73.74613100000001,42.184258],[-73.746077,42.184338],[-73.74602899999999,42.184436],[-73.74601800000001,42.184542],[-73.74609100000001,42.184637],[-73.74651900000001,42.185077],[-73.74679999999999,42.185311],[-73.746833,42.185372],[-73.746915,42.185587],[-73.746904,42.18578],[-73.746864,42.18585],[-73.74678400000001,42.186076],[-73.746685,42.186287],[-73.746634,42.186491],[-73.746634,42.186564],[-73.746674,42.18668],[-73.746718,42.186717],[-73.746942,42.186852],[-73.747274,42.186946],[-73.747699,42.187267],[-73.747786,42.187347],[-73.748148,42.187552],[-73.748408,42.187646],[-73.748846,42.187757],[-73.749559,42.187917],[-73.750337,42.188172],[-73.750508,42.188236],[-73.75067199999999,42.188277],[-73.750822,42.188328],[-73.75096000000001,42.188393],[-73.751383,42.188648],[-73.751637,42.188834],[-73.751695,42.188903],[-73.75173100000001,42.188972],[-73.75174199999999,42.189082],[-73.751735,42.189209],[-73.751655,42.189592],[-73.751593,42.190444],[-73.75159600000001,42.190539],[-73.751622,42.190659],[-73.75167999999999,42.190808],[-73.75200700000001,42.191191],[-73.752444,42.191657],[-73.75253499999999,42.191715],[-73.75266999999999,42.191748],[-73.752816,42.191748],[-73.753165,42.191683],[-73.753441,42.191628],[-73.753547,42.191599],[-73.753981,42.191544],[-73.754068,42.191511],[-73.75415599999999,42.191457],[-73.75424,42.191373],[-73.754327,42.191307],[-73.754426,42.191271],[-73.754524,42.191278],[-73.754564,42.191297],[-73.75479900000001,42.191497],[-73.755104,42.191907],[-73.75558700000001,42.192542],[-73.755758,42.19271],[-73.75584600000001,42.192772],[-73.755951,42.192819],[-73.756061,42.192841],[-73.756305,42.192834],[-73.756524,42.192787],[-73.75664399999999,42.192779],[-73.756732,42.192787],[-73.756826,42.192819],[-73.756978,42.192903],[-73.757204,42.193093],[-73.757317,42.19326],[-73.757368,42.193366],[-73.757446,42.193617],[-73.757464,42.193748],[-73.75746100000001,42.193843],[-73.757413,42.194047],[-73.75721799999999,42.194528],[-73.757204,42.194637],[-73.757226,42.194852],[-73.75725799999999,42.194976],[-73.757313,42.195049],[-73.75739299999999,42.195082],[-73.757586,42.195118],[-73.757685,42.195173],[-73.757802,42.195297],[-73.757834,42.195369],[-73.758037,42.196145],[-73.758077,42.196233],[-73.75815900000001,42.196364],[-73.758421,42.196652],[-73.758607,42.196808],[-73.759236,42.197238],[-73.75935699999999,42.197304],[-73.759542,42.197377],[-73.759809,42.197453],[-73.759947,42.197468],[-73.760561,42.197442],[-73.760718,42.197453],[-73.760992,42.197519],[-73.761105,42.197555],[-73.76134500000001,42.197592],[-73.761517,42.197639],[-73.761568,42.197675],[-73.761737,42.197883],[-73.761781,42.198021],[-73.761781,42.198069],[-73.761759,42.198131],[-73.761708,42.198185],[-73.761562,42.198295],[-73.761511,42.198357],[-73.761475,42.19843],[-73.761402,42.198685],[-73.761354,42.198772],[-73.761303,42.19883],[-73.761174,42.198947],[-73.761105,42.199038],[-73.761065,42.199144],[-73.761039,42.199275],[-73.760997,42.199748],[-73.761004,42.199978],[-73.761026,42.200113],[-73.761081,42.200233],[-73.76118700000001,42.200342],[-73.761509,42.200433],[-73.76156400000001,42.200462],[-73.761644,42.200528],[-73.762023,42.200983],[-73.76211499999999,42.201045],[-73.76219500000001,42.201082],[-73.762514,42.201162],[-73.762638,42.201176],[-73.76278000000001,42.201162],[-73.7629,42.201118],[-73.763159,42.200991],[-73.763239,42.200972],[-73.763352,42.200965],[-73.763959,42.201012],[-73.764138,42.201056],[-73.764222,42.201118],[-73.764273,42.201176],[-73.764306,42.201238],[-73.764338,42.201267],[-73.764415,42.201311],[-73.764577,42.20134],[-73.764734,42.201358],[-73.765011,42.20146],[-73.76511000000001,42.201468],[-73.76522300000001,42.20146],[-73.765303,42.201439],[-73.765383,42.201435],[-73.765511,42.20145],[-73.765631,42.201475],[-73.765733,42.201515],[-73.765882,42.201617],[-73.76601700000001,42.201748],[-73.766057,42.20181],[-73.766068,42.201887],[-73.76606099999999,42.201963],[-73.765682,42.202604],[-73.76562699999999,42.202757],[-73.765649,42.202889],[-73.76567799999999,42.202936],[-73.76599,42.203187],[-73.766285,42.203453],[-73.766413,42.203621],[-73.766486,42.203741],[-73.766566,42.203941],[-73.766623,42.204127],[-73.766739,42.20483],[-73.766732,42.204903]]],"type":"Polygon"}
}