{
  "id": "361059509001",
  "type": "Feature",
  "properties": {
    "area_land":11472648,
    "area_water":24530,
    "geoid":"361059509001",
    "name":"Block Group 1",
    "state":"ny"
},
  "bbox": [
    -74.704549,
    41.728908,
    -74.643618,
    41.778698
],
  "geometry": {"coordinates":[[[-74.701679,41.74238],[-74.701432,41.743102],[-74.699023,41.750116],[-74.69789,41.753306],[-74.697489,41.754592],[-74.697183,41.755584],[-74.69711599999999,41.755817],[-74.69493900000001,41.762222],[-74.694132,41.764666],[-74.69207,41.770815],[-74.69036199999999,41.775932],[-74.690281,41.77598],[-74.689953,41.776224],[-74.68970899999999,41.77643],[-74.68899399999999,41.777114],[-74.688565,41.777497],[-74.68828999999999,41.777707],[-74.688014,41.777888],[-74.687774,41.77802],[-74.687501,41.778153],[-74.687071,41.778323],[-74.68677700000001,41.778411],[-74.686055,41.778582],[-74.685699,41.778655],[-74.68549,41.778698],[-74.685423,41.778589],[-74.684871,41.777684],[-74.684692,41.777364],[-74.684558,41.777068],[-74.684482,41.776837],[-74.684405,41.776392],[-74.684348,41.775671],[-74.68429,41.775294],[-74.684203,41.774989],[-74.684049,41.774619],[-74.683853,41.774305],[-74.683246,41.773434],[-74.683004,41.773002],[-74.682788,41.772507],[-74.68242600000001,41.771369],[-74.682199,41.770618],[-74.682147,41.770313],[-74.68213,41.769996],[-74.682168,41.76952],[-74.682209,41.769286],[-74.682247,41.768924],[-74.68222900000001,41.768412],[-74.68220100000001,41.768266],[-74.682125,41.768032],[-74.68201999999999,41.767804],[-74.681881,41.767575],[-74.681679,41.767295],[-74.681505,41.767118],[-74.681178,41.766817],[-74.68093399999999,41.766583],[-74.68063100000001,41.766311],[-74.67977,41.765539],[-74.67796800000001,41.763956],[-74.677758,41.763765],[-74.677521,41.763554],[-74.677246,41.763272],[-74.67719700000001,41.763211],[-74.67712899999999,41.763128],[-74.676963,41.762884],[-74.676687,41.76239],[-74.676558,41.762138],[-74.676382,41.761796],[-74.676222,41.761519],[-74.676078,41.761313],[-74.675817,41.76101],[-74.675533,41.760753],[-74.675375,41.760634],[-74.674817,41.760278],[-74.674271,41.759982],[-74.673355,41.759494],[-74.671093,41.75832],[-74.67000400000001,41.757707],[-74.668908,41.757097],[-74.66852400000001,41.756876],[-74.666927,41.755985],[-74.664573,41.754714],[-74.66372,41.754278],[-74.66360899999999,41.754229],[-74.66348000000001,41.754172],[-74.663273,41.754082],[-74.662954,41.753958],[-74.66215200000001,41.75367],[-74.661115,41.753289],[-74.660624,41.753066],[-74.66040099999999,41.752942],[-74.659972,41.75268],[-74.659342,41.752206],[-74.658312,41.751376],[-74.658085,41.75122],[-74.657971,41.751162],[-74.657055,41.750698],[-74.656561,41.750418],[-74.655449,41.749809],[-74.65457000000001,41.749336],[-74.653987,41.749031],[-74.65191299999999,41.747962],[-74.65116500000001,41.747568],[-74.651055,41.74751],[-74.650502,41.747176],[-74.650093,41.746918],[-74.648965,41.746135],[-74.64838899999999,41.745772],[-74.647209,41.745062],[-74.646547,41.744692],[-74.64578899999999,41.744285],[-74.644403,41.743575],[-74.643618,41.743202],[-74.64378499999999,41.743118],[-74.643871,41.743094],[-74.644485,41.743006],[-74.646039,41.74281],[-74.647569,41.742646],[-74.64819300000001,41.742562],[-74.64988700000001,41.742367],[-74.650801,41.742273],[-74.651402,41.742229],[-74.651983,41.742219],[-74.652393,41.742203],[-74.653081,41.742188],[-74.654076,41.742152],[-74.65427699999999,41.742145],[-74.654515,41.74215],[-74.654713,41.742165],[-74.654892,41.7422],[-74.655173,41.742271],[-74.655879,41.742488],[-74.65621299999999,41.742594],[-74.65659599999999,41.7427],[-74.656935,41.742782],[-74.657636,41.742912],[-74.65830200000001,41.742965],[-74.659137,41.742975],[-74.659909,41.742959],[-74.661434,41.742897],[-74.66213500000001,41.742877],[-74.66270799999999,41.742877],[-74.663003,41.742893],[-74.66441,41.743017],[-74.664745,41.743011],[-74.66532100000001,41.742879],[-74.66659,41.742528],[-74.666832,41.742476],[-74.667113,41.742449],[-74.66733600000001,41.74246],[-74.667637,41.742498],[-74.668145,41.742643],[-74.668381,41.742739],[-74.668418,41.742754],[-74.669101,41.743101],[-74.670193,41.743635],[-74.67050500000001,41.743767],[-74.670596,41.74382],[-74.670745,41.743486],[-74.670922,41.743032],[-74.67148,41.74172],[-74.672162,41.740216],[-74.672263,41.739995],[-74.672484,41.739474],[-74.672933,41.738504],[-74.672963,41.738447],[-74.673543,41.737295],[-74.674013,41.736352],[-74.674114,41.736127],[-74.674143,41.736038],[-74.67416,41.735958],[-74.674149,41.735736],[-74.67409499999999,41.735446],[-74.67399399999999,41.734814],[-74.674003,41.734765],[-74.67404399999999,41.734629],[-74.67411800000001,41.734487],[-74.674261,41.73429],[-74.674533,41.733985],[-74.67472600000001,41.733785],[-74.674907,41.733566],[-74.67514300000001,41.733122],[-74.67528299999999,41.732852],[-74.67542299999999,41.732614],[-74.67554199999999,41.73247],[-74.675827,41.732039],[-74.67615499999999,41.731584],[-74.676647,41.730902],[-74.67680300000001,41.730705],[-74.676982,41.7305],[-74.677228,41.730262],[-74.67753999999999,41.730004],[-74.67833299999999,41.72931],[-74.678755,41.728908],[-74.682669,41.72976],[-74.693173,41.731686],[-74.700526,41.733215],[-74.704549,41.733988],[-74.701679,41.74238]]],"type":"Polygon"}
}