{
  "id": "360957406004",
  "type": "Feature",
  "properties": {
    "area_land":61375566,
    "area_water":42630,
    "geoid":"360957406004",
    "name":"Block Group 4",
    "state":"ny"
},
  "bbox": [
    -74.699859,
    42.472122,
    -74.551613,
    42.548472
],
  "geometry": {"coordinates":[[[-74.697298,42.507626],[-74.69643600000001,42.508115],[-74.69638399999999,42.508106],[-74.694014,42.509535],[-74.68870200000001,42.5127],[-74.68816099999999,42.513028],[-74.679176,42.518452],[-74.678363,42.518943],[-74.674246,42.521428],[-74.670191,42.523891],[-74.662133,42.528759],[-74.65989,42.530063],[-74.649822,42.536056],[-74.649681,42.536103],[-74.649592,42.536163],[-74.648325,42.536928],[-74.64814699999999,42.537042],[-74.64798999999999,42.537209],[-74.646877,42.537871],[-74.64623899999999,42.538249],[-74.645383,42.538775],[-74.64241199999999,42.54056],[-74.637326,42.543598],[-74.635306,42.544802],[-74.629142,42.548472],[-74.624611,42.547508],[-74.623716,42.547274],[-74.62026299999999,42.546365],[-74.613291,42.544615],[-74.595264,42.54009],[-74.58615500000001,42.537849],[-74.582981,42.537029],[-74.57276299999999,42.534484],[-74.565915,42.532779],[-74.565344,42.532637],[-74.559489,42.531158],[-74.55695,42.530547],[-74.55605300000001,42.530323],[-74.555128,42.528002],[-74.554586,42.52655],[-74.554406,42.526127],[-74.554349,42.526018],[-74.55408,42.525731],[-74.553932,42.525555],[-74.55387500000001,42.525439],[-74.553729,42.525011],[-74.553535,42.524617],[-74.553426,42.524441],[-74.55337900000001,42.524337],[-74.553298,42.524048],[-74.553248,42.523464],[-74.553276,42.523274],[-74.553549,42.522424],[-74.553636,42.522094],[-74.553743,42.521476],[-74.55388600000001,42.520122],[-74.55387899999999,42.519788],[-74.55382299999999,42.519573],[-74.553648,42.519152],[-74.55359,42.518978],[-74.553585,42.518962],[-74.55356,42.518761],[-74.553597,42.518546],[-74.55371700000001,42.518119],[-74.55381199999999,42.517643],[-74.55382299999999,42.517464],[-74.55381,42.517201],[-74.55354800000001,42.515833],[-74.553433,42.51518],[-74.553426,42.515054],[-74.553439,42.514812],[-74.55346299999999,42.514657],[-74.553535,42.514394],[-74.553916,42.513318],[-74.553758,42.513153],[-74.55359,42.51294],[-74.55318800000001,42.512261],[-74.552443,42.511072],[-74.55226,42.510727],[-74.55207299999999,42.510329],[-74.55193,42.509979],[-74.551832,42.50968],[-74.551793,42.509387],[-74.55178100000001,42.509041],[-74.551789,42.508423],[-74.55188800000001,42.507901],[-74.55191499999999,42.507625],[-74.551862,42.507252],[-74.551745,42.506847],[-74.551641,42.506053],[-74.551615,42.50572],[-74.551613,42.505505],[-74.551772,42.505549],[-74.55200499999999,42.505611],[-74.552217,42.505633],[-74.553149,42.505635],[-74.55440400000001,42.505617],[-74.554846,42.505565],[-74.557084,42.504951],[-74.55757199999999,42.504831],[-74.557889,42.504765],[-74.558183,42.504704],[-74.55884399999999,42.504622],[-74.559425,42.504526],[-74.56013299999999,42.504356],[-74.560447,42.50428],[-74.561435,42.50408],[-74.561944,42.50396],[-74.564792,42.503243],[-74.565065,42.503192],[-74.565245,42.50317],[-74.56551899999999,42.503166],[-74.56580099999999,42.503187],[-74.565876,42.503194],[-74.566204,42.50324],[-74.56737099999999,42.503429],[-74.568377,42.503615],[-74.568557,42.503653],[-74.56873400000001,42.503697],[-74.569085,42.503799],[-74.569669,42.503999],[-74.569971,42.504114],[-74.570038,42.504141],[-74.57037,42.504274],[-74.572063,42.505162],[-74.572525,42.505391],[-74.572672,42.505459],[-74.572948,42.505565],[-74.573173,42.505623],[-74.57337,42.505647],[-74.573581,42.505654],[-74.57395200000001,42.505649],[-74.57415399999999,42.505638],[-74.574487,42.505611],[-74.574547,42.505602],[-74.57468,42.505583],[-74.574921,42.505532],[-74.575153,42.505478],[-74.576386,42.505164],[-74.577865,42.504782],[-74.57804400000001,42.504729],[-74.578202,42.504669],[-74.578446,42.504568],[-74.57858,42.504499],[-74.578754,42.504374],[-74.57898299999999,42.504242],[-74.579322,42.504066],[-74.57984,42.503835],[-74.58053,42.503511],[-74.580845,42.503347],[-74.58190500000001,42.502731],[-74.58250099999999,42.502348],[-74.58296799999999,42.502013],[-74.583262,42.501774],[-74.58372300000001,42.501329],[-74.583979,42.501018],[-74.584383,42.500552],[-74.585005,42.499882],[-74.585364,42.499482],[-74.58624,42.49854],[-74.586894,42.497789],[-74.586962,42.497711],[-74.58733100000001,42.497309],[-74.58769100000001,42.496883],[-74.588137,42.49638],[-74.58847799999999,42.49604],[-74.588678,42.495864],[-74.588998,42.49561],[-74.589776,42.495026],[-74.5904,42.494664],[-74.591075,42.494301],[-74.591335,42.494135],[-74.591983,42.493602],[-74.59241900000001,42.493204],[-74.592873,42.492809],[-74.592973,42.492702],[-74.593063,42.492578],[-74.593114,42.492464],[-74.59314999999999,42.492322],[-74.593198,42.491929],[-74.59322299999999,42.491468],[-74.593267,42.490455],[-74.593295,42.490261],[-74.593333,42.49014],[-74.59341999999999,42.489939],[-74.593665,42.489555],[-74.593723,42.489465],[-74.594021,42.489128],[-74.594928,42.487896],[-74.596,42.486438],[-74.596907,42.48527],[-74.59701200000001,42.485135],[-74.597506,42.484554],[-74.59765400000001,42.484393],[-74.597714,42.484248],[-74.59775399999999,42.484108],[-74.597774,42.483597],[-74.597804,42.483436],[-74.59803700000001,42.482732],[-74.59822,42.482294],[-74.598393,42.481952],[-74.600826,42.481825],[-74.603712,42.481642],[-74.60544299999999,42.481567],[-74.61001899999999,42.481348],[-74.610106,42.48135],[-74.61018199999999,42.481353],[-74.610535,42.481322],[-74.611745,42.481262],[-74.612978,42.481199],[-74.61330599999999,42.481176],[-74.61429699999999,42.481118],[-74.61519199999999,42.481065],[-74.615712,42.481044],[-74.616463,42.480984],[-74.616632,42.480957],[-74.61717400000001,42.480833],[-74.617544,42.480732],[-74.61799000000001,42.480616],[-74.619604,42.480235],[-74.6208,42.479966],[-74.62300399999999,42.479476],[-74.623529,42.479373],[-74.625874,42.478893],[-74.626364,42.478807],[-74.627054,42.478663],[-74.63120600000001,42.477798],[-74.63135699999999,42.477769],[-74.631743,42.477673],[-74.632046,42.47757],[-74.632492,42.477373],[-74.633528,42.476781],[-74.63633,42.475254],[-74.637108,42.474769],[-74.63792599999999,42.474187],[-74.638271,42.47389],[-74.63837700000001,42.473769],[-74.63882,42.473154],[-74.638988,42.472964],[-74.639179,42.472795],[-74.63958,42.472503],[-74.639837,42.472339],[-74.639942,42.472284],[-74.640102,42.472219],[-74.640304,42.472158],[-74.640433,42.472136],[-74.64062199999999,42.472122],[-74.640945,42.47215],[-74.641321,42.472213],[-74.64390899999999,42.472726],[-74.644722,42.472872],[-74.645331,42.472997],[-74.645749,42.473087],[-74.646244,42.473173],[-74.647679,42.473373],[-74.648381,42.473457],[-74.649793,42.4736],[-74.65088299999999,42.47368],[-74.651025,42.47369],[-74.65124,42.473723],[-74.651436,42.473791],[-74.65170000000001,42.473919],[-74.652013,42.474101],[-74.65248800000001,42.47439],[-74.652708,42.474507],[-74.652838,42.474588],[-74.65305600000001,42.474769],[-74.653344,42.475081],[-74.65351,42.475225],[-74.653677,42.475327],[-74.65393400000001,42.475446],[-74.654298,42.475582],[-74.65462599999999,42.475668],[-74.654853,42.475694],[-74.655005,42.475698],[-74.65551600000001,42.47566],[-74.655548,42.475657],[-74.656102,42.475611],[-74.65638800000001,42.475602],[-74.656634,42.475625],[-74.656773,42.475653],[-74.65678800000001,42.475657],[-74.65692300000001,42.475695],[-74.657044,42.475741],[-74.657292,42.475877],[-74.65779999999999,42.476196],[-74.658107,42.476333],[-74.65860600000001,42.476501],[-74.659105,42.476626],[-74.659435,42.476678],[-74.660211,42.476775],[-74.66263600000001,42.47708],[-74.664749,42.477324],[-74.665897,42.47742],[-74.66618200000001,42.477462],[-74.666561,42.477501],[-74.66712099999999,42.477596],[-74.66783599999999,42.477681],[-74.668589,42.47775],[-74.66900699999999,42.477768],[-74.66990800000001,42.477764],[-74.67107900000001,42.477695],[-74.67161900000001,42.477652],[-74.67164699999999,42.47768],[-74.67729199999999,42.483388],[-74.684907,42.491086],[-74.686637,42.492835],[-74.688857,42.495079],[-74.688909,42.49513],[-74.68892200000001,42.495143],[-74.68893,42.495151],[-74.693901,42.500076],[-74.695644,42.501823],[-74.699859,42.50605],[-74.697298,42.507626]]],"type":"Polygon"}
}