{
  "id": "360470912003",
  "type": "Feature",
  "properties": {
    "area_land":56362,
    "area_water":0,
    "geoid":"360470912003",
    "name":"Block Group 3",
    "state":"ny"
},
  "bbox": [
    -73.909305,
    40.662554,
    -73.905173,
    40.664659
],
  "geometry": {"coordinates":[[[-73.909305,40.664097],[-73.907539,40.664365],[-73.90557800000001,40.664659],[-73.905173,40.663106],[-73.906138,40.662967],[-73.907032,40.662834],[-73.908046,40.662684],[-73.90891999999999,40.662554],[-73.909305,40.664097]]],"type":"Polygon"}
}