{
  "id": "360630201003",
  "type": "Feature",
  "properties": {
    "area_land":442686,
    "area_water":0,
    "geoid":"360630201003",
    "name":"Block Group 3",
    "state":"ny"
},
  "bbox": [
    -79.056662,
    43.109592,
    -79.047073,
    43.122392
],
  "geometry": {"coordinates":[[[-79.056646,43.121137],[-79.05663699999999,43.121185],[-79.05660399999999,43.121272],[-79.05642400000001,43.121534],[-79.05617100000001,43.121853],[-79.05599599999999,43.122084],[-79.055764,43.122392],[-79.05557,43.122389],[-79.05499,43.12238],[-79.05479699999999,43.122378],[-79.054486,43.122374],[-79.05355299999999,43.122365],[-79.05324299999999,43.122362],[-79.05311399999999,43.122361],[-79.052728,43.122359],[-79.0526,43.122359],[-79.05237200000001,43.122358],[-79.051689,43.122357],[-79.051462,43.122357],[-79.05123500000001,43.122354],[-79.050555,43.122347],[-79.050329,43.122345],[-79.050105,43.122343],[-79.04943400000001,43.122337],[-79.049211,43.122336],[-79.048967,43.122333],[-79.048236,43.122325],[-79.04799300000001,43.122323],[-79.047803,43.122316],[-79.047494,43.122307],[-79.04740099999999,43.122288],[-79.04724400000001,43.122234],[-79.047225,43.122228],[-79.047073,43.122154],[-79.04737799999999,43.121841],[-79.048067,43.121136],[-79.04829700000001,43.120908],[-79.048608,43.120601],[-79.048793,43.120418],[-79.049381,43.119816],[-79.050184,43.118997],[-79.050883,43.118303],[-79.051703,43.117466],[-79.051948,43.117216],[-79.052059,43.11708],[-79.05241700000001,43.116629],[-79.052581,43.116421],[-79.052622,43.116371],[-79.052908,43.115956],[-79.053022,43.115763],[-79.053158,43.115536],[-79.053275,43.115333],[-79.05331700000001,43.115262],[-79.05358099999999,43.114729],[-79.05359,43.114706],[-79.05368300000001,43.114492],[-79.05392500000001,43.113927],[-79.053985,43.113788],[-79.054174,43.113349],[-79.05445400000001,43.112655],[-79.054644,43.112132],[-79.05469100000001,43.111923],[-79.054697,43.111788],[-79.054664,43.111627],[-79.054655,43.111579],[-79.054503,43.111011],[-79.054455,43.110892],[-79.054413,43.110788],[-79.054405,43.110767],[-79.05435799999999,43.110696],[-79.05426900000001,43.110596],[-79.05420100000001,43.110534],[-79.054119,43.110459],[-79.05398700000001,43.110352],[-79.05382899999999,43.110248],[-79.05367099999999,43.110186],[-79.053496,43.110117],[-79.05333400000001,43.110076],[-79.053236,43.11006],[-79.053117,43.110054],[-79.052102,43.110102],[-79.051581,43.110131],[-79.052122,43.110055],[-79.052171,43.110049],[-79.052402,43.110025],[-79.053731,43.109749],[-79.053916,43.109711],[-79.05426300000001,43.109625],[-79.054377,43.109592],[-79.054422,43.109744],[-79.054553,43.110188],[-79.05463399999999,43.110455],[-79.054658,43.110532],[-79.05473000000001,43.110763],[-79.054755,43.110841],[-79.054785,43.110938],[-79.054811,43.111027],[-79.05497699999999,43.111587],[-79.05503299999999,43.111774],[-79.055645,43.113827],[-79.055761,43.114209],[-79.05578199999999,43.114282],[-79.055848,43.114501],[-79.05587,43.114574],[-79.05590599999999,43.114707],[-79.055921,43.114762],[-79.055965,43.115118],[-79.055982,43.115256],[-79.055998,43.11539],[-79.05604599999999,43.115794],[-79.056062,43.115929],[-79.056067,43.115971],[-79.056082,43.116098],[-79.05608700000001,43.116141],[-79.056112,43.116349],[-79.05614,43.116575],[-79.056191,43.116974],[-79.056218,43.117183],[-79.05624400000001,43.117376],[-79.05627,43.117568],[-79.056286,43.117724],[-79.05631,43.117959],[-79.05633,43.118154],[-79.056394,43.118673],[-79.056507,43.119594],[-79.056586,43.120233],[-79.056596,43.120314],[-79.05664400000001,43.120754],[-79.056662,43.121056],[-79.056646,43.121137]]],"type":"Polygon"}
}