{
  "id": "361219710004",
  "type": "Feature",
  "properties": {
    "area_land":6197513,
    "area_water":8312,
    "geoid":"361219710004",
    "name":"Block Group 4",
    "state":"ny"
},
  "bbox": [
    -78.464556,
    42.519166,
    -78.419822,
    42.541557
],
  "geometry": {"coordinates":[[[-78.4645,42.519828],[-78.464499,42.519963],[-78.464384,42.521836],[-78.464343,42.522521],[-78.46430100000001,42.523297],[-78.464297,42.523382],[-78.464279,42.523704],[-78.46426099999999,42.524043],[-78.464259,42.524088],[-78.46425600000001,42.524121],[-78.464251,42.524305],[-78.464235,42.524777],[-78.464231,42.52485],[-78.46422800000001,42.524986],[-78.464206,42.525945],[-78.464179,42.527084],[-78.464054,42.530664],[-78.464077,42.530754],[-78.46406500000001,42.531797],[-78.464063,42.532068],[-78.464063,42.532092],[-78.46405900000001,42.532163],[-78.46405900000001,42.532187],[-78.464035,42.533016],[-78.46396300000001,42.535502],[-78.46393999999999,42.536332],[-78.463931,42.536403],[-78.463773,42.541557],[-78.463655,42.541545],[-78.463261,42.541476],[-78.462087,42.541238],[-78.461139,42.541003],[-78.46034,42.540782],[-78.45711900000001,42.53995],[-78.456464,42.53979],[-78.45604400000001,42.539691],[-78.455406,42.539542],[-78.454787,42.539386],[-78.45470299999999,42.539365],[-78.454369,42.539283],[-78.453537,42.539078],[-78.45236,42.538789],[-78.451041,42.538477],[-78.450209,42.538281],[-78.449077,42.537998],[-78.447768,42.537685],[-78.447622,42.53766],[-78.447434,42.537644],[-78.446957,42.537636],[-78.445621,42.537651],[-78.44489799999999,42.53766],[-78.444592,42.537681],[-78.444461,42.537713],[-78.444372,42.537698],[-78.444354,42.537697],[-78.44424100000001,42.537694],[-78.444141,42.53771],[-78.444035,42.537734],[-78.44392999999999,42.537759],[-78.4438,42.537789],[-78.443772,42.537796],[-78.443416,42.537893],[-78.443288,42.537929],[-78.443062,42.537991],[-78.442926,42.53802],[-78.442761,42.538025],[-78.442729,42.538026],[-78.44238799999999,42.537989],[-78.441406,42.537769],[-78.441175,42.537734],[-78.441036,42.537713],[-78.440828,42.5377],[-78.44071599999999,42.53771],[-78.440645,42.537738],[-78.440619,42.537728],[-78.440583,42.537716],[-78.44054,42.537709],[-78.44051399999999,42.537705],[-78.44044100000001,42.537694],[-78.439796,42.537693],[-78.439561,42.537687],[-78.4375,42.537636],[-78.437201,42.53762],[-78.436967,42.537601],[-78.436705,42.53758],[-78.435756,42.537504],[-78.43508300000001,42.537469],[-78.435031,42.53747],[-78.434893,42.537473],[-78.434695,42.53749],[-78.434231,42.537594],[-78.43355099999999,42.537776],[-78.433361,42.537807],[-78.432939,42.53784],[-78.432894,42.537839],[-78.432169,42.537838],[-78.43179000000001,42.537831],[-78.43150199999999,42.537817],[-78.43106400000001,42.537797],[-78.430498,42.537752],[-78.429513,42.537604],[-78.429205,42.537558],[-78.428854,42.537506],[-78.428656,42.537474],[-78.42841300000001,42.537436],[-78.42806400000001,42.537371],[-78.42786700000001,42.537335],[-78.427246,42.53721],[-78.42635300000001,42.537031],[-78.425399,42.536781],[-78.425354,42.53677],[-78.424786,42.536628],[-78.42459599999999,42.536595],[-78.423846,42.536489],[-78.42283,42.536346],[-78.422521,42.53632],[-78.42226100000001,42.536311],[-78.422099,42.536314],[-78.421851,42.536346],[-78.421026,42.536496],[-78.420261,42.536637],[-78.42009,42.536648],[-78.42003200000001,42.536643],[-78.419988,42.536637],[-78.419898,42.536607],[-78.41986300000001,42.536594],[-78.419822,42.53658],[-78.419872,42.536495],[-78.419927,42.53636],[-78.419955,42.536294],[-78.42020599999999,42.535684],[-78.420299,42.535459],[-78.42034,42.535348],[-78.420466,42.535019],[-78.420508,42.534909],[-78.420554,42.534895],[-78.420694,42.534856],[-78.42074100000001,42.534843],[-78.42101,42.534768],[-78.421238,42.534705],[-78.421815,42.534525],[-78.422083,42.534442],[-78.422133,42.534426],[-78.422286,42.534378],[-78.422337,42.534363],[-78.42249700000001,42.534311],[-78.42298,42.534156],[-78.423141,42.534105],[-78.422813,42.533862],[-78.42237,42.533535],[-78.421843,42.53312],[-78.42152400000001,42.532869],[-78.421778,42.532689],[-78.422543,42.532151],[-78.422798,42.531972],[-78.42281800000001,42.531957],[-78.42288000000001,42.531912],[-78.422901,42.531898],[-78.422952,42.531861],[-78.423106,42.531751],[-78.423158,42.531715],[-78.42320100000001,42.531683],[-78.423333,42.531589],[-78.423377,42.531558],[-78.423529,42.531457],[-78.423987,42.531158],[-78.42413999999999,42.531058],[-78.424121,42.530812],[-78.424064,42.530076],[-78.424046,42.529831],[-78.42439299999999,42.529972],[-78.42511,42.530265],[-78.425439,42.530389],[-78.42579000000001,42.530522],[-78.427089,42.531013],[-78.427722,42.531253],[-78.430224,42.532232],[-78.430971,42.532527],[-78.432264,42.533037],[-78.432276,42.532408],[-78.43231299999999,42.530522],[-78.432326,42.529894],[-78.432337,42.527747],[-78.432363,42.523264],[-78.432376,42.523071],[-78.432408,42.521509],[-78.43241399999999,42.521309],[-78.43244,42.520482],[-78.432485,42.519897],[-78.43251100000001,42.519753],[-78.432592,42.519509],[-78.43270699999999,42.519274],[-78.43274599999999,42.51922],[-78.43326399999999,42.519222],[-78.43481800000001,42.519231],[-78.43533600000001,42.519234],[-78.43763800000001,42.519229],[-78.444546,42.519218],[-78.44662599999999,42.519215],[-78.446849,42.519215],[-78.446876,42.519215],[-78.447033,42.519214],[-78.447076,42.519214],[-78.44768000000001,42.519213],[-78.447881,42.519213],[-78.450447,42.519209],[-78.45814900000001,42.519197],[-78.46071600000001,42.519194],[-78.46085100000001,42.519194],[-78.461258,42.519194],[-78.461394,42.519194],[-78.461428,42.519193],[-78.46153,42.519193],[-78.46156499999999,42.519193],[-78.462163,42.519187],[-78.46395699999999,42.519171],[-78.46432900000001,42.519175],[-78.464556,42.519166],[-78.4645,42.519828]]],"type":"Polygon"}
}