{
  "id": "360470722001",
  "type": "Feature",
  "properties": {
    "area_land":149765,
    "area_water":0,
    "geoid":"360470722001",
    "name":"Block Group 1",
    "state":"ny"
},
  "bbox": [
    -73.925456,
    40.630689,
    -73.918604,
    40.634483
],
  "geometry": {"coordinates":[[[-73.925456,40.633028],[-73.924486,40.63309],[-73.923556,40.633146],[-73.92258699999999,40.633209],[-73.921904,40.633256],[-73.921618,40.633276],[-73.920683,40.63333],[-73.920412,40.633474],[-73.919809,40.633865],[-73.91943999999999,40.634102],[-73.918852,40.634483],[-73.918763,40.633637],[-73.918604,40.632096],[-73.919543,40.631471],[-73.920418,40.630904],[-73.920621,40.630972],[-73.92136600000001,40.630927],[-73.922335,40.630866],[-73.923305,40.630808],[-73.924239,40.630749],[-73.92520500000001,40.630689],[-73.925456,40.633028]]],"type":"Polygon"}
}