{
  "id": "360610228001",
  "type": "Feature",
  "properties": {
    "area_land":43593,
    "area_water":0,
    "geoid":"360610228001",
    "name":"Block Group 1",
    "state":"ny"
},
  "bbox": [
    -73.94321,
    40.814774,
    -73.939457,
    40.817226
],
  "geometry": {"coordinates":[[[-73.942756,40.816602],[-73.94229900000001,40.817226],[-73.939457,40.816027],[-73.93968,40.815719],[-73.939909,40.815404],[-73.940369,40.814774],[-73.94320999999999,40.815976],[-73.942756,40.816602]]],"type":"Polygon"}
}