{
  "id": "360470401002",
  "type": "Feature",
  "properties": {
    "area_land":47043,
    "area_water":0,
    "geoid":"360470401002",
    "name":"Block Group 2",
    "state":"ny"
},
  "bbox": [
    -73.91529,
    40.684368,
    -73.911637,
    40.687079
],
  "geometry": {"coordinates":[[[-73.91529,40.685645],[-73.913892,40.687079],[-73.91314,40.686652],[-73.912389,40.686224],[-73.911637,40.685796],[-73.913037,40.684368],[-73.913308,40.684521],[-73.913798,40.6848],[-73.91454,40.685227],[-73.91470099999999,40.685317],[-73.91529,40.685645]]],"type":"Polygon"}
}