{
  "id": "361031238011",
  "type": "Feature",
  "properties": {
    "area_land":410319,
    "area_water":541908,
    "geoid":"361031238011",
    "name":"Block Group 1",
    "state":"ny"
},
  "bbox": [
    -73.406267,
    40.6516,
    -73.391719,
    40.667894
],
  "geometry": {"coordinates":[[[-73.405413,40.657691],[-73.405289,40.658325],[-73.404197,40.660076],[-73.404072,40.663184],[-73.404569,40.664742],[-73.40452000000001,40.666891],[-73.404618,40.667647],[-73.404635,40.667779],[-73.40423199999999,40.667737],[-73.404139,40.667728],[-73.403311,40.667653],[-73.403115,40.667651],[-73.402586,40.667662],[-73.402103,40.667678],[-73.401692,40.667688],[-73.401163,40.667737],[-73.400797,40.667766],[-73.400218,40.667837],[-73.399905,40.667894],[-73.399922,40.666144],[-73.399979,40.663397],[-73.39997,40.66327],[-73.399964,40.663124],[-73.400013,40.660788],[-73.40007799999999,40.658459],[-73.400086,40.658155],[-73.400098,40.65747],[-73.400116,40.656782],[-73.400121,40.656462],[-73.400136,40.656346],[-73.400201,40.65624],[-73.40033200000001,40.656134],[-73.400462,40.656015],[-73.400549,40.655887],[-73.400645,40.655644],[-73.400682,40.655443],[-73.400597,40.655269],[-73.400463,40.655135],[-73.40034900000001,40.655082],[-73.399918,40.655049],[-73.399512,40.65553],[-73.399472,40.655578],[-73.397465,40.655439],[-73.397572,40.655799],[-73.39728100000001,40.656013],[-73.396969,40.65618],[-73.396641,40.656303],[-73.395972,40.656425],[-73.395805,40.656005],[-73.395448,40.656119],[-73.39503000000001,40.656191],[-73.39450600000001,40.65623],[-73.393637,40.656219],[-73.393559,40.656654],[-73.39340300000001,40.657094],[-73.393135,40.657501],[-73.39280599999999,40.65793],[-73.392662,40.658131],[-73.392617,40.658264],[-73.392634,40.658392],[-73.392606,40.658604],[-73.39239999999999,40.659061],[-73.39218200000001,40.659379],[-73.39187099999999,40.659699],[-73.3918,40.659526],[-73.391721,40.659193],[-73.39171899999999,40.654161],[-73.406267,40.6516],[-73.405413,40.657691]]],"type":"Polygon"}
}