{
  "id": "360650227023",
  "type": "Feature",
  "properties": {
    "area_land":19204952,
    "area_water":520435,
    "geoid":"360650227023",
    "name":"Block Group 3",
    "state":"ny"
},
  "bbox": [
    -75.469389,
    43.226569,
    -75.384816,
    43.281523
],
  "geometry": {"coordinates":[[[-75.46938900000001,43.275722],[-75.464232,43.27618],[-75.45171499999999,43.276688],[-75.450919,43.276669],[-75.448915,43.27677],[-75.447642,43.27691],[-75.44734,43.276908],[-75.440821,43.277466],[-75.43371500000001,43.278064],[-75.43247,43.277965],[-75.431718,43.278169],[-75.429783,43.278311],[-75.428719,43.278355],[-75.428364,43.278369],[-75.42389799999999,43.278776],[-75.423438,43.278769],[-75.423149,43.278829],[-75.415997,43.279383],[-75.41595599999999,43.279759],[-75.412786,43.279981],[-75.40990499999999,43.280208],[-75.40917399999999,43.280271],[-75.40768199999999,43.28038],[-75.40628,43.280503],[-75.40416999999999,43.28068],[-75.403462,43.280748],[-75.399886,43.281011],[-75.399164,43.281073],[-75.396872,43.281282],[-75.395366,43.281395],[-75.39385299999999,43.281492],[-75.39341400000001,43.281523],[-75.390917,43.27337],[-75.39051499999999,43.270252],[-75.390142,43.267487],[-75.38821299999999,43.254359],[-75.38766800000001,43.250386],[-75.387674,43.250188],[-75.387332,43.247616],[-75.385988,43.237209],[-75.385994,43.236299],[-75.385634,43.232324],[-75.384816,43.226569],[-75.391913,43.227657],[-75.392121,43.227613],[-75.392421,43.22755],[-75.394317,43.229263],[-75.394288,43.23241],[-75.39199499999999,43.232432],[-75.391868,43.233325],[-75.39267599999999,43.237333],[-75.396244,43.237137],[-75.397535,43.24425],[-75.402327,43.243856],[-75.40263299999999,43.243956],[-75.40287600000001,43.24556],[-75.41025999999999,43.245107],[-75.41234,43.244974],[-75.414029,43.244802],[-75.414171,43.244779],[-75.41412699999999,43.245693],[-75.414117,43.246121],[-75.41412699999999,43.24747],[-75.414123,43.247588],[-75.41412099999999,43.247927],[-75.41421099999999,43.248532],[-75.414309,43.248732],[-75.414534,43.249591],[-75.414689,43.25024],[-75.414827,43.250717],[-75.418404,43.250455],[-75.419819,43.250348],[-75.421209,43.250251],[-75.422214,43.250166],[-75.422557,43.250133],[-75.42303699999999,43.2501],[-75.423655,43.250046],[-75.424048,43.250003],[-75.42677399999999,43.249812],[-75.427404,43.249743],[-75.42765,43.249691],[-75.42782,43.24963],[-75.428085,43.249477],[-75.429057,43.24876],[-75.429593,43.248345],[-75.430232,43.247878],[-75.431314,43.24704],[-75.431817,43.246675],[-75.43197600000001,43.246524],[-75.432075,43.246394],[-75.43215600000001,43.246253],[-75.43223,43.246018],[-75.43224600000001,43.245513],[-75.43417700000001,43.245617],[-75.434691,43.245636],[-75.434928,43.245996],[-75.43515600000001,43.246446],[-75.435503,43.246714],[-75.435705,43.246767],[-75.43668,43.246792],[-75.436981,43.24721],[-75.43706400000001,43.24729],[-75.43720399999999,43.247379],[-75.437276,43.247398],[-75.437501,43.247405],[-75.438309,43.247569],[-75.438772,43.247726],[-75.439024,43.247843],[-75.43911900000001,43.247919],[-75.43925,43.248116],[-75.439272,43.248214],[-75.439272,43.248309],[-75.43925400000001,43.248382],[-75.439184,43.248487],[-75.439083,43.248584],[-75.441913,43.248527],[-75.44247,43.249556],[-75.442694,43.249995],[-75.442818,43.250469],[-75.443029,43.251164],[-75.44309800000001,43.251514],[-75.443118,43.25178],[-75.44311,43.252092],[-75.443011,43.252683],[-75.442899,43.253197],[-75.44279,43.253634],[-75.442745,43.253763],[-75.44264,43.254045],[-75.442463,43.254425],[-75.441349,43.256489],[-75.440935,43.257287],[-75.44041900000001,43.258347],[-75.44007000000001,43.258947],[-75.439892,43.259227],[-75.439485,43.259902],[-75.438996,43.260801],[-75.438925,43.260913],[-75.438857,43.260991],[-75.43884300000001,43.261153],[-75.438748,43.261493],[-75.438676,43.261707],[-75.438259,43.262608],[-75.438006,43.263204],[-75.437662,43.263885],[-75.437707,43.263901],[-75.437849,43.263934],[-75.43805,43.26394],[-75.438998,43.263877],[-75.44233699999999,43.263631],[-75.44327,43.263569],[-75.44485,43.263451],[-75.44919,43.263084],[-75.44933899999999,43.263072],[-75.450748,43.262989],[-75.45163100000001,43.262946],[-75.452646,43.262881],[-75.453271,43.262848],[-75.45524500000001,43.262706],[-75.456542,43.262624],[-75.459312,43.26243],[-75.459808,43.262385],[-75.46033799999999,43.26236],[-75.46148100000001,43.262275],[-75.46280299999999,43.262216],[-75.463093,43.262197],[-75.46371600000001,43.263707],[-75.464095,43.264512],[-75.46503199999999,43.26634],[-75.465836,43.267888],[-75.466337,43.268845],[-75.46742500000001,43.270921],[-75.46775,43.271605],[-75.468129,43.272483],[-75.468924,43.274371],[-75.469105,43.274837],[-75.469173,43.275046],[-75.46938299999999,43.275697],[-75.46938900000001,43.275722]]],"type":"Polygon"}
}