{
  "id": "360179702006",
  "type": "Feature",
  "properties": {
    "area_land":90426631,
    "area_water":27314,
    "geoid":"360179702006",
    "name":"Block Group 6",
    "state":"ny"
},
  "bbox": [
    -75.889832,
    42.575737,
    -75.796459,
    42.727152
],
  "geometry": {"coordinates":[[[-75.889832,42.723844],[-75.88940100000001,42.723867],[-75.88917600000001,42.723879],[-75.88908499999999,42.723884],[-75.889064,42.723885],[-75.88890499999999,42.723894],[-75.888851,42.723897],[-75.88879799999999,42.7239],[-75.88876,42.723902],[-75.888746,42.723903],[-75.888049,42.72394],[-75.883411,42.724192],[-75.880657,42.724315],[-75.874639,42.724583],[-75.86976300000001,42.724885],[-75.84999500000001,42.725674],[-75.84985,42.72568],[-75.84892600000001,42.725716],[-75.84007,42.726071],[-75.830958,42.726446],[-75.830606,42.72647],[-75.83037,42.726486],[-75.829447,42.72655],[-75.829306,42.72656],[-75.824016,42.726926],[-75.821167,42.727146],[-75.821089,42.727152],[-75.82108599999999,42.727116],[-75.82100800000001,42.726454],[-75.820933,42.725913],[-75.820837,42.725571],[-75.82076499999999,42.7254],[-75.82056300000001,42.725015],[-75.820453,42.724857],[-75.820166,42.724509],[-75.81971799999999,42.724085],[-75.81931299999999,42.723759],[-75.81755699999999,42.722472],[-75.81488299999999,42.720482],[-75.81464699999999,42.720306],[-75.814318,42.72006],[-75.814076,42.719891],[-75.81223199999999,42.718524],[-75.811604,42.718055],[-75.811262,42.717787],[-75.811099,42.717628],[-75.81091600000001,42.717396],[-75.810717,42.717039],[-75.81063899999999,42.716807],[-75.81057800000001,42.716441],[-75.810523,42.715682],[-75.810509,42.715207],[-75.810351,42.712857],[-75.810239,42.710957],[-75.81018299999999,42.709023],[-75.81011100000001,42.708199],[-75.810044,42.707824],[-75.809955,42.707508],[-75.80962599999999,42.706692],[-75.809397,42.70615],[-75.809006,42.705164],[-75.808594,42.704181],[-75.808212,42.703213],[-75.807625,42.701772],[-75.807447,42.701295],[-75.807166,42.70059],[-75.80660399999999,42.699208],[-75.806194,42.698383],[-75.80549499999999,42.697046],[-75.805194,42.696476],[-75.804967,42.696033],[-75.80422299999999,42.694626],[-75.803499,42.693199],[-75.803292,42.692833],[-75.802999,42.692263],[-75.80256,42.69139],[-75.802333,42.690833],[-75.80219099999999,42.690424],[-75.80179099999999,42.68935],[-75.80156599999999,42.688552],[-75.801483,42.688115],[-75.801418,42.68762],[-75.801231,42.685978],[-75.801135,42.685436],[-75.801025,42.685116],[-75.800572,42.68392],[-75.800382,42.683471],[-75.800151,42.682849],[-75.799807,42.681646],[-75.799764,42.681497],[-75.799716,42.681054],[-75.799684,42.679852],[-75.79963499999999,42.678923],[-75.799628,42.678826],[-75.799497,42.676888],[-75.799459,42.67631],[-75.79945600000001,42.675969],[-75.799476,42.675714],[-75.799491,42.675668],[-75.799525,42.675454],[-75.79963600000001,42.675118],[-75.799909,42.674382],[-75.800043,42.673946],[-75.80007500000001,42.673677],[-75.800078,42.673432],[-75.80006899999999,42.673378],[-75.80001300000001,42.67304],[-75.79994000000001,42.672842],[-75.79982699999999,42.672596],[-75.799773,42.672479],[-75.799604,42.67207],[-75.79950599999999,42.671822],[-75.799474,42.671736],[-75.799111,42.670566],[-75.79901,42.670175],[-75.798976,42.670036],[-75.798756,42.669145],[-75.798535,42.668362],[-75.79848699999999,42.668212],[-75.798168,42.667226],[-75.797088,42.66465],[-75.796459,42.662769],[-75.796577,42.662757],[-75.796705,42.662786],[-75.797225,42.662974],[-75.797397,42.663023],[-75.797573,42.663053],[-75.797759,42.663068],[-75.797884,42.663066],[-75.79814500000001,42.663025],[-75.798248,42.662989],[-75.798446,42.6629],[-75.799583,42.662295],[-75.800048,42.662082],[-75.80027,42.661997],[-75.801001,42.661779],[-75.801345,42.661692],[-75.802063,42.661532],[-75.803645,42.661204],[-75.80419000000001,42.661091],[-75.80489799999999,42.660936],[-75.80517999999999,42.660879],[-75.80559,42.660795],[-75.806566,42.660583],[-75.80650799999999,42.659761],[-75.806426,42.658598],[-75.806256,42.657045],[-75.806157,42.655617],[-75.80611500000001,42.654705],[-75.80612000000001,42.65376],[-75.806088,42.653382],[-75.805926,42.65247],[-75.80583,42.652002],[-75.805441,42.650842],[-75.805274,42.650299],[-75.80525,42.65015],[-75.805176,42.649765],[-75.805166,42.649596],[-75.80508500000001,42.648975],[-75.805031,42.64825],[-75.80505100000001,42.64788],[-75.80510700000001,42.647527],[-75.80517999999999,42.647249],[-75.805393,42.646562],[-75.805685,42.645752],[-75.805932,42.645129],[-75.806271,42.644241],[-75.80637900000001,42.643903],[-75.806549,42.643198],[-75.806642,42.642718],[-75.80671100000001,42.642425],[-75.80704799999999,42.641275],[-75.80723,42.640487],[-75.807371,42.639852],[-75.807593,42.638961],[-75.807681,42.638749],[-75.80771799999999,42.63868],[-75.807787,42.638588],[-75.808404,42.637964],[-75.80870299999999,42.637605],[-75.808932,42.637293],[-75.80916499999999,42.636908],[-75.80921600000001,42.63677],[-75.809234,42.636686],[-75.80923900000001,42.636294],[-75.809225,42.635901],[-75.80924899999999,42.635561],[-75.80929399999999,42.635209],[-75.809454,42.6343],[-75.809478,42.633917],[-75.809466,42.633674],[-75.809325,42.633179],[-75.809179,42.632841],[-75.80874799999999,42.631897],[-75.80869199999999,42.631753],[-75.80867499999999,42.631679],[-75.80865300000001,42.631443],[-75.808661,42.631379],[-75.80873099999999,42.631147],[-75.808857,42.630683],[-75.809006,42.630351],[-75.809224,42.630139],[-75.809471,42.629921],[-75.81003,42.629453],[-75.812121,42.627806],[-75.8125,42.627531],[-75.813699,42.626694],[-75.81406,42.626442],[-75.816149,42.624999],[-75.817847,42.623844],[-75.818715,42.623316],[-75.81955499999999,42.622834],[-75.82039899999999,42.622347],[-75.822225,42.621297],[-75.822637,42.621041],[-75.822926,42.620826],[-75.823133,42.620635],[-75.823419,42.620307],[-75.823888,42.619573],[-75.824872,42.617993],[-75.825495,42.61698],[-75.826374,42.615577],[-75.82842100000001,42.612206],[-75.829037,42.611219],[-75.82930899999999,42.610752],[-75.829435,42.610481],[-75.82951199999999,42.610265],[-75.829561,42.609961],[-75.829655,42.609305],[-75.829764,42.608352],[-75.82976600000001,42.607877],[-75.829725,42.60722],[-75.829716,42.607071],[-75.829627,42.605486],[-75.82965,42.605174],[-75.82969,42.605006],[-75.829804,42.604705],[-75.829909,42.604531],[-75.829989,42.604423],[-75.83011500000001,42.604281],[-75.83024899999999,42.604156],[-75.83050799999999,42.603948],[-75.830664,42.603853],[-75.830889,42.603737],[-75.831155,42.603626],[-75.83126300000001,42.603589],[-75.831845,42.603388],[-75.83354,42.602836],[-75.833816,42.602733],[-75.83407699999999,42.602617],[-75.834255,42.602516],[-75.83430300000001,42.602488],[-75.83457900000001,42.602288],[-75.834774,42.60211],[-75.834869,42.602004],[-75.83497,42.601868],[-75.83504600000001,42.601742],[-75.83515300000001,42.601499],[-75.835172,42.601441],[-75.83522000000001,42.601274],[-75.835441,42.600084],[-75.835565,42.599708],[-75.835757,42.599275],[-75.83585600000001,42.599135],[-75.835938,42.599029],[-75.836127,42.598839],[-75.83628299999999,42.598717],[-75.836568,42.598512],[-75.83799399999999,42.597706],[-75.83830500000001,42.597502],[-75.83882199999999,42.597101],[-75.839247,42.596763],[-75.84081999999999,42.595528],[-75.84125400000001,42.595192],[-75.841741,42.59481],[-75.84229999999999,42.594342],[-75.842484,42.594171],[-75.84349899999999,42.593085],[-75.844115,42.592421],[-75.84458600000001,42.591937],[-75.84559,42.590935],[-75.845995,42.590535],[-75.846918,42.589609],[-75.847883,42.588596],[-75.848159,42.588341],[-75.84852100000001,42.58808],[-75.84881900000001,42.587905],[-75.849237,42.587688],[-75.850343,42.587188],[-75.850734,42.586971],[-75.851157,42.586677],[-75.851795,42.586214],[-75.852265,42.585899],[-75.85299999999999,42.585442],[-75.853883,42.585002],[-75.856781,42.583739],[-75.857507,42.58341],[-75.861023,42.581867],[-75.861195,42.581802],[-75.86150000000001,42.581713],[-75.861898,42.581617],[-75.86445000000001,42.581076],[-75.86472000000001,42.581029],[-75.865447,42.580994],[-75.86693699999999,42.580935],[-75.867361,42.580912],[-75.867566,42.580882],[-75.86781000000001,42.580814],[-75.868047,42.580706],[-75.868362,42.580524],[-75.869766,42.579647],[-75.872253,42.578144],[-75.872591,42.57794],[-75.872913,42.577773],[-75.87376500000001,42.577327],[-75.874999,42.576707],[-75.876096,42.576189],[-75.87662400000001,42.575949],[-75.876831,42.57586],[-75.87715900000001,42.575737],[-75.877167,42.575835],[-75.8772,42.577362],[-75.877211,42.577844],[-75.877224,42.578444],[-75.87723699999999,42.578488],[-75.87724,42.578498],[-75.87725,42.578535],[-75.877263,42.578579],[-75.87750200000001,42.579406],[-75.879098,42.598507],[-75.87910599999999,42.598591],[-75.879245,42.601869],[-75.87925199999999,42.601953],[-75.879346,42.603068],[-75.87955100000001,42.605482],[-75.881259,42.625068],[-75.88137399999999,42.62644],[-75.88156499999999,42.628699],[-75.881889,42.632526],[-75.881955,42.633313],[-75.882245,42.636731],[-75.88232499999999,42.637695],[-75.883242,42.648535],[-75.883843,42.655634],[-75.884016,42.657675],[-75.88519599999999,42.671619],[-75.88543300000001,42.674327],[-75.885443,42.674445],[-75.88546100000001,42.674645],[-75.886663,42.688366],[-75.886967,42.69167],[-75.887404,42.696401],[-75.888587,42.70923],[-75.88903000000001,42.714433],[-75.88907500000001,42.714962],[-75.88908600000001,42.715091],[-75.889088,42.715115],[-75.88909,42.715141],[-75.889093,42.715168],[-75.889094,42.71518],[-75.889126,42.715554],[-75.889546,42.720481],[-75.889546,42.720494],[-75.889549,42.720511],[-75.88969899999999,42.722287],[-75.889832,42.723844]]],"type":"Polygon"}
}