{
  "id": "360670008002",
  "type": "Feature",
  "properties": {
    "area_land":357725,
    "area_water":0,
    "geoid":"360670008002",
    "name":"Block Group 2",
    "state":"ny"
},
  "bbox": [
    -76.143353,
    43.063075,
    -76.13394,
    43.069832
],
  "geometry": {"coordinates":[[[-76.143353,43.064032],[-76.143342,43.065047],[-76.143334,43.066406],[-76.143321,43.067124],[-76.143321,43.0682],[-76.143317,43.068473],[-76.14330099999999,43.069615],[-76.14269299999999,43.069602],[-76.142087,43.069589],[-76.142038,43.069602],[-76.142005,43.069633],[-76.141977,43.069721],[-76.141969,43.0698],[-76.14157,43.069832],[-76.14141600000001,43.069825],[-76.141229,43.069804],[-76.140946,43.069757],[-76.140323,43.069624],[-76.140196,43.069586],[-76.14004199999999,43.069541],[-76.13955,43.069318],[-76.139331,43.069202],[-76.13895100000001,43.068954],[-76.13852900000001,43.068606],[-76.138464,43.068533],[-76.138366,43.068359],[-76.13834,43.068311],[-76.13831500000001,43.068169],[-76.138336,43.067869],[-76.13838,43.067704],[-76.138426,43.067587],[-76.13767,43.067217],[-76.137333,43.067048],[-76.137171,43.066955],[-76.137086,43.066888],[-76.13674,43.06691],[-76.136324,43.066933],[-76.136319,43.066865],[-76.135214,43.066929],[-76.134109,43.066963],[-76.13402499999999,43.065697],[-76.13394,43.064422],[-76.135046,43.064367],[-76.136154,43.064324],[-76.13682300000001,43.064289],[-76.13737500000001,43.06427],[-76.137664,43.06426],[-76.138518,43.064246],[-76.13855599999999,43.064223],[-76.138572,43.064188],[-76.13857299999999,43.064098],[-76.138492,43.06312],[-76.139492,43.063075],[-76.139584,43.064138],[-76.140552,43.064101],[-76.141538,43.064051],[-76.14299,43.063981],[-76.143095,43.063976],[-76.143353,43.06398],[-76.143353,43.064032]]],"type":"Polygon"}
}