{
  "id": "360670045001",
  "type": "Feature",
  "properties": {
    "area_land":214557,
    "area_water":0,
    "geoid":"360670045001",
    "name":"Block Group 1",
    "state":"ny"
},
  "bbox": [
    -76.119344,
    43.036809,
    -76.113946,
    43.04176
],
  "geometry": {"coordinates":[[[-76.119344,43.041501],[-76.11778700000001,43.041583],[-76.11660500000001,43.041625],[-76.116028,43.041662],[-76.115458,43.041684],[-76.114704,43.041727],[-76.114302,43.04176],[-76.114277,43.041407],[-76.114244,43.041173],[-76.11403,43.038432],[-76.113946,43.037051],[-76.11513600000001,43.036994],[-76.11575499999999,43.036955],[-76.11626,43.036934],[-76.116888,43.036905],[-76.117705,43.036865],[-76.117862,43.036857],[-76.118932,43.036809],[-76.119089,43.038567],[-76.119112,43.03891],[-76.119167,43.039506],[-76.119192,43.039778],[-76.11922199999999,43.040142],[-76.119265,43.040635],[-76.119344,43.041501]]],"type":"Polygon"}
}