{
  "id": "360270802011",
  "type": "Feature",
  "properties": {
    "area_land":3922879,
    "area_water":8354,
    "geoid":"360270802011",
    "name":"Block Group 1",
    "state":"ny"
},
  "bbox": [
    -73.866743,
    41.651716,
    -73.833617,
    41.684433
],
  "geometry": {"coordinates":[[[-73.866668,41.684107],[-73.866591,41.684219],[-73.866542,41.684311],[-73.86651000000001,41.684433],[-73.866308,41.684418],[-73.866038,41.684367],[-73.86522100000001,41.684221],[-73.864307,41.68398],[-73.863865,41.683831],[-73.863142,41.683546],[-73.862032,41.68305],[-73.861452,41.68279],[-73.859748,41.682073],[-73.859449,41.68197],[-73.85847800000001,41.681609],[-73.85781799999999,41.681383],[-73.857443,41.68125],[-73.857192,41.681156],[-73.857052,41.68114],[-73.85694700000001,41.681143],[-73.85682,41.681091],[-73.856233,41.680865],[-73.855289,41.68052],[-73.854557,41.680228],[-73.853857,41.67991],[-73.85364800000001,41.679794],[-73.853399,41.679662],[-73.852774,41.679317],[-73.852315,41.679061],[-73.84949400000001,41.677401],[-73.849412,41.677355],[-73.84895,41.67709],[-73.848384,41.676761],[-73.84797399999999,41.676513],[-73.84778300000001,41.676395],[-73.847611,41.676279],[-73.847449,41.676166],[-73.847303,41.676055],[-73.84714099999999,41.675923],[-73.846963,41.675765],[-73.846897,41.675704],[-73.846532,41.675274],[-73.846324,41.674953],[-73.845933,41.674217],[-73.845777,41.673973],[-73.845564,41.673707],[-73.845339,41.673469],[-73.84517099999999,41.673323],[-73.84492,41.673106],[-73.843649,41.672235],[-73.843279,41.671993],[-73.84318399999999,41.67193],[-73.842651,41.671564],[-73.841553,41.670822],[-73.841303,41.670658],[-73.841094,41.670537],[-73.840925,41.670436],[-73.840695,41.67032],[-73.84041499999999,41.670196],[-73.840115,41.670075],[-73.83970100000001,41.669928],[-73.839491,41.66987],[-73.839204,41.6698],[-73.839151,41.669787],[-73.83875999999999,41.669709],[-73.838472,41.669671],[-73.838038,41.669615],[-73.837665,41.669595],[-73.83734800000001,41.669599],[-73.83712199999999,41.669597],[-73.837157,41.66932],[-73.83741000000001,41.667315],[-73.836456,41.663831],[-73.83448300000001,41.657599],[-73.833617,41.654862],[-73.833878,41.651716],[-73.833986,41.65174],[-73.83442100000001,41.651834],[-73.835134,41.651997],[-73.836448,41.652294],[-73.837064,41.652549],[-73.83797,41.653066],[-73.83836599999999,41.653303],[-73.83867100000001,41.65344],[-73.838781,41.653481],[-73.83910299999999,41.653549],[-73.83972799999999,41.653629],[-73.840227,41.653668],[-73.841453,41.653798],[-73.84201400000001,41.653861],[-73.842595,41.653915],[-73.842821,41.653936],[-73.84326,41.653995],[-73.843332,41.654011],[-73.84457399999999,41.654336],[-73.84482199999999,41.654403],[-73.84520999999999,41.654528],[-73.845551,41.654668],[-73.84581300000001,41.654793],[-73.845977,41.654912],[-73.84612300000001,41.655037],[-73.846317,41.655248],[-73.84640400000001,41.655384],[-73.84647699999999,41.655523],[-73.846785,41.656237],[-73.84719200000001,41.657175],[-73.847553,41.657954],[-73.847914,41.658698],[-73.84822,41.659286],[-73.84831699999999,41.659336],[-73.848446,41.659373],[-73.848573,41.659361],[-73.848951,41.659279],[-73.849225,41.659242],[-73.849459,41.659179],[-73.84969599999999,41.659127],[-73.853185,41.658446],[-73.853684,41.658362],[-73.854467,41.658204],[-73.85475700000001,41.65814],[-73.854842,41.658127],[-73.85458300000001,41.658873],[-73.854524,41.659082],[-73.854339,41.659856],[-73.854207,41.660491],[-73.854151,41.66095],[-73.854113,41.66148],[-73.854106,41.661631],[-73.854094,41.661919],[-73.85409199999999,41.662679],[-73.854123,41.663097],[-73.85420000000001,41.663832],[-73.854332,41.664677],[-73.854412,41.66499],[-73.85463900000001,41.665785],[-73.854936,41.666638],[-73.855138,41.667126],[-73.85538200000001,41.667673],[-73.85554399999999,41.667992],[-73.855847,41.668518],[-73.856703,41.669945],[-73.85728400000001,41.670884],[-73.857854,41.671832],[-73.859155,41.673996],[-73.860276,41.675825],[-73.861014,41.677041],[-73.861226,41.677365],[-73.8627,41.679813],[-73.86313199999999,41.680427],[-73.86394300000001,41.681449],[-73.86427999999999,41.68184],[-73.864895,41.682491],[-73.865655,41.683171],[-73.86631199999999,41.683693],[-73.866581,41.68391],[-73.866743,41.68403],[-73.866668,41.684107]]],"type":"Polygon"}
}