{
  "id": "360070119032",
  "type": "Feature",
  "properties": {
    "area_land":43029069,
    "area_water":61112,
    "geoid":"360070119032",
    "name":"Block Group 2",
    "state":"ny"
},
  "bbox": [
    -76.070289,
    42.339607,
    -75.982641,
    42.412761
],
  "geometry": {"coordinates":[[[-76.070289,42.411657],[-76.06842,42.411707],[-76.067638,42.411723],[-76.05807799999999,42.411932],[-76.057785,42.411938],[-76.057633,42.411941],[-76.048411,42.412143],[-76.044113,42.412237],[-76.042441,42.412273],[-76.024308,42.41267],[-76.022689,42.412706],[-76.02223600000001,42.412761],[-76.02220800000001,42.412688],[-76.022187,42.412634],[-76.022053,42.412284],[-76.021953,42.412093],[-76.021779,42.411848],[-76.021198,42.411228],[-76.021126,42.411106],[-76.021068,42.410978],[-76.020978,42.410644],[-76.02096400000001,42.410347],[-76.020971,42.409938],[-76.021036,42.409651],[-76.021136,42.409333],[-76.021237,42.409147],[-76.02137399999999,42.409008],[-76.017731,42.409058],[-76.017625,42.409061],[-76.015383,42.40912],[-76.014612,42.40914],[-76.012381,42.409199],[-75.999646,42.40959],[-75.992141,42.409809],[-75.98656,42.409989],[-75.98641000000001,42.406614],[-75.98632600000001,42.404697],[-75.986063,42.400536],[-75.98582500000001,42.396782],[-75.985721,42.394953],[-75.985327,42.388877],[-75.985139,42.386612],[-75.984742,42.381749],[-75.984497,42.378051],[-75.984376,42.375073],[-75.984207,42.373219],[-75.983881,42.365247],[-75.983745,42.361717],[-75.983699,42.358661],[-75.983166,42.347983],[-75.98312799999999,42.347106],[-75.98309399999999,42.346242],[-75.982641,42.342586],[-75.982896,42.340827],[-75.98284700000001,42.339897],[-75.982839,42.339607],[-75.983859,42.340402],[-75.98579100000001,42.341757],[-75.98686499999999,42.342341],[-75.990151,42.343977],[-75.99162099999999,42.344661],[-75.993883,42.34572],[-75.99607899999999,42.346727],[-75.997415,42.347412],[-75.998445,42.348166],[-75.999228,42.349157],[-75.99937799999999,42.349553],[-75.999746,42.349674],[-75.99993000000001,42.349725],[-76.000725,42.349912],[-76.000939,42.349973],[-76.001283,42.350095],[-76.0016,42.350248],[-76.00236599999999,42.35063],[-76.00251,42.350705],[-76.00333500000001,42.351137],[-76.003457,42.3512],[-76.003495,42.35122],[-76.00353800000001,42.351242],[-76.00385799999999,42.351409],[-76.004865,42.351925],[-76.005387,42.352194],[-76.006562,42.352831],[-76.006648,42.352874],[-76.007108,42.353032],[-76.007514,42.353153],[-76.008061,42.353269],[-76.008554,42.353315],[-76.009013,42.353338],[-76.009574,42.353281],[-76.010606,42.353126],[-76.011494,42.352989],[-76.011695,42.352949],[-76.012147,42.352885],[-76.012612,42.352857],[-76.013165,42.352834],[-76.013214,42.352836],[-76.013473,42.352858],[-76.01387800000001,42.352916],[-76.014233,42.353001],[-76.014506,42.353079],[-76.01630299999999,42.353765],[-76.01809299999999,42.354537],[-76.018985,42.354889],[-76.019643,42.355116],[-76.020307,42.355253],[-76.020685,42.355312],[-76.021635,42.355331],[-76.022846,42.355273],[-76.023416,42.355261],[-76.023715,42.355267],[-76.023839,42.355263],[-76.02464000000001,42.355295],[-76.02668199999999,42.355442],[-76.026991,42.355478],[-76.02775699999999,42.355601],[-76.029004,42.355827],[-76.029281,42.355869],[-76.02988999999999,42.355909],[-76.03060600000001,42.355917],[-76.031882,42.355898],[-76.03342499999999,42.355859],[-76.03446,42.355806],[-76.03502,42.355793],[-76.035886,42.355748],[-76.03662799999999,42.355709],[-76.03806,42.355826],[-76.04057299999999,42.356099],[-76.042275,42.356271],[-76.04311,42.356368],[-76.043485,42.356438],[-76.043942,42.356571],[-76.044419,42.356758],[-76.044785,42.356909],[-76.045664,42.357258],[-76.04589199999999,42.357337],[-76.04677100000001,42.357578],[-76.04930299999999,42.358243],[-76.049475,42.35829],[-76.049909,42.35841],[-76.050614,42.3586],[-76.05077799999999,42.358635],[-76.051247,42.358726],[-76.05283799999999,42.358939],[-76.053313,42.359003],[-76.054827,42.359192],[-76.05521899999999,42.359212],[-76.055486,42.359216],[-76.055853,42.359198],[-76.055992,42.359185],[-76.05641900000001,42.359128],[-76.057171,42.358958],[-76.057197,42.358952],[-76.057506,42.358872],[-76.06035,42.358198],[-76.060591,42.358144],[-76.060776,42.358103],[-76.061279,42.358018],[-76.061404,42.357999],[-76.061673,42.357969],[-76.06178300000001,42.357957],[-76.062455,42.357923],[-76.062406,42.358051],[-76.06218800000001,42.358502],[-76.06250300000001,42.358619],[-76.063303,42.358849],[-76.06359399999999,42.358961],[-76.063615,42.358961],[-76.06364000000001,42.359214],[-76.063712,42.359881],[-76.063867,42.361359],[-76.064229,42.364074],[-76.064291,42.364345],[-76.06436100000001,42.364517],[-76.06458499999999,42.364832],[-76.064999,42.365315],[-76.06585099999999,42.366237],[-76.06611700000001,42.366589],[-76.066231,42.366757],[-76.06668000000001,42.367396],[-76.06680299999999,42.367616],[-76.06689,42.367844],[-76.066968,42.368226],[-76.06709499999999,42.36899],[-76.067142,42.369464],[-76.06719,42.370225],[-76.06724800000001,42.370585],[-76.067373,42.371319],[-76.06745100000001,42.371848],[-76.067549,42.372751],[-76.06759,42.373252],[-76.067669,42.37477],[-76.06773800000001,42.375887],[-76.067773,42.377244],[-76.06777200000001,42.378473],[-76.067763,42.378976],[-76.067826,42.380025],[-76.067857,42.380964],[-76.067866,42.382143],[-76.06783799999999,42.382421],[-76.067728,42.382881],[-76.06753999999999,42.383545],[-76.067387,42.384175],[-76.067246,42.384796],[-76.067091,42.385269],[-76.066873,42.385851],[-76.06663399999999,42.386611],[-76.066506,42.38685],[-76.06634200000001,42.387135],[-76.065646,42.388183],[-76.06552499999999,42.388411],[-76.065439,42.388652],[-76.06535599999999,42.389025],[-76.065324,42.389438],[-76.065324,42.389997],[-76.065342,42.390624],[-76.065319,42.390761],[-76.065214,42.391042],[-76.065183,42.391104],[-76.064992,42.391523],[-76.064894,42.391799],[-76.06487300000001,42.391899],[-76.06486599999999,42.392226],[-76.064942,42.392665],[-76.065127,42.393435],[-76.06518699999999,42.393664],[-76.065409,42.394338],[-76.06550900000001,42.394766],[-76.06560899999999,42.395043],[-76.065725,42.395328],[-76.065753,42.395467],[-76.065764,42.395637],[-76.065764,42.395828],[-76.065765,42.39594],[-76.06575599999999,42.396162],[-76.06575599999999,42.396734],[-76.06573,42.397044],[-76.065611,42.397781],[-76.06557599999999,42.398438],[-76.065572,42.399169],[-76.06559,42.399517],[-76.065623,42.39973],[-76.065744,42.400256],[-76.065803,42.40039],[-76.065938,42.400576],[-76.066074,42.400689],[-76.066337,42.400838],[-76.06734899999999,42.401369],[-76.067682,42.401583],[-76.06782200000001,42.401707],[-76.067993,42.401891],[-76.068108,42.402042],[-76.068163,42.402143],[-76.06830600000001,42.402422],[-76.068358,42.402549],[-76.068512,42.402921],[-76.069018,42.404306],[-76.069119,42.40473],[-76.069137,42.404878],[-76.069131,42.405313],[-76.06907699999999,42.406253],[-76.06908,42.406299],[-76.06913,42.407074],[-76.069153,42.407216],[-76.069183,42.407375],[-76.069371,42.408014],[-76.06978100000001,42.409445],[-76.07003,42.410392],[-76.070222,42.41127],[-76.070289,42.411657]]],"type":"Polygon"}
}