{
  "id": "360850138005",
  "type": "Feature",
  "properties": {
    "area_land":207597,
    "area_water":0,
    "geoid":"360850138005",
    "name":"Block Group 5",
    "state":"ny"
},
  "bbox": [
    -74.129144,
    40.57094,
    -74.121286,
    40.576369
],
  "geometry": {"coordinates":[[[-74.128148,40.575056],[-74.12779500000001,40.575185],[-74.127653,40.575235],[-74.12752999999999,40.575398],[-74.127397,40.575603],[-74.12729,40.5758],[-74.12720400000001,40.575995],[-74.127135,40.576194],[-74.127089,40.576369],[-74.12665699999999,40.576286],[-74.125637,40.575973],[-74.125134,40.575881],[-74.124084,40.575834],[-74.123497,40.575808],[-74.12332000000001,40.575783],[-74.123177,40.57575],[-74.123019,40.575698],[-74.122871,40.57563],[-74.12276,40.575566],[-74.12264399999999,40.575483],[-74.12177,40.575054],[-74.121853,40.574652],[-74.121831,40.574217],[-74.1217,40.573833],[-74.121604,40.573556],[-74.121394,40.572975],[-74.121286,40.572107],[-74.12162499999999,40.571502],[-74.122169,40.57094],[-74.125494,40.572884],[-74.125934,40.573064],[-74.126811,40.573409],[-74.12771499999999,40.573759],[-74.129144,40.57473],[-74.128148,40.575056]]],"type":"Polygon"}
}