{
  "id": "360595195001",
  "type": "Feature",
  "properties": {
    "area_land":487090,
    "area_water":0,
    "geoid":"360595195001",
    "name":"Block Group 1",
    "state":"ny"
},
  "bbox": [
    -73.515124,
    40.781271,
    -73.503004,
    40.788947
],
  "geometry": {"coordinates":[[[-73.515124,40.786087],[-73.514306,40.786146],[-73.51423,40.786179],[-73.514197,40.786214],[-73.51418200000001,40.786258],[-73.51418200000001,40.786308],[-73.514325,40.787427],[-73.513104,40.787516],[-73.51298800000001,40.787535],[-73.512873,40.78757],[-73.512702,40.787668],[-73.512604,40.787772],[-73.512556,40.78786],[-73.512534,40.787926],[-73.512529,40.78809],[-73.51255999999999,40.788291],[-73.512574,40.788324],[-73.51257,40.788508],[-73.51246999999999,40.788829],[-73.512252,40.788814],[-73.512112,40.788819],[-73.511715,40.788857],[-73.51154,40.787627],[-73.510987,40.787672],[-73.510828,40.787696],[-73.51072600000001,40.787723],[-73.51058500000001,40.787777],[-73.51043199999999,40.787845],[-73.510558,40.78798],[-73.51061199999999,40.78806],[-73.51064700000001,40.788128],[-73.51027499999999,40.788201],[-73.509817,40.788258],[-73.50953800000001,40.788259],[-73.509321,40.788228],[-73.509163,40.788166],[-73.509022,40.788068],[-73.50885,40.787943],[-73.508782,40.78791],[-73.508728,40.787896],[-73.508594,40.787892],[-73.50808000000001,40.787944],[-73.50558700000001,40.788205],[-73.50498,40.788269],[-73.504912,40.788288],[-73.504839,40.788326],[-73.504788,40.788384],[-73.50476999999999,40.788441],[-73.504813,40.788871],[-73.50381400000001,40.788947],[-73.503799,40.788871],[-73.50367,40.787862],[-73.503406,40.785841],[-73.50318799999999,40.784178],[-73.503004,40.782756],[-73.50347600000001,40.782389],[-73.503936,40.78203],[-73.504912,40.781271],[-73.504985,40.781812],[-73.507228,40.781635],[-73.507336,40.782421],[-73.507434,40.783147],[-73.50950899999999,40.782983],[-73.50956600000001,40.783416],[-73.509822,40.785311],[-73.510087,40.785261],[-73.510189,40.785228],[-73.51037700000001,40.785139],[-73.51046700000001,40.785061],[-73.511242,40.785425],[-73.511364,40.785464],[-73.511617,40.785502],[-73.511566,40.785124],[-73.512569,40.785045],[-73.513296,40.784991],[-73.513498,40.784976],[-73.513672,40.784955],[-73.51382700000001,40.784906],[-73.51419,40.784702],[-73.514382,40.784615],[-73.514527,40.784585],[-73.514922,40.784554],[-73.515017,40.785276],[-73.51506999999999,40.785682],[-73.515124,40.786087]]],"type":"Polygon"}
}