{
  "id": "360810185023",
  "type": "Feature",
  "properties": {
    "area_land":49141,
    "area_water":0,
    "geoid":"360810185023",
    "name":"Block Group 3",
    "state":"ny"
},
  "bbox": [
    -73.924105,
    40.739525,
    -73.920956,
    40.741692
],
  "geometry": {"coordinates":[[[-73.924065,40.73998],[-73.923739,40.741692],[-73.92281,40.741585],[-73.92188299999999,40.741478],[-73.920956,40.741362],[-73.92132100000001,40.739525],[-73.92224899999999,40.739632],[-73.923176,40.73974],[-73.924105,40.739848],[-73.924065,40.73998]]],"type":"Polygon"}
}