{
  "id": "360894905003",
  "type": "Feature",
  "properties": {
    "area_land":47486636,
    "area_water":10997109,
    "geoid":"360894905003",
    "name":"Block Group 3",
    "state":"ny"
},
  "bbox": [
    -75.245673,
    44.827447,
    -75.079046,
    44.900046
],
  "geometry": {"coordinates":[[[-75.245673,44.864026],[-75.241294,44.866948],[-75.239921,44.867087],[-75.228638,44.867891],[-75.228559,44.86797],[-75.22118,44.875055],[-75.219926,44.876265],[-75.218576,44.877569],[-75.217885,44.877539],[-75.21648399999999,44.877478],[-75.20877299999999,44.877499],[-75.203845,44.877534],[-75.203012,44.877548],[-75.19965500000001,44.879438],[-75.19622699999999,44.881368],[-75.19407200000001,44.882625],[-75.19232700000001,44.882764],[-75.189311,44.883029],[-75.188277,44.883212],[-75.18035399999999,44.886668],[-75.176288,44.888445],[-75.175269,44.888886],[-75.173603,44.889615],[-75.171809,44.890394],[-75.170016,44.891177],[-75.16871399999999,44.891744],[-75.16777,44.892164],[-75.16512299999999,44.893324],[-75.153344,44.894898],[-75.140547,44.896597],[-75.139866,44.896684],[-75.138908,44.899943],[-75.13887699999999,44.900046],[-75.12971400000001,44.899534],[-75.12739500000001,44.897173],[-75.12638699999999,44.896151],[-75.12572299999999,44.895459],[-75.125398,44.895143],[-75.12492399999999,44.894636],[-75.120977,44.89047],[-75.120496,44.889943],[-75.11970599999999,44.889216],[-75.119181,44.888673],[-75.118982,44.888438],[-75.118887,44.888334],[-75.11874,44.888181],[-75.11859,44.888025],[-75.113018,44.882187],[-75.111727,44.880914],[-75.11137100000001,44.880565],[-75.110568,44.879713],[-75.109497,44.878609],[-75.109375,44.878481],[-75.108402,44.877458],[-75.108338,44.877391],[-75.107602,44.876634],[-75.106674,44.875669],[-75.10612399999999,44.875113],[-75.10601,44.874997],[-75.102912,44.871781],[-75.10114400000001,44.869932],[-75.09978,44.86853],[-75.098949,44.867665],[-75.09826,44.866954],[-75.09787,44.866528],[-75.09781599999999,44.866468],[-75.097317,44.865982],[-75.097129,44.865784],[-75.09670300000001,44.865326],[-75.096407,44.865009],[-75.095928,44.86452],[-75.095018,44.863553],[-75.09451900000001,44.863062],[-75.093127,44.861612],[-75.092631,44.861124],[-75.091188,44.859651],[-75.090232,44.85866],[-75.089814,44.858226],[-75.089789,44.858201],[-75.088795,44.857197],[-75.088331,44.856702],[-75.08736399999999,44.85572],[-75.08697100000001,44.855291],[-75.08653,44.85485],[-75.085628,44.853915],[-75.08513499999999,44.853421],[-75.084665,44.852919],[-75.083719,44.851944],[-75.082801,44.850956],[-75.08079600000001,44.848894],[-75.07918100000001,44.847224],[-75.07904600000001,44.847083],[-75.08060500000001,44.846147],[-75.082054,44.845492],[-75.083411,44.845246],[-75.084907,44.845042],[-75.08628,44.843693],[-75.087828,44.84254],[-75.089045,44.841943],[-75.08962200000001,44.840773],[-75.089855,44.839562],[-75.090411,44.838919],[-75.092096,44.837007],[-75.093467,44.835599],[-75.094831,44.834591],[-75.09601499999999,44.833734],[-75.09696,44.832489],[-75.09758100000001,44.83134],[-75.09879100000001,44.829571],[-75.09924700000001,44.829005],[-75.099851,44.82866],[-75.10045599999999,44.828426],[-75.102627,44.827447],[-75.102847,44.827516],[-75.10512300000001,44.828331],[-75.108996,44.829764],[-75.110394,44.830281],[-75.112539,44.831052],[-75.11789,44.83298],[-75.120144,44.833774],[-75.122451,44.834613],[-75.123864,44.835112],[-75.124725,44.835432],[-75.126445,44.836038],[-75.128047,44.836622],[-75.128874,44.836914],[-75.129682,44.837217],[-75.133848,44.838711],[-75.13467199999999,44.839014],[-75.13549500000001,44.839328],[-75.13658700000001,44.839726],[-75.137784,44.840161],[-75.138789,44.840526],[-75.141048,44.841324],[-75.141519,44.841498],[-75.149005,44.844157],[-75.149191,44.844224],[-75.149833,44.844441],[-75.15057400000001,44.844714],[-75.15383799999999,44.845834],[-75.156282,44.846699],[-75.159125,44.847685],[-75.161421,44.848484],[-75.162282,44.848802],[-75.16425599999999,44.849563],[-75.16733600000001,44.850725],[-75.168243,44.85108],[-75.169691,44.851634],[-75.170619,44.850779],[-75.171706,44.849828],[-75.17220399999999,44.849342],[-75.172589,44.84889],[-75.173114,44.848234],[-75.17374700000001,44.847411],[-75.17428099999999,44.846626],[-75.174522,44.846285],[-75.17531099999999,44.845366],[-75.175563,44.845042],[-75.175982,44.844385],[-75.176187,44.844018],[-75.176424,44.843522],[-75.176608,44.84317],[-75.176878,44.842725],[-75.177162,44.842344],[-75.17761400000001,44.841839],[-75.178814,44.84055],[-75.179227,44.840144],[-75.179413,44.840016],[-75.179766,44.839812],[-75.181555,44.838912],[-75.18234699999999,44.838531],[-75.18404200000001,44.837682],[-75.18571900000001,44.836863],[-75.186544,44.836444],[-75.187887,44.835791],[-75.188227,44.835666],[-75.188941,44.837115],[-75.190876,44.841013],[-75.191407,44.842071],[-75.192087,44.843472],[-75.192357,44.843395],[-75.192646,44.843267],[-75.192835,44.843153],[-75.19511300000001,44.841693],[-75.196178,44.840995],[-75.197142,44.840385],[-75.197559,44.840138],[-75.198218,44.839805],[-75.201718,44.838152],[-75.203777,44.837201],[-75.204111,44.837027],[-75.20449499999999,44.836846],[-75.20540099999999,44.836385],[-75.207027,44.835503],[-75.20811500000001,44.834782],[-75.21015,44.833385],[-75.210363,44.833223],[-75.211241,44.832616],[-75.21148100000001,44.832463],[-75.21209399999999,44.832119],[-75.21344499999999,44.831449],[-75.21352899999999,44.831594],[-75.21368699999999,44.8318],[-75.21384399999999,44.831957],[-75.21404,44.832133],[-75.214558,44.83263],[-75.215084,44.833109],[-75.21540299999999,44.833368],[-75.216775,44.834396],[-75.216971,44.834533],[-75.217912,44.835135],[-75.218795,44.83564],[-75.21973199999999,44.836191],[-75.22067800000001,44.836748],[-75.220752,44.836793],[-75.221102,44.837006],[-75.221406,44.837181],[-75.22172399999999,44.837374],[-75.22230399999999,44.837726],[-75.222668,44.837953],[-75.22309799999999,44.838239],[-75.223274,44.838379],[-75.22367800000001,44.838806],[-75.223788,44.838939],[-75.22412799999999,44.83929],[-75.225008,44.84028],[-75.22739300000001,44.842894],[-75.227825,44.843347],[-75.22845100000001,44.844071],[-75.22897399999999,44.844675],[-75.23028600000001,44.846144],[-75.230979,44.846894],[-75.233271,44.849561],[-75.234728,44.851213],[-75.23599400000001,44.8527],[-75.23716400000001,44.854058],[-75.23796,44.85387],[-75.238007,44.853858],[-75.23803700000001,44.853998],[-75.238235,44.854636],[-75.23824500000001,44.854824],[-75.240414,44.860535],[-75.242272,44.86173],[-75.245673,44.864026]]],"type":"Polygon"}
}