{
  "id": "360610309004",
  "type": "Feature",
  "properties": {
    "area_land":117182,
    "area_water":0,
    "geoid":"360610309004",
    "name":"Block Group 4",
    "state":"ny"
},
  "bbox": [
    -73.9152,
    40.874015,
    -73.908554,
    40.879278
],
  "geometry": {"coordinates":[[[-73.91516799999999,40.875695],[-73.915125,40.875845],[-73.914905,40.876578],[-73.912205,40.878178],[-73.911405,40.879278],[-73.91031,40.879047],[-73.910184,40.879021],[-73.910044,40.878991],[-73.909505,40.878878],[-73.909189,40.878168],[-73.908682,40.877763],[-73.908554,40.877712],[-73.908677,40.877584],[-73.909046,40.877221],[-73.90920800000001,40.877362],[-73.909384,40.877495],[-73.90957400000001,40.877618],[-73.909775,40.877729],[-73.90998500000001,40.877828],[-73.910607,40.877355],[-73.912786,40.875634],[-73.91277700000001,40.87553],[-73.91274300000001,40.875426],[-73.912685,40.875325],[-73.912603,40.875233],[-73.912503,40.875154],[-73.91238800000001,40.87509],[-73.912266,40.875044],[-73.91108800000001,40.874662],[-73.91027,40.874272],[-73.910203,40.874214],[-73.910335,40.874122],[-73.910393,40.87408],[-73.91048499999999,40.874015],[-73.910532,40.874066],[-73.9152,40.875581],[-73.91516799999999,40.875695]]],"type":"Polygon"}
}