{
  "id": "361019630002",
  "type": "Feature",
  "properties": {
    "area_land":62124445,
    "area_water":1003843,
    "geoid":"361019630002",
    "name":"Block Group 2",
    "state":"ny"
},
  "bbox": [
    -77.083272,
    42.000073,
    -76.965728,
    42.073048
],
  "geometry": {"coordinates":[[[-77.083169,42.003914],[-77.08326,42.010847],[-77.083202,42.022569],[-77.08320500000001,42.025998],[-77.083151,42.042178],[-77.08280999999999,42.042244],[-77.081373,42.042642],[-77.081029,42.042713],[-77.08083999999999,42.042738],[-77.078509,42.0429],[-77.07795900000001,42.042939],[-77.07751500000001,42.042981],[-77.07696,42.043035],[-77.076291,42.043128],[-77.075906,42.043203],[-77.07428899999999,42.0436],[-77.07383,42.043742],[-77.07350599999999,42.04388],[-77.073323,42.043965],[-77.072756,42.044269],[-77.072097,42.044674],[-77.071912,42.044809],[-77.07155,42.045102],[-77.071269,42.045349],[-77.07100699999999,42.045548],[-77.06993799999999,42.046214],[-77.068636,42.047015],[-77.066574,42.048354],[-77.065769,42.048896],[-77.065629,42.048975],[-77.06374,42.049804],[-77.06334200000001,42.049987],[-77.06304799999999,42.050122],[-77.062313,42.050432],[-77.062076,42.050488],[-77.061892,42.050492],[-77.061583,42.050454],[-77.06044199999999,42.050244],[-77.060283,42.050223],[-77.05982299999999,42.0502],[-77.057474,42.050347],[-77.05444,42.050494],[-77.05317100000001,42.050542],[-77.052825,42.050624],[-77.05104900000001,42.051109],[-77.048306,42.051892],[-77.046831,42.052299],[-77.045168,42.052776],[-77.045025,42.052826],[-77.044827,42.052916],[-77.043654,42.053524],[-77.043322,42.053674],[-77.042986,42.053763],[-77.04286999999999,42.053786],[-77.04148499999999,42.053963],[-77.039051,42.054221],[-77.038871,42.054252],[-77.03870000000001,42.054317],[-77.03862100000001,42.054369],[-77.038561,42.054421],[-77.03847399999999,42.054564],[-77.03842400000001,42.054755],[-77.03834999999999,42.055248],[-77.03832199999999,42.055354],[-77.038282,42.055478],[-77.038235,42.055553],[-77.038175,42.055623],[-77.038077,42.055694],[-77.03791200000001,42.055761],[-77.03779900000001,42.055779],[-77.037571,42.055791],[-77.035794,42.055791],[-77.034761,42.055809],[-77.033411,42.055842],[-77.032974,42.055861],[-77.03236699999999,42.055871],[-77.03125,42.055847],[-77.030112,42.055852],[-77.029175,42.055864],[-77.029011,42.055869],[-77.027978,42.055892],[-77.02736299999999,42.055901],[-77.02682900000001,42.055899],[-77.025899,42.055907],[-77.025677,42.055917],[-77.02539,42.055947],[-77.024964,42.056004],[-77.024492,42.056092],[-77.02405400000001,42.056201],[-77.02396,42.05623],[-77.023681,42.056317],[-77.021547,42.057099],[-77.02136400000001,42.057168],[-77.020996,42.057307],[-77.020427,42.057562],[-77.020363,42.057597],[-77.02020899999999,42.057681],[-77.019779,42.057954],[-77.019299,42.058325],[-77.018964,42.058628],[-77.01602800000001,42.061687],[-77.01522300000001,42.062502],[-77.014949,42.062704],[-77.014343,42.063128],[-77.013443,42.063735],[-77.00863699999999,42.066918],[-77.008048,42.067271],[-77.007743,42.067417],[-77.007431,42.067544],[-77.007017,42.067691],[-77.006675,42.067781],[-77.006361,42.067866],[-77.006122,42.067918],[-77.00541,42.068016],[-77.00465699999999,42.068111],[-77.003828,42.068234],[-77.002233,42.06843],[-76.999757,42.068755],[-76.99935600000001,42.068806],[-76.999026,42.068847],[-76.99768299999999,42.06902],[-76.99690200000001,42.069122],[-76.99621399999999,42.069171],[-76.995861,42.069178],[-76.995397,42.069163],[-76.99503,42.069135],[-76.991553,42.068786],[-76.990917,42.068763],[-76.990617,42.068765],[-76.99000599999999,42.068818],[-76.989636,42.068877],[-76.98935899999999,42.06894],[-76.989125,42.068999],[-76.988764,42.069105],[-76.988339,42.069261],[-76.983017,42.071355],[-76.981478,42.071967],[-76.981106,42.072112],[-76.980788,42.072231],[-76.980538,42.072313],[-76.980209,42.072412],[-76.979641,42.072566],[-76.978877,42.072722],[-76.978542,42.072783],[-76.978213,42.07283],[-76.97779300000001,42.072877],[-76.977368,42.072917],[-76.977194,42.072927],[-76.97690799999999,42.072945],[-76.975335,42.073043],[-76.97495600000001,42.073048],[-76.974816,42.073041],[-76.974515,42.073027],[-76.97411,42.072986],[-76.973787,42.072944],[-76.97324,42.072841],[-76.97184,42.072557],[-76.971424,42.072488],[-76.971272,42.072468],[-76.970692,42.072428],[-76.970116,42.072421],[-76.969797,42.072434],[-76.969267,42.072482],[-76.96875300000001,42.072529],[-76.966779,42.07273],[-76.966154,42.072759],[-76.965971,42.07276],[-76.965839,42.072751],[-76.965782,42.07275],[-76.965782,42.07273],[-76.96586600000001,42.072025],[-76.965884,42.071874],[-76.965886,42.071856],[-76.965886,42.06999],[-76.965886,42.06997],[-76.965885,42.066073],[-76.965885,42.066052],[-76.965885,42.066026],[-76.965885,42.065986],[-76.965886,42.061074],[-76.965886,42.061042],[-76.965886,42.060474],[-76.965886,42.058261],[-76.965886,42.056974],[-76.965886,42.056888],[-76.965886,42.053624],[-76.965886,42.05345],[-76.965886,42.053342],[-76.965886,42.048846],[-76.965886,42.04371],[-76.965886,42.04305],[-76.96589400000001,42.041402],[-76.965952,42.041184],[-76.965969,42.041121],[-76.96599500000001,42.041015],[-76.96598,42.040977],[-76.965918,42.040823],[-76.96592800000001,42.039077],[-76.965986,42.029025],[-76.965986,42.028827],[-76.965987,42.02762],[-76.965986,42.024792],[-76.965986,42.024205],[-76.96587700000001,42.022457],[-76.965835,42.022055],[-76.965835,42.02194],[-76.965836,42.021714],[-76.965836,42.021638],[-76.96583699999999,42.021526],[-76.965873,42.011438],[-76.96586499999999,42.008432],[-76.96586499999999,42.008261],[-76.965728,42.001276],[-76.99968699999999,42.000874],[-77.00604199999999,42.000828],[-77.007571,42.000722],[-77.00794999999999,42.000682],[-77.00796099999999,42.000674],[-77.008033,42.000654],[-77.00806799999999,42.000649],[-77.008506,42.000618],[-77.00897000000001,42.000594],[-77.0202,42.000469],[-77.021036,42.000494],[-77.02603499999999,42.000487],[-77.031109,42.0004],[-77.03537300000001,42.00044],[-77.038657,42.000591],[-77.04919700000001,42.000558],[-77.050113,42.000554],[-77.050377,42.000552],[-77.052862,42.000533],[-77.063676,42.000461],[-77.064314,42.000448],[-77.073842,42.00026],[-77.08327199999999,42.000073],[-77.083169,42.003914]]],"type":"Polygon"}
}