{
  "id": "360811377002",
  "type": "Feature",
  "properties": {
    "area_land":238923,
    "area_water":0,
    "geoid":"360811377002",
    "name":"Block Group 2",
    "state":"ny"
},
  "bbox": [
    -73.754788,
    40.743518,
    -73.743967,
    40.748801
],
  "geometry": {"coordinates":[[[-73.754788,40.745277],[-73.753501,40.745636],[-73.753964,40.746674],[-73.752076,40.747185],[-73.752571,40.748218],[-73.75044200000001,40.748801],[-73.74946300000001,40.746735],[-73.748546,40.746988],[-73.747665,40.74723],[-73.74678,40.747471],[-73.745895,40.747714],[-73.745018,40.747958],[-73.744151,40.748217],[-73.743967,40.74763],[-73.746122,40.746539],[-73.745931,40.745716],[-73.74682900000001,40.745471],[-73.747713,40.745232],[-73.748631,40.744979],[-73.749543,40.744732],[-73.750434,40.744487],[-73.751316,40.744243],[-73.75219300000001,40.744002],[-73.75308,40.743762],[-73.753978,40.743518],[-73.754788,40.745277]]],"type":"Polygon"}
}