{
  "id": "360610226002",
  "type": "Feature",
  "properties": {
    "area_land":44032,
    "area_water":0,
    "geoid":"360610226002",
    "name":"Block Group 2",
    "state":"ny"
},
  "bbox": [
    -73.946031,
    40.810942,
    -73.942249,
    40.813388
],
  "geometry": {"coordinates":[[[-73.945984,40.812183],[-73.94556799999999,40.812752],[-73.94510200000001,40.813388],[-73.944759,40.813245],[-73.944485,40.813131],[-73.94270299999999,40.81239],[-73.942249,40.812201],[-73.94272100000001,40.811568],[-73.943172,40.810942],[-73.946031,40.812119],[-73.945984,40.812183]]],"type":"Polygon"}
}