{
  "id": "360690504001",
  "type": "Feature",
  "properties": {
    "area_land":74017271,
    "area_water":178822,
    "geoid":"360690504001",
    "name":"Block Group 1",
    "state":"ny"
},
  "bbox": [
    -77.133397,
    42.954888,
    -76.963563,
    43.013157
],
  "geometry": {"coordinates":[[[-77.13315,43.012463],[-77.13241499999999,43.012466],[-77.13217,43.012468],[-77.131581,43.01247],[-77.12981600000001,43.012481],[-77.129231,43.012486],[-77.12902,43.012486],[-77.12839099999999,43.01249],[-77.128182,43.012493],[-77.127156,43.012484],[-77.124697,43.012467],[-77.124359,43.012481],[-77.124084,43.012491],[-77.123542,43.012513],[-77.12306100000001,43.012516],[-77.12290299999999,43.012516],[-77.122429,43.012518],[-77.12227300000001,43.01252],[-77.122248,43.01252],[-77.122176,43.01252],[-77.122152,43.01252],[-77.120087,43.012525],[-77.113895,43.012543],[-77.111831,43.012549],[-77.110715,43.012551],[-77.107373,43.012561],[-77.10625899999999,43.012565],[-77.104108,43.012567],[-77.097657,43.012575],[-77.095508,43.012579],[-77.09509199999999,43.012579],[-77.093847,43.01258],[-77.093433,43.012581],[-77.09219899999999,43.012582],[-77.088503,43.012592],[-77.087271,43.012596],[-77.085626,43.012599],[-77.08069500000001,43.01261],[-77.07905100000001,43.012614],[-77.078148,43.012614],[-77.075445,43.012619],[-77.074545,43.012621],[-77.074174,43.01262],[-77.07306800000001,43.012624],[-77.0727,43.012627],[-77.072278,43.012628],[-77.071012,43.012631],[-77.07059,43.012632],[-77.070508,43.012633],[-77.06934099999999,43.012635],[-77.065594,43.012643],[-77.064346,43.012646],[-77.063783,43.012647],[-77.062095,43.012651],[-77.061533,43.012653],[-77.060818,43.012654],[-77.05867600000001,43.012658],[-77.057962,43.01266],[-77.057748,43.01266],[-77.057106,43.012662],[-77.056893,43.012663],[-77.056061,43.012666],[-77.053567,43.012679],[-77.052736,43.012683],[-77.051655,43.012688],[-77.048416,43.012704],[-77.047336,43.01271],[-77.04694499999999,43.012711],[-77.045772,43.012718],[-77.045382,43.01272],[-77.04294899999999,43.012732],[-77.03565399999999,43.012768],[-77.03322199999999,43.012781],[-77.032543,43.012783],[-77.030511,43.012791],[-77.02983399999999,43.012795],[-77.02879799999999,43.012799],[-77.02569200000001,43.012819],[-77.02466,43.012826],[-77.024387,43.012826],[-77.02357600000001,43.012833],[-77.02330600000001,43.012837],[-77.02327,43.012837],[-77.023166,43.012837],[-77.02313100000001,43.012838],[-77.02284,43.012839],[-77.02197099999999,43.012847],[-77.02168399999999,43.01285],[-77.021224,43.012851],[-77.01984899999999,43.012858],[-77.019391,43.012863],[-77.01848200000001,43.012862],[-77.015755,43.012859],[-77.01484600000001,43.012859],[-77.013289,43.012844],[-77.011608,43.012829],[-77.00862100000001,43.012832],[-77.007065,43.012834],[-77.006772,43.012834],[-77.005893,43.012835],[-77.005601,43.012836],[-77.003722,43.012836],[-76.99974400000001,43.012841],[-76.99808899999999,43.012849],[-76.996212,43.012859],[-76.994361,43.012875],[-76.988809,43.012927],[-76.98696,43.012945],[-76.98639900000001,43.01295],[-76.98472,43.012965],[-76.98416,43.012971],[-76.982896,43.012983],[-76.979107,43.01302],[-76.977844,43.013033],[-76.97506,43.013057],[-76.96670899999999,43.013131],[-76.963926,43.013157],[-76.963926,43.013117],[-76.963927,43.012992],[-76.963928,43.01295],[-76.963928,43.012921],[-76.963928,43.012836],[-76.96392899999999,43.012808],[-76.963927,43.012409],[-76.963925,43.011212],[-76.96392400000001,43.010813],[-76.96392,43.010018],[-76.96391,43.007636],[-76.96390700000001,43.006842],[-76.96390599999999,43.006737],[-76.96390599999999,43.006422],[-76.96390599999999,43.006318],[-76.96390599999999,43.00626],[-76.96390599999999,43.006087],[-76.96390599999999,43.00603],[-76.96390599999999,43.006],[-76.96390599999999,43.005912],[-76.96390599999999,43.005883],[-76.96390599999999,43.005819],[-76.96390599999999,43.00563],[-76.96390599999999,43.005567],[-76.963903,43.00544],[-76.963894,43.005062],[-76.963892,43.004936],[-76.963892,43.00489],[-76.963892,43.004754],[-76.963892,43.004709],[-76.96388899999999,43.004662],[-76.96388399999999,43.004521],[-76.963882,43.004474],[-76.963881,43.004429],[-76.96388,43.004296],[-76.96388,43.004252],[-76.96388,43.004192],[-76.96388,43.004014],[-76.96388,43.003955],[-76.96387799999999,43.003608],[-76.963877,43.003487],[-76.963876,43.003459],[-76.963869,43.003194],[-76.96386,43.002827],[-76.963818,43.000003],[-76.963812,42.998177],[-76.96378799999999,42.996555],[-76.963784,42.994646],[-76.96376100000001,42.993681],[-76.963745,42.99076],[-76.963741,42.990519],[-76.963729,42.989799],[-76.96372599999999,42.989559],[-76.96373,42.988534],[-76.963734,42.987644],[-76.96373199999999,42.986106],[-76.96371600000001,42.98546],[-76.96369199999999,42.984436],[-76.96369,42.984331],[-76.963677,42.983274],[-76.96363700000001,42.979891],[-76.963638,42.979791],[-76.96364800000001,42.979097],[-76.963643,42.97863],[-76.96364199999999,42.978595],[-76.963641,42.97849],[-76.963641,42.978455],[-76.96363599999999,42.978031],[-76.963621,42.976761],[-76.963616,42.976338],[-76.963605,42.975715],[-76.96360300000001,42.975556],[-76.963577,42.974812],[-76.96356900000001,42.973847],[-76.963565,42.973225],[-76.96356400000001,42.973163],[-76.96356299999999,42.972977],[-76.96356299999999,42.972915],[-76.96359,42.972252],[-76.963673,42.970262],[-76.963701,42.9696],[-76.963701,42.969561],[-76.963701,42.969444],[-76.963702,42.969406],[-76.96370400000001,42.968857],[-76.963712,42.967211],[-76.96371600000001,42.966663],[-76.963712,42.965349],[-76.963702,42.961407],[-76.96369900000001,42.960094],[-76.963697,42.959595],[-76.96369300000001,42.9581],[-76.96369199999999,42.957602],[-76.96368699999999,42.955699],[-76.964046,42.955631],[-76.964912,42.955481],[-76.96590500000001,42.95531],[-76.966894,42.955186],[-76.967595,42.955111],[-76.9682,42.95506],[-76.96861800000001,42.955029],[-76.969758,42.954945],[-76.96986,42.95494],[-76.970755,42.954902],[-76.970935,42.954895],[-76.97156099999999,42.954888],[-76.973443,42.954896],[-76.97359299999999,42.954897],[-76.97434,42.954908],[-76.97497199999999,42.954913],[-76.97687000000001,42.954931],[-76.977503,42.954937],[-76.977935,42.954937],[-76.978087,42.954938],[-76.979839,42.95496],[-76.980234,42.954966],[-76.980423,42.954968],[-76.980636,42.95497],[-76.98127599999999,42.954976],[-76.98148999999999,42.954979],[-76.981549,42.954979],[-76.981647,42.954976],[-76.981824,42.954981],[-76.982191,42.954985],[-76.983091,42.954998],[-76.983632,42.955005],[-76.983794,42.955005],[-76.98428,42.955008],[-76.984443,42.955009],[-76.985192,42.955012],[-76.986318,42.955019],[-76.987078,42.955033],[-76.98743899999999,42.955038],[-76.98818900000001,42.95505],[-76.98857099999999,42.955053],[-76.98940899999999,42.955062],[-76.989717,42.955065],[-76.990099,42.955069],[-76.990943,42.955075],[-76.99314099999999,42.955092],[-76.994908,42.955106],[-76.99969,42.955163],[-77.001633,42.955177],[-77.002267,42.955189],[-77.00399899999999,42.955222],[-77.005309,42.955266],[-77.00673399999999,42.95533],[-77.01101199999999,42.955522],[-77.012438,42.955587],[-77.013575,42.955644],[-77.017364,42.955822],[-77.018638,42.955882],[-77.02018099999999,42.955947],[-77.02172299999999,42.956031],[-77.022508,42.956058],[-77.024041,42.956199],[-77.024799,42.95629],[-77.026329,42.956512],[-77.027089,42.956652],[-77.027905,42.956816],[-77.02860200000001,42.956966],[-77.029984,42.957312],[-77.030434,42.957438],[-77.03125300000001,42.957679],[-77.031802,42.957854],[-77.03194999999999,42.957905],[-77.03256399999999,42.958116],[-77.03332,42.958394],[-77.034077,42.95869],[-77.034825,42.958999],[-77.036524,42.959745],[-77.037255,42.960062],[-77.03851299999999,42.960608],[-77.039444,42.961023],[-77.040172,42.961348],[-77.040615,42.961535],[-77.040764,42.961599],[-77.041935,42.962121],[-77.04237500000001,42.962318],[-77.042446,42.962349],[-77.042659,42.962442],[-77.042731,42.962474],[-77.045514,42.96369],[-77.046779,42.964244],[-77.04751899999999,42.964581],[-77.050489,42.96588],[-77.05122900000001,42.966188],[-77.0527,42.966749],[-77.05342899999999,42.967004],[-77.053933,42.96716],[-77.05490500000001,42.967461],[-77.056333,42.967842],[-77.056461,42.967867],[-77.056861,42.967968],[-77.056946,42.967989],[-77.05720100000001,42.968053],[-77.057286,42.968075],[-77.057721,42.968167],[-77.057821,42.968189],[-77.059033,42.968425],[-77.059471,42.968511],[-77.059713,42.968548],[-77.060113,42.96861],[-77.06044300000001,42.968656],[-77.060687,42.96869],[-77.06148899999999,42.968798],[-77.062223,42.968884],[-77.063665,42.969001],[-77.063705,42.969003],[-77.06440000000001,42.969046],[-77.06514,42.969081],[-77.066631,42.969125],[-77.06886299999999,42.969176],[-77.07097400000001,42.96925],[-77.07176699999999,42.969301],[-77.072496,42.969369],[-77.0728,42.969408],[-77.07328200000001,42.969471],[-77.07407499999999,42.969591],[-77.07529100000001,42.969826],[-77.075785,42.969952],[-77.076205,42.970042],[-77.076587,42.970133],[-77.076722,42.970171],[-77.07701400000001,42.970254],[-77.077945,42.970544],[-77.079183,42.970979],[-77.07946,42.971085],[-77.080325,42.971417],[-77.08036,42.97143],[-77.081012,42.971676],[-77.082583,42.972252],[-77.082987,42.972389],[-77.084192,42.972768],[-77.085104,42.973024],[-77.08611399999999,42.973291],[-77.086658,42.97342],[-77.087795,42.973659],[-77.088334,42.973768],[-77.089448,42.973965],[-77.09012199999999,42.974065],[-77.091149,42.974205],[-77.091713,42.974269],[-77.092766,42.974361],[-77.094138,42.974451],[-77.094796,42.974472],[-77.095879,42.974494],[-77.09632999999999,42.974504],[-77.098449,42.974506],[-77.10117,42.974529],[-77.102678,42.974536],[-77.104659,42.974518],[-77.106658,42.974481],[-77.11251,42.9743],[-77.113572,42.974269],[-77.114498,42.97423],[-77.121342,42.974014],[-77.12302699999999,42.973965],[-77.123514,42.973946],[-77.12508099999999,42.973889],[-77.12692199999999,42.973841],[-77.12873500000001,42.973771],[-77.13003,42.973731],[-77.132203,42.973665],[-77.132216,42.974161],[-77.132216,42.97419],[-77.132265,42.975767],[-77.132282,42.976293],[-77.132279,42.977337],[-77.132272,42.980472],[-77.13227000000001,42.981518],[-77.132273,42.981621],[-77.132282,42.981934],[-77.13228599999999,42.982038],[-77.13235899999999,42.987416],[-77.13239,42.988126],[-77.132682,42.994758],[-77.13283800000001,42.998514],[-77.132863,43.000053],[-77.133135,43.006379],[-77.133397,43.012463],[-77.13315,43.012463]]],"type":"Polygon"}
}