{
  "id": "360670014003",
  "type": "Feature",
  "properties": {
    "area_land":95483,
    "area_water":0,
    "geoid":"360670014003",
    "name":"Block Group 3",
    "state":"ny"
},
  "bbox": [
    -76.151516,
    43.064149,
    -76.1458,
    43.067787
],
  "geometry": {"coordinates":[[[-76.150676,43.067006],[-76.150302,43.067517],[-76.150104,43.067787],[-76.14913799999999,43.067395],[-76.14886,43.067283],[-76.14828900000001,43.06703],[-76.148104,43.066949],[-76.14670700000001,43.066382],[-76.14579999999999,43.066018],[-76.146351,43.065262],[-76.14668,43.064848],[-76.147209,43.064149],[-76.148126,43.064521],[-76.149039,43.064892],[-76.150447,43.065464],[-76.151516,43.065899],[-76.150676,43.067006]]],"type":"Polygon"}
}