{
  "id": "360850134002",
  "type": "Feature",
  "properties": {
    "area_land":285393,
    "area_water":0,
    "geoid":"360850134002",
    "name":"Block Group 2",
    "state":"ny"
},
  "bbox": [
    -74.12024,
    40.563915,
    -74.111482,
    40.571017
],
  "geometry": {"coordinates":[[[-74.119574,40.566948],[-74.11903599999999,40.567534],[-74.118482,40.568128],[-74.117918,40.56871],[-74.117362,40.569283],[-74.117025,40.569644],[-74.116815,40.569865],[-74.11626699999999,40.570444],[-74.115859,40.570865],[-74.11571000000001,40.571017],[-74.11354,40.569858],[-74.111482,40.568763],[-74.112055,40.568195],[-74.112622,40.567633],[-74.113197,40.567061],[-74.11376199999999,40.566497],[-74.114338,40.565917],[-74.11493,40.565338],[-74.1155,40.564775],[-74.116362,40.563915],[-74.11721300000001,40.564418],[-74.11803999999999,40.564922],[-74.11876100000001,40.565355],[-74.11948,40.565779],[-74.12024,40.566228],[-74.119574,40.566948]]],"type":"Polygon"}
}