{
  "id": "360850248002",
  "type": "Feature",
  "properties": {
    "area_land":320351,
    "area_water":0,
    "geoid":"360850248002",
    "name":"Block Group 2",
    "state":"ny"
},
  "bbox": [
    -74.249514,
    40.509543,
    -74.239701,
    40.515893
],
  "geometry": {"coordinates":[[[-74.249514,40.514157],[-74.24910300000001,40.514314],[-74.248457,40.514539],[-74.247743,40.514737],[-74.24623,40.515157],[-74.245327,40.51542],[-74.24369900000001,40.515893],[-74.243623,40.515833],[-74.243528,40.515777],[-74.241755,40.514069],[-74.239701,40.511946],[-74.240251,40.51166],[-74.240585,40.511493],[-74.24198199999999,40.510816],[-74.242411,40.510593],[-74.24257299999999,40.510512],[-74.24273700000001,40.510421],[-74.243005,40.510287],[-74.243235,40.510183],[-74.243538,40.510063],[-74.243741,40.509992],[-74.24499,40.509622],[-74.245248,40.509543],[-74.246683,40.511072],[-74.24787000000001,40.512348],[-74.248563,40.513093],[-74.249202,40.513805],[-74.249514,40.514157]]],"type":"Polygon"}
}