{
  "id": "360810081001",
  "type": "Feature",
  "properties": {
    "area_land":112317,
    "area_water":0,
    "geoid":"360810081001",
    "name":"Block Group 1",
    "state":"ny"
},
  "bbox": [
    -73.936184,
    40.767013,
    -73.930126,
    40.7727
],
  "geometry": {"coordinates":[[[-73.936184,40.767692],[-73.93593199999999,40.767784],[-73.935821,40.768631],[-73.935771,40.76905],[-73.935227,40.769526],[-73.935019,40.769701],[-73.934832,40.769891],[-73.93469,40.770065],[-73.93459900000001,40.770195],[-73.93447399999999,40.770412],[-73.93446400000001,40.770439],[-73.93429399999999,40.770899],[-73.934246,40.771029],[-73.934015,40.771697],[-73.933976,40.771771],[-73.933916,40.771844],[-73.933836,40.771908],[-73.93373800000001,40.771959],[-73.933629,40.771995],[-73.933515,40.772012],[-73.933403,40.772012],[-73.93329900000001,40.771997],[-73.932965,40.772149],[-73.932783,40.772393],[-73.93268500000001,40.7727],[-73.931473,40.772325],[-73.930772,40.772108],[-73.930126,40.772114],[-73.93013000000001,40.77206],[-73.93014599999999,40.772007],[-73.93017399999999,40.771957],[-73.930212,40.771913],[-73.93127800000001,40.771516],[-73.932046,40.770545],[-73.932726,40.769699],[-73.933367,40.768912],[-73.93344500000001,40.768818],[-73.934229,40.767855],[-73.934935,40.767013],[-73.93594899999999,40.767578],[-73.936184,40.767692]]],"type":"Polygon"}
}