{
  "id": "360810580002",
  "type": "Feature",
  "properties": {
    "area_land":170354,
    "area_water":0,
    "geoid":"360810580002",
    "name":"Block Group 2",
    "state":"ny"
},
  "bbox": [
    -73.732315,
    40.702768,
    -73.726762,
    40.707107
],
  "geometry": {"coordinates":[[[-73.732274,40.703898],[-73.732236,40.704626],[-73.732174,40.705352],[-73.73187299999999,40.706046],[-73.73157500000001,40.706726],[-73.73141,40.707107],[-73.729647,40.70666],[-73.727914,40.706221],[-73.72776399999999,40.705793],[-73.727555,40.705796],[-73.727453,40.705801],[-73.72724100000001,40.705806],[-73.726895,40.7058],[-73.726871,40.705237],[-73.72683499999999,40.704406],[-73.726781,40.703145],[-73.72677899999999,40.703082],[-73.726772,40.702954],[-73.726767,40.702872],[-73.72676199999999,40.702768],[-73.72713899999999,40.703046],[-73.72737499999999,40.702956],[-73.727768,40.703021],[-73.73036999999999,40.703099],[-73.732315,40.70316],[-73.732274,40.703898]]],"type":"Polygon"}
}