{
  "id": "360594084001",
  "type": "Feature",
  "properties": {
    "area_land":401374,
    "area_water":0,
    "geoid":"360594084001",
    "name":"Block Group 1",
    "state":"ny"
},
  "bbox": [
    -73.566167,
    40.692016,
    -73.556616,
    40.699066
],
  "geometry": {"coordinates":[[[-73.56616699999999,40.697765],[-73.56508700000001,40.697948],[-73.564763,40.698],[-73.563485,40.698216],[-73.56315600000001,40.698267],[-73.562449,40.698396],[-73.56214,40.698484],[-73.561144,40.698749],[-73.56061,40.698904],[-73.560429,40.698957],[-73.56008799999999,40.699066],[-73.55922200000001,40.698575],[-73.559094,40.698503],[-73.558091,40.697945],[-73.556892,40.697258],[-73.55661600000001,40.697079],[-73.556759,40.69687],[-73.557281,40.696115],[-73.557306,40.696066],[-73.557524,40.695716],[-73.558088,40.694814],[-73.558215,40.694617],[-73.55828700000001,40.694524],[-73.55872100000001,40.694044],[-73.558992,40.69375],[-73.559083,40.693676],[-73.55954,40.693435],[-73.559156,40.692793],[-73.558921,40.692328],[-73.560073,40.692233],[-73.56101200000001,40.692158],[-73.56172599999999,40.692099],[-73.56190700000001,40.692092],[-73.562814,40.692016],[-73.562861,40.692115],[-73.5633,40.693188],[-73.56346000000001,40.693166],[-73.564212,40.693038],[-73.56451,40.693761],[-73.56463100000001,40.694054],[-73.564911,40.69474],[-73.565468,40.696087],[-73.565568,40.69633],[-73.56607099999999,40.697556],[-73.56616699999999,40.697765]]],"type":"Polygon"}
}