{
  "id": "360610132006",
  "type": "Feature",
  "properties": {
    "area_land":29812,
    "area_water":0,
    "geoid":"360610132006",
    "name":"Block Group 6",
    "state":"ny"
},
  "bbox": [
    -73.951858,
    40.768355,
    -73.948202,
    40.770085
],
  "geometry": {"coordinates":[[[-73.951398,40.770073],[-73.94993599999999,40.769469],[-73.949454,40.770085],[-73.948393,40.769634],[-73.948302,40.769595],[-73.94820199999999,40.769544],[-73.94896199999999,40.768721],[-73.94907000000001,40.768603],[-73.94915399999999,40.768487],[-73.949253,40.768355],[-73.949366,40.768396],[-73.951858,40.769441],[-73.951398,40.770073]]],"type":"Polygon"}
}