{
  "id": "361019619002",
  "type": "Feature",
  "properties": {
    "area_land":858078,
    "area_water":0,
    "geoid":"361019619002",
    "name":"Block Group 2",
    "state":"ny"
},
  "bbox": [
    -77.610918,
    42.268018,
    -77.595506,
    42.281939
],
  "geometry": {"coordinates":[[[-77.610907,42.278536],[-77.61080200000001,42.278836],[-77.61073399999999,42.278794],[-77.610671,42.278777],[-77.610484,42.278774],[-77.610418,42.278788],[-77.610326,42.278822],[-77.610203,42.2789],[-77.610094,42.278998],[-77.610011,42.279132],[-77.609656,42.279853],[-77.609599,42.280008],[-77.609573,42.280137],[-77.609584,42.280358],[-77.60974899999999,42.281445],[-77.609745,42.281663],[-77.609722,42.281738],[-77.60968200000001,42.281795],[-77.609627,42.281844],[-77.609498,42.281916],[-77.609416,42.281939],[-77.609201,42.281933],[-77.60905200000001,42.281899],[-77.608744,42.281781],[-77.60857799999999,42.281695],[-77.60850600000001,42.281646],[-77.6084,42.28154],[-77.608256,42.281339],[-77.607833,42.280559],[-77.60747499999999,42.279706],[-77.607429,42.279635],[-77.60736900000001,42.279569],[-77.607314,42.279548],[-77.607162,42.279548],[-77.60699,42.279597],[-77.606667,42.279784],[-77.606515,42.279913],[-77.60611,42.2803],[-77.605749,42.280691],[-77.60557900000001,42.28086],[-77.605527,42.280892],[-77.60546100000001,42.280912],[-77.605352,42.280914],[-77.60530900000001,42.280898],[-77.605237,42.280868],[-77.605191,42.280825],[-77.605062,42.280636],[-77.60501600000001,42.280513],[-77.604938,42.280071],[-77.60493,42.279959],[-77.604938,42.279749],[-77.60497599999999,42.279615],[-77.60511099999999,42.279322],[-77.605114,42.27921],[-77.605099,42.279155],[-77.604883,42.278774],[-77.60476800000001,42.278636],[-77.604455,42.278295],[-77.604145,42.278061],[-77.603932,42.27793],[-77.603121,42.277394],[-77.602463,42.276912],[-77.601607,42.276252],[-77.601224,42.275959],[-77.59989899999999,42.275075],[-77.598979,42.274515],[-77.59846,42.274217],[-77.598112,42.274048],[-77.59795099999999,42.273982],[-77.59696599999999,42.273632],[-77.596756,42.273514],[-77.59660700000001,42.273408],[-77.59631400000001,42.27317],[-77.59614500000001,42.272975],[-77.596017,42.272799],[-77.595692,42.2723],[-77.59557599999999,42.272073],[-77.59552499999999,42.271947],[-77.595506,42.271901],[-77.595636,42.271867],[-77.59582399999999,42.271674],[-77.596007,42.271405],[-77.59670699999999,42.270329],[-77.59721,42.269557],[-77.59772599999999,42.268826],[-77.598298,42.268018],[-77.598681,42.268156],[-77.600189,42.26858],[-77.602228,42.269133],[-77.60276,42.269281],[-77.60334,42.269438],[-77.60356400000001,42.269501],[-77.60390599999999,42.269596],[-77.60436300000001,42.269744],[-77.605259,42.270076],[-77.60545999999999,42.270154],[-77.605637,42.27024],[-77.605687,42.270275],[-77.605732,42.270314],[-77.605846,42.270412],[-77.605935,42.270537],[-77.606043,42.270744],[-77.606452,42.271568],[-77.60652399999999,42.271715],[-77.606532,42.271731],[-77.606747,42.272173],[-77.606842,42.272373],[-77.60705799999999,42.272825],[-77.607225,42.273209],[-77.60739599999999,42.273609],[-77.607578,42.274026],[-77.608133,42.275297],[-77.608441,42.275877],[-77.608716,42.276306],[-77.609174,42.276937],[-77.60953000000001,42.277348],[-77.609706,42.277529],[-77.610277,42.278056],[-77.610918,42.278505],[-77.610907,42.278536]]],"type":"Polygon"}
}