{
  "id": "360670114013",
  "type": "Feature",
  "properties": {
    "area_land":1539439,
    "area_water":19282,
    "geoid":"360670114013",
    "name":"Block Group 3",
    "state":"ny"
},
  "bbox": [
    -76.303481,
    43.184621,
    -76.287529,
    43.199418
],
  "geometry": {"coordinates":[[[-76.303481,43.198739],[-76.301925,43.198816],[-76.29652,43.199039],[-76.295248,43.19909],[-76.29427099999999,43.199138],[-76.293426,43.19917],[-76.292177,43.199231],[-76.291365,43.199259],[-76.291111,43.199272],[-76.290829,43.199266],[-76.29060699999999,43.199234],[-76.29038300000001,43.199172],[-76.290149,43.199071],[-76.290053,43.199016],[-76.289951,43.198938],[-76.28979,43.199062],[-76.289599,43.199176],[-76.289419,43.199251],[-76.289199,43.199314],[-76.28910500000001,43.199335],[-76.28884600000001,43.199374],[-76.288532,43.1994],[-76.287948,43.199418],[-76.287969,43.198476],[-76.287958,43.198003],[-76.28793,43.197615],[-76.28792799999999,43.197585],[-76.287724,43.195586],[-76.287649,43.194384],[-76.28752900000001,43.192461],[-76.28813599999999,43.191988],[-76.289404,43.190971],[-76.289886,43.190589],[-76.29281,43.188239],[-76.29310099999999,43.188001],[-76.293387,43.187785],[-76.293531,43.187675],[-76.295069,43.18643],[-76.296723,43.185117],[-76.297057,43.184829],[-76.297327,43.184621],[-76.298221,43.185229],[-76.29969,43.186204],[-76.301191,43.187225],[-76.30165599999999,43.187546],[-76.301958,43.187827],[-76.30208399999999,43.187986],[-76.302164,43.188129],[-76.302217,43.188261],[-76.302378,43.188751],[-76.30247799999999,43.189094],[-76.302515,43.189159],[-76.30257400000001,43.189204],[-76.302663,43.189285],[-76.30271,43.189362],[-76.303004,43.193446],[-76.30327699999999,43.19641],[-76.303481,43.198739]]],"type":"Polygon"}
}