{
  "id": "360610191006",
  "type": "Feature",
  "properties": {
    "area_land":22560,
    "area_water":0,
    "geoid":"360610191006",
    "name":"Block Group 6",
    "state":"ny"
},
  "bbox": [
    -73.969001,
    40.79787,
    -73.966662,
    40.799786
],
  "geometry": {"coordinates":[[[-73.968557,40.799109],[-73.96820700000001,40.799786],[-73.966662,40.799133],[-73.96711999999999,40.798503],[-73.967575,40.79787],[-73.96900100000001,40.798476],[-73.968557,40.799109]]],"type":"Polygon"}
}