{
  "id": "360191004003",
  "type": "Feature",
  "properties": {
    "area_land":132425962,
    "area_water":1478502,
    "geoid":"360191004003",
    "name":"Block Group 3",
    "state":"ny"
},
  "bbox": [
    -74.006692,
    44.757761,
    -73.836236,
    44.902571
],
  "geometry": {"coordinates":[[[-74.006601,44.839568],[-74.006573,44.840386],[-74.006484,44.844508],[-74.006472,44.845012],[-74.00642499999999,44.847184],[-74.006429,44.848952],[-74.00631199999999,44.85403],[-74.006303,44.854145],[-74.00597399999999,44.858489],[-74.006015,44.86364],[-74.005957,44.872184],[-74.00597,44.872426],[-74.005972,44.872439],[-74.005985,44.872573],[-74.006,44.872821],[-74.006006,44.873224],[-74.006052,44.873926],[-74.006095,44.874829],[-74.006095,44.874916],[-74.00614299999999,44.875799],[-74.006218,44.877777],[-74.006294,44.879471],[-74.006328,44.879977],[-74.00637,44.880633],[-74.006415,44.881479],[-74.00657699999999,44.884468],[-74.00664,44.88552],[-74.006668,44.886017],[-74.006451,44.88603],[-74.00181000000001,44.886279],[-74.000581,44.886337],[-74.0,44.886378],[-73.99829099999999,44.886458],[-73.996066,44.886599],[-73.991629,44.886933],[-73.989513,44.887069],[-73.986594,44.887275],[-73.984791,44.887388],[-73.98401,44.887445],[-73.982952,44.887542],[-73.98076500000001,44.887725],[-73.978493,44.887893],[-73.977677,44.887943],[-73.97498,44.888148],[-73.974232,44.888192],[-73.96866,44.88863],[-73.966385,44.888819],[-73.965461,44.888912],[-73.964518,44.888982],[-73.964282,44.88902],[-73.964187,44.889044],[-73.946243,44.890798],[-73.94439800000001,44.890958],[-73.89966699999999,44.895265],[-73.899541,44.895278],[-73.882288,44.897738],[-73.878058,44.898338],[-73.878028,44.898342],[-73.877004,44.898459],[-73.874724,44.898721],[-73.86882,44.899316],[-73.861172,44.900166],[-73.85779599999999,44.90047],[-73.84886899999999,44.901345],[-73.842268,44.902002],[-73.836972,44.902571],[-73.836921,44.902211],[-73.836568,44.900282],[-73.83632799999999,44.898865],[-73.83626099999999,44.898397],[-73.836236,44.898093],[-73.83624399999999,44.89791],[-73.836303,44.897697],[-73.836382,44.8975],[-73.836451,44.897386],[-73.83683600000001,44.896865],[-73.836946,44.896651],[-73.83701000000001,44.896424],[-73.83705500000001,44.89617],[-73.83704899999999,44.895947],[-73.836922,44.895148],[-73.836769,44.894349],[-73.836724,44.894041],[-73.836585,44.893523],[-73.837153,44.893322],[-73.83751599999999,44.893182],[-73.838759,44.892699],[-73.84008799999999,44.892208],[-73.840362,44.89212],[-73.84060100000001,44.892057],[-73.84064499999999,44.891832],[-73.840976,44.89146],[-73.84134,44.89109],[-73.84212599999999,44.890308],[-73.84353900000001,44.888866],[-73.844044,44.888369],[-73.84540800000001,44.886973],[-73.846144,44.886244],[-73.84641000000001,44.886011],[-73.846581,44.885881],[-73.84682100000001,44.885711],[-73.847041,44.885581],[-73.84732,44.885434],[-73.848187,44.885031],[-73.849431,44.884425],[-73.849858,44.884176],[-73.85020400000001,44.883933],[-73.850944,44.883341],[-73.856662,44.878536],[-73.85724999999999,44.878065],[-73.858479,44.877106],[-73.860495,44.875594],[-73.861277,44.874999],[-73.864178,44.872822],[-73.865923,44.871531],[-73.86628,44.871288],[-73.866561,44.871109],[-73.86700399999999,44.870842],[-73.867248,44.870715],[-73.868275,44.870232],[-73.870456,44.869261],[-73.873136,44.868076],[-73.873914,44.867769],[-73.874165,44.867693],[-73.875056,44.867455],[-73.87554,44.867358],[-73.876656,44.867181],[-73.880841,44.86658],[-73.880567,44.865584],[-73.880189,44.864102],[-73.879873,44.862816],[-73.87920699999999,44.860175],[-73.878692,44.858055],[-73.878615,44.857714],[-73.87800799999999,44.855244],[-73.877123,44.851809],[-73.876694,44.849927],[-73.87639299999999,44.848751],[-73.876418,44.848624],[-73.876454,44.848565],[-73.87657,44.848447],[-73.87737199999999,44.848066],[-73.878477,44.847579],[-73.87876799999999,44.847433],[-73.879566,44.84708],[-73.884011,44.845318],[-73.8856,44.844672],[-73.886556,44.844297],[-73.88685099999999,44.844207],[-73.88721200000001,44.844151],[-73.88765600000001,44.844109],[-73.887997,44.844094],[-73.88941,44.84401],[-73.88925399999999,44.842532],[-73.88904700000001,44.841037],[-73.88904100000001,44.840759],[-73.889056,44.840697],[-73.88916399999999,44.840499],[-73.88926499999999,44.840377],[-73.889393,44.840274],[-73.889556,44.840176],[-73.889712,44.840111],[-73.889962,44.840039],[-73.890125,44.84002],[-73.893109,44.839898],[-73.89569899999999,44.839785],[-73.89851299999999,44.839673],[-73.898662,44.839653],[-73.89896400000001,44.839603],[-73.89918299999999,44.839534],[-73.899508,44.839402],[-73.899677,44.839307],[-73.8999,44.839143],[-73.90007300000001,44.838953],[-73.90019599999999,44.83876],[-73.900274,44.838563],[-73.900293,44.838475],[-73.90031,44.838191],[-73.90025799999999,44.837525],[-73.900087,44.835686],[-73.899888,44.833273],[-73.899585,44.829845],[-73.899253,44.826441],[-73.899075,44.824505],[-73.89878299999999,44.821543],[-73.898746,44.82108],[-73.898687,44.820093],[-73.898594,44.816666],[-73.89854800000001,44.815905],[-73.898535,44.81582],[-73.898421,44.815053],[-73.898363,44.814437],[-73.89833900000001,44.81389],[-73.89831,44.812735],[-73.89827,44.811688],[-73.89826600000001,44.811207],[-73.89817499999999,44.807947],[-73.89819300000001,44.807793],[-73.898235,44.807702],[-73.89835100000001,44.807548],[-73.898442,44.807472],[-73.898483,44.807444],[-73.89864300000001,44.807363],[-73.898813,44.807309],[-73.89923899999999,44.807217],[-73.89955999999999,44.807173],[-73.902086,44.806741],[-73.902734,44.806602],[-73.903874,44.806308],[-73.904991,44.806002],[-73.905225,44.805904],[-73.90535199999999,44.805828],[-73.905508,44.8057],[-73.905621,44.805548],[-73.905708,44.805363],[-73.905762,44.805107],[-73.905934,44.802958],[-73.906018,44.802476],[-73.906296,44.801218],[-73.906357,44.801037],[-73.90648899999999,44.800759],[-73.906648,44.800515],[-73.907359,44.799614],[-73.907466,44.799443],[-73.907573,44.799188],[-73.90759799999999,44.798896],[-73.907572,44.798552],[-73.90746900000001,44.797948],[-73.907253,44.796559],[-73.90718699999999,44.796251],[-73.90707,44.795892],[-73.90643300000001,44.794457],[-73.905958,44.793414],[-73.905779,44.793128],[-73.905602,44.792946],[-73.905357,44.79275],[-73.904999,44.792509],[-73.903677,44.791676],[-73.903149,44.791342],[-73.90294400000001,44.791182],[-73.902733,44.790974],[-73.90262300000001,44.790845],[-73.902529,44.790705],[-73.902435,44.790477],[-73.90229600000001,44.789872],[-73.902103,44.788756],[-73.902024,44.788043],[-73.901886,44.786078],[-73.901849,44.785604],[-73.901794,44.785121],[-73.901535,44.782206],[-73.901481,44.781735],[-73.901403,44.781231],[-73.900809,44.778122],[-73.90057899999999,44.776999],[-73.900402,44.776337],[-73.89979599999999,44.774738],[-73.899208,44.773262],[-73.898956,44.772777],[-73.898742,44.772426],[-73.898026,44.771351],[-73.89791700000001,44.771156],[-73.897757,44.770782],[-73.89766299999999,44.77035],[-73.89757299999999,44.769486],[-73.897541,44.768807],[-73.897588,44.765385],[-73.89796200000001,44.765355],[-73.94135900000001,44.761421],[-73.941545,44.761405],[-73.946603,44.761083],[-73.95198600000001,44.760706],[-73.95486,44.760488],[-73.95544099999999,44.760464],[-73.97772500000001,44.758851],[-73.98826200000001,44.75809],[-73.99308600000001,44.757761],[-73.993616,44.761578],[-73.99366499999999,44.761924],[-73.993673,44.762074],[-73.993684,44.76227],[-73.993695,44.762461],[-73.993942,44.764663],[-73.99515599999999,44.771567],[-73.995214,44.771881],[-73.996053,44.776667],[-73.99621500000001,44.777556],[-73.997112,44.782479],[-73.99757700000001,44.785028],[-73.998057,44.787663],[-73.998521,44.790212],[-73.99905699999999,44.79315],[-73.999267,44.794569],[-73.999404,44.795521],[-73.99944600000001,44.795983],[-73.999469,44.796285],[-73.99959200000001,44.797429],[-73.99960299999999,44.79745],[-73.999661,44.797868],[-73.999661,44.79792],[-73.99973199999999,44.798362],[-73.99999699999999,44.800568],[-74.000021,44.800708],[-74.000033,44.800852],[-74.000051,44.800934],[-74.000055,44.800951],[-74.00013300000001,44.801486],[-74.000137,44.801511],[-74.00014,44.801535],[-74.000404,44.80359],[-74.000417,44.803678],[-74.00046,44.803982],[-74.000516,44.804383],[-74.000523,44.804435],[-74.000586,44.804911],[-74.00059299999999,44.80496],[-74.000646,44.805317],[-74.000688,44.805593],[-74.000698,44.805654],[-74.00069999999999,44.805666],[-74.000705,44.805699],[-74.000775,44.806151],[-74.000787,44.806219],[-74.000795,44.806261],[-74.000891,44.806785],[-74.000962,44.807127],[-74.001054,44.80757],[-74.001127,44.807796],[-74.001076,44.807949],[-74.00107,44.808126],[-74.001088,44.808282],[-74.001142,44.808563],[-74.001172,44.808703],[-74.001234,44.808993],[-74.001598,44.810598],[-74.002019,44.812117],[-74.002178,44.812892],[-74.002543,44.814596],[-74.00256,44.814682],[-74.002568,44.814722],[-74.002769,44.815762],[-74.002838,44.816167],[-74.002926,44.816684],[-74.003124,44.817674],[-74.003139,44.817747],[-74.003142,44.81776],[-74.00316599999999,44.817948],[-74.003184,44.818114],[-74.003209,44.818335],[-74.00321099999999,44.818352],[-74.003266,44.818563],[-74.00328399999999,44.818631],[-74.003704,44.820233],[-74.004864,44.826761],[-74.005741,44.831591],[-74.005959,44.83279],[-74.006692,44.836938],[-74.006601,44.839568]]],"type":"Polygon"}
}