{
  "id": "360650248002",
  "type": "Feature",
  "properties": {
    "area_land":3984041,
    "area_water":0,
    "geoid":"360650248002",
    "name":"Block Group 2",
    "state":"ny"
},
  "bbox": [
    -75.611328,
    43.053697,
    -75.579723,
    43.082867
],
  "geometry": {"coordinates":[[[-75.611214,43.081803],[-75.61107,43.081894],[-75.61086899999999,43.081972],[-75.610789,43.08199],[-75.61044,43.082103],[-75.610305,43.082136],[-75.61015399999999,43.082136],[-75.609999,43.082116],[-75.60990200000001,43.082116],[-75.609753,43.082149],[-75.609689,43.082171],[-75.60952399999999,43.082267],[-75.60941099999999,43.082306],[-75.609336,43.082318],[-75.609185,43.082298],[-75.609115,43.082273],[-75.609033,43.082218],[-75.608969,43.082125],[-75.608952,43.082007],[-75.608925,43.081921],[-75.60889899999999,43.081885],[-75.60882599999999,43.081828],[-75.608768,43.081801],[-75.608661,43.081799],[-75.608346,43.081894],[-75.608135,43.081954],[-75.607945,43.082052],[-75.60789800000001,43.082092],[-75.60784,43.082236],[-75.607753,43.08238],[-75.607758,43.082448],[-75.60784,43.082526],[-75.60793700000001,43.082584],[-75.608048,43.08267],[-75.60806100000001,43.082712],[-75.608059,43.08275],[-75.60803199999999,43.082792],[-75.607975,43.082827],[-75.60782,43.082865],[-75.607614,43.082867],[-75.607328,43.082794],[-75.607237,43.082723],[-75.607148,43.082677],[-75.60700799999999,43.082672],[-75.606842,43.08273],[-75.60678900000001,43.082726],[-75.606709,43.082677],[-75.606656,43.082597],[-75.606582,43.082328],[-75.60657399999999,43.082314],[-75.606554,43.082279],[-75.60647299999999,43.082205],[-75.606357,43.082138],[-75.606251,43.08206],[-75.606167,43.081983],[-75.606121,43.081927],[-75.606086,43.081797],[-75.606093,43.081744],[-75.606117,43.081705],[-75.606216,43.081628],[-75.606216,43.081603],[-75.606191,43.081571],[-75.60610699999999,43.081526],[-75.60592699999999,43.081466],[-75.605706,43.081418],[-75.605414,43.081381],[-75.605205,43.081366],[-75.60492600000001,43.081386],[-75.604473,43.081451],[-75.604052,43.081499],[-75.60397399999999,43.081521],[-75.60383899999999,43.081535],[-75.60354100000001,43.081526],[-75.603286,43.08153],[-75.60305200000001,43.081495],[-75.60276,43.081482],[-75.60265099999999,43.081488],[-75.60257900000001,43.081526],[-75.602457,43.081666],[-75.60243,43.081723],[-75.602395,43.081757],[-75.601946,43.081757],[-75.601795,43.081739],[-75.601753,43.081725],[-75.60164,43.081652],[-75.601519,43.081531],[-75.601483,43.081479],[-75.601456,43.081415],[-75.601365,43.081242],[-75.60126700000001,43.081131],[-75.60122,43.081102],[-75.601088,43.081058],[-75.600925,43.080989],[-75.600818,43.080914],[-75.600624,43.08083],[-75.600537,43.080808],[-75.600427,43.080816],[-75.600324,43.080898],[-75.600245,43.08091],[-75.600069,43.080854],[-75.600038,43.080796],[-75.600024,43.080705],[-75.600004,43.080684],[-75.599962,43.080664],[-75.599872,43.080655],[-75.599582,43.080701],[-75.599328,43.080715],[-75.59910000000001,43.080839],[-75.598983,43.080867],[-75.598653,43.080859],[-75.598404,43.080903],[-75.59813200000001,43.080932],[-75.597689,43.08102],[-75.597601,43.081023],[-75.59751199999999,43.081038],[-75.597444,43.081076],[-75.597342,43.081094],[-75.59690399999999,43.081094],[-75.59646499999999,43.081058],[-75.59631899999999,43.081032],[-75.59604400000001,43.080949],[-75.595787,43.080855],[-75.595747,43.082426],[-75.595174,43.082403],[-75.59275,43.082309],[-75.592809,43.080547],[-75.592079,43.080479],[-75.59181599999999,43.079833],[-75.591627,43.07998],[-75.591527,43.08008],[-75.591482,43.080153],[-75.591431,43.080174],[-75.59113499999999,43.080182],[-75.590766,43.080204],[-75.59056699999999,43.080253],[-75.59054399999999,43.080273],[-75.59045500000001,43.08045],[-75.58957599999999,43.080151],[-75.589361,43.080056],[-75.589248,43.080025],[-75.588736,43.080016],[-75.58840499999999,43.080052],[-75.588187,43.080113],[-75.587941,43.080251],[-75.587442,43.080561],[-75.587309,43.080588],[-75.5872,43.080579],[-75.587158,43.080562],[-75.587063,43.080486],[-75.586957,43.080393],[-75.586861,43.0803],[-75.586781,43.080153],[-75.586697,43.079765],[-75.58653200000001,43.079291],[-75.586444,43.079089],[-75.586299,43.078878],[-75.58626,43.078839],[-75.58628400000001,43.078355],[-75.586382,43.076955],[-75.586386,43.076911],[-75.586472,43.075948],[-75.586324,43.075984],[-75.585708,43.076106],[-75.585453,43.076157],[-75.584881,43.076247],[-75.584892,43.075971],[-75.58470800000001,43.075998],[-75.584738,43.075363],[-75.58375700000001,43.075271],[-75.583736,43.075111],[-75.583164,43.075277],[-75.583287,43.074293],[-75.583303,43.074172],[-75.58116099999999,43.074359],[-75.580595,43.074346],[-75.579723,43.074338],[-75.57975,43.074],[-75.579843,43.07261],[-75.579982,43.070579],[-75.580091,43.068817],[-75.580127,43.068258],[-75.58197199999999,43.0683],[-75.585222,43.068391],[-75.58563599999999,43.062888],[-75.585638,43.061295],[-75.585812,43.059244],[-75.586568,43.059597],[-75.586921,43.059731],[-75.587187,43.059817],[-75.587571,43.059096],[-75.587912,43.059219],[-75.58857999999999,43.059439],[-75.588154,43.061375],[-75.588475,43.061383],[-75.58869,43.06139],[-75.588904,43.060395],[-75.59016099999999,43.060752],[-75.59023999999999,43.059978],[-75.59113600000001,43.060261],[-75.59130399999999,43.060314],[-75.5915,43.055691],[-75.591617,43.055682],[-75.59176600000001,43.055635],[-75.591871,43.055579],[-75.592056,43.055515],[-75.592443,43.055506],[-75.59268899999999,43.055557],[-75.593118,43.055713],[-75.593323,43.055775],[-75.59344,43.055793],[-75.59357199999999,43.0558],[-75.593887,43.055673],[-75.59396,43.055632],[-75.594043,43.055601],[-75.594154,43.055601],[-75.59432700000001,43.055639],[-75.594403,43.055635],[-75.59459699999999,43.055559],[-75.59474899999999,43.055518],[-75.594898,43.0555],[-75.59515399999999,43.055414],[-75.595636,43.055201],[-75.595764,43.055163],[-75.596217,43.055135],[-75.59634200000001,43.055118],[-75.596546,43.055028],[-75.596654,43.055011],[-75.596806,43.055028],[-75.59706199999999,43.05512],[-75.59719699999999,43.055182],[-75.597336,43.055286],[-75.59742900000001,43.055379],[-75.597578,43.055608],[-75.597831,43.055834],[-75.59795200000001,43.055928],[-75.59809799999999,43.056018],[-75.59822200000001,43.056056],[-75.598344,43.05607],[-75.59848599999999,43.05607],[-75.59859299999999,43.056024],[-75.598731,43.05598],[-75.598856,43.05599],[-75.598963,43.056011],[-75.599116,43.056073],[-75.59922299999999,43.056142],[-75.59931,43.056218],[-75.599493,43.056313],[-75.59963500000001,43.056403],[-75.59977000000001,43.056504],[-75.599992,43.056698],[-75.600116,43.056794],[-75.600269,43.056964],[-75.600314,43.05704],[-75.60036599999999,43.057127],[-75.60042,43.05719],[-75.600587,43.057331],[-75.60086099999999,43.057443],[-75.60100199999999,43.057393],[-75.600988,43.057299],[-75.60172799999999,43.057217],[-75.601806,43.057036],[-75.602068,43.056433],[-75.601874,43.055139],[-75.601752,43.054327],[-75.60324900000001,43.054408],[-75.603219,43.054161],[-75.603117,43.053697],[-75.60647400000001,43.054647],[-75.60599000000001,43.054687],[-75.604732,43.054641],[-75.60417700000001,43.054648],[-75.603949,43.054668],[-75.60379399999999,43.054715],[-75.60367599999999,43.054808],[-75.60363,43.054915],[-75.603621,43.055015],[-75.60363,43.055141],[-75.603703,43.055341],[-75.603831,43.055541],[-75.604068,43.055874],[-75.604282,43.056099],[-75.60438000000001,43.056203],[-75.604563,43.056376],[-75.604681,43.056502],[-75.60471699999999,43.056589],[-75.604736,43.056675],[-75.604708,43.056788],[-75.604663,43.056902],[-75.60451500000001,43.057067],[-75.60431199999999,43.057232],[-75.604163,43.05735],[-75.60397399999999,43.057477],[-75.60360900000001,43.057657],[-75.60336100000001,43.057753],[-75.602868,43.057939],[-75.602555,43.058012],[-75.602531,43.058018],[-75.601848,43.058271],[-75.601669,43.058432],[-75.601527,43.05871],[-75.60136300000001,43.058885],[-75.60115399999999,43.059081],[-75.60093000000001,43.059277],[-75.60072,43.059474],[-75.600594,43.059719],[-75.600459,43.059872],[-75.60028699999999,43.06002],[-75.600041,43.060085],[-75.59987700000001,43.060156],[-75.599795,43.060331],[-75.59963,43.060653],[-75.599548,43.060893],[-75.599503,43.061089],[-75.59946600000001,43.06128],[-75.59946600000001,43.061335],[-75.599496,43.0614],[-75.599608,43.061438],[-75.599727,43.061446],[-75.599847,43.061455],[-75.599981,43.061495],[-75.60006300000001,43.06152],[-75.600228,43.061558],[-75.600295,43.061607],[-75.600325,43.0617],[-75.600347,43.061809],[-75.600455,43.061905],[-75.600548,43.061977],[-75.600776,43.062077],[-75.600931,43.062151],[-75.60106399999999,43.062268],[-75.60111499999999,43.062329],[-75.601152,43.062373],[-75.601251,43.062491],[-75.601378,43.062675],[-75.60149199999999,43.062902],[-75.601501,43.06292],[-75.60158300000001,43.06307],[-75.601771,43.063411],[-75.601871,43.063543],[-75.601983,43.063691],[-75.602115,43.063872],[-75.60226400000001,43.064077],[-75.602446,43.064257],[-75.602574,43.06435],[-75.602738,43.064404],[-75.602857,43.064417],[-75.602991,43.064412],[-75.60329,43.064379],[-75.603454,43.064401],[-75.60364800000001,43.064499],[-75.60393999999999,43.064679],[-75.60417,43.064844],[-75.60438000000001,43.064937],[-75.604581,43.06499],[-75.6048,43.065023],[-75.60498200000001,43.065037],[-75.60528600000001,43.065045],[-75.605289,43.065183],[-75.60527999999999,43.065375],[-75.605262,43.065491],[-75.605221,43.065664],[-75.605125,43.065938],[-75.605008,43.06615],[-75.604844,43.066383],[-75.60458300000001,43.066662],[-75.604326,43.066893],[-75.60364800000001,43.067469],[-75.602735,43.068254],[-75.601798,43.069055],[-75.60158699999999,43.068955],[-75.60148700000001,43.068928],[-75.601276,43.068894],[-75.599048,43.068595],[-75.598935,43.068722],[-75.59882399999999,43.068907],[-75.598738,43.069187],[-75.598659,43.069598],[-75.598399,43.070647],[-75.598286,43.07107],[-75.598265,43.071265],[-75.598298,43.071707],[-75.59836,43.072272],[-75.598403,43.072499],[-75.59836,43.072874],[-75.598303,43.073795],[-75.598223,43.075076],[-75.598168,43.075842],[-75.598173,43.075939],[-75.59818199999999,43.076195],[-75.598184,43.076245],[-75.598184,43.076335],[-75.59818199999999,43.076498],[-75.59817,43.076676],[-75.598268,43.076735],[-75.598347,43.076803],[-75.598375,43.076843],[-75.598851,43.076811],[-75.59901000000001,43.076816],[-75.599104,43.076847],[-75.59937600000001,43.076966],[-75.59948799999999,43.076987],[-75.59978099999999,43.076997],[-75.60016299999999,43.077004],[-75.600399,43.077037],[-75.600729,43.077058],[-75.601372,43.077033],[-75.60216200000001,43.077089],[-75.602271,43.077105],[-75.60234800000001,43.077141],[-75.60238200000001,43.077196],[-75.602434,43.077914],[-75.603534,43.077869],[-75.603966,43.077847],[-75.60508900000001,43.077789],[-75.60626499999999,43.077748],[-75.606466,43.077726],[-75.606607,43.077694],[-75.60668200000001,43.077667],[-75.606803,43.077583],[-75.606832,43.077544],[-75.606869,43.07748],[-75.606882,43.077459],[-75.606898,43.077431],[-75.60692,43.077353],[-75.607072,43.077391],[-75.607338,43.07743],[-75.607471,43.077445],[-75.607951,43.077502],[-75.608368,43.07758],[-75.608529,43.07761],[-75.60920900000001,43.077767],[-75.609516,43.077825],[-75.60991,43.077883],[-75.610187,43.077892],[-75.61046,43.077877],[-75.610947,43.077815],[-75.611328,43.08179],[-75.611214,43.081803]]],"type":"Polygon"}
}