{
  "id": "360710106005",
  "type": "Feature",
  "properties": {
    "area_land":20686244,
    "area_water":421178,
    "geoid":"360710106005",
    "name":"Block Group 5",
    "state":"ny"
},
  "bbox": [
    -74.30407,
    41.48986,
    -74.226367,
    41.558199
],
  "geometry": {"coordinates":[[[-74.30407,41.50212],[-74.302463,41.50418],[-74.295438,41.512886],[-74.295107,41.51329],[-74.289642,41.519997],[-74.287318,41.522846],[-74.286957,41.523289],[-74.28605,41.524397],[-74.28238399999999,41.529027],[-74.282188,41.529276],[-74.281723,41.529839],[-74.28081400000001,41.530944],[-74.277601,41.530442],[-74.27668300000001,41.530326],[-74.276276,41.53117],[-74.276152,41.532085],[-74.275235,41.537258],[-74.27517400000001,41.537599],[-74.27434700000001,41.540552],[-74.27269699999999,41.546368],[-74.272639,41.546483],[-74.27175200000001,41.549842],[-74.271726,41.549974],[-74.270582,41.551554],[-74.268619,41.554237],[-74.265833,41.558041],[-74.26571,41.558199],[-74.26557,41.558033],[-74.265488,41.557904],[-74.265399,41.55772],[-74.26536400000001,41.557652],[-74.26518900000001,41.557314],[-74.265154,41.557246],[-74.265102,41.557167],[-74.26502499999999,41.557086],[-74.264932,41.557044],[-74.264758,41.556999],[-74.264712,41.556995],[-74.26450199999999,41.556977],[-74.264117,41.556977],[-74.263778,41.556958],[-74.26367399999999,41.556939],[-74.263645,41.556929],[-74.26335400000001,41.556835],[-74.263131,41.556793],[-74.263008,41.556783],[-74.26294300000001,41.556777],[-74.262692,41.556773],[-74.262511,41.556781],[-74.262376,41.556773],[-74.262309,41.556754],[-74.26222,41.556705],[-74.262019,41.556535],[-74.26155799999999,41.556059],[-74.261458,41.555966],[-74.261337,41.555853],[-74.26127,41.555803],[-74.261112,41.555734],[-74.26100599999999,41.555705],[-74.260927,41.555693],[-74.26033,41.555662],[-74.259905,41.555621],[-74.259732,41.555621],[-74.259472,41.555636],[-74.258672,41.555742],[-74.25852,41.555756],[-74.25841200000001,41.555756],[-74.258123,41.555736],[-74.257807,41.555692],[-74.257324,41.555602],[-74.25662800000001,41.555453],[-74.256162,41.555328],[-74.255622,41.555153],[-74.254471,41.554871],[-74.254296,41.554819],[-74.254041,41.554697],[-74.253868,41.554584],[-74.252274,41.553353],[-74.25031,41.55185],[-74.250001,41.551586],[-74.249623,41.551234],[-74.249083,41.550693],[-74.248732,41.550332],[-74.24786400000001,41.549491],[-74.24712100000001,41.548747],[-74.246388,41.547968],[-74.24566799999999,41.547227],[-74.24548,41.547031],[-74.24526,41.546814],[-74.24499400000001,41.54657],[-74.244659,41.546317],[-74.244342,41.546095],[-74.243658,41.54564],[-74.242619,41.54486],[-74.242403,41.54468],[-74.241986,41.544309],[-74.24179700000001,41.544204],[-74.24101,41.543882],[-74.24008600000001,41.54353],[-74.239019,41.543181],[-74.238798,41.543125],[-74.238395,41.543009],[-74.237855,41.542874],[-74.237319,41.542662],[-74.23705200000001,41.542554],[-74.236429,41.542263],[-74.23635899999999,41.54223],[-74.235162,41.541733],[-74.23377600000001,41.541114],[-74.232726,41.540721],[-74.23221100000001,41.540526],[-74.23109100000001,41.540094],[-74.230653,41.539903],[-74.23039199999999,41.539764],[-74.230065,41.539554],[-74.229945,41.539443],[-74.229703,41.539103],[-74.228263,41.536736],[-74.227608,41.535787],[-74.227176,41.535116],[-74.227002,41.534823],[-74.22669399999999,41.534362],[-74.22663900000001,41.534298],[-74.22654900000001,41.534221],[-74.226437,41.534162],[-74.226433,41.533975],[-74.22638600000001,41.533628],[-74.226367,41.533366],[-74.22640199999999,41.532858],[-74.226448,41.532635],[-74.226519,41.532458],[-74.226623,41.5323],[-74.22674600000001,41.532156],[-74.227413,41.531582],[-74.227756,41.53125],[-74.227795,41.531203],[-74.227958,41.531012],[-74.228497,41.530452],[-74.22892,41.529985],[-74.229117,41.529792],[-74.229348,41.529604],[-74.229587,41.529432],[-74.229877,41.529251],[-74.230121,41.529131],[-74.230312,41.52907],[-74.23075799999999,41.528964],[-74.23124900000001,41.528884],[-74.231736,41.528838],[-74.23194700000001,41.528838],[-74.232415,41.528856],[-74.232634,41.528881],[-74.232899,41.528938],[-74.233644,41.529151],[-74.233906,41.52921],[-74.234202,41.529257],[-74.234396,41.529272],[-74.234679,41.529264],[-74.23500799999999,41.52922],[-74.235164,41.529184],[-74.235529,41.529087],[-74.235736,41.529013],[-74.23593700000001,41.52893],[-74.236378,41.528769],[-74.236531,41.528733],[-74.23676399999999,41.528705],[-74.236915,41.528714],[-74.237067,41.528748],[-74.23722600000001,41.528819],[-74.2373,41.528883],[-74.23747299999999,41.52912],[-74.23760900000001,41.529271],[-74.237635,41.529236],[-74.237737,41.529156],[-74.23778299999999,41.529125],[-74.237989,41.528981],[-74.23841,41.529822],[-74.238686,41.530129],[-74.23933599999999,41.530583],[-74.240031,41.530735],[-74.240168,41.530765],[-74.241985,41.530805],[-74.24315199999999,41.530608],[-74.24380600000001,41.530434],[-74.24427900000001,41.530254],[-74.244437,41.530195],[-74.24491,41.529955],[-74.245071,41.529794],[-74.245299,41.529336],[-74.245395,41.529111],[-74.24557900000001,41.528894],[-74.245997,41.52871],[-74.246236,41.528328],[-74.246358,41.527994],[-74.246539,41.527383],[-74.246696,41.526254],[-74.24673,41.525948],[-74.24661399999999,41.525673],[-74.246509,41.525351],[-74.24663,41.524899],[-74.246685,41.524706],[-74.24687900000001,41.524408],[-74.24724399999999,41.524208],[-74.24802699999999,41.523897],[-74.248965,41.523605],[-74.249594,41.523308],[-74.25018300000001,41.52314],[-74.25078000000001,41.523041],[-74.251936,41.523038],[-74.25206900000001,41.52308],[-74.25252399999999,41.523303],[-74.252644,41.523382],[-74.25277699999999,41.523502],[-74.253069,41.523803],[-74.253122,41.523869],[-74.253781,41.522695],[-74.25160099999999,41.522191],[-74.252053,41.521041],[-74.25354400000001,41.516438],[-74.253597,41.516175],[-74.253748,41.515739],[-74.254014,41.51445],[-74.254468,41.512309],[-74.253659,41.511851],[-74.25298600000001,41.511494],[-74.25326099999999,41.511217],[-74.254662,41.509853],[-74.25474199999999,41.509775],[-74.255808,41.508764],[-74.25596899999999,41.50861],[-74.25682500000001,41.50779],[-74.258405,41.506266],[-74.258684,41.50602],[-74.25920000000001,41.505633],[-74.260243,41.504948],[-74.261982,41.503799],[-74.262207,41.503642],[-74.262705,41.503265],[-74.263201,41.50286],[-74.26324200000001,41.502829],[-74.263282,41.502795],[-74.263837,41.502359],[-74.264577,41.501786],[-74.264618,41.501752],[-74.265107,41.50135],[-74.265528,41.500974],[-74.26628700000001,41.500251],[-74.26655599999999,41.500002],[-74.268517,41.498098],[-74.26912799999999,41.497453],[-74.269353,41.497224],[-74.269553,41.49699],[-74.26992199999999,41.496602],[-74.270432,41.496046],[-74.270886,41.495581],[-74.27135800000001,41.495144],[-74.271466,41.495059],[-74.27179700000001,41.494796],[-74.271885,41.494736],[-74.27211200000001,41.494582],[-74.272571,41.494303],[-74.273088,41.494031],[-74.276152,41.492599],[-74.27783599999999,41.491841],[-74.278347,41.491629],[-74.278465,41.49158],[-74.279404,41.491164],[-74.28065700000001,41.490594],[-74.281251,41.490328],[-74.28226100000001,41.48986],[-74.283575,41.490599],[-74.292312,41.495514],[-74.300481,41.500097],[-74.30097499999999,41.500355],[-74.302261,41.501037],[-74.30250599999999,41.501171],[-74.302689,41.50128],[-74.303099,41.501528],[-74.30407,41.50212]]],"type":"Polygon"}
}