{
  "id": "360650239011",
  "type": "Feature",
  "properties": {
    "area_land":3446437,
    "area_water":0,
    "geoid":"360650239011",
    "name":"Block Group 1",
    "state":"ny"
},
  "bbox": [
    -75.206698,
    43.114769,
    -75.158706,
    43.138628
],
  "geometry": {"coordinates":[[[-75.206694,43.129882],[-75.206676,43.129966],[-75.206569,43.130115],[-75.206025,43.130594],[-75.205782,43.130731],[-75.20561499999999,43.130884],[-75.20542500000001,43.131008],[-75.205185,43.13111],[-75.204536,43.131554],[-75.204244,43.131817],[-75.204094,43.131977],[-75.203952,43.132171],[-75.203929,43.132321],[-75.203952,43.132466],[-75.203987,43.132581],[-75.204097,43.132708],[-75.20467499999999,43.133072],[-75.20493999999999,43.133184],[-75.205045,43.133252],[-75.205232,43.133449],[-75.205308,43.133588],[-75.205327,43.133682],[-75.205344,43.133911],[-75.20533,43.134053],[-75.205279,43.134228],[-75.205189,43.134378],[-75.205142,43.134402],[-75.205085,43.134402],[-75.204215,43.134309],[-75.20404000000001,43.134359],[-75.20384900000001,43.134473],[-75.203744,43.134585],[-75.20357300000001,43.134855],[-75.203427,43.135205],[-75.203369,43.135518],[-75.203351,43.135955],[-75.203377,43.136103],[-75.203429,43.13623],[-75.20352800000001,43.136333],[-75.203693,43.136429],[-75.204003,43.136531],[-75.20405599999999,43.136576],[-75.20407299999999,43.136618],[-75.20407299999999,43.136713],[-75.20405100000001,43.136808],[-75.20397800000001,43.13688],[-75.20387599999999,43.136917],[-75.20383,43.136918],[-75.203627,43.13686],[-75.20352200000001,43.13688],[-75.203486,43.136924],[-75.203478,43.136953],[-75.20350000000001,43.137055],[-75.203819,43.137461],[-75.203872,43.137558],[-75.20391600000001,43.137879],[-75.20385,43.13817],[-75.203748,43.138311],[-75.20369100000001,43.138358],[-75.203396,43.138516],[-75.20326799999999,43.138628],[-75.196792,43.133458],[-75.186511,43.128472],[-75.186312,43.12837],[-75.18230800000001,43.126957],[-75.18085499999999,43.12633],[-75.16860800000001,43.12155],[-75.16450500000001,43.119769],[-75.158706,43.117469],[-75.159901,43.11609],[-75.160006,43.115969],[-75.160906,43.114769],[-75.161706,43.114969],[-75.162082,43.115033],[-75.164621,43.11547],[-75.166355,43.115838],[-75.17487800000001,43.11758],[-75.175911,43.117826],[-75.176914,43.118076],[-75.179596,43.118468],[-75.18495299999999,43.119415],[-75.18524600000001,43.119412],[-75.188228,43.119864],[-75.189245,43.120083],[-75.190775,43.120409],[-75.191799,43.120496],[-75.192024,43.120624],[-75.192797,43.120758],[-75.193887,43.120969],[-75.195609,43.121573],[-75.197204,43.121767],[-75.197316,43.121789],[-75.198307,43.121969],[-75.198498,43.122027],[-75.20060700000001,43.122669],[-75.201407,43.122969],[-75.201488,43.122998],[-75.202507,43.123369],[-75.204526,43.124065],[-75.205719,43.12461],[-75.205611,43.12495],[-75.20555899999999,43.125044],[-75.20549099999999,43.125131],[-75.205474,43.125199],[-75.205476,43.125371],[-75.20556999999999,43.125601],[-75.205657,43.125718],[-75.205675,43.125805],[-75.205679,43.125929],[-75.20564400000001,43.126188],[-75.20544700000001,43.12668],[-75.205342,43.126887],[-75.20531800000001,43.127],[-75.205325,43.12715],[-75.205354,43.127379],[-75.205398,43.127489],[-75.205449,43.127551],[-75.205493,43.127587],[-75.20571200000001,43.12766],[-75.205898,43.12778],[-75.205915,43.127806],[-75.205932,43.127944],[-75.20598,43.128021],[-75.206253,43.128327],[-75.20634200000001,43.128498],[-75.206335,43.128574],[-75.20622899999999,43.128691],[-75.20623999999999,43.128807],[-75.206298,43.128873],[-75.206408,43.128935],[-75.206514,43.129015],[-75.20660100000001,43.12911],[-75.206638,43.129201],[-75.206698,43.129744],[-75.206694,43.129882]]],"type":"Polygon"}
}