{
  "id": "361031117041",
  "type": "Feature",
  "properties": {
    "area_land":873341,
    "area_water":0,
    "geoid":"361031117041",
    "name":"Block Group 1",
    "state":"ny"
},
  "bbox": [
    -73.307125,
    40.867427,
    -73.290263,
    40.876925
],
  "geometry": {"coordinates":[[[-73.307125,40.874099],[-73.307087,40.874202],[-73.306995,40.874278],[-73.306765,40.874366],[-73.306614,40.874438],[-73.30653,40.874514],[-73.30646900000001,40.874617],[-73.306444,40.874751],[-73.306453,40.874884],[-73.30655299999999,40.875216],[-73.30662100000001,40.87551],[-73.305851,40.875663],[-73.305217,40.875766],[-73.304142,40.875933],[-73.30033400000001,40.876532],[-73.299328,40.876685],[-73.29844300000001,40.876826],[-73.29777799999999,40.876925],[-73.29771700000001,40.876822],[-73.297634,40.876521],[-73.297054,40.874297],[-73.296772,40.873111],[-73.296688,40.873019],[-73.296566,40.873011],[-73.295778,40.873126],[-73.295597,40.873122],[-73.295458,40.873088],[-73.295359,40.872992],[-73.295284,40.872855],[-73.294864,40.871424],[-73.294573,40.87131],[-73.29346,40.871283],[-73.292185,40.871249],[-73.291996,40.87107],[-73.29146900000001,40.870597],[-73.29131599999999,40.870497],[-73.290897,40.870311],[-73.29073699999999,40.870223],[-73.290638,40.870112],[-73.290516,40.869948],[-73.290263,40.869521],[-73.290476,40.869448],[-73.292537,40.8688],[-73.293513,40.868899],[-73.29376499999999,40.868903],[-73.295564,40.868911],[-73.296657,40.868903],[-73.296909,40.868884],[-73.297297,40.868823],[-73.29848,40.868617],[-73.29891600000001,40.868521],[-73.30095900000001,40.868167],[-73.302036,40.867984],[-73.302752,40.867865],[-73.304272,40.867598],[-73.305278,40.867427],[-73.305446,40.867991],[-73.305485,40.868155],[-73.30550700000001,40.868289],[-73.305508,40.868434],[-73.305483,40.868594],[-73.30543900000001,40.868727],[-73.305263,40.86912],[-73.305606,40.8692],[-73.305858,40.869281],[-73.306027,40.869357],[-73.306156,40.869456],[-73.30625499999999,40.869551],[-73.306324,40.869773],[-73.306476,40.870612],[-73.306513,40.87081],[-73.306499,40.870913],[-73.306414,40.87123],[-73.306392,40.871371],[-73.306422,40.871539],[-73.30651400000001,40.871814],[-73.306583,40.872069],[-73.306667,40.872325],[-73.30669,40.87247],[-73.30670600000001,40.87266],[-73.30666600000001,40.87276],[-73.30653,40.873019],[-73.30644599999999,40.87313],[-73.306758,40.873313],[-73.30689599999999,40.8734],[-73.30696500000001,40.8735],[-73.30707,40.87382],[-73.30711700000001,40.873999],[-73.307125,40.874099]]],"type":"Polygon"}
}