{
  "id": "361190097034",
  "type": "Feature",
  "properties": {
    "area_land":1268364,
    "area_water":4951,
    "geoid":"361190097034",
    "name":"Block Group 4",
    "state":"ny"
},
  "bbox": [
    -73.751326,
    41.000408,
    -73.730897,
    41.01444
],
  "geometry": {"coordinates":[[[-73.751176,41.005826],[-73.750818,41.005993],[-73.74995699999999,41.006393],[-73.749458,41.006618],[-73.74822399999999,41.0072],[-73.747838,41.007382],[-73.746854,41.007853],[-73.746242,41.008141],[-73.746118,41.008199],[-73.745659,41.008419],[-73.74478999999999,41.008832],[-73.74467799999999,41.008904],[-73.744634,41.008941],[-73.744405,41.009134],[-73.74428,41.00926],[-73.743956,41.009555],[-73.742633,41.010636],[-73.741877,41.01123],[-73.741709,41.011362],[-73.74155399999999,41.011466],[-73.74127300000001,41.011689],[-73.74048500000001,41.012298],[-73.74028300000001,41.012468],[-73.740025,41.012684],[-73.73982599999999,41.012835],[-73.739206,41.013208],[-73.738696,41.013476],[-73.73841299999999,41.01362],[-73.737139,41.014105],[-73.736649,41.014325],[-73.736425,41.01444],[-73.736081,41.013486],[-73.735669,41.012532],[-73.735437,41.012031],[-73.73514400000001,41.011438],[-73.735034,41.01126],[-73.73487,41.011057],[-73.73479399999999,41.010964],[-73.73472099999999,41.010874],[-73.73453499999999,41.010669],[-73.73411400000001,41.010249],[-73.733799,41.009936],[-73.733582,41.00972],[-73.73342,41.00952],[-73.732919,41.008902],[-73.73280699999999,41.008763],[-73.73268299999999,41.008634],[-73.731945,41.007867],[-73.731515,41.007406],[-73.730897,41.006744],[-73.731229,41.006564],[-73.73166500000001,41.006312],[-73.732085,41.005978],[-73.732179,41.005918],[-73.732336,41.005841],[-73.732482,41.005785],[-73.73329200000001,41.00556],[-73.733711,41.005439],[-73.73429,41.005258],[-73.735258,41.004978],[-73.735623,41.004853],[-73.73598800000001,41.004769],[-73.736119,41.004743],[-73.736312,41.004725],[-73.736547,41.004727],[-73.736716,41.004736],[-73.736959,41.004771],[-73.73720299999999,41.004786],[-73.73733900000001,41.004783],[-73.737464,41.004771],[-73.737617,41.004719],[-73.73793000000001,41.004568],[-73.73811499999999,41.004443],[-73.738884,41.003913],[-73.739107,41.003753],[-73.739278,41.003629],[-73.73948900000001,41.003421],[-73.739729,41.003228],[-73.73984799999999,41.003169],[-73.740374,41.003008],[-73.740762,41.002889],[-73.74141299999999,41.002669],[-73.741545,41.00261],[-73.74169500000001,41.002515],[-73.741828,41.002381],[-73.742143,41.001958],[-73.74224,41.001805],[-73.742357,41.001656],[-73.742529,41.001504],[-73.742698,41.001404],[-73.742879,41.001317],[-73.743061,41.001248],[-73.743167,41.001222],[-73.743509,41.001179],[-73.744308,41.001116],[-73.74468299999999,41.001081],[-73.745198,41.001039],[-73.745394,41.000994],[-73.745667,41.00092],[-73.746413,41.000684],[-73.74660900000001,41.000632],[-73.74735699999999,41.000435],[-73.74747600000001,41.000411],[-73.747553,41.000408],[-73.747591,41.00042],[-73.747986,41.001063],[-73.74802200000001,41.00112],[-73.748046,41.001164],[-73.74851,41.001005],[-73.74867500000001,41.000949],[-73.748784,41.001151],[-73.74923800000001,41.002013],[-73.749483,41.002429],[-73.75026099999999,41.003682],[-73.75132600000001,41.00575],[-73.751176,41.005826]]],"type":"Polygon"}
}