{
  "id": "360610231003",
  "type": "Feature",
  "properties": {
    "area_land":56695,
    "area_water":0,
    "geoid":"360610231003",
    "name":"Block Group 3",
    "state":"ny"
},
  "bbox": [
    -73.946222,
    40.824032,
    -73.942453,
    40.827815
],
  "geometry": {"coordinates":[[[-73.94573099999999,40.825322],[-73.94527600000001,40.825948],[-73.944819,40.826571],[-73.94436399999999,40.827195],[-73.943898,40.827815],[-73.942781,40.827345],[-73.942453,40.827207],[-73.94335700000001,40.825956],[-73.943669,40.825527],[-73.94381300000001,40.825332],[-73.94426799999999,40.824705],[-73.944407,40.824513],[-73.944756,40.824032],[-73.94622200000001,40.824652],[-73.94573099999999,40.825322]]],"type":"Polygon"}
}