{
  "id": "360811579014",
  "type": "Feature",
  "properties": {
    "area_land":147978,
    "area_water":0,
    "geoid":"360811579014",
    "name":"Block Group 4",
    "state":"ny"
},
  "bbox": [
    -73.707947,
    40.73953,
    -73.700292,
    40.743184
],
  "geometry": {"coordinates":[[[-73.707947,40.741578],[-73.70701,40.741779],[-73.706073,40.74198],[-73.705169,40.742175],[-73.704266,40.742369],[-73.703346,40.742568],[-73.70242399999999,40.742763],[-73.70107400000001,40.74307],[-73.700582,40.743184],[-73.700292,40.74105],[-73.70083700000001,40.740896],[-73.70166500000001,40.740718],[-73.702585,40.74052],[-73.70350500000001,40.740322],[-73.704408,40.740128],[-73.705308,40.739934],[-73.706245,40.739733],[-73.70718599999999,40.73953],[-73.707947,40.741578]]],"type":"Polygon"}
}