{
  "id": "360894923004",
  "type": "Feature",
  "properties": {
    "area_land":397088408,
    "area_water":25109949,
    "geoid":"360894923004",
    "name":"Block Group 4",
    "state":"ny"
},
  "bbox": [
    -74.942817,
    44.320591,
    -74.686129,
    44.612228
],
  "geometry": {"coordinates":[[[-74.94281700000001,44.470096],[-74.919552,44.472067],[-74.90607,44.473168],[-74.90350599999999,44.47337],[-74.885676,44.474775],[-74.874605,44.475637],[-74.85640600000001,44.477002],[-74.85314200000001,44.477259],[-74.84765899999999,44.477656],[-74.824062,44.479584],[-74.824262,44.481385],[-74.824958,44.487107],[-74.826347,44.499323],[-74.826427,44.50006],[-74.827232,44.506764],[-74.82729399999999,44.507202],[-74.827628,44.509968],[-74.827684,44.510403],[-74.828889,44.520396],[-74.829356,44.524283],[-74.829489,44.525351],[-74.82953000000001,44.525683],[-74.829579,44.526105],[-74.83006,44.529897],[-74.830071,44.529998],[-74.830494,44.53365],[-74.83106600000001,44.538449],[-74.831548,44.542699],[-74.83193900000001,44.546091],[-74.832307,44.549189],[-74.832504,44.550842],[-74.832729,44.552671],[-74.833558,44.559503],[-74.833943,44.56273],[-74.836426,44.590881],[-74.836527,44.591648],[-74.83646400000001,44.591696],[-74.83645799999999,44.591708],[-74.83753400000001,44.604035],[-74.83786600000001,44.60777],[-74.831852,44.608237],[-74.820666,44.609148],[-74.812776,44.609769],[-74.805438,44.610344],[-74.803517,44.610478],[-74.793853,44.611223],[-74.7809,44.612228],[-74.78030099999999,44.60712],[-74.779787,44.602714],[-74.778339,44.590414],[-74.777317,44.58221],[-74.776597,44.576372],[-74.775336,44.566187],[-74.76192899999999,44.566962],[-74.749668,44.567668],[-74.748628,44.567776],[-74.72748799999999,44.569014],[-74.72219,44.569324],[-74.716084,44.569661],[-74.714658,44.556437],[-74.714032,44.550615],[-74.712828,44.53972],[-74.712819,44.539638],[-74.712565,44.537654],[-74.710702,44.522032],[-74.71037,44.519458],[-74.710162,44.517747],[-74.70996599999999,44.516205],[-74.709722,44.514288],[-74.709637,44.513622],[-74.70952,44.512667],[-74.70838999999999,44.503827],[-74.70793,44.500198],[-74.707404,44.496119],[-74.707114,44.493869],[-74.70647099999999,44.489071],[-74.706062,44.48607],[-74.704916,44.477749],[-74.704536,44.475073],[-74.704421,44.474201],[-74.703604,44.467629],[-74.70330300000001,44.465393],[-74.702732,44.461168],[-74.700497,44.444346],[-74.700418,44.44376],[-74.699854,44.439513],[-74.69899599999999,44.433033],[-74.69808999999999,44.426089],[-74.697239,44.419741],[-74.697093,44.418663],[-74.69656000000001,44.414441],[-74.69646,44.41372],[-74.696192,44.411781],[-74.695674,44.408056],[-74.695131,44.404126],[-74.695066,44.403651],[-74.69439800000001,44.398296],[-74.693821,44.393826],[-74.6931,44.38826],[-74.693016,44.387655],[-74.69295200000001,44.387181],[-74.692786,44.385839],[-74.692742,44.38548],[-74.692531,44.384206],[-74.69252,44.384144],[-74.69209499999999,44.381901],[-74.69175199999999,44.380092],[-74.691433,44.37816],[-74.6914,44.377996],[-74.69134,44.377633],[-74.691028,44.375767],[-74.68814500000001,44.360414],[-74.68612899999999,44.349099],[-74.68813299999999,44.34958],[-74.688912,44.349218],[-74.689807,44.34939],[-74.69174700000001,44.349632],[-74.69224800000001,44.350066],[-74.69318,44.34984],[-74.695106,44.350268],[-74.69546099999999,44.351059],[-74.695942,44.35162],[-74.69686,44.352054],[-74.697175,44.352836],[-74.69851300000001,44.353533],[-74.699609,44.353568],[-74.700929,44.354106],[-74.701295,44.354984],[-74.70273899999999,44.354778],[-74.703638,44.354036],[-74.704002,44.354067],[-74.704583,44.353785],[-74.70529500000001,44.353303],[-74.705341,44.352523],[-74.705409,44.351701],[-74.705016,44.351376],[-74.705105,44.350984],[-74.704976,44.350421],[-74.705066,44.350097],[-74.705164,44.349787],[-74.70589,44.349709],[-74.70708399999999,44.349901],[-74.70808,44.35023],[-74.708484,44.350442],[-74.709307,44.35054],[-74.709571,44.350733],[-74.70972999999999,44.350774],[-74.71008999999999,44.35043],[-74.710491,44.350437],[-74.71116499999999,44.350761],[-74.71143499999999,44.350655],[-74.71157599999999,44.350233],[-74.71225800000001,44.350038],[-74.713398,44.349934],[-74.71447999999999,44.349758],[-74.714303,44.348907],[-74.71467699999999,44.348185],[-74.71562400000001,44.347407],[-74.717119,44.34643],[-74.71824599999999,44.345412],[-74.718903,44.344199],[-74.71901,44.343331],[-74.71897199999999,44.342333],[-74.718656,44.340989],[-74.719148,44.339429],[-74.71925,44.33762],[-74.719346,44.337573],[-74.719523,44.337457],[-74.719937,44.336949],[-74.720265,44.336572],[-74.72072199999999,44.336032],[-74.722334,44.334836],[-74.72263,44.334846],[-74.72276599999999,44.334841],[-74.72297,44.334817],[-74.723024,44.334797],[-74.72304800000001,44.334768],[-74.72305299999999,44.334729],[-74.72301899999999,44.334652],[-74.722995,44.334627],[-74.72299,44.334584],[-74.723009,44.33455],[-74.723072,44.334501],[-74.72309199999999,44.334472],[-74.72309199999999,44.334423],[-74.723106,44.33438],[-74.723131,44.334356],[-74.723184,44.334336],[-74.72322800000001,44.334336],[-74.72330599999999,44.334409],[-74.723349,44.334428],[-74.72349,44.334428],[-74.723524,44.334409],[-74.72358699999999,44.334317],[-74.723626,44.334229],[-74.72367,44.334186],[-74.72383499999999,44.334108],[-74.724103,44.33388],[-74.724161,44.333812],[-74.7242,44.3337],[-74.7242,44.333535],[-74.72426299999999,44.333438],[-74.724316,44.33339],[-74.724491,44.333283],[-74.72516,44.332785],[-74.725311,44.332635],[-74.72536100000001,44.332565],[-74.72541099999999,44.332515],[-74.725537,44.332447],[-74.725505,44.33215],[-74.72551300000001,44.331834],[-74.72553499999999,44.33169],[-74.725864,44.330091],[-74.726586,44.330214],[-74.726842,44.330266],[-74.727102,44.330312],[-74.727423,44.330356],[-74.727577,44.330364],[-74.727707,44.330358],[-74.727795,44.33034],[-74.727957,44.330262],[-74.72847299999999,44.329953],[-74.728621,44.329887],[-74.728928,44.329794],[-74.729263,44.32972],[-74.729332,44.329715],[-74.729546,44.329724],[-74.729669,44.329729],[-74.72980200000001,44.329721],[-74.73024100000001,44.32967],[-74.730985,44.329608],[-74.732112,44.329585],[-74.73240300000001,44.329578],[-74.73304899999999,44.329589],[-74.73335299999999,44.329594],[-74.733445,44.329587],[-74.733525,44.329569],[-74.733712,44.329507],[-74.734084,44.329403],[-74.734281,44.32937],[-74.734515,44.329373],[-74.734888,44.329368],[-74.73505,44.329358],[-74.735167,44.329342],[-74.73535200000001,44.329284],[-74.735601,44.329168],[-74.735775,44.32909],[-74.73602200000001,44.329034],[-74.73631,44.328946],[-74.73652,44.32887],[-74.73788,44.328593],[-74.73872299999999,44.328441],[-74.73966900000001,44.328245],[-74.739807,44.328261],[-74.741365,44.328182],[-74.742318,44.328428],[-74.742988,44.328596],[-74.74547200000001,44.329649],[-74.74785799999999,44.330408],[-74.749509,44.33122],[-74.749591,44.331264],[-74.74999699999999,44.331663],[-74.75017699999999,44.331744],[-74.75044,44.331786],[-74.75057099999999,44.331786],[-74.750733,44.331802],[-74.751222,44.331924],[-74.75246300000001,44.332092],[-74.752557,44.332111],[-74.752807,44.332217],[-74.753258,44.332448],[-74.753479,44.332514],[-74.75369600000001,44.332533],[-74.753755,44.332522],[-74.75382500000001,44.33249],[-74.754327,44.332075],[-74.754694,44.331712],[-74.75484299999999,44.33155],[-74.75492,44.331483],[-74.755053,44.331393],[-74.755177,44.331324],[-74.755475,44.331192],[-74.755741,44.331089],[-74.756034,44.331013],[-74.75621,44.330986],[-74.756343,44.330979],[-74.756867,44.330999],[-74.757586,44.331072],[-74.75772600000001,44.331079],[-74.757869,44.331052],[-74.758002,44.331006],[-74.758681,44.330733],[-74.759199,44.330479],[-74.759462,44.330372],[-74.759625,44.330289],[-74.759771,44.330176],[-74.75993800000001,44.330027],[-74.760018,44.329973],[-74.760144,44.329933],[-74.76031399999999,44.329904],[-74.760493,44.329897],[-74.760696,44.329904],[-74.76126499999999,44.32996],[-74.761562,44.32995],[-74.761641,44.329933],[-74.76170500000001,44.32989],[-74.76175499999999,44.329837],[-74.761821,44.329741],[-74.76189100000001,44.329661],[-74.76199099999999,44.329594],[-74.76205299999999,44.32957],[-74.76218,44.329546],[-74.76248200000001,44.329433],[-74.762612,44.329367],[-74.76285799999999,44.329297],[-74.763171,44.329247],[-74.76390000000001,44.329174],[-74.764196,44.329141],[-74.764303,44.329114],[-74.764449,44.329051],[-74.764825,44.328825],[-74.764933,44.328781],[-74.76514,44.328738],[-74.765479,44.328704],[-74.76573500000001,44.328611],[-74.765805,44.328598],[-74.766048,44.328605],[-74.766221,44.328601],[-74.766368,44.328578],[-74.76680500000001,44.328424],[-74.766887,44.328405],[-74.767205,44.328377],[-74.767341,44.328327],[-74.767448,44.328271],[-74.76769400000001,44.328074],[-74.767903,44.32789],[-74.76816599999999,44.327659],[-74.768513,44.327399],[-74.768782,44.327263],[-74.76903799999999,44.327186],[-74.769318,44.327137],[-74.769712,44.327103],[-74.770118,44.327126],[-74.770448,44.327179],[-74.770814,44.327226],[-74.771337,44.327244],[-74.77148,44.32724],[-74.77162199999999,44.327207],[-74.77188700000001,44.327112],[-74.77234,44.326976],[-74.77251099999999,44.326912],[-74.77260200000001,44.326856],[-74.772831,44.326655],[-74.77306299999999,44.326493],[-74.77331700000001,44.326355],[-74.773601,44.326254],[-74.77393600000001,44.326182],[-74.774196,44.326182],[-74.774265,44.32616],[-74.774416,44.326063],[-74.77483700000001,44.325742],[-74.775226,44.325566],[-74.775447,44.325432],[-74.77570299999999,44.325204],[-74.776155,44.324693],[-74.77652999999999,44.324173],[-74.77661500000001,44.324089],[-74.776709,44.323998],[-74.77688999999999,44.323849],[-74.776993,44.323781],[-74.777378,44.323575],[-74.777883,44.323205],[-74.778037,44.323111],[-74.778424,44.322967],[-74.77920899999999,44.322742],[-74.7801,44.322473],[-74.780531,44.322374],[-74.78089300000001,44.322335],[-74.781993,44.322242],[-74.782265,44.322189],[-74.78288000000001,44.322004],[-74.783219,44.321917],[-74.78373999999999,44.321847],[-74.784126,44.321777],[-74.784583,44.321625],[-74.784717,44.321614],[-74.78494999999999,44.321627],[-74.78507999999999,44.321614],[-74.785207,44.321574],[-74.786193,44.321052],[-74.786717,44.320822],[-74.786952,44.320754],[-74.78748,44.320717],[-74.787684,44.320695],[-74.787768,44.320658],[-74.787831,44.320591],[-74.790599,44.320718],[-74.793752,44.320856],[-74.79569499999999,44.321039],[-74.79709699999999,44.321542],[-74.798275,44.32184],[-74.799582,44.322618],[-74.79969800000001,44.322732],[-74.800123,44.323075],[-74.801557,44.323875],[-74.802385,44.324516],[-74.80541100000001,44.325454],[-74.806685,44.326323],[-74.80840499999999,44.327215],[-74.809201,44.327786],[-74.809361,44.328084],[-74.809743,44.329318],[-74.81030199999999,44.332747],[-74.810599,44.332736],[-74.81253100000001,44.332623],[-74.842536,44.330929],[-74.847385,44.330611],[-74.856137,44.330136],[-74.85999700000001,44.329914],[-74.861175,44.32984],[-74.862263,44.329778],[-74.867069,44.329492],[-74.867966,44.329454],[-74.868407,44.329445],[-74.868977,44.329407],[-74.875366,44.329076],[-74.88937199999999,44.327941],[-74.89249700000001,44.328078],[-74.923242,44.326312],[-74.924528,44.336462],[-74.925006,44.34027],[-74.92612800000001,44.349443],[-74.927025,44.356297],[-74.927097,44.356846],[-74.927188,44.357499],[-74.927294,44.358184],[-74.927339,44.358452],[-74.927381,44.35887],[-74.927808,44.361898],[-74.92784899999999,44.362186],[-74.928758,44.367413],[-74.929468,44.371318],[-74.930222,44.374976],[-74.9308,44.378968],[-74.93180700000001,44.386928],[-74.935423,44.414339],[-74.93642,44.422098],[-74.93656900000001,44.423231],[-74.939632,44.446328],[-74.939773,44.447387],[-74.941253,44.458851],[-74.942156,44.465345],[-74.94281700000001,44.470096]]],"type":"Polygon"}
}