{
  "id": "361031583063",
  "type": "Feature",
  "properties": {
    "area_land":1258161,
    "area_water":0,
    "geoid":"361031583063",
    "name":"Block Group 3",
    "state":"ny"
},
  "bbox": [
    -73.002028,
    40.907641,
    -72.986373,
    40.923946
],
  "geometry": {"coordinates":[[[-73.001655,40.913273],[-73.001313,40.913907],[-73.00098300000001,40.91452],[-73.000877,40.914757],[-73.000839,40.914909],[-73.000846,40.915099],[-73.000884,40.91531],[-73.001052,40.915836],[-73.00108299999999,40.916054],[-73.001144,40.916267],[-73.00125800000001,40.916733],[-73.001274,40.916832],[-73.001266,40.917019],[-73.00123499999999,40.917201],[-73.001159,40.917415],[-73.001098,40.917655],[-73.001014,40.917937],[-73.000922,40.918143],[-73.000806,40.918339],[-73.000563,40.918608],[-73.000266,40.918899],[-73.000029,40.91917],[-72.999945,40.919365],[-72.999892,40.919609],[-72.999869,40.919802],[-72.99974,40.920222],[-72.999633,40.920467],[-72.99948000000001,40.920795],[-72.999297,40.921181],[-72.999138,40.921539],[-72.9991,40.921676],[-72.999083,40.921817],[-72.999098,40.921974],[-72.999122,40.922134],[-72.999191,40.92234],[-72.999258,40.922497],[-72.999297,40.922702],[-72.999298,40.922863],[-72.999229,40.923092],[-72.999129,40.923213],[-72.99903,40.923313],[-72.998923,40.923397],[-72.998825,40.923446],[-72.99866400000001,40.923508],[-72.998481,40.923561],[-72.99829,40.923603],[-72.99773399999999,40.923691],[-72.996314,40.923946],[-72.99612399999999,40.92349],[-72.995942,40.923056],[-72.995783,40.922672],[-72.99562899999999,40.922381],[-72.995251,40.921848],[-72.994479,40.920799],[-72.99377800000001,40.919891],[-72.99375000000001,40.919848],[-72.99342300000001,40.919361],[-72.993087,40.918953],[-72.99267500000001,40.918579],[-72.992133,40.918072],[-72.991714,40.917663],[-72.99137,40.917427],[-72.990852,40.917118],[-72.99035499999999,40.91682],[-72.990089,40.916607],[-72.98947,40.916229],[-72.98859400000001,40.915305],[-72.988078,40.914742],[-72.987403,40.914005],[-72.987128,40.913643],[-72.98702900000001,40.912891],[-72.986968,40.912624],[-72.98689899999999,40.911609],[-72.986831,40.910827],[-72.986693,40.9103],[-72.98648,40.909438],[-72.98638099999999,40.907944],[-72.986373,40.907654],[-72.987143,40.907642],[-72.987662,40.907641],[-72.987892,40.907649],[-72.988051,40.907673],[-72.988226,40.90773],[-72.988387,40.90782],[-72.98891399999999,40.908165],[-72.989135,40.908314],[-72.989318,40.908447],[-72.989546,40.908585],[-72.989738,40.908703],[-72.98988199999999,40.908821],[-72.98998,40.908966],[-72.99002,40.908747],[-72.99112700000001,40.909102],[-72.99177400000001,40.909358],[-72.992499,40.909599],[-72.99374299999999,40.909988],[-72.99767300000001,40.911243],[-72.998532,40.91153],[-72.999641,40.911884],[-73.002028,40.912616],[-73.001655,40.913273]]],"type":"Polygon"}
}