{
  "id": "360470207002",
  "type": "Feature",
  "properties": {
    "area_land":38361,
    "area_water":0,
    "geoid":"360470207002",
    "name":"Block Group 2",
    "state":"ny"
},
  "bbox": [
    -73.968999,
    40.672878,
    -73.966613,
    40.675492
],
  "geometry": {"coordinates":[[[-73.968999,40.674713],[-73.967519,40.675492],[-73.966613,40.675302],[-73.966942,40.674416],[-73.967191,40.673694],[-73.96742999999999,40.673032],[-73.96748599999999,40.672878],[-73.96790900000001,40.672938],[-73.968453,40.67296],[-73.968924,40.672938],[-73.968858,40.67307],[-73.968797,40.673284],[-73.96873100000001,40.673928],[-73.96874099999999,40.674025],[-73.968777,40.674202],[-73.968835,40.674386],[-73.968906,40.674548],[-73.968999,40.674713]]],"type":"Polygon"}
}