{
  "id": "360593006004",
  "type": "Feature",
  "properties": {
    "area_land":462213,
    "area_water":0,
    "geoid":"360593006004",
    "name":"Block Group 4",
    "state":"ny"
},
  "bbox": [
    -73.721619,
    40.786029,
    -73.706391,
    40.793048
],
  "geometry": {"coordinates":[[[-73.721619,40.791308],[-73.720321,40.791361],[-73.715935,40.791845],[-73.713949,40.792675],[-73.71339999999999,40.792456],[-73.71292699999999,40.792787],[-73.712608,40.792902],[-73.712203,40.793013],[-73.712034,40.793048],[-73.709498,40.793007],[-73.709408,40.792716],[-73.70928600000001,40.79232],[-73.70877299999999,40.791635],[-73.708687,40.79153],[-73.709182,40.790988],[-73.709475,40.790701],[-73.706452,40.786866],[-73.706391,40.78617],[-73.707966,40.786029],[-73.708253,40.786276],[-73.70837899999999,40.786375],[-73.708586,40.78651],[-73.708643,40.78655],[-73.708781,40.786847],[-73.708823,40.786883],[-73.708943,40.786986],[-73.709001,40.787022],[-73.709131,40.787077],[-73.70926,40.787119],[-73.709535,40.787171],[-73.709867,40.787205],[-73.710285,40.787267],[-73.710545,40.787328],[-73.7111,40.787504],[-73.711162,40.787744],[-73.711164,40.78787],[-73.711174,40.788002],[-73.711173,40.78821],[-73.71114900000001,40.788385],[-73.711129,40.78849],[-73.711113,40.788808],[-73.711147,40.789076],[-73.71115,40.789103],[-73.71141900000001,40.789536],[-73.71163300000001,40.789515],[-73.712441,40.789403],[-73.713688,40.78924],[-73.71504899999999,40.789043],[-73.715433,40.788986],[-73.715504,40.788972],[-73.71563,40.788965],[-73.716165,40.788887],[-73.71652899999999,40.788845],[-73.717518,40.788739],[-73.71801499999999,40.788688],[-73.718388,40.788688],[-73.71888800000001,40.788696],[-73.71916299999999,40.788672],[-73.719294,40.788647],[-73.71952400000001,40.788615],[-73.720077,40.788517],[-73.720927,40.788361],[-73.721045,40.788334],[-73.72105500000001,40.78879],[-73.72124700000001,40.789365],[-73.72125,40.789431],[-73.721282,40.789552],[-73.721327,40.789828],[-73.721619,40.791308]]],"type":"Polygon"}
}