{
  "id": "360810601001",
  "type": "Feature",
  "properties": {
    "area_land":75121,
    "area_water":0,
    "geoid":"360810601001",
    "name":"Block Group 1",
    "state":"ny"
},
  "bbox": [
    -73.90333,
    40.713793,
    -73.897502,
    40.717382
],
  "geometry": {"coordinates":[[[-73.90333,40.715398],[-73.90244300000001,40.715515],[-73.901443,40.715646],[-73.901584,40.716144],[-73.899018,40.717382],[-73.89820400000001,40.71693],[-73.89805800000001,40.716863],[-73.897963,40.71681],[-73.897818,40.716712],[-73.897729,40.71664],[-73.897617,40.71653],[-73.897502,40.716384],[-73.897687,40.716298],[-73.897824,40.716236],[-73.89860299999999,40.715867],[-73.899264,40.715544],[-73.8999,40.715233],[-73.90087200000001,40.71476],[-73.901158,40.714622],[-73.902045,40.714197],[-73.902854,40.713793],[-73.90333,40.715398]]],"type":"Polygon"}
}