{
  "id": "360150007001",
  "type": "Feature",
  "properties": {
    "area_land":869664,
    "area_water":0,
    "geoid":"360150007001",
    "name":"Block Group 1",
    "state":"ny"
},
  "bbox": [
    -76.811332,
    42.092011,
    -76.79083,
    42.100952
],
  "geometry": {"coordinates":[[[-76.81057,42.099996],[-76.81031400000001,42.100071],[-76.80972199999999,42.100222],[-76.80931699999999,42.100382],[-76.808407,42.100643],[-76.80825,42.100702],[-76.808013,42.100755],[-76.80726900000001,42.100952],[-76.806529,42.100492],[-76.806054,42.100235],[-76.805164,42.099838],[-76.804389,42.099563],[-76.803883,42.099401],[-76.80345800000001,42.099282],[-76.80177399999999,42.098938],[-76.801472,42.098888],[-76.800926,42.098788],[-76.79996800000001,42.098638],[-76.79785099999999,42.098232],[-76.796876,42.098038],[-76.79603899999999,42.097858],[-76.795205,42.097607],[-76.794146,42.097188],[-76.79339,42.096813],[-76.79251600000001,42.096307],[-76.791811,42.095813],[-76.79083,42.095087],[-76.79112000000001,42.095011],[-76.79160899999999,42.09485],[-76.79257,42.094549],[-76.793966,42.09411],[-76.795187,42.093729],[-76.79650700000001,42.093347],[-76.79779600000001,42.092913],[-76.798903,42.092562],[-76.799803,42.09231],[-76.80052000000001,42.093683],[-76.801153,42.09482],[-76.801665,42.094663],[-76.802496,42.094416],[-76.80319799999999,42.094225],[-76.803915,42.094023],[-76.804694,42.093798],[-76.805373,42.093603],[-76.806189,42.093386],[-76.806411,42.093346],[-76.806093,42.092359],[-76.806245,42.092315],[-76.807311,42.092011],[-76.807536,42.092418],[-76.80775800000001,42.092817],[-76.80801200000001,42.093282],[-76.80855,42.094238],[-76.80975100000001,42.096404],[-76.81133199999999,42.099771],[-76.81057,42.099996]]],"type":"Polygon"}
}