{
  "id": "360594119023",
  "type": "Feature",
  "properties": {
    "area_land":281561,
    "area_water":0,
    "geoid":"360594119023",
    "name":"Block Group 3",
    "state":"ny"
},
  "bbox": [
    -73.690776,
    40.649978,
    -73.681373,
    40.657412
],
  "geometry": {"coordinates":[[[-73.690776,40.650584],[-73.690405,40.650888],[-73.690265,40.651091],[-73.690106,40.651395],[-73.68975500000001,40.65208],[-73.689505,40.652745],[-73.689221,40.653389],[-73.68815600000001,40.655287],[-73.687838,40.655855],[-73.687597,40.656281],[-73.688288,40.6565],[-73.68906800000001,40.656745],[-73.689881,40.65701],[-73.690257,40.65716],[-73.690139,40.657412],[-73.689768,40.657294],[-73.689668,40.65727],[-73.689622,40.657248],[-73.688936,40.657028],[-73.688158,40.656778],[-73.68732,40.656513],[-73.686689,40.65631],[-73.685164,40.655822],[-73.684152,40.655501],[-73.683684,40.655349],[-73.683583,40.655307],[-73.68343900000001,40.655216],[-73.68281899999999,40.654758],[-73.68207099999999,40.654209],[-73.68149099999999,40.653784],[-73.68137299999999,40.653704],[-73.682209,40.653351],[-73.683059,40.652996],[-73.684181,40.652499],[-73.68509,40.652039],[-73.68539,40.651858],[-73.686026,40.651507],[-73.686037,40.65149],[-73.68614100000001,40.651453],[-73.68627600000001,40.65137],[-73.68656799999999,40.651215],[-73.686818,40.651092],[-73.686875,40.651064],[-73.68722200000001,40.650909],[-73.688067,40.650561],[-73.68882499999999,40.65032],[-73.689134,40.650231],[-73.689368,40.650171],[-73.689663,40.650068],[-73.68986200000001,40.649978],[-73.689999,40.650083],[-73.690217,40.650261],[-73.690326,40.650334],[-73.69043600000001,40.650406],[-73.69056399999999,40.650453],[-73.690776,40.650584]]],"type":"Polygon"}
}