{
  "id": "360290171003",
  "type": "Feature",
  "properties": {
    "area_land":128692,
    "area_water":0,
    "geoid":"360290171003",
    "name":"Block Group 3",
    "state":"ny"
},
  "bbox": [
    -78.892341,
    42.922028,
    -78.887278,
    42.925878
],
  "geometry": {"coordinates":[[[-78.892217,42.924911],[-78.892099,42.92585],[-78.88963099999999,42.925878],[-78.889757,42.924951],[-78.88727799999999,42.92499],[-78.887407,42.92407],[-78.88746399999999,42.923746],[-78.88757,42.922878],[-78.887614,42.922576],[-78.88767900000001,42.922073],[-78.88891700000001,42.922057],[-78.890142,42.922043],[-78.891386,42.922028],[-78.891347,42.922325],[-78.891299,42.922652],[-78.89110599999999,42.924001],[-78.892341,42.923976],[-78.892217,42.924911]]],"type":"Polygon"}
}