{
  "id": "360290156001",
  "type": "Feature",
  "properties": {
    "area_land":31710864,
    "area_water":314462,
    "geoid":"360290156001",
    "name":"Block Group 1",
    "state":"ny"
},
  "bbox": [
    -79.132649,
    42.567088,
    -79.017192,
    42.610471
],
  "geometry": {"coordinates":[[[-79.132566,42.586634],[-79.131944,42.589216],[-79.13132299999999,42.590949],[-79.13008000000001,42.591995],[-79.12843700000001,42.592125],[-79.126439,42.591929],[-79.124747,42.592124],[-79.123839,42.593187],[-79.122941,42.594936],[-79.121516,42.599212],[-79.12077600000001,42.602166],[-79.12061799999999,42.603371],[-79.11882300000001,42.604032],[-79.11618199999999,42.604343],[-79.11454500000001,42.606831],[-79.11385900000001,42.609279],[-79.113331,42.610471],[-79.112168,42.61046],[-79.111873,42.610462],[-79.109454,42.610423],[-79.09976,42.610264],[-79.09270100000001,42.610318],[-79.07871799999999,42.61046],[-79.07179499999999,42.610461],[-79.068504,42.61044],[-79.064898,42.610448],[-79.06470299999999,42.610439],[-79.063971,42.610442],[-79.062296,42.61045],[-79.061244,42.610452],[-79.058066,42.610447],[-79.056687,42.61044],[-79.055272,42.610419],[-79.05386,42.610415],[-79.053174,42.61042],[-79.052446,42.610429],[-79.047297,42.6104],[-79.046616,42.6104],[-79.045976,42.610398],[-79.04591600000001,42.610397],[-79.04552,42.610395],[-79.043848,42.610375],[-79.04168300000001,42.610329],[-79.03475299999999,42.610189],[-79.034387,42.610181],[-79.03330200000001,42.610159],[-79.03198,42.61013],[-79.030584,42.610098],[-79.027666,42.610018],[-79.024018,42.609938],[-79.021743,42.609899],[-79.02168399999999,42.609898],[-79.02112,42.609881],[-79.02109900000001,42.609881],[-79.020585,42.609869],[-79.019409,42.609842],[-79.018221,42.609825],[-79.01804799999999,42.609824],[-79.01719199999999,42.609817],[-79.017212,42.608597],[-79.017247,42.606392],[-79.01734,42.600451],[-79.01736099999999,42.599105],[-79.017408,42.595208],[-79.017493,42.591793],[-79.01753600000001,42.590372],[-79.017549,42.589813],[-79.017584,42.588339],[-79.01772099999999,42.582457],[-79.017228,42.581481],[-79.017273,42.580386],[-79.017314,42.579248],[-79.017432,42.57538],[-79.017467,42.574371],[-79.017717,42.567088],[-79.048244,42.56798],[-79.06204700000001,42.568384],[-79.06202999999999,42.575663],[-79.062016,42.578697],[-79.062004,42.581172],[-79.06200800000001,42.582379],[-79.062386,42.582379],[-79.06384,42.582475],[-79.063952,42.582477],[-79.068889,42.582571],[-79.080461,42.582702],[-79.089792,42.582808],[-79.095806,42.582861],[-79.096824,42.58287],[-79.09827300000001,42.582923],[-79.101125,42.582951],[-79.10110899999999,42.585536],[-79.103122,42.585542],[-79.12046100000001,42.585637],[-79.12466999999999,42.585572],[-79.12997799999999,42.585612],[-79.13144699999999,42.585611],[-79.132649,42.585581],[-79.132566,42.586634]]],"type":"Polygon"}
}