{
  "id": "360272102015",
  "type": "Feature",
  "properties": {
    "area_land":930950,
    "area_water":0,
    "geoid":"360272102015",
    "name":"Block Group 5",
    "state":"ny"
},
  "bbox": [
    -73.978789,
    41.488561,
    -73.966727,
    41.500857
],
  "geometry": {"coordinates":[[[-73.97878900000001,41.495392],[-73.97870899999999,41.49589],[-73.978624,41.496116],[-73.97852399999999,41.49646],[-73.97823699999999,41.496962],[-73.978089,41.497269],[-73.978058,41.497381],[-73.97804600000001,41.497472],[-73.978025,41.497731],[-73.97802900000001,41.497955],[-73.978059,41.498397],[-73.978084,41.499018],[-73.978088,41.499446],[-73.97811299999999,41.49973],[-73.978162,41.499793],[-73.978121,41.499835],[-73.978047,41.499933],[-73.978036,41.499997],[-73.978043,41.500572],[-73.977692,41.500613],[-73.977339,41.500691],[-73.977023,41.50081],[-73.97689200000001,41.50084],[-73.976713,41.500856],[-73.97659299999999,41.500857],[-73.976046,41.500799],[-73.97562600000001,41.500744],[-73.975328,41.500713],[-73.974817,41.500639],[-73.974326,41.50058],[-73.97373899999999,41.500515],[-73.97323400000001,41.50043],[-73.97309199999999,41.500393],[-73.97288,41.50032],[-73.97274400000001,41.500263],[-73.972486,41.500167],[-73.972365,41.500106],[-73.97221500000001,41.499995],[-73.97213499999999,41.499927],[-73.971935,41.49975],[-73.971789,41.499642],[-73.971626,41.49955],[-73.971491,41.499501],[-73.97123499999999,41.499462],[-73.970905,41.499432],[-73.970817,41.499424],[-73.970572,41.499368],[-73.970423,41.499313],[-73.96883800000001,41.498717],[-73.968524,41.498602],[-73.967896,41.498369],[-73.967501,41.49825],[-73.967429,41.498213],[-73.967347,41.498173],[-73.96672700000001,41.497926],[-73.967082,41.497176],[-73.96726,41.496636],[-73.96738000000001,41.496235],[-73.967416,41.495892],[-73.96742999999999,41.495534],[-73.96741400000001,41.495306],[-73.96734600000001,41.494918],[-73.967332,41.49474],[-73.967341,41.494566],[-73.967382,41.494457],[-73.96745300000001,41.494326],[-73.967823,41.493897],[-73.96796999999999,41.493667],[-73.968012,41.493576],[-73.968109,41.493374],[-73.96827399999999,41.492931],[-73.968486,41.492583],[-73.968694,41.492281],[-73.96888,41.492039],[-73.968997,41.491911],[-73.969151,41.491709],[-73.969224,41.49156],[-73.96946199999999,41.490867],[-73.969555,41.490643],[-73.96971600000001,41.490438],[-73.969855,41.490309],[-73.97076,41.48963],[-73.97090300000001,41.489456],[-73.971199,41.488909],[-73.971281,41.488804],[-73.971368,41.48874],[-73.97150499999999,41.48868],[-73.971615,41.488662],[-73.971688,41.488662],[-73.97190999999999,41.488788],[-73.97210699999999,41.488952],[-73.97229799999999,41.489089],[-73.97242199999999,41.489139],[-73.972532,41.489157],[-73.972651,41.489148],[-73.972838,41.489043],[-73.973117,41.488842],[-73.973322,41.488728],[-73.973418,41.488696],[-73.97407,41.488561],[-73.974206,41.48867],[-73.97439,41.488826],[-73.974582,41.489012],[-73.974947,41.489421],[-73.975032,41.489547],[-73.975105,41.48971],[-73.97511900000001,41.489802],[-73.97512500000001,41.489921],[-73.97515199999999,41.489913],[-73.975194,41.489901],[-73.975607,41.489862],[-73.975773,41.489866],[-73.975915,41.48988],[-73.97610400000001,41.489919],[-73.976311,41.489994],[-73.97639700000001,41.490051],[-73.97655399999999,41.490226],[-73.976643,41.490375],[-73.976681,41.490492],[-73.976693,41.490539],[-73.976686,41.490693],[-73.976354,41.492422],[-73.976254,41.492735],[-73.97617,41.492878],[-73.976106,41.492939],[-73.976035,41.49297],[-73.97686,41.493612],[-73.977101,41.493781],[-73.97765699999999,41.493998],[-73.97788300000001,41.49408],[-73.977976,41.494122],[-73.97815300000001,41.494227],[-73.978221,41.494288],[-73.978435,41.494523],[-73.97863599999999,41.494816],[-73.97872099999999,41.495006],[-73.978773,41.495178],[-73.97878900000001,41.495271],[-73.97878900000001,41.495392]]],"type":"Polygon"}
}