{
  "id": "360379506002",
  "type": "Feature",
  "properties": {
    "area_land":545793,
    "area_water":0,
    "geoid":"360379506002",
    "name":"Block Group 2",
    "state":"ny"
},
  "bbox": [
    -78.191489,
    42.997379,
    -78.180172,
    43.005378
],
  "geometry": {"coordinates":[[[-78.191453,42.999862],[-78.19005900000001,43.001586],[-78.18926500000001,43.00255],[-78.188191,43.003834],[-78.18693399999999,43.005378],[-78.18586999999999,43.005225],[-78.18412600000001,43.004987],[-78.18277500000001,43.004753],[-78.180172,43.004375],[-78.180696,43.002215],[-78.181257,42.999977],[-78.181521,42.999002],[-78.18174,42.99815],[-78.18193100000001,42.99741],[-78.181938,42.997379],[-78.183212,42.997535],[-78.185423,42.997837],[-78.186718,42.997999],[-78.186806,42.998011],[-78.18691200000001,42.998026],[-78.18700800000001,42.998039],[-78.18745800000001,42.9981],[-78.18766599999999,42.998142],[-78.187686,42.998149],[-78.187741,42.998167],[-78.188135,42.998321],[-78.188221,42.998359],[-78.188532,42.998499],[-78.18926999999999,42.998834],[-78.189302,42.998848],[-78.189404,42.99889],[-78.19011399999999,42.999202],[-78.191489,42.999816],[-78.191453,42.999862]]],"type":"Polygon"}
}