{
  "id": "360470408003",
  "type": "Feature",
  "properties": {
    "area_land":62570,
    "area_water":0,
    "geoid":"360470408003",
    "name":"Block Group 3",
    "state":"ny"
},
  "bbox": [
    -73.981679,
    40.598548,
    -73.978929,
    40.60337
],
  "geometry": {"coordinates":[[[-73.981679,40.60316],[-73.980752,40.603264],[-73.98021300000001,40.603328],[-73.979827,40.60337],[-73.979387,40.601044],[-73.97892899999999,40.598653],[-73.97935200000001,40.598605],[-73.97985799999999,40.598548],[-73.980311,40.600942],[-73.98123699999999,40.600837],[-73.981679,40.60316]]],"type":"Polygon"}
}