{
  "id": "360290142042",
  "type": "Feature",
  "properties": {
    "area_land":17925419,
    "area_water":89172,
    "geoid":"360290142042",
    "name":"Block Group 2",
    "state":"ny"
},
  "bbox": [
    -78.657436,
    42.878349,
    -78.577802,
    42.927174
],
  "geometry": {"coordinates":[[[-78.65735599999999,42.905169],[-78.65735100000001,42.90526],[-78.65731700000001,42.906913],[-78.657222,42.911474],[-78.657152,42.914324],[-78.657151,42.914665],[-78.657149,42.915384],[-78.638336,42.917605],[-78.637671,42.917684],[-78.637609,42.917691],[-78.63232600000001,42.918314],[-78.632194,42.91833],[-78.624748,42.919315],[-78.623395,42.919511],[-78.622546,42.919642],[-78.620717,42.919924],[-78.61919899999999,42.920178],[-78.61282199999999,42.921259],[-78.606737,42.922292],[-78.606483,42.922335],[-78.604404,42.922719],[-78.602859,42.923004],[-78.593497,42.924631],[-78.593001,42.924714],[-78.58477499999999,42.926092],[-78.578322,42.927174],[-78.578333,42.926357],[-78.578305,42.925215],[-78.578304,42.923068],[-78.57830300000001,42.922853],[-78.57830300000001,42.922756],[-78.57830300000001,42.922392],[-78.578312,42.92134],[-78.578305,42.920911],[-78.578259,42.918066],[-78.578248,42.917363],[-78.57825,42.916818],[-78.578278,42.910197],[-78.578219,42.904829],[-78.5782,42.903042],[-78.57818399999999,42.901532],[-78.578183,42.901439],[-78.57818,42.901192],[-78.57817799999999,42.901058],[-78.57813,42.897727],[-78.578035,42.892558],[-78.578011,42.891532],[-78.57799300000001,42.890707],[-78.57798,42.89019],[-78.577944,42.888612],[-78.577889,42.885345],[-78.57787399999999,42.884487],[-78.577868,42.884102],[-78.57785199999999,42.883213],[-78.57780200000001,42.880253],[-78.577969,42.880306],[-78.57915199999999,42.880285],[-78.579843,42.880117],[-78.580811,42.88],[-78.581568,42.879742],[-78.582089,42.879158],[-78.582336,42.878408],[-78.582774,42.878349],[-78.583865,42.879081],[-78.585098,42.879359],[-78.585922,42.879788],[-78.586444,42.879959],[-78.587318,42.879886],[-78.587507,42.879821],[-78.58784199999999,42.87974],[-78.588132,42.87967],[-78.588292,42.879632],[-78.588976,42.879646],[-78.58908099999999,42.879675],[-78.58996,42.879918],[-78.590354,42.880201],[-78.59079800000001,42.880782],[-78.591921,42.881146],[-78.591964,42.88115],[-78.593148,42.881152],[-78.593766,42.881257],[-78.594528,42.881662],[-78.594819,42.882171],[-78.594802,42.883406],[-78.594714,42.884067],[-78.594774,42.884114],[-78.595049,42.885035],[-78.595032,42.886293],[-78.595056,42.886477],[-78.59595,42.887479],[-78.59620700000001,42.888079],[-78.596509,42.888291],[-78.59715300000001,42.888534],[-78.597617,42.888612],[-78.598494,42.88847],[-78.599535,42.888103],[-78.600311,42.888142],[-78.60137899999999,42.888668],[-78.60253299999999,42.888601],[-78.603447,42.888299],[-78.603976,42.888288],[-78.604587,42.888575],[-78.605053,42.888608],[-78.605834,42.888532],[-78.60636100000001,42.888566],[-78.607097,42.888856],[-78.607488,42.88935],[-78.60786,42.889522],[-78.607927,42.889553],[-78.60791999999999,42.891022],[-78.607846,42.891832],[-78.607764,42.892691],[-78.60772799999999,42.895626],[-78.607726,42.899125],[-78.607724,42.899591],[-78.60771800000001,42.901226],[-78.60771699999999,42.901559],[-78.612386,42.901811],[-78.612551,42.901808],[-78.617323,42.901994],[-78.617802,42.90201],[-78.62280699999999,42.902318],[-78.626541,42.902548],[-78.637216,42.903205],[-78.63798199999999,42.903242],[-78.63873599999999,42.903278],[-78.64865,42.903819],[-78.65185700000001,42.903994],[-78.651965,42.90401],[-78.65201399999999,42.904003],[-78.657436,42.904299],[-78.65735599999999,42.905169]]],"type":"Polygon"}
}