{
  "id": "360470446001",
  "type": "Feature",
  "properties": {
    "area_land":70355,
    "area_water":0,
    "geoid":"360470446001",
    "name":"Block Group 1",
    "state":"ny"
},
  "bbox": [
    -73.978455,
    40.61403,
    -73.972903,
    40.617287
],
  "geometry": {"coordinates":[[[-73.97785,40.617287],[-73.97563,40.615946],[-73.97541699999999,40.615975],[-73.975481,40.616312],[-73.97444400000001,40.616421],[-73.973358,40.616541],[-73.972903,40.614153],[-73.97399299999999,40.61403],[-73.975172,40.614724],[-73.976223,40.615359],[-73.978455,40.616707],[-73.97785,40.617287]]],"type":"Polygon"}
}