{
  "id": "361032010015",
  "type": "Feature",
  "properties": {
    "area_land":3845863,
    "area_water":0,
    "geoid":"361032010015",
    "name":"Block Group 5",
    "state":"ny"
},
  "bbox": [
    -72.181509,
    41.004808,
    -72.15477,
    41.030725
],
  "geometry": {"coordinates":[[[-72.181496,41.006562],[-72.181389,41.006995],[-72.181316,41.007671],[-72.181303,41.008038],[-72.181169,41.00879],[-72.181174,41.009168],[-72.18111399999999,41.009391],[-72.18105799999999,41.009661],[-72.180752,41.011132],[-72.180666,41.011761],[-72.180431,41.012566],[-72.180228,41.012919],[-72.17992599999999,41.013131],[-72.17972399999999,41.013318],[-72.179588,41.013661],[-72.179508,41.013849],[-72.179349,41.014218],[-72.17927,41.014389],[-72.17920100000001,41.014552],[-72.17888000000001,41.014867],[-72.17872199999999,41.015015],[-72.178487,41.015236],[-72.17824400000001,41.015501],[-72.17819799999999,41.015694],[-72.178174,41.015866],[-72.178189,41.016204],[-72.17823300000001,41.016365],[-72.178254,41.016457],[-72.178372,41.016875],[-72.17841,41.017111],[-72.17833,41.017358],[-72.178301,41.017434],[-72.178219,41.017652],[-72.17809800000001,41.018326],[-72.177886,41.018729],[-72.177634,41.019089],[-72.17753399999999,41.019294],[-72.17744399999999,41.019493],[-72.177442,41.019752],[-72.177464,41.019996],[-72.177496,41.020143],[-72.17750700000001,41.02028],[-72.17735,41.020451],[-72.176755,41.020965],[-72.176458,41.0213],[-72.17628999999999,41.02159],[-72.176215,41.021734],[-72.17613900000001,41.02183],[-72.175991,41.021947],[-72.175735,41.022168],[-72.175248,41.022549],[-72.175303,41.022927],[-72.175359,41.023449],[-72.175383,41.023716],[-72.175388,41.024013],[-72.175394,41.024383],[-72.175376,41.02452],[-72.175359,41.024802],[-72.17541900000001,41.025236],[-72.17546900000001,41.025498],[-72.175578,41.02568],[-72.17583399999999,41.025901],[-72.176074,41.026106],[-72.176196,41.026198],[-72.176309,41.026535],[-72.17632999999999,41.02667],[-72.176337,41.026846],[-72.176315,41.027011],[-72.176301,41.027194],[-72.176281,41.027312],[-72.176247,41.027422],[-72.176199,41.027531],[-72.176062,41.027708],[-72.17589599999999,41.027879],[-72.17556500000001,41.028237],[-72.17502,41.028878],[-72.17486,41.029028],[-72.174469,41.029422],[-72.17423100000001,41.029705],[-72.173855,41.030146],[-72.173789,41.030223],[-72.17328999999999,41.030725],[-72.17147799999999,41.029843],[-72.171302,41.029758],[-72.171269,41.029743],[-72.16931700000001,41.028818],[-72.167315,41.027871],[-72.167821,41.027272],[-72.165828,41.026331],[-72.163793,41.025392],[-72.16332199999999,41.025984],[-72.161331,41.02504],[-72.161028,41.025401],[-72.16085099999999,41.025612],[-72.160556,41.025478],[-72.160079,41.025262],[-72.159738,41.025106],[-72.15933,41.024919],[-72.1593,41.024905],[-72.158525,41.024526],[-72.15754699999999,41.02572],[-72.156685,41.025338],[-72.155855,41.024991],[-72.154836,41.024562],[-72.155396,41.023676],[-72.15584200000001,41.023006],[-72.15634,41.022258],[-72.156724,41.021701],[-72.15663499999999,41.021474],[-72.156362,41.021113],[-72.155996,41.02093],[-72.15531,41.020538],[-72.15477,41.02023],[-72.155041,41.019635],[-72.155343,41.019077],[-72.155597,41.018579],[-72.155766,41.01824],[-72.155784,41.018219],[-72.156435,41.017467],[-72.157054,41.01693],[-72.157274,41.016841],[-72.157561,41.016764],[-72.15806000000001,41.016617],[-72.158519,41.016477],[-72.15903400000001,41.016202],[-72.159182,41.016068],[-72.15932599999999,41.015906],[-72.15974300000001,41.015099],[-72.160169,41.014273],[-72.160473,41.013685],[-72.160583,41.013486],[-72.160676,41.012907],[-72.160769,41.01233],[-72.16086900000001,41.01193],[-72.161001,41.011675],[-72.16118,41.011358],[-72.16135800000001,41.011107],[-72.161781,41.010542],[-72.16193199999999,41.010326],[-72.162283,41.010032],[-72.162888,41.009549],[-72.163392,41.00914],[-72.163477,41.009068],[-72.16404300000001,41.008579],[-72.16465700000001,41.00808],[-72.165103,41.007714],[-72.165904,41.006993],[-72.16623300000001,41.006724],[-72.167236,41.005865],[-72.167635,41.005406],[-72.16809600000001,41.004841],[-72.16817500000001,41.004928],[-72.169093,41.005334],[-72.17045,41.005925],[-72.171465,41.006384],[-72.17211,41.006664],[-72.174474,41.00722],[-72.17503000000001,41.007123],[-72.175788,41.006977],[-72.175985,41.006938],[-72.176143,41.006908],[-72.17676899999999,41.00665],[-72.177255,41.006446],[-72.17811500000001,41.006085],[-72.178299,41.005967],[-72.17924499999999,41.00536],[-72.179519,41.005184],[-72.17977,41.005023],[-72.18025799999999,41.004873],[-72.18124299999999,41.004808],[-72.181276,41.00498],[-72.181314,41.005657],[-72.18150900000001,41.006475],[-72.181496,41.006562]]],"type":"Polygon"}
}