{
  "id": "360610275002",
  "type": "Feature",
  "properties": {
    "area_land":49438,
    "area_water":0,
    "geoid":"360610275002",
    "name":"Block Group 2",
    "state":"ny"
},
  "bbox": [
    -73.942039,
    40.851313,
    -73.938652,
    40.855176
],
  "geometry": {"coordinates":[[[-73.94203899999999,40.851931],[-73.941591,40.852355],[-73.941501,40.852479],[-73.940377,40.854016],[-73.94026100000001,40.854313],[-73.94012600000001,40.854606],[-73.939972,40.854893],[-73.939808,40.855176],[-73.939311,40.85498],[-73.938652,40.854677],[-73.93944999999999,40.853605],[-73.93953999999999,40.853486],[-73.93970400000001,40.852924],[-73.93981599999999,40.852537],[-73.93985000000001,40.852417],[-73.94014799999999,40.851402],[-73.940285,40.851322],[-73.94048600000001,40.851313],[-73.94068799999999,40.851315],[-73.94089,40.85133],[-73.94108900000001,40.851357],[-73.94126199999999,40.851392],[-73.941852,40.851821],[-73.94203899999999,40.851931]]],"type":"Polygon"}
}