{
  "id": "360290055002",
  "type": "Feature",
  "properties": {
    "area_land":190876,
    "area_water":0,
    "geoid":"360290055002",
    "name":"Block Group 2",
    "state":"ny"
},
  "bbox": [
    -78.891973,
    42.936574,
    -78.885194,
    42.942374
],
  "geometry": {"coordinates":[[[-78.891948,42.941473],[-78.891806,42.942277],[-78.891792,42.942357],[-78.890798,42.942361],[-78.889729,42.942367],[-78.888423,42.942374],[-78.88806700000001,42.941839],[-78.887811,42.941456],[-78.88647,42.939469],[-78.886264,42.939124],[-78.886231,42.939078],[-78.88560099999999,42.938152],[-78.885487,42.938024],[-78.885194,42.93763],[-78.88634,42.937582],[-78.88721099999999,42.937522],[-78.887703,42.937504],[-78.888316,42.937204],[-78.887411,42.937421],[-78.887218,42.937291],[-78.887125,42.937229],[-78.887281,42.937209],[-78.887451,42.937171],[-78.887748,42.937105],[-78.887974,42.937017],[-78.888182,42.936925],[-78.888299,42.936869],[-78.888397,42.936815],[-78.888583,42.936695],[-78.88878699999999,42.936574],[-78.88880399999999,42.936594],[-78.888847,42.936655],[-78.888954,42.936806],[-78.889403,42.937506],[-78.889488,42.937634],[-78.88988500000001,42.938238],[-78.891391,42.940459],[-78.89197299999999,42.941329],[-78.891948,42.941473]]],"type":"Polygon"}
}