{
  "id": "360290069011",
  "type": "Feature",
  "properties": {
    "area_land":150352,
    "area_water":0,
    "geoid":"360290069011",
    "name":"Block Group 1",
    "state":"ny"
},
  "bbox": [
    -78.891591,
    42.908477,
    -78.885442,
    42.914649
],
  "geometry": {"coordinates":[[[-78.89159100000001,42.913229],[-78.89048099999999,42.913796],[-78.890162,42.91396],[-78.88996400000001,42.914049],[-78.888792,42.914649],[-78.887649,42.913414],[-78.88742000000001,42.913185],[-78.887316,42.913073],[-78.88748699999999,42.912984],[-78.886002,42.911403],[-78.886155,42.911336],[-78.886939,42.910934],[-78.885442,42.90933],[-78.886,42.909045],[-78.886551,42.908764],[-78.88712599999999,42.908477],[-78.887559,42.908942],[-78.887956,42.909373],[-78.888614,42.910069],[-78.889748,42.911268],[-78.88983899999999,42.911363],[-78.890096,42.911643],[-78.890203,42.911758],[-78.89148,42.913109],[-78.89159100000001,42.913229]]],"type":"Polygon"}
}