{
  "id": "360050092001",
  "type": "Feature",
  "properties": {
    "area_land":75350,
    "area_water":0,
    "geoid":"360050092001",
    "name":"Block Group 1",
    "state":"ny"
},
  "bbox": [
    -73.860344,
    40.831477,
    -73.854123,
    40.833888
],
  "geometry": {"coordinates":[[[-73.860344,40.833294],[-73.859056,40.833413],[-73.857732,40.833558],[-73.854651,40.833888],[-73.854435,40.832957],[-73.85426200000001,40.832237],[-73.854123,40.831593],[-73.854292,40.831561],[-73.85457599999999,40.831515],[-73.854744,40.831477],[-73.855463,40.831685],[-73.855977,40.831831],[-73.85742999999999,40.832266],[-73.857596,40.832314],[-73.858853,40.832673],[-73.86033500000001,40.833129],[-73.860328,40.833217],[-73.860344,40.833294]]],"type":"Polygon"}
}