{
  "id": "361031354011",
  "type": "Feature",
  "properties": {
    "area_land":1445283,
    "area_water":0,
    "geoid":"361031354011",
    "name":"Block Group 1",
    "state":"ny"
},
  "bbox": [
    -73.175014,
    40.847696,
    -73.153304,
    40.860698
],
  "geometry": {"coordinates":[[[-73.175014,40.854079],[-73.174565,40.854077],[-73.17431000000001,40.854083],[-73.17401,40.85472],[-73.17377,40.855307],[-73.17263,40.855522],[-73.17229399999999,40.855605],[-73.170331,40.856009],[-73.169555,40.856205],[-73.16853999999999,40.856528],[-73.167798,40.856747],[-73.16716,40.857004],[-73.16692399999999,40.857074],[-73.16612000000001,40.857337],[-73.16546,40.857567],[-73.16514100000001,40.857727],[-73.16413300000001,40.858239],[-73.163026,40.858793],[-73.162435,40.859067],[-73.162053,40.859222],[-73.161734,40.859337],[-73.160961,40.85957],[-73.160437,40.859702],[-73.159263,40.859965],[-73.157172,40.860187],[-73.156729,40.860247],[-73.155844,40.860327],[-73.153654,40.860698],[-73.153654,40.860499],[-73.15379299999999,40.859626],[-73.153693,40.859252],[-73.15330400000001,40.857943],[-73.154006,40.8532],[-73.15409,40.8527],[-73.154028,40.852358],[-73.153999,40.852195],[-73.154983,40.852084],[-73.15597099999999,40.851974],[-73.15899899999999,40.851637],[-73.161038,40.851366],[-73.16191499999999,40.851159],[-73.16234799999999,40.851025],[-73.162886,40.850861],[-73.16301799999999,40.850806],[-73.164537,40.850141],[-73.169584,40.847696],[-73.169692,40.847838],[-73.170012,40.848184],[-73.170525,40.848641],[-73.170913,40.849104],[-73.171295,40.84957],[-73.171576,40.850188],[-73.171727,40.850517],[-73.171913,40.850825],[-73.17202399999999,40.850981],[-73.17231700000001,40.851375],[-73.17289700000001,40.851948],[-73.173743,40.852786],[-73.174301,40.853305],[-73.17455200000001,40.853568],[-73.174758,40.853779],[-73.17497899999999,40.854041],[-73.175014,40.854079]]],"type":"Polygon"}
}