{
  "id": "360594065011",
  "type": "Feature",
  "properties": {
    "area_land":535757,
    "area_water":0,
    "geoid":"360594065011",
    "name":"Block Group 1",
    "state":"ny"
},
  "bbox": [
    -73.620569,
    40.720296,
    -73.608705,
    40.729366
],
  "geometry": {"coordinates":[[[-73.62056800000001,40.726201],[-73.62056699999999,40.726304],[-73.62053,40.727128],[-73.620526,40.727245],[-73.620515,40.727453],[-73.618908,40.727823],[-73.618003,40.72803],[-73.61523,40.728667],[-73.612184,40.729366],[-73.61201199999999,40.728996],[-73.61189299999999,40.727995],[-73.61169099999999,40.728044],[-73.61095899999999,40.727209],[-73.610767,40.726597],[-73.610654,40.726268],[-73.60979399999999,40.726393],[-73.609472,40.725701],[-73.608932,40.724165],[-73.60888799999999,40.724011],[-73.609588,40.723876],[-73.609365,40.723204],[-73.608705,40.721127],[-73.608918,40.720944],[-73.609095,40.720783],[-73.60897,40.720296],[-73.609267,40.720397],[-73.609414,40.720487],[-73.60955199999999,40.720601],[-73.609891,40.720655],[-73.61093200000001,40.720915],[-73.611817,40.721129],[-73.611794,40.721374],[-73.612542,40.721346],[-73.612674,40.721692],[-73.61544499999999,40.721072],[-73.615713,40.721771],[-73.615976,40.722456],[-73.61631300000001,40.723323],[-73.61663900000001,40.72417],[-73.61695400000001,40.724986],[-73.61709999999999,40.725358],[-73.617132,40.725476],[-73.617267,40.725803],[-73.617625,40.726729],[-73.61909900000001,40.7264],[-73.619863,40.726229],[-73.62004399999999,40.726202],[-73.620569,40.726106],[-73.62056800000001,40.726201]]],"type":"Polygon"}
}