{
  "id": "360050218003",
  "type": "Feature",
  "properties": {
    "area_land":74117,
    "area_water":0,
    "geoid":"360050218003",
    "name":"Block Group 3",
    "state":"ny"
},
  "bbox": [
    -73.869208,
    40.835473,
    -73.866888,
    40.840305
],
  "geometry": {"coordinates":[[[-73.869208,40.8396],[-73.868847,40.839753],[-73.868723,40.839806],[-73.868308,40.839995],[-73.867822,40.840166],[-73.867406,40.840305],[-73.867355,40.839043],[-73.867316,40.838032],[-73.86726400000001,40.837503],[-73.86712199999999,40.83674],[-73.867006,40.836118],[-73.866888,40.835473],[-73.868155,40.835846],[-73.86832200000001,40.835893],[-73.869015,40.836086],[-73.86907600000001,40.836103],[-73.86909,40.836691],[-73.869139,40.837994],[-73.869208,40.8396]]],"type":"Polygon"}
}