{
  "id": "360630239022",
  "type": "Feature",
  "properties": {
    "area_land":1158755,
    "area_water":0,
    "geoid":"360630239022",
    "name":"Block Group 2",
    "state":"ny"
},
  "bbox": [
    -78.678498,
    43.163628,
    -78.664574,
    43.175885
],
  "geometry": {"coordinates":[[[-78.678498,43.173814],[-78.67818699999999,43.173907],[-78.677256,43.174188],[-78.676946,43.174282],[-78.67665599999999,43.174369],[-78.675787,43.17463],[-78.675498,43.174718],[-78.675347,43.174763],[-78.674897,43.1749],[-78.67485600000001,43.174913],[-78.67474900000001,43.174952],[-78.674494,43.175048],[-78.674229,43.175149],[-78.673731,43.175344],[-78.673478,43.175444],[-78.672336,43.175885],[-78.672336,43.175621],[-78.672336,43.175598],[-78.672336,43.175529],[-78.672336,43.175507],[-78.672338,43.175282],[-78.67233899999999,43.174776],[-78.67233299999999,43.174229],[-78.67233299999999,43.174097],[-78.672332,43.173405],[-78.67233,43.172698],[-78.67193399999999,43.17268],[-78.67181100000001,43.172675],[-78.67101099999999,43.172653],[-78.670749,43.172639],[-78.670354,43.172619],[-78.669923,43.172599],[-78.668633,43.172542],[-78.66820300000001,43.172524],[-78.66751600000001,43.172492],[-78.66747700000001,43.17249],[-78.665299,43.172425],[-78.664574,43.172404],[-78.66459500000001,43.172113],[-78.664641,43.171508],[-78.664652,43.171383],[-78.664663,43.17124],[-78.664687,43.17095],[-78.664703,43.170737],[-78.66475,43.1701],[-78.664767,43.169888],[-78.66479200000001,43.169553],[-78.664867,43.168564],[-78.664868,43.168548],[-78.66489199999999,43.168213],[-78.66492599999999,43.167711],[-78.66498900000001,43.166794],[-78.665031,43.166206],[-78.665059,43.165836],[-78.66506800000001,43.165705],[-78.66507,43.165675],[-78.665075,43.165588],[-78.66507799999999,43.165559],[-78.665081,43.165505],[-78.665092,43.165344],[-78.665097,43.165291],[-78.66512,43.164958],[-78.66519099999999,43.16396],[-78.665215,43.163628],[-78.66607500000001,43.163671],[-78.66703699999999,43.16372],[-78.668655,43.163797],[-78.669516,43.163839],[-78.67088200000001,43.163899],[-78.67115099999999,43.163911],[-78.673372,43.164014],[-78.67477700000001,43.164077],[-78.674982,43.164086],[-78.675192,43.164096],[-78.675388,43.164106],[-78.676349,43.164151],[-78.676659,43.164165],[-78.67697099999999,43.164181],[-78.677592,43.164209],[-78.677904,43.164224],[-78.67792,43.164764],[-78.677921,43.16505],[-78.677932,43.166895],[-78.677942,43.167531],[-78.677955,43.168358],[-78.67804599999999,43.168361],[-78.678319,43.16837],[-78.67841,43.168374],[-78.678414,43.168641],[-78.678428,43.169441],[-78.678433,43.169709],[-78.678437,43.170157],[-78.67845199999999,43.171502],[-78.67845699999999,43.171951],[-78.67845800000001,43.172132],[-78.678461,43.172675],[-78.67846299999999,43.172857],[-78.67846400000001,43.173048],[-78.67847,43.17355],[-78.678477,43.173623],[-78.678498,43.173814]]],"type":"Polygon"}
}