{
  "id": "360290147012",
  "type": "Feature",
  "properties": {
    "area_land":4368907,
    "area_water":0,
    "geoid":"360290147012",
    "name":"Block Group 2",
    "state":"ny"
},
  "bbox": [
    -78.652665,
    43.01512,
    -78.612608,
    43.032443
],
  "geometry": {"coordinates":[[[-78.652665,43.032443],[-78.64932899999999,43.0323],[-78.646666,43.032182],[-78.640079,43.031883],[-78.637477,43.03177],[-78.636892,43.031744],[-78.63338299999999,43.03168],[-78.62779500000001,43.03156],[-78.625621,43.031524],[-78.62238000000001,43.031454],[-78.616243,43.031336],[-78.61626,43.031107],[-78.616317,43.030354],[-78.616457,43.029968],[-78.616586,43.029055],[-78.616985,43.0284],[-78.618117,43.027349],[-78.6181,43.026181],[-78.618014,43.025974],[-78.61630700000001,43.024954],[-78.615694,43.02469],[-78.614546,43.024529],[-78.613772,43.023575],[-78.613381,43.023223],[-78.61260799999999,43.022246],[-78.612627,43.021743],[-78.612893,43.021314],[-78.613612,43.020872],[-78.615207,43.020858],[-78.61761199999999,43.02086],[-78.622631,43.020864],[-78.623465,43.02084],[-78.624027,43.020855],[-78.624734,43.020866],[-78.62536,43.02088],[-78.625443,43.020882],[-78.626344,43.020898],[-78.627596,43.020921],[-78.629397,43.020953],[-78.63041,43.020974],[-78.631167,43.020976],[-78.63159,43.020985],[-78.631629,43.020986],[-78.63193,43.020992],[-78.63252300000001,43.021004],[-78.633427,43.021018],[-78.635339,43.021055],[-78.636134,43.021074],[-78.63704300000001,43.02109],[-78.637068,43.0191],[-78.637085,43.018756],[-78.637095,43.018383],[-78.637091,43.018064],[-78.637108,43.016418],[-78.637125,43.015304],[-78.637129,43.01512],[-78.644289,43.015486],[-78.647195,43.0156],[-78.64865,43.015658],[-78.652351,43.015985],[-78.652355,43.016161],[-78.652367,43.016771],[-78.652402,43.018523],[-78.652416,43.019082],[-78.652433,43.020042],[-78.652451,43.020965],[-78.65246500000001,43.021858],[-78.652468,43.022043],[-78.65246999999999,43.022129],[-78.652506,43.024229],[-78.652528,43.025027],[-78.652575,43.02768],[-78.652613,43.02899],[-78.652665,43.032443]]],"type":"Polygon"}
}