{
  "id": "360690521001",
  "type": "Feature",
  "properties": {
    "area_land":36951558,
    "area_water":0,
    "geoid":"360690521001",
    "name":"Block Group 1",
    "state":"ny"
},
  "bbox": [
    -77.479131,
    42.805816,
    -77.369693,
    42.85498
],
  "geometry": {"coordinates":[[[-77.479131,42.8546],[-77.478392,42.854619],[-77.476179,42.854676],[-77.475441,42.854696],[-77.47363799999999,42.854682],[-77.47000800000001,42.854655],[-77.46822899999999,42.854664],[-77.466426,42.854674],[-77.466301,42.854675],[-77.465926,42.85468],[-77.465802,42.854683],[-77.465678,42.854684],[-77.464664,42.854701],[-77.46182899999999,42.854752],[-77.461253,42.854769],[-77.460117,42.854803],[-77.457639,42.854745],[-77.45633100000001,42.854715],[-77.452099,42.85478],[-77.45084900000001,42.8548],[-77.450204,42.854809],[-77.44959900000001,42.854819],[-77.447726,42.854848],[-77.44711599999999,42.85487],[-77.446956,42.85487],[-77.446416,42.85487],[-77.44473600000001,42.854896],[-77.444648,42.854897],[-77.444298,42.854904],[-77.443879,42.854894],[-77.44331699999999,42.854908],[-77.44256799999999,42.854927],[-77.441712,42.854877],[-77.441632,42.854875],[-77.44107099999999,42.854863],[-77.44080200000001,42.854873],[-77.44031,42.854858],[-77.440084,42.854852],[-77.439334,42.854848],[-77.438953,42.854866],[-77.438029,42.854895],[-77.43746400000001,42.854913],[-77.437281,42.85498],[-77.434877,42.854899],[-77.433916,42.854867],[-77.432886,42.854851],[-77.42846299999999,42.854861],[-77.42766399999999,42.854855],[-77.42525999999999,42.85484],[-77.42446,42.854814],[-77.42206299999999,42.854736],[-77.42126399999999,42.854711],[-77.420466,42.854709],[-77.418072,42.854705],[-77.417275,42.854704],[-77.41628,42.854701],[-77.415806,42.854701],[-77.413298,42.854696],[-77.412565,42.854695],[-77.41230400000001,42.85469],[-77.41000200000001,42.854648],[-77.409004,42.854631],[-77.405603,42.854686],[-77.40309600000001,42.854686],[-77.40119300000001,42.854687],[-77.400794,42.854689],[-77.39945899999999,42.85469],[-77.397156,42.854693],[-77.39545699999999,42.854666],[-77.39507,42.85466],[-77.394125,42.854599],[-77.393703,42.854621],[-77.392437,42.854687],[-77.392324,42.854693],[-77.392015,42.85469],[-77.39054400000001,42.854675],[-77.389484,42.854665],[-77.38613100000001,42.854653],[-77.386089,42.854653],[-77.38466099999999,42.854631],[-77.381952,42.854588],[-77.381739,42.854588],[-77.37755900000001,42.854599],[-77.374709,42.854669],[-77.372974,42.854648],[-77.372546,42.854643],[-77.370053,42.854693],[-77.369998,42.854697],[-77.369997,42.854645],[-77.36999,42.854024],[-77.36997700000001,42.852604],[-77.369961,42.851842],[-77.369947,42.851115],[-77.369934,42.850503],[-77.369916,42.849589],[-77.369906,42.848667],[-77.3699,42.848056],[-77.369894,42.846378],[-77.369827,42.842024],[-77.369716,42.83731],[-77.369693,42.83631],[-77.369714,42.833176],[-77.369721,42.832042],[-77.36973,42.830774],[-77.369758,42.828642],[-77.369773,42.827509],[-77.369793,42.826464],[-77.369799,42.825898],[-77.36983600000001,42.822454],[-77.369862,42.821067],[-77.369893,42.819457],[-77.37083199999999,42.819456],[-77.37352199999999,42.819454],[-77.37365200000001,42.819452],[-77.37459200000001,42.819444],[-77.376316,42.819448],[-77.37667999999999,42.819445],[-77.378918,42.819432],[-77.381677,42.819454],[-77.382946,42.819444],[-77.38375499999999,42.819438],[-77.384736,42.819415],[-77.385034,42.819394],[-77.38524200000001,42.819376],[-77.385401,42.819364],[-77.385643,42.819354],[-77.385868,42.81936],[-77.386078,42.819366],[-77.386138,42.819286],[-77.38632,42.819049],[-77.386381,42.81897],[-77.387022,42.818101],[-77.38871399999999,42.815815],[-77.388901,42.815535],[-77.388927,42.815483],[-77.38928,42.814805],[-77.38940700000001,42.814517],[-77.38950800000001,42.814263],[-77.389577,42.814045],[-77.38967599999999,42.813738],[-77.389774,42.813288],[-77.38984000000001,42.812832],[-77.389853,42.812571],[-77.389878,42.81207],[-77.389884,42.811943],[-77.389903,42.811564],[-77.38991,42.811438],[-77.389931,42.81092],[-77.389974,42.809863],[-77.390022,42.809666],[-77.39009,42.809554],[-77.39021700000001,42.809457],[-77.390665,42.809197],[-77.39080199999999,42.80957],[-77.391175,42.810585],[-77.391217,42.810689],[-77.391367,42.811058],[-77.391386,42.811106],[-77.39142099999999,42.811178],[-77.39157299999999,42.811489],[-77.39159600000001,42.811534],[-77.391657,42.811652],[-77.392064,42.812439],[-77.392523,42.813287],[-77.392972,42.814115],[-77.393664,42.815487],[-77.39406700000001,42.816338],[-77.394446,42.817122],[-77.39491700000001,42.818021],[-77.39503499999999,42.818236],[-77.39528900000001,42.818698],[-77.39591799999999,42.819863],[-77.396266,42.819846],[-77.39649799999999,42.819843],[-77.39714600000001,42.819837],[-77.398241,42.819842],[-77.39882299999999,42.819846],[-77.40024699999999,42.819851],[-77.40149,42.819857],[-77.40324099999999,42.819857],[-77.404521,42.819864],[-77.404946,42.819867],[-77.405946,42.819866],[-77.406454,42.819869],[-77.406632,42.819871],[-77.407371,42.819893],[-77.407974,42.819962],[-77.408479,42.820021],[-77.409611,42.820151],[-77.410802,42.820257],[-77.410994,42.820275],[-77.41191499999999,42.820378],[-77.41212899999999,42.820416],[-77.412215,42.820446],[-77.412325,42.820528],[-77.41237700000001,42.820605],[-77.41241599999999,42.820772],[-77.412451,42.821856],[-77.41245499999999,42.822693],[-77.41248899999999,42.823065],[-77.412555,42.823295],[-77.412617,42.823413],[-77.412753,42.823578],[-77.413055,42.823846],[-77.414221,42.824715],[-77.41456599999999,42.824982],[-77.415493,42.8257],[-77.416144,42.826239],[-77.416397,42.826433],[-77.41644700000001,42.826472],[-77.41653599999999,42.826541],[-77.41660400000001,42.826584],[-77.416659,42.826619],[-77.416709,42.826651],[-77.41685699999999,42.826745],[-77.416918,42.826773],[-77.41716099999999,42.826561],[-77.417486,42.826241],[-77.417654,42.826077],[-77.418117,42.825549],[-77.418975,42.824445],[-77.419453,42.823831],[-77.419534,42.823711],[-77.419628,42.823573],[-77.419764,42.823345],[-77.41979499999999,42.823295],[-77.419855,42.823234],[-77.41999199999999,42.823245],[-77.420034,42.82323],[-77.42055000000001,42.823051],[-77.420723,42.822992],[-77.422657,42.822278],[-77.42281800000001,42.822219],[-77.423405,42.822018],[-77.42359999999999,42.821942],[-77.424077,42.821733],[-77.42463100000001,42.821466],[-77.42487300000001,42.821363],[-77.425164,42.821305],[-77.425647,42.821256],[-77.425837,42.821242],[-77.42659999999999,42.821184],[-77.427235,42.821114],[-77.42764699999999,42.821053],[-77.42782,42.821026],[-77.42814300000001,42.820957],[-77.42861499999999,42.820834],[-77.429877,42.820507],[-77.430109,42.82043],[-77.430593,42.820255],[-77.430894,42.820137],[-77.431748,42.819744],[-77.43186,42.819694],[-77.43272399999999,42.819288],[-77.433207,42.819078],[-77.43371999999999,42.818897],[-77.435213,42.818489],[-77.435305,42.818464],[-77.436289,42.818207],[-77.43653,42.818152],[-77.437038,42.818005],[-77.437153,42.817973],[-77.43750300000001,42.817856],[-77.438211,42.81756],[-77.43852,42.817436],[-77.438788,42.817329],[-77.439016,42.817251],[-77.439218,42.817182],[-77.439508,42.817103],[-77.440203,42.816965],[-77.44037899999999,42.816931],[-77.441777,42.816696],[-77.441907,42.816665],[-77.44241100000001,42.816513],[-77.44283799999999,42.816358],[-77.443572,42.816132],[-77.443753,42.816071],[-77.444351,42.815873],[-77.444772,42.815712],[-77.444891,42.815634],[-77.444981,42.815673],[-77.445168,42.8157],[-77.446315,42.815749],[-77.44682299999999,42.815751],[-77.448852,42.815763],[-77.45054399999999,42.815756],[-77.452263,42.815805],[-77.452651,42.815826],[-77.45286900000001,42.815838],[-77.453693,42.815875],[-77.453936,42.815902],[-77.45425299999999,42.815983],[-77.454409,42.81605],[-77.454533,42.81615],[-77.459025,42.813657],[-77.459827,42.813235],[-77.460528,42.812896],[-77.461387,42.8125],[-77.46306300000001,42.811718],[-77.464125,42.81123],[-77.464235,42.811181],[-77.46597300000001,42.810399],[-77.467046,42.809944],[-77.4684,42.809412],[-77.472336,42.807987],[-77.473344,42.807604],[-77.47382,42.807423],[-77.474065,42.807322],[-77.47426900000001,42.807241],[-77.47463399999999,42.807097],[-77.474952,42.806965],[-77.476353,42.806388],[-77.476996,42.80612],[-77.47716699999999,42.80605],[-77.47766799999999,42.805816],[-77.477712,42.807237],[-77.47779199999999,42.809787],[-77.477844,42.8115],[-77.47788799999999,42.812922],[-77.477912,42.813745],[-77.47793900000001,42.814645],[-77.478009,42.816214],[-77.478047,42.817038],[-77.47812399999999,42.818776],[-77.478144,42.819204],[-77.478168,42.822154],[-77.478241,42.823994],[-77.47830500000001,42.825574],[-77.47829400000001,42.825733],[-77.47826000000001,42.826113],[-77.478262,42.826884],[-77.478269,42.828942],[-77.478312,42.830341],[-77.47834899999999,42.831493],[-77.478374,42.832221],[-77.478379,42.832388],[-77.47843,42.834087],[-77.478447,42.835076],[-77.478464,42.835972],[-77.478469,42.836307],[-77.478487,42.837315],[-77.478493,42.837651],[-77.478476,42.83811],[-77.478471,42.839105],[-77.478465,42.840462],[-77.47839399999999,42.843112],[-77.47842199999999,42.843466],[-77.47851799999999,42.844663],[-77.478604,42.844902],[-77.478639,42.845919],[-77.47865400000001,42.846813],[-77.47868099999999,42.848304],[-77.47875500000001,42.85068],[-77.478775,42.8521],[-77.47878799999999,42.852547],[-77.478824,42.853672],[-77.478865,42.854003],[-77.47889499999999,42.854112],[-77.47894700000001,42.854207],[-77.47905,42.854319],[-77.479112,42.85437],[-77.47911499999999,42.854416],[-77.47912700000001,42.854553],[-77.479131,42.8546]]],"type":"Polygon"}
}