{
  "id": "360690501024",
  "type": "Feature",
  "properties": {
    "area_land":1489953,
    "area_water":0,
    "geoid":"360690501024",
    "name":"Block Group 4",
    "state":"ny"
},
  "bbox": [
    -77.394963,
    42.974337,
    -77.37058,
    42.984379
],
  "geometry": {"coordinates":[[[-77.39474,42.979436],[-77.394623,42.979491],[-77.39450600000001,42.979509],[-77.39437,42.979499],[-77.393297,42.979231],[-77.393086,42.979198],[-77.392889,42.979194],[-77.39261,42.979203],[-77.392528,42.979214],[-77.392348,42.979241],[-77.391848,42.979368],[-77.39045299999999,42.979787],[-77.389768,42.980013],[-77.38939999999999,42.980154],[-77.38909700000001,42.980308],[-77.38872600000001,42.980559],[-77.388294,42.980916],[-77.38784200000001,42.981268],[-77.386962,42.981984],[-77.386501,42.982334],[-77.38629299999999,42.982462],[-77.38587800000001,42.982663],[-77.385144,42.982941],[-77.38446399999999,42.983175],[-77.384006,42.983342],[-77.38365899999999,42.983445],[-77.38347,42.983489],[-77.383331,42.983516],[-77.383039,42.983574],[-77.382914,42.983586],[-77.382774,42.9836],[-77.38255599999999,42.983615],[-77.382363,42.983615],[-77.38113,42.983619],[-77.38072,42.983621],[-77.37983,42.983622],[-77.379659,42.983623],[-77.37728199999999,42.983598],[-77.377161,42.983597],[-77.37662899999999,42.983592],[-77.376272,42.983587],[-77.37617899999999,42.983587],[-77.376088,42.983587],[-77.375649,42.983586],[-77.37530700000001,42.983586],[-77.375,42.983575],[-77.374505,42.983577],[-77.37378,42.983581],[-77.37334,42.983584],[-77.373158,42.983599],[-77.37288599999999,42.983655],[-77.37271800000001,42.983712],[-77.37245799999999,42.9838],[-77.37230599999999,42.983853],[-77.37212700000001,42.983926],[-77.37144499999999,42.984206],[-77.371025,42.984379],[-77.37102299999999,42.984339],[-77.37102,42.98422],[-77.371019,42.984181],[-77.371019,42.984063],[-77.371021,42.98371],[-77.371022,42.983593],[-77.37090999999999,42.98234],[-77.370885,42.981745],[-77.370656,42.976191],[-77.37058,42.97434],[-77.370661,42.97434],[-77.37096,42.974339],[-77.3721,42.974338],[-77.37248,42.974337],[-77.373447,42.974337],[-77.37470399999999,42.974339],[-77.375405,42.97434],[-77.37634799999999,42.974342],[-77.37731599999999,42.974344],[-77.377409,42.974345],[-77.3775,42.974345],[-77.378075,42.974348],[-77.37889,42.974353],[-77.379643,42.974391],[-77.380348,42.974456],[-77.380771,42.974495],[-77.38110500000001,42.974518],[-77.381336,42.974534],[-77.382031,42.974584],[-77.38226299999999,42.974601],[-77.38247200000001,42.974615],[-77.383077,42.974686],[-77.383126,42.974692],[-77.38328,42.97472],[-77.383562,42.974778],[-77.383746,42.974816],[-77.384049,42.974896],[-77.384351,42.974991],[-77.384394,42.975006],[-77.384666,42.975104],[-77.384801,42.975153],[-77.385206,42.9753],[-77.38534199999999,42.975349],[-77.385823,42.975525],[-77.38618099999999,42.975657],[-77.38726699999999,42.976054],[-77.387749,42.976231],[-77.388136,42.976368],[-77.388595,42.976532],[-77.38897799999999,42.976656],[-77.389307,42.976754],[-77.389702,42.976872],[-77.389892,42.97693],[-77.390463,42.977105],[-77.390654,42.977164],[-77.391221,42.977335],[-77.391611,42.977453],[-77.39194999999999,42.97757],[-77.392219,42.977679],[-77.392718,42.977925],[-77.392859,42.978008],[-77.392957,42.978066],[-77.393359,42.978327],[-77.393405,42.978357],[-77.393546,42.978448],[-77.393593,42.978479],[-77.393663,42.978525],[-77.393857,42.978656],[-77.39440399999999,42.979012],[-77.39460200000001,42.979114],[-77.394672,42.979144],[-77.394963,42.979272],[-77.39474,42.979436]]],"type":"Polygon"}
}