{
  "id": "360359710001",
  "type": "Feature",
  "properties": {
    "area_land":372765,
    "area_water":0,
    "geoid":"360359710001",
    "name":"Block Group 1",
    "state":"ny"
},
  "bbox": [
    -74.339435,
    43.054385,
    -74.326593,
    43.05909
],
  "geometry": {"coordinates":[[[-74.33943499999999,43.05757],[-74.339186,43.057584],[-74.33680699999999,43.057802],[-74.334479,43.058018],[-74.334512,43.058204],[-74.331979,43.058508],[-74.330342,43.058702],[-74.328828,43.058872],[-74.326988,43.05909],[-74.326593,43.056286],[-74.32832000000001,43.056115],[-74.32837000000001,43.05611],[-74.32841999999999,43.056105],[-74.328411,43.056027],[-74.32827,43.055184],[-74.331227,43.054912],[-74.33250099999999,43.054801],[-74.333915,43.054656],[-74.336095,43.054467],[-74.33695299999999,43.054385],[-74.33700899999999,43.054467],[-74.337114,43.055259],[-74.339023,43.055068],[-74.33913699999999,43.055892],[-74.33928,43.056714],[-74.33943499999999,43.05757]]],"type":"Polygon"}
}