{
  "id": "360610231001",
  "type": "Feature",
  "properties": {
    "area_land":72260,
    "area_water":0,
    "geoid":"360610231001",
    "name":"Block Group 1",
    "state":"ny"
},
  "bbox": [
    -73.944756,
    40.82326,
    -73.940595,
    40.827207
],
  "geometry": {"coordinates":[[[-73.944407,40.824513],[-73.94426799999999,40.824705],[-73.94381300000001,40.825332],[-73.943669,40.825527],[-73.94335700000001,40.825956],[-73.942453,40.827207],[-73.941536,40.826821],[-73.941102,40.826711],[-73.940595,40.826414],[-73.94104900000001,40.825793],[-73.941503,40.825171],[-73.941956,40.824555],[-73.94243,40.823909],[-73.942924,40.82326],[-73.943842,40.823648],[-73.944756,40.824032],[-73.944407,40.824513]]],"type":"Polygon"}
}