{
  "id": "360811223003",
  "type": "Feature",
  "properties": {
    "area_land":234091,
    "area_water":0,
    "geoid":"360811223003",
    "name":"Block Group 3",
    "state":"ny"
},
  "bbox": [
    -73.804063,
    40.731428,
    -73.794278,
    40.734897
],
  "geometry": {"coordinates":[[[-73.803968,40.733056],[-73.80384599999999,40.734897],[-73.802943,40.734862],[-73.802047,40.734831],[-73.801141,40.734796],[-73.800242,40.734759],[-73.799339,40.734726],[-73.79844199999999,40.73469],[-73.797541,40.734656],[-73.79664,40.734621],[-73.79574,40.734587],[-73.794596,40.734544],[-73.79462599999999,40.733596],[-73.79453700000001,40.733163],[-73.79427800000001,40.732696],[-73.794923,40.732715],[-73.795862,40.732751],[-73.796761,40.732785],[-73.797663,40.732822],[-73.798564,40.732858],[-73.798658,40.731428],[-73.799561,40.731463],[-73.80046299999999,40.731497],[-73.801366,40.731517],[-73.802262,40.731569],[-73.803163,40.7316],[-73.804063,40.731638],[-73.803968,40.733056]]],"type":"Polygon"}
}