{
  "id": "361219711002",
  "type": "Feature",
  "properties": {
    "area_land":91782810,
    "area_water":440222,
    "geoid":"361219711002",
    "name":"Block Group 2",
    "state":"ny"
},
  "bbox": [
    -78.254611,
    42.521321,
    -78.117629,
    42.608997
],
  "geometry": {"coordinates":[[[-78.25428599999999,42.574989],[-78.25357700000001,42.576069],[-78.253404,42.576302],[-78.253275,42.576443],[-78.253141,42.57659],[-78.25285100000001,42.576854],[-78.252689,42.57698],[-78.251451,42.577616],[-78.250917,42.577865],[-78.250883,42.577876],[-78.250704,42.577931],[-78.250248,42.578051],[-78.248921,42.578368],[-78.248469,42.578488],[-78.24795899999999,42.578641],[-78.247602,42.578769],[-78.246799,42.579093],[-78.24647899999999,42.579228],[-78.24606300000001,42.579417],[-78.243478,42.580514],[-78.24266799999999,42.580863],[-78.24217299999999,42.58106],[-78.241983,42.581126],[-78.241578,42.581231],[-78.241564,42.581234],[-78.241086,42.581322],[-78.240739,42.581375],[-78.23843599999999,42.581632],[-78.238246,42.581661],[-78.237819,42.581727],[-78.237422,42.581799],[-78.237493,42.582063],[-78.237709,42.582858],[-78.237782,42.583123],[-78.237825,42.583288],[-78.23795699999999,42.583783],[-78.238001,42.583949],[-78.238134,42.584467],[-78.238749,42.586771],[-78.23875200000001,42.586781],[-78.23891999999999,42.587484],[-78.23904400000001,42.588264],[-78.239105,42.588683],[-78.239386,42.589827],[-78.23957900000001,42.590482],[-78.239667,42.590872],[-78.239678,42.591033],[-78.23966,42.591309],[-78.239634,42.591455],[-78.23958,42.591663],[-78.239266,42.592643],[-78.239189,42.592898],[-78.239113,42.593065],[-78.238978,42.593258],[-78.238726,42.593514],[-78.238591,42.593619],[-78.237309,42.59441],[-78.237246,42.59445],[-78.236706,42.594823],[-78.23644,42.595052],[-78.236278,42.59521],[-78.23578999999999,42.595729],[-78.23556600000001,42.595996],[-78.23524,42.596439],[-78.235332,42.596484],[-78.23533500000001,42.596852],[-78.235342,42.597498],[-78.23535800000001,42.598386],[-78.235438,42.598369],[-78.23548,42.603406],[-78.23548700000001,42.607183],[-78.23548,42.608163],[-78.23544200000001,42.608409],[-78.235375,42.608684],[-78.23533399999999,42.608855],[-78.2214,42.60891],[-78.21686099999999,42.608926],[-78.203243,42.608976],[-78.198705,42.608993],[-78.197596,42.608997],[-78.197568,42.608996],[-78.19416,42.608987],[-78.19302399999999,42.608984],[-78.192583,42.608982],[-78.19126199999999,42.608979],[-78.190822,42.608979],[-78.190287,42.608976],[-78.188682,42.60897],[-78.188147,42.608969],[-78.181432,42.608952],[-78.17832,42.60895],[-78.176289,42.608942],[-78.170197,42.608921],[-78.168167,42.608914],[-78.165663,42.608908],[-78.158153,42.608891],[-78.15564999999999,42.608886],[-78.153555,42.608882],[-78.148529,42.608875],[-78.147272,42.608862],[-78.145178,42.608843],[-78.14470799999999,42.608837],[-78.143298,42.608819],[-78.14282900000001,42.608814],[-78.14128599999999,42.608814],[-78.136656,42.608816],[-78.135114,42.608817],[-78.13489199999999,42.608817],[-78.134226,42.608817],[-78.134005,42.608817],[-78.134001,42.608377],[-78.133989,42.607057],[-78.133985,42.606618],[-78.133971,42.605058],[-78.13397000000001,42.60495],[-78.133931,42.599947],[-78.13391799999999,42.59828],[-78.13391799999999,42.596919],[-78.13391900000001,42.596894],[-78.133883,42.592836],[-78.133872,42.591476],[-78.133854,42.589333],[-78.13382900000001,42.586293],[-78.13379,42.584382],[-78.13378400000001,42.583426],[-78.133776,42.582906],[-78.13374399999999,42.580764],[-78.133713,42.578925],[-78.133709,42.578666],[-78.133657,42.574014],[-78.13364300000001,42.573408],[-78.133636,42.573082],[-78.133634,42.572141],[-78.133619,42.57157],[-78.133608,42.57095],[-78.13360299999999,42.570232],[-78.13358100000001,42.56622],[-78.133574,42.564883],[-78.133573,42.564354],[-78.133571,42.56277],[-78.133571,42.562242],[-78.133571,42.56162],[-78.133571,42.560135],[-78.133579,42.559757],[-78.133593,42.559185],[-78.133593,42.559137],[-78.13359800000001,42.557763],[-78.133591,42.55751],[-78.133517,42.554365],[-78.133551,42.554155],[-78.13363099999999,42.55396],[-78.13369299999999,42.553869],[-78.133838,42.553739],[-78.134371,42.553332],[-78.134643,42.553136],[-78.135345,42.552632],[-78.135986,42.552218],[-78.135683,42.551998],[-78.135398,42.551761],[-78.135167,42.551539],[-78.13487000000001,42.551254],[-78.13364799999999,42.549988],[-78.132931,42.549259],[-78.132375,42.548693],[-78.13219100000001,42.548495],[-78.131935,42.54822],[-78.131472,42.54775],[-78.131062,42.547309],[-78.13060400000001,42.546818],[-78.128882,42.544983],[-78.12864,42.544759],[-78.128066,42.544316],[-78.12752399999999,42.543927],[-78.126194,42.542974],[-78.125823,42.542716],[-78.125542,42.542566],[-78.12531300000001,42.542491],[-78.12515399999999,42.542457],[-78.124832,42.542441],[-78.124731,42.542437],[-78.12434500000001,42.542426],[-78.122384,42.542477],[-78.12128300000001,42.542529],[-78.121121,42.54253],[-78.120822,42.542512],[-78.12048,42.542473],[-78.120352,42.542448],[-78.120187,42.542417],[-78.119485,42.542216],[-78.118915,42.542039],[-78.118954,42.541735],[-78.118944,42.541309],[-78.11894100000001,42.541296],[-78.118911,42.541124],[-78.118852,42.540976],[-78.118619,42.540659],[-78.118163,42.540096],[-78.117964,42.53981],[-78.11781000000001,42.53951],[-78.11777499999999,42.539416],[-78.11767500000001,42.539139],[-78.117649,42.538993],[-78.11762899999999,42.538733],[-78.117634,42.538692],[-78.11765200000001,42.538545],[-78.117683,42.538414],[-78.117733,42.538268],[-78.11778700000001,42.538152],[-78.11783699999999,42.538084],[-78.117976,42.537899],[-78.118588,42.537206],[-78.118692,42.537056],[-78.118746,42.536952],[-78.11882300000001,42.536731],[-78.11884999999999,42.536554],[-78.118853,42.536473],[-78.118869,42.53611],[-78.118865,42.535824],[-78.118858,42.535393],[-78.11885700000001,42.535025],[-78.118854,42.533521],[-78.118843,42.532629],[-78.11883400000001,42.531831],[-78.11882199999999,42.531022],[-78.11881099999999,42.530217],[-78.11882199999999,42.529192],[-78.118816,42.528598],[-78.118808,42.52779],[-78.118804,42.527406],[-78.118803,42.527345],[-78.11882900000001,42.525622],[-78.118808,42.525021],[-78.118774,42.524841],[-78.118694,42.524666],[-78.118617,42.524559],[-78.118255,42.524159],[-78.118183,42.524053],[-78.11812500000001,42.523945],[-78.11805200000001,42.523664],[-78.118038,42.523525],[-78.11804100000001,42.523416],[-78.11814699999999,42.522674],[-78.118236,42.521903],[-78.11825,42.521574],[-78.11823,42.521408],[-78.118172,42.521353],[-78.118122,42.521334],[-78.118081,42.521334],[-78.117993,42.521321],[-78.11821,42.521321],[-78.118302,42.521322],[-78.118959,42.521326],[-78.118987,42.521326],[-78.121044,42.521338],[-78.12173,42.521343],[-78.122997,42.521351],[-78.124729,42.521363],[-78.1268,42.521365],[-78.128068,42.521367],[-78.129144,42.521368],[-78.132373,42.521372],[-78.13345,42.521374],[-78.133464,42.521374],[-78.133506,42.521374],[-78.133521,42.521374],[-78.13481899999999,42.521375],[-78.138713,42.521378],[-78.140011,42.52138],[-78.140261,42.521382],[-78.141077,42.521382],[-78.144278,42.521386],[-78.145346,42.521388],[-78.145893,42.521388],[-78.147535,42.52139],[-78.148083,42.521391],[-78.151073,42.521394],[-78.160044,42.521405],[-78.16303499999999,42.521409],[-78.16305199999999,42.521409],[-78.163104,42.521409],[-78.163122,42.521409],[-78.16323800000001,42.521409],[-78.163586,42.52141],[-78.163703,42.521411],[-78.163895,42.521411],[-78.165211,42.521412],[-78.169738,42.521417],[-78.17124699999999,42.521419],[-78.174857,42.521423],[-78.185688,42.521435],[-78.18929900000001,42.521439],[-78.18938,42.521439],[-78.18962500000001,42.521439],[-78.189707,42.521439],[-78.18983299999999,42.521439],[-78.19021100000001,42.521439],[-78.190337,42.52144],[-78.191558,42.521447],[-78.195221,42.521471],[-78.196442,42.52148],[-78.19650799999999,42.52148],[-78.196709,42.521481],[-78.196776,42.521482],[-78.197245,42.521504],[-78.198655,42.521572],[-78.199125,42.521595],[-78.199361,42.521606],[-78.20007,42.52164],[-78.200307,42.521652],[-78.200332,42.521653],[-78.20062799999999,42.521671],[-78.20121,42.521691],[-78.20298200000001,42.521735],[-78.20381399999999,42.521749],[-78.204679,42.521764],[-78.20535099999999,42.521758],[-78.20604299999999,42.521752],[-78.206772,42.521752],[-78.207368,42.521773],[-78.207459,42.521777],[-78.20804099999999,42.521779],[-78.20828400000001,42.52178],[-78.208586,42.521792],[-78.209227,42.521773],[-78.210014,42.521757],[-78.21093,42.52176],[-78.212855,42.521755],[-78.214337,42.521759],[-78.215075,42.521747],[-78.216188,42.521743],[-78.21642300000001,42.521732],[-78.216677,42.521701],[-78.216902,42.521684],[-78.21709,42.52168],[-78.217342,42.52168],[-78.21752600000001,42.521692],[-78.21763900000001,42.521692],[-78.217752,42.521716],[-78.217882,42.521723],[-78.21881500000001,42.521731],[-78.21983,42.521727],[-78.22078500000001,42.521732],[-78.221683,42.521758],[-78.222044,42.521729],[-78.22313,42.521646],[-78.22349199999999,42.521619],[-78.223732,42.521616],[-78.224452,42.521611],[-78.224693,42.52161],[-78.226553,42.521596],[-78.23213699999999,42.521556],[-78.233998,42.521543],[-78.234224,42.521541],[-78.234904,42.521536],[-78.235131,42.521535],[-78.235801,42.521572],[-78.23781099999999,42.521685],[-78.23848099999999,42.521723],[-78.24043500000001,42.52171],[-78.247377,42.521713],[-78.24875900000001,42.521711],[-78.248774,42.521828],[-78.248789,42.521875],[-78.248801,42.521979],[-78.24891700000001,42.522573],[-78.24896099999999,42.523054],[-78.248983,42.5239],[-78.248988,42.525217],[-78.248992,42.526098],[-78.248993,42.52623],[-78.248997,42.526936],[-78.24901199999999,42.529311],[-78.24901300000001,42.52945],[-78.249025,42.530289],[-78.24903,42.530762],[-78.249037,42.531253],[-78.249055,42.532181],[-78.249065,42.532655],[-78.249095,42.533886],[-78.249099,42.534394],[-78.249118,42.536684],[-78.249168,42.539611],[-78.249199,42.541351],[-78.249205,42.54224],[-78.24924300000001,42.543552],[-78.249253,42.544012],[-78.249298,42.545912],[-78.24932099999999,42.547624],[-78.249323,42.548791],[-78.249381,42.551997],[-78.24943,42.554659],[-78.249431,42.554757],[-78.24943500000001,42.555054],[-78.249437,42.555153],[-78.249461,42.558352],[-78.249475,42.560035],[-78.249503,42.561942],[-78.249498,42.562475],[-78.24951799999999,42.563425],[-78.249532,42.564085],[-78.249554,42.564794],[-78.249568,42.565883],[-78.249568,42.566851],[-78.24958599999999,42.567425],[-78.249589,42.567948],[-78.2496,42.569757],[-78.249628,42.570629],[-78.249656,42.57091],[-78.249713,42.571139],[-78.249725,42.571176],[-78.249762,42.571288],[-78.249771,42.571314],[-78.249776,42.571326],[-78.24985599999999,42.571496],[-78.24986,42.571505],[-78.25001399999999,42.571814],[-78.25015399999999,42.572023],[-78.250212,42.572108],[-78.25027300000001,42.572183],[-78.250531,42.572491],[-78.25069499999999,42.572666],[-78.25094,42.572891],[-78.25096000000001,42.572907],[-78.25118000000001,42.573074],[-78.251594,42.57334],[-78.251791,42.573449],[-78.252177,42.573631],[-78.252746,42.57385],[-78.253663,42.574174],[-78.25411200000001,42.574334],[-78.254611,42.574495],[-78.25428599999999,42.574989]]],"type":"Polygon"}
}