{
  "id": "360470182001",
  "type": "Feature",
  "properties": {
    "area_land":67253,
    "area_water":0,
    "geoid":"360470182001",
    "name":"Block Group 1",
    "state":"ny"
},
  "bbox": [
    -74.003778,
    40.611995,
    -74.000192,
    40.615711
],
  "geometry": {"coordinates":[[[-74.003196,40.614035],[-74.00261399999999,40.614594],[-74.002031,40.615153],[-74.00144899999999,40.615711],[-74.000192,40.614951],[-74.000398,40.614166],[-74.00062699999999,40.613394],[-74.00084200000001,40.612616],[-74.000911,40.612388],[-74.001318,40.611995],[-74.003778,40.613475],[-74.003196,40.614035]]],"type":"Polygon"}
}