{
  "id": "361031243001",
  "type": "Feature",
  "properties": {
    "area_land":588034,
    "area_water":0,
    "geoid":"361031243001",
    "name":"Block Group 1",
    "state":"ny"
},
  "bbox": [
    -73.349666,
    40.704287,
    -73.334983,
    40.712113
],
  "geometry": {"coordinates":[[[-73.349666,40.71073],[-73.348764,40.710828],[-73.34685500000001,40.710992],[-73.34620099999999,40.711046],[-73.34505900000001,40.711141],[-73.343448,40.711277],[-73.341044,40.711479],[-73.34097,40.711484],[-73.340772,40.711501],[-73.340005,40.711683],[-73.33917599999999,40.71188],[-73.33863700000001,40.712009],[-73.33827599999999,40.712052],[-73.337515,40.712065],[-73.33609199999999,40.712094],[-73.335111,40.712113],[-73.33508999999999,40.712024],[-73.335026,40.711778],[-73.33498299999999,40.711613],[-73.335458,40.710794],[-73.335514,40.710699],[-73.33611000000001,40.710768],[-73.336417,40.710083],[-73.336601,40.709176],[-73.336781,40.708837],[-73.336966,40.708199],[-73.337661,40.707178],[-73.33856900000001,40.705645],[-73.339185,40.704287],[-73.339451,40.704427],[-73.339578,40.704488],[-73.339738,40.704596],[-73.339844,40.704715],[-73.339934,40.70484],[-73.340076,40.705078],[-73.340304,40.705392],[-73.34047700000001,40.705577],[-73.340673,40.705727],[-73.340948,40.705877],[-73.34124199999999,40.706007],[-73.342179,40.706351],[-73.34272900000001,40.706568],[-73.343127,40.70673],[-73.343429,40.706659],[-73.344425,40.706196],[-73.34551,40.705694],[-73.346807,40.706991],[-73.347246,40.70742],[-73.34758100000001,40.707871],[-73.34823799999999,40.708718],[-73.34857599999999,40.709173],[-73.348709,40.709391],[-73.349125,40.709904],[-73.34942599999999,40.710333],[-73.349666,40.71073]]],"type":"Polygon"}
}