{
  "id": "360650252002",
  "type": "Feature",
  "properties": {
    "area_land":2173808,
    "area_water":0,
    "geoid":"360650252002",
    "name":"Block Group 2",
    "state":"ny"
},
  "bbox": [
    -75.343597,
    43.069443,
    -75.308673,
    43.082727
],
  "geometry": {"coordinates":[[[-75.343597,43.071193],[-75.343407,43.071712],[-75.342748,43.072961],[-75.34266,43.073189],[-75.34219400000001,43.07437],[-75.34189000000001,43.075104],[-75.341734,43.075409],[-75.341531,43.075742],[-75.341257,43.076115],[-75.340887,43.076526],[-75.34084900000001,43.076563],[-75.340476,43.076905],[-75.340028,43.077251],[-75.339529,43.077577],[-75.33902,43.077858],[-75.33846200000001,43.078112],[-75.33661499999999,43.07883],[-75.335335,43.079383],[-75.334234,43.079855],[-75.333517,43.080144],[-75.331355,43.081066],[-75.330635,43.08136],[-75.32996300000001,43.081607],[-75.329222,43.08186],[-75.328337,43.082138],[-75.32769500000001,43.082328],[-75.327639,43.082377],[-75.327252,43.082499],[-75.32700800000001,43.082568],[-75.326795,43.082646],[-75.32664200000001,43.082704],[-75.32641,43.082727],[-75.325778,43.082615],[-75.32548800000001,43.082543],[-75.32507200000001,43.082431],[-75.324901,43.082433],[-75.324466,43.082269],[-75.324265,43.0822],[-75.324032,43.08212],[-75.32379,43.082031],[-75.32281500000001,43.081666],[-75.320393,43.08077],[-75.320241,43.080714],[-75.319176,43.08033],[-75.31786700000001,43.079851],[-75.317019,43.079522],[-75.316063,43.079152],[-75.314806,43.078669],[-75.314228,43.078447],[-75.314161,43.078422],[-75.31352800000001,43.078187],[-75.312994,43.078015],[-75.312949,43.078568],[-75.312853,43.08012],[-75.312794,43.080977],[-75.31276099999999,43.081044],[-75.312744,43.08106],[-75.31267,43.081088],[-75.31178300000001,43.081065],[-75.311752,43.081048],[-75.311744,43.081035],[-75.31173800000001,43.080878],[-75.311826,43.079164],[-75.31192900000001,43.077765],[-75.31166399999999,43.07772],[-75.311199,43.07764],[-75.310455,43.077529],[-75.309702,43.077404],[-75.30918800000001,43.077299],[-75.30901,43.077324],[-75.308673,43.077266],[-75.308791,43.077159],[-75.30888899999999,43.07707],[-75.309021,43.076975],[-75.30916499999999,43.076894],[-75.30973,43.076616],[-75.309945,43.076539],[-75.31031400000001,43.076439],[-75.31065599999999,43.076377],[-75.311155,43.076302],[-75.312453,43.076112],[-75.31376400000001,43.075922],[-75.314407,43.075838],[-75.31489999999999,43.075787],[-75.315574,43.075713],[-75.315899,43.075671],[-75.316112,43.075633],[-75.316558,43.075529],[-75.31698799999999,43.07539],[-75.31782,43.075088],[-75.31866599999999,43.074776],[-75.319513,43.074465],[-75.320352,43.074156],[-75.325183,43.07237],[-75.32778500000001,43.071421],[-75.328154,43.071299],[-75.328271,43.071271],[-75.32852800000001,43.071225],[-75.32949499999999,43.071102],[-75.330625,43.070977],[-75.330568,43.070919],[-75.330561,43.070875],[-75.33056999999999,43.070838],[-75.340868,43.069443],[-75.34191199999999,43.070084],[-75.34353400000001,43.071151],[-75.343597,43.071193]]],"type":"Polygon"}
}