{
  "id": "360610114012",
  "type": "Feature",
  "properties": {
    "area_land":49118,
    "area_water":0,
    "geoid":"360610114012",
    "name":"Block Group 2",
    "state":"ny"
},
  "bbox": [
    -73.973015,
    40.763588,
    -73.969585,
    40.766767
],
  "geometry": {"coordinates":[[[-73.972553,40.764898],[-73.972099,40.765518],[-73.971648,40.766143],[-73.971189,40.766767],[-73.969585,40.766091],[-73.97004200000001,40.765467],[-73.97049699999999,40.764842],[-73.97071099999999,40.76455],[-73.970957,40.764216],[-73.971411,40.763588],[-73.973015,40.764279],[-73.972553,40.764898]]],"type":"Polygon"}
}