{
  "id": "360359701001",
  "type": "Feature",
  "properties": {
    "area_land":31921416,
    "area_water":28795932,
    "geoid":"360359701001",
    "name":"Block Group 1",
    "state":"ny"
},
  "bbox": [
    -74.224215,
    43.129561,
    -74.122729,
    43.249894
],
  "geometry": {"coordinates":[[[-74.224215,43.248165],[-74.213598,43.248897],[-74.213244,43.24893],[-74.211491,43.249095],[-74.20975900000001,43.249262],[-74.2068,43.249546],[-74.206525,43.249562],[-74.200664,43.249894],[-74.200018,43.249214],[-74.198932,43.248344],[-74.19676,43.246674],[-74.195837,43.245958],[-74.191191,43.23932],[-74.189156,43.237317],[-74.18906699999999,43.235618],[-74.18889299999999,43.233669],[-74.188523,43.231977],[-74.18790300000001,43.230912],[-74.186353,43.229691],[-74.18487500000001,43.228906],[-74.18441,43.228601],[-74.18358499999999,43.227591],[-74.182653,43.226257],[-74.182315,43.224998],[-74.182204,43.224407],[-74.18215499999999,43.224249],[-74.18190300000001,43.221533],[-74.181591,43.219826],[-74.181123,43.219005],[-74.179408,43.217418],[-74.17885099999999,43.217129],[-74.177919,43.216643],[-74.176152,43.214469],[-74.17350500000001,43.210113],[-74.169066,43.203973],[-74.165515,43.197495],[-74.162846,43.191415],[-74.160403,43.185782],[-74.159981,43.182615],[-74.155067,43.176711],[-74.15603299999999,43.176001],[-74.15377599999999,43.175074],[-74.150156,43.175876],[-74.14494999999999,43.175579],[-74.140911,43.175513],[-74.13926499999999,43.175313],[-74.138666,43.17522],[-74.13855,43.175304],[-74.138209,43.17551],[-74.136171,43.176627],[-74.133436,43.17816],[-74.133168,43.178285],[-74.133083,43.178335],[-74.13301,43.178404],[-74.132927,43.17851],[-74.132469,43.179256],[-74.132256,43.179623],[-74.13209000000001,43.179877],[-74.131978,43.180023],[-74.13187499999999,43.180135],[-74.13177399999999,43.180223],[-74.131671,43.180296],[-74.131388,43.180444],[-74.130442,43.180904],[-74.130334,43.180804],[-74.13011400000001,43.180643],[-74.12961900000001,43.180337],[-74.129097,43.180077],[-74.128815,43.179946],[-74.128393,43.179762],[-74.12838600000001,43.179759],[-74.12808800000001,43.177626],[-74.12806,43.177448],[-74.128012,43.177143],[-74.127753,43.175487],[-74.127664,43.174922],[-74.127551,43.1742],[-74.12740100000001,43.173227],[-74.127341,43.172835],[-74.127078,43.171131],[-74.127061,43.171025],[-74.127019,43.17076],[-74.12697799999999,43.170502],[-74.12692800000001,43.170185],[-74.126853,43.169712],[-74.126778,43.169237],[-74.126757,43.169103],[-74.12670900000001,43.168802],[-74.126696,43.168719],[-74.12665200000001,43.168443],[-74.126339,43.166462],[-74.126144,43.165108],[-74.126081,43.164675],[-74.12593,43.163623],[-74.125158,43.158952],[-74.124574,43.155483],[-74.124335,43.1539],[-74.124049,43.152034],[-74.123525,43.148608],[-74.123451,43.148349],[-74.12343,43.148218],[-74.123188,43.146665],[-74.12318500000001,43.146646],[-74.12272900000001,43.143729],[-74.12460799999999,43.143363],[-74.12870599999999,43.142728],[-74.140157,43.141079],[-74.140345,43.141056],[-74.140614,43.141022],[-74.141396,43.14085],[-74.144149,43.140411],[-74.145195,43.140253],[-74.153367,43.138987],[-74.16551699999999,43.137107],[-74.16873200000001,43.136586],[-74.183758,43.134157],[-74.200221,43.131551],[-74.212596,43.129561],[-74.212611,43.131903],[-74.21263500000001,43.135706],[-74.212793,43.143175],[-74.212789,43.151167],[-74.21264499999999,43.154435],[-74.212648,43.154998],[-74.21264499999999,43.155748],[-74.21264600000001,43.155829],[-74.212806,43.156489],[-74.212968,43.157308],[-74.21316299999999,43.159123],[-74.213386,43.161212],[-74.213504,43.162231],[-74.213767,43.164293],[-74.214217,43.167594],[-74.214243,43.16779],[-74.214956,43.17367],[-74.215716,43.180418],[-74.21629,43.184543],[-74.216455,43.18606],[-74.21674899999999,43.188435],[-74.217197,43.19135],[-74.217265,43.191808],[-74.21766599999999,43.196467],[-74.217643,43.196541],[-74.218844,43.204368],[-74.21939500000001,43.209117],[-74.220175,43.215856],[-74.220247,43.216439],[-74.220902,43.221403],[-74.224215,43.248165]]],"type":"Polygon"}
}