{
  "id": "360470563001",
  "type": "Feature",
  "properties": {
    "area_land":214373,
    "area_water":67755,
    "geoid":"360470563001",
    "name":"Block Group 1",
    "state":"ny"
},
  "bbox": [
    -73.962672,
    40.731625,
    -73.955087,
    40.7394
],
  "geometry": {"coordinates":[[[-73.962672,40.736446],[-73.96262900000001,40.736545],[-73.962478,40.736802],[-73.961859,40.737072],[-73.96152499999999,40.737218],[-73.95706,40.739167],[-73.95508700000001,40.7394],[-73.955189,40.739062],[-73.955472,40.737997],[-73.956902,40.737152],[-73.958321,40.736382],[-73.95851500000001,40.736278],[-73.958635,40.736213],[-73.958524,40.735553],[-73.95840800000001,40.734844],[-73.958292,40.734135],[-73.958175,40.733426],[-73.95805900000001,40.732716],[-73.957943,40.732009],[-73.959592,40.731852],[-73.961519,40.731685],[-73.961843,40.731625],[-73.961997,40.732038],[-73.962148,40.732452],[-73.96189699999999,40.732485],[-73.961932,40.732679],[-73.96222899999999,40.732649],[-73.96225200000001,40.732713],[-73.962261,40.732741],[-73.96226799999999,40.732769],[-73.962278,40.732826],[-73.962288,40.732899],[-73.962307,40.733119],[-73.962338,40.733451],[-73.96234800000001,40.733812],[-73.962605,40.734902],[-73.962665,40.736334],[-73.96266799999999,40.73641],[-73.962672,40.736446]]],"type":"Polygon"}
}