{
  "id": "360930331012",
  "type": "Feature",
  "properties": {
    "area_land":35775458,
    "area_water":591969,
    "geoid":"360930331012",
    "name":"Block Group 2",
    "state":"ny"
},
  "bbox": [
    -74.112059,
    42.745471,
    -73.994026,
    42.821471
],
  "geometry": {"coordinates":[[[-74.112059,42.816269],[-74.111987,42.816206],[-74.111385,42.815709],[-74.110947,42.815339],[-74.110649,42.815131],[-74.11028899999999,42.814933],[-74.109898,42.814783],[-74.10948999999999,42.814701],[-74.108926,42.814654],[-74.10839300000001,42.814664],[-74.107938,42.814709],[-74.10729499999999,42.814801],[-74.106651,42.814938],[-74.09987700000001,42.816623],[-74.096847,42.817373],[-74.093371,42.818177],[-74.09199599999999,42.818482],[-74.091863,42.818512],[-74.09066799999999,42.818726],[-74.089878,42.818818],[-74.087507,42.819124],[-74.08691899999999,42.819191],[-74.08611000000001,42.819216],[-74.085577,42.819215],[-74.083562,42.819163],[-74.082869,42.819162],[-74.081867,42.81927],[-74.08138,42.819323],[-74.080549,42.819461],[-74.079742,42.819664],[-74.07749699999999,42.82024],[-74.076559,42.820452],[-74.076229,42.820527],[-74.074088,42.820935],[-74.071967,42.821273],[-74.070733,42.821442],[-74.07047900000001,42.821471],[-74.070376,42.820926],[-74.070318,42.82062],[-74.069491,42.816955],[-74.067801,42.809313],[-74.06711,42.806319],[-74.066817,42.804977],[-74.066633,42.804588],[-74.066434,42.80442],[-74.066183,42.804333],[-74.056657,42.797828],[-74.048755,42.792504],[-74.045186,42.790098],[-74.042869,42.788536],[-74.042377,42.788204],[-74.034335,42.782392],[-74.03398900000001,42.782142],[-74.03379700000001,42.782003],[-74.033536,42.781815],[-74.030911,42.77992],[-74.030534,42.779648],[-74.03002600000001,42.779281],[-74.023076,42.774263],[-74.019623,42.77177],[-74.019177,42.771444],[-74.01711,42.76993],[-74.012986,42.766909],[-74.012137,42.766287],[-74.005583,42.761486],[-74.005568,42.761475],[-73.99402600000001,42.752992],[-74.001903,42.751979],[-74.011414,42.750755],[-74.013884,42.750431],[-74.015412,42.750233],[-74.01969200000001,42.749706],[-74.024209,42.74915],[-74.02455399999999,42.749108],[-74.0249,42.749065],[-74.029667,42.748478],[-74.029904,42.748447],[-74.038374,42.747375],[-74.038517,42.747358],[-74.04274100000001,42.746862],[-74.04428900000001,42.74668],[-74.04661900000001,42.746299],[-74.04715299999999,42.746239],[-74.047194,42.746234],[-74.047365,42.746204],[-74.047589,42.746174],[-74.049781,42.745944],[-74.05038,42.745859],[-74.05098599999999,42.745789],[-74.05127899999999,42.745744],[-74.051305,42.745749],[-74.0544,42.745471],[-74.054857,42.747438],[-74.05500600000001,42.74808],[-74.05576499999999,42.751351],[-74.056009,42.752546],[-74.05620999999999,42.753265],[-74.05722,42.757616],[-74.057959,42.760799],[-74.058128,42.761524],[-74.058577,42.763458],[-74.058936,42.765004],[-74.059602,42.767874],[-74.05962100000001,42.767909],[-74.05962100000001,42.767952],[-74.060496,42.771724],[-74.06380299999999,42.771379],[-74.068091,42.770931],[-74.071603,42.770564],[-74.072844,42.770435],[-74.07758699999999,42.769941],[-74.083626,42.769318],[-74.087785,42.768885],[-74.09358899999999,42.768271],[-74.095961,42.768034],[-74.098159,42.767816],[-74.101364,42.767352],[-74.10322499999999,42.767226],[-74.103388,42.767433],[-74.103567,42.768088],[-74.103814,42.769104],[-74.104196,42.771263],[-74.10426099999999,42.771634],[-74.105093,42.776347],[-74.10542700000001,42.778235],[-74.10544,42.778311],[-74.10563999999999,42.779445],[-74.10588,42.780801],[-74.105902,42.780928],[-74.10597,42.781316],[-74.106278,42.783093],[-74.106289,42.783154],[-74.10879,42.797589],[-74.109037,42.799012],[-74.10933799999999,42.800747],[-74.109392,42.801061],[-74.10940100000001,42.80111],[-74.10944600000001,42.801372],[-74.110073,42.804943],[-74.111223,42.811207],[-74.112042,42.816173],[-74.112059,42.816269]]],"type":"Polygon"}
}