{
  "id": "360319601002",
  "type": "Feature",
  "properties": {
    "area_land":14575164,
    "area_water":1314049,
    "geoid":"360319601002",
    "name":"Block Group 2",
    "state":"ny"
},
  "bbox": [
    -73.481631,
    44.493869,
    -73.400553,
    44.54236
],
  "geometry": {"coordinates":[[[-73.48159,44.500711],[-73.48141699999999,44.501459],[-73.48132200000001,44.501837],[-73.481308,44.501882],[-73.48117999999999,44.502304],[-73.48080400000001,44.503295],[-73.480391,44.504306],[-73.480277,44.504592],[-73.480085,44.505072],[-73.479996,44.505265],[-73.479806,44.505552],[-73.479382,44.506083],[-73.479294,44.506218],[-73.47924999999999,44.506352],[-73.47924500000001,44.50654],[-73.47928,44.50684],[-73.479283,44.506857],[-73.47886099999999,44.507006],[-73.478523,44.507125],[-73.47805700000001,44.50731],[-73.476705,44.507818],[-73.475984,44.508094],[-73.47532099999999,44.508123],[-73.47397599999999,44.507986],[-73.47304699999999,44.507803],[-73.47201699999999,44.507588],[-73.47142100000001,44.507665],[-73.47126900000001,44.507705],[-73.47124700000001,44.50771],[-73.471132,44.507742],[-73.47083499999999,44.507822],[-73.470358,44.508284],[-73.47014,44.508661],[-73.47099300000001,44.512094],[-73.47135400000001,44.513543],[-73.471458,44.514035],[-73.47138200000001,44.514142],[-73.471153,44.514463],[-73.471045,44.514614],[-73.46938400000001,44.515273],[-73.468425,44.515668],[-73.468065,44.516213],[-73.467737,44.517155],[-73.467432,44.517738],[-73.46738499999999,44.517826],[-73.467288,44.518013],[-73.467195,44.51819],[-73.467116,44.518239],[-73.46683,44.518416],[-73.466702,44.518495],[-73.465891,44.518987],[-73.464611,44.519121],[-73.463309,44.519058],[-73.462802,44.519979],[-73.462698,44.520026],[-73.462537,44.520099],[-73.462484,44.520123],[-73.461505,44.519793],[-73.460742,44.519756],[-73.46019,44.519793],[-73.45965,44.520046],[-73.459337,44.520807],[-73.45930300000001,44.521722],[-73.45930199999999,44.521738],[-73.459203,44.522714],[-73.45926,44.522835],[-73.45932999999999,44.522977],[-73.45941999999999,44.523172],[-73.459986,44.52345],[-73.460213,44.523531],[-73.46083400000001,44.523775],[-73.46146299999999,44.523991],[-73.462728,44.524507],[-73.46285,44.524562],[-73.462879,44.524574],[-73.46296599999999,44.524629],[-73.463166,44.524736],[-73.463375,44.525115],[-73.463319,44.525488],[-73.463168,44.525791],[-73.462991,44.526124],[-73.46268499999999,44.52655],[-73.462355,44.526743],[-73.46210600000001,44.526881],[-73.461761,44.526977],[-73.461733,44.527184],[-73.461761,44.527543],[-73.461747,44.527681],[-73.461637,44.528012],[-73.461472,44.528288],[-73.46118199999999,44.528757],[-73.461195,44.529212],[-73.461168,44.529557],[-73.461113,44.53026],[-73.461223,44.530536],[-73.461471,44.530922],[-73.46167800000001,44.531226],[-73.46194,44.531598],[-73.462037,44.531777],[-73.462119,44.531957],[-73.46223000000001,44.532205],[-73.46231299999999,44.532481],[-73.46238200000001,44.532743],[-73.462478,44.532936],[-73.46271299999999,44.53317],[-73.463044,44.533377],[-73.463595,44.533433],[-73.46396799999999,44.533515],[-73.464415,44.533561],[-73.464707,44.533682],[-73.464823,44.533756],[-73.46490900000001,44.533812],[-73.46497100000001,44.534069],[-73.464979,44.534188],[-73.464878,44.534439],[-73.464417,44.534972],[-73.464157,44.535335],[-73.464212,44.535481],[-73.464297,44.535573],[-73.464451,44.535635],[-73.464613,44.535704],[-73.464752,44.535766],[-73.46489800000001,44.535812],[-73.464975,44.535905],[-73.465034,44.536023],[-73.465084,44.536218],[-73.465024,44.536329],[-73.46474600000001,44.53668],[-73.464699,44.536703],[-73.46409,44.537395],[-73.464078,44.537409],[-73.464055,44.537434],[-73.46404,44.537451],[-73.463838,44.537681],[-73.463494,44.537707],[-73.463475,44.537708],[-73.46316400000001,44.537731],[-73.46303899999999,44.53774],[-73.462558,44.537776],[-73.46242100000001,44.537786],[-73.452562,44.538516],[-73.450513,44.538667],[-73.45031299999999,44.538682],[-73.443043,44.53922],[-73.426894,44.540417],[-73.42598,44.540485],[-73.419661,44.540951],[-73.41949099999999,44.540962],[-73.41928299999999,44.540981],[-73.419212,44.540986],[-73.418987,44.541001],[-73.418345,44.541049],[-73.400553,44.54236],[-73.40416,44.526921],[-73.40413100000001,44.52692],[-73.40407399999999,44.526936],[-73.403735,44.527104],[-73.40366899999999,44.527147],[-73.403633,44.527147],[-73.4036,44.527107],[-73.403577,44.526988],[-73.403558,44.526949],[-73.40383,44.526865],[-73.40395100000001,44.526817],[-73.403993,44.526821],[-73.404059,44.526854],[-73.404107,44.526861],[-73.404156,44.526857],[-73.404178,44.526832],[-73.404173,44.526777],[-73.40414199999999,44.526733],[-73.404132,44.526714],[-73.404211,44.526632],[-73.404235,44.526535],[-73.404315,44.526448],[-73.404359,44.526364],[-73.404329,44.526273],[-73.40424899999999,44.526196],[-73.404191,44.526171],[-73.404122,44.526124],[-73.403975,44.525778],[-73.403756,44.525086],[-73.40370900000001,44.524969],[-73.403621,44.524816],[-73.403425,44.524688],[-73.403312,44.524601],[-73.403268,44.524546],[-73.403257,44.524517],[-73.403271,44.524317],[-73.403257,44.5242],[-73.40323100000001,44.524127],[-73.40298300000001,44.523869],[-73.403139,44.523876],[-73.40324,44.52384],[-73.405614,44.52308],[-73.40622999999999,44.522861],[-73.40683199999999,44.522733],[-73.407051,44.522591],[-73.407309,44.522452],[-73.407597,44.522311],[-73.407797,44.522229],[-73.407938,44.522184],[-73.40808699999999,44.522136],[-73.40828500000001,44.522075],[-73.40896100000001,44.521923],[-73.410336,44.521631],[-73.41064799999999,44.521558],[-73.411103,44.521459],[-73.411698,44.521327],[-73.413769,44.520883],[-73.41450500000001,44.520767],[-73.41517399999999,44.520697],[-73.41572499999999,44.520652],[-73.41594499999999,44.520634],[-73.416532,44.520588],[-73.41997000000001,44.52032],[-73.42413500000001,44.520005],[-73.42536,44.519903],[-73.42580599999999,44.519866],[-73.426022,44.51985],[-73.427549,44.519736],[-73.428943,44.519622],[-73.431854,44.5194],[-73.432241,44.51937],[-73.43241999999999,44.519358],[-73.43263399999999,44.519344],[-73.43320799999999,44.519313],[-73.433824,44.519298],[-73.434012,44.519295],[-73.434293,44.519291],[-73.435039,44.519306],[-73.435506,44.51928],[-73.436274,44.519285],[-73.436937,44.519281],[-73.438819,44.519296],[-73.440245,44.519294],[-73.440799,44.519258],[-73.44083000000001,44.519249],[-73.441282,44.519169],[-73.44173600000001,44.519038],[-73.442137,44.518903],[-73.442437,44.518804],[-73.44274,44.518694],[-73.443971,44.518292],[-73.445414,44.51788],[-73.44681,44.517468],[-73.449575,44.516583],[-73.45011700000001,44.51639],[-73.450513,44.516218],[-73.451553,44.515655],[-73.452243,44.515255],[-73.452307,44.515208],[-73.452417,44.515082],[-73.451823,44.513917],[-73.44995400000001,44.510589],[-73.44831600000001,44.507738],[-73.44806800000001,44.507306],[-73.447827,44.506868],[-73.44735799999999,44.506013],[-73.447294,44.505895],[-73.44722,44.505722],[-73.447142,44.505456],[-73.447097,44.505136],[-73.447112,44.504763],[-73.447147,44.504534],[-73.447329,44.503607],[-73.447621,44.502118],[-73.44763,44.502076],[-73.448007,44.500217],[-73.448261,44.498781],[-73.44835500000001,44.498568],[-73.448459,44.49845],[-73.44853000000001,44.498385],[-73.44863700000001,44.498308],[-73.449063,44.498068],[-73.449758,44.497676],[-73.450014,44.497505],[-73.450045,44.497479],[-73.450273,44.497236],[-73.450496,44.49696],[-73.45243000000001,44.494384],[-73.452833,44.493869],[-73.453035,44.494035],[-73.45311700000001,44.49409],[-73.45366199999999,44.494388],[-73.45441099999999,44.494759],[-73.455454,44.495235],[-73.45634099999999,44.495613],[-73.457826,44.496201],[-73.458752,44.496558],[-73.459982,44.496429],[-73.460306,44.496407],[-73.460944,44.496387],[-73.461191,44.496401],[-73.46136799999999,44.496423],[-73.46231299999999,44.496602],[-73.462509,44.496624],[-73.46269599999999,44.496631],[-73.462806,44.496627],[-73.463171,44.496588],[-73.463509,44.49654],[-73.463922,44.496495],[-73.464387,44.496431],[-73.464775,44.496367],[-73.465103,44.496289],[-73.465812,44.496079],[-73.46619800000001,44.495988],[-73.46719,44.495824],[-73.468238,44.495703],[-73.46877600000001,44.495633],[-73.469269,44.495545],[-73.46953600000001,44.495463],[-73.469705,44.49539],[-73.469926,44.495275],[-73.47069,44.494834],[-73.471169,44.49454],[-73.47152699999999,44.49432],[-73.47188300000001,44.494135],[-73.472084,44.494058],[-73.472306,44.494016],[-73.472843,44.493976],[-73.473409,44.493956],[-73.473558,44.493963],[-73.473681,44.494621],[-73.473761,44.494929],[-73.473832,44.495059],[-73.473983,44.49524],[-73.474141,44.495365],[-73.47483699999999,44.495853],[-73.475325,44.496173],[-73.475769,44.496479],[-73.47580000000001,44.496499],[-73.475859,44.496538],[-73.47596,44.496605],[-73.476743,44.497135],[-73.477097,44.497386],[-73.47735299999999,44.497554],[-73.478403,44.498266],[-73.479512,44.499012],[-73.479742,44.499177],[-73.480673,44.499809],[-73.480934,44.499997],[-73.481075,44.500088],[-73.48163099999999,44.500472],[-73.48159,44.500711]]],"type":"Polygon"}
}