{
  "id": "360930208002",
  "type": "Feature",
  "properties": {
    "area_land":224949,
    "area_water":0,
    "geoid":"360930208002",
    "name":"Block Group 2",
    "state":"ny"
},
  "bbox": [
    -73.92859,
    42.804149,
    -73.920727,
    42.812986
],
  "geometry": {"coordinates":[[[-73.92795,42.811834],[-73.926928,42.812986],[-73.925803,42.812588],[-73.92450700000001,42.812112],[-73.92337499999999,42.811683],[-73.92312800000001,42.811606],[-73.922168,42.811275],[-73.92147300000001,42.811038],[-73.920727,42.810744],[-73.92133,42.80988],[-73.922132,42.808744],[-73.922934,42.807531],[-73.923461,42.80678],[-73.923947,42.806073],[-73.922489,42.805329],[-73.921864,42.804988],[-73.92086500000001,42.804492],[-73.92097200000001,42.804434],[-73.92102300000001,42.804406],[-73.921504,42.804149],[-73.921541,42.804189],[-73.9242,42.805735],[-73.924677,42.806026],[-73.924331,42.806602],[-73.924763,42.8069],[-73.924837,42.806974],[-73.92439,42.808083],[-73.924964,42.808374],[-73.924852,42.808828],[-73.925358,42.809031],[-73.92588600000001,42.809289],[-73.925209,42.810048],[-73.925529,42.810234],[-73.92574500000001,42.810071],[-73.926169,42.809698],[-73.927066,42.810276],[-73.927487,42.810362],[-73.92859,42.810647],[-73.92795,42.811834]]],"type":"Polygon"}
}