{
  "id": "360471170001",
  "type": "Feature",
  "properties": {
    "area_land":48204,
    "area_water":0,
    "geoid":"360471170001",
    "name":"Block Group 1",
    "state":"ny"
},
  "bbox": [
    -73.887304,
    40.67736,
    -73.884195,
    40.67994
],
  "geometry": {"coordinates":[[[-73.887304,40.679097],[-73.886438,40.679373],[-73.885555,40.679657],[-73.884671,40.67994],[-73.88419500000001,40.678089],[-73.884489,40.678005],[-73.885085,40.677835],[-73.885277,40.677781],[-73.886019,40.677578],[-73.886861,40.67736],[-73.887304,40.679097]]],"type":"Polygon"}
}