{
  "id": "360470165002",
  "type": "Feature",
  "properties": {
    "area_land":54116,
    "area_water":0,
    "geoid":"360470165002",
    "name":"Block Group 2",
    "state":"ny"
},
  "bbox": [
    -73.975196,
    40.669427,
    -73.971325,
    40.672222
],
  "geometry": {"coordinates":[[[-73.974698,40.671175],[-73.974188,40.671784],[-73.97382,40.672222],[-73.97132499999999,40.671248],[-73.971816,40.67063],[-73.972317,40.670029],[-73.97282,40.669427],[-73.975196,40.670576],[-73.974698,40.671175]]],"type":"Polygon"}
}