{
  "id": "360470280002",
  "type": "Feature",
  "properties": {
    "area_land":81461,
    "area_water":0,
    "geoid":"360470280002",
    "name":"Block Group 2",
    "state":"ny"
},
  "bbox": [
    -74.007459,
    40.601432,
    -74.00263,
    40.605075
],
  "geometry": {"coordinates":[[[-74.007459,40.602645],[-74.00617200000001,40.603887],[-74.00493400000001,40.605075],[-74.004446,40.604801],[-74.00416199999999,40.604655],[-74.003409,40.604259],[-74.00263,40.603847],[-74.003854,40.602668],[-74.00514,40.601432],[-74.00592399999999,40.60184],[-74.006781,40.602291],[-74.007459,40.602645]]],"type":"Polygon"}
}