{
  "id": "360050042005",
  "type": "Feature",
  "properties": {
    "area_land":85177,
    "area_water":0,
    "geoid":"360050042005",
    "name":"Block Group 5",
    "state":"ny"
},
  "bbox": [
    -73.861624,
    40.821632,
    -73.858264,
    40.825621
],
  "geometry": {"coordinates":[[[-73.86162400000001,40.823826],[-73.86070100000001,40.823951],[-73.861035,40.825417],[-73.860117,40.825533],[-73.859407,40.825621],[-73.858789,40.824209],[-73.858445,40.822774],[-73.85826400000001,40.822013],[-73.859262,40.821882],[-73.860193,40.821757],[-73.861114,40.821632],[-73.86162400000001,40.823826]]],"type":"Polygon"}
}