{
  "id": "361031471002",
  "type": "Feature",
  "properties": {
    "area_land":520406,
    "area_water":0,
    "geoid":"361031471002",
    "name":"Block Group 2",
    "state":"ny"
},
  "bbox": [
    -73.273188,
    40.718538,
    -73.258935,
    40.724753
],
  "geometry": {"coordinates":[[[-73.273188,40.723574],[-73.27192599999999,40.72375],[-73.270664,40.723934],[-73.269392,40.724108],[-73.268097,40.724292],[-73.266867,40.724477],[-73.265648,40.72464],[-73.265406,40.724655],[-73.265126,40.724683],[-73.26442400000001,40.724728],[-73.26399600000001,40.724745],[-73.26373700000001,40.724751],[-73.263176,40.724753],[-73.262882,40.724714],[-73.26255999999999,40.724682],[-73.262378,40.724648],[-73.262111,40.724585],[-73.26183,40.724509],[-73.261358,40.724295],[-73.260986,40.724095],[-73.26056699999999,40.72384],[-73.26046100000001,40.723801],[-73.260346,40.723782],[-73.260088,40.7238],[-73.259996,40.723864],[-73.259829,40.723962],[-73.25893499999999,40.722509],[-73.265597,40.719825],[-73.265868,40.719717],[-73.266184,40.719698],[-73.26651,40.719964],[-73.269131,40.719087],[-73.269954,40.718811],[-73.270753,40.718538],[-73.271778,40.718795],[-73.272088,40.719469],[-73.272634,40.721526],[-73.273188,40.723574]]],"type":"Polygon"}
}