{
  "id": "361119547001",
  "type": "Feature",
  "properties": {
    "area_land":43934771,
    "area_water":1045188,
    "geoid":"361119547001",
    "name":"Block Group 1",
    "state":"ny"
},
  "bbox": [
    -74.563193,
    41.720884,
    -74.402337,
    41.789369
],
  "geometry": {"coordinates":[[[-74.563193,41.757491],[-74.561166,41.759723],[-74.561082,41.759902],[-74.56104499999999,41.75997],[-74.554671,41.766779],[-74.553258,41.768326],[-74.54440200000001,41.778023],[-74.543475,41.778933],[-74.54061400000001,41.781747],[-74.537139,41.785282],[-74.532956,41.789369],[-74.532889,41.789344],[-74.53249,41.789158],[-74.531538,41.788671],[-74.530565,41.788227],[-74.52841600000001,41.787319],[-74.528177,41.787201],[-74.52797200000001,41.78708],[-74.527789,41.786965],[-74.52749,41.786777],[-74.527053,41.786482],[-74.526679,41.786173],[-74.52646900000001,41.785948],[-74.526274,41.785657],[-74.525578,41.784384],[-74.52538800000001,41.784075],[-74.525139,41.783739],[-74.524906,41.783463],[-74.524395,41.782954],[-74.523822,41.782439],[-74.523307,41.782045],[-74.522661,41.781524],[-74.52231500000001,41.781262],[-74.52215099999999,41.781154],[-74.521399,41.780751],[-74.52121099999999,41.780654],[-74.519997,41.78003],[-74.51971,41.779922],[-74.51938,41.77985],[-74.51871300000001,41.779793],[-74.517832,41.779764],[-74.517151,41.779757],[-74.51640399999999,41.779744],[-74.51617400000001,41.779722],[-74.51580199999999,41.779637],[-74.51557699999999,41.779562],[-74.515145,41.779397],[-74.514819,41.779234],[-74.514562,41.779068],[-74.51448600000001,41.779017],[-74.513897,41.778587],[-74.51333,41.778198],[-74.513006,41.778015],[-74.51258900000001,41.77784],[-74.511799,41.777557],[-74.50969499999999,41.776784],[-74.50915500000001,41.776597],[-74.50783300000001,41.776222],[-74.505537,41.775457],[-74.50540700000001,41.775414],[-74.504096,41.774977],[-74.503764,41.774863],[-74.50271600000001,41.774502],[-74.501518,41.7741],[-74.50064999999999,41.77385],[-74.50000199999999,41.773642],[-74.49830900000001,41.773208],[-74.498091,41.773132],[-74.497939,41.773052],[-74.49703100000001,41.772456],[-74.49676700000001,41.772316],[-74.496555,41.772228],[-74.496284,41.772132],[-74.49367700000001,41.771516],[-74.49244899999999,41.77121],[-74.49235400000001,41.771187],[-74.492093,41.771122],[-74.491371,41.770915],[-74.490578,41.770662],[-74.489616,41.770345],[-74.488822,41.770084],[-74.487408,41.769637],[-74.487184,41.769589],[-74.48702299999999,41.769574],[-74.487004,41.769574],[-74.486796,41.769575],[-74.486468,41.769621],[-74.486026,41.769698],[-74.485328,41.769237],[-74.485068,41.769104],[-74.484876,41.769033],[-74.484706,41.768994],[-74.48457500000001,41.76899],[-74.48318500000001,41.769067],[-74.482073,41.769148],[-74.481495,41.769223],[-74.480881,41.769352],[-74.479983,41.769534],[-74.47983600000001,41.769564],[-74.479564,41.769607],[-74.47927,41.769636],[-74.47908,41.769642],[-74.478701,41.769616],[-74.478538,41.769589],[-74.478111,41.769485],[-74.478072,41.769474],[-74.477422,41.769281],[-74.477052,41.769171],[-74.47563100000001,41.76878],[-74.474203,41.768413],[-74.47293000000001,41.768108],[-74.472469,41.76799],[-74.47211799999999,41.767896],[-74.47135,41.767661],[-74.468159,41.766788],[-74.46727300000001,41.76655],[-74.465942,41.766192],[-74.464705,41.765879],[-74.46450299999999,41.765837],[-74.464235,41.76577],[-74.463875,41.76568],[-74.46297300000001,41.765441],[-74.462819,41.765385],[-74.46262400000001,41.765293],[-74.462491,41.765208],[-74.462129,41.764924],[-74.46192499999999,41.764774],[-74.46128400000001,41.764408],[-74.460882,41.764215],[-74.460572,41.764095],[-74.46035500000001,41.764029],[-74.460229,41.763991],[-74.45990999999999,41.763937],[-74.459598,41.763908],[-74.459064,41.763897],[-74.45804800000001,41.763914],[-74.45756299999999,41.763895],[-74.457353,41.763864],[-74.456504,41.763657],[-74.455348,41.763354],[-74.454539,41.763116],[-74.45361699999999,41.762806],[-74.453394,41.762706],[-74.45258699999999,41.762227],[-74.45203600000001,41.761857],[-74.451835,41.761698],[-74.451401,41.761314],[-74.45079699999999,41.760658],[-74.45020599999999,41.760067],[-74.45005999999999,41.75989],[-74.4499,41.759621],[-74.44959799999999,41.759078],[-74.44951500000001,41.758949],[-74.449286,41.758615],[-74.44894499999999,41.75821],[-74.448206,41.757517],[-74.44779800000001,41.757192],[-74.447598,41.757032],[-74.44696999999999,41.756558],[-74.446297,41.756088],[-74.44540499999999,41.755439],[-74.445261,41.755314],[-74.44514599999999,41.755187],[-74.44508,41.755115],[-74.44497800000001,41.754973],[-74.44490500000001,41.75479],[-74.444816,41.754419],[-74.444772,41.754296],[-74.44467,41.754131],[-74.444597,41.754051],[-74.444328,41.753824],[-74.443708,41.753353],[-74.443426,41.753129],[-74.44239399999999,41.75226],[-74.44210200000001,41.751992],[-74.441613,41.75155],[-74.441293,41.751303],[-74.44076,41.750947],[-74.440342,41.750697],[-74.438451,41.74967],[-74.437138,41.748966],[-74.43705199999999,41.74892],[-74.437031,41.748909],[-74.43681100000001,41.748791],[-74.436549,41.748651],[-74.436297,41.748526],[-74.435667,41.748252],[-74.434978,41.74799],[-74.43323700000001,41.74736],[-74.432728,41.747207],[-74.432046,41.747028],[-74.431685,41.746915],[-74.431397,41.746781],[-74.431257,41.7467],[-74.431049,41.746562],[-74.430319,41.74599],[-74.430012,41.745753],[-74.429108,41.744999],[-74.428687,41.744624],[-74.428087,41.744063],[-74.42735399999999,41.743294],[-74.427097,41.74297],[-74.426875,41.742624],[-74.42679099999999,41.742456],[-74.426754,41.7423],[-74.42675800000001,41.742107],[-74.42677999999999,41.742034],[-74.426847,41.741895],[-74.42701099999999,41.741637],[-74.427066,41.74152],[-74.42708399999999,41.741447],[-74.42708500000001,41.741395],[-74.427088,41.741305],[-74.427048,41.741156],[-74.426802,41.740759],[-74.426441,41.74026],[-74.42622,41.739979],[-74.426034,41.739779],[-74.425433,41.739203],[-74.424757,41.738524],[-74.424463,41.738216],[-74.424029,41.737721],[-74.42363,41.737127],[-74.423491,41.736992],[-74.42336400000001,41.736897],[-74.422999,41.736671],[-74.422926,41.736613],[-74.42286799999999,41.736551],[-74.422742,41.736387],[-74.422684,41.736278],[-74.42240099999999,41.73552],[-74.422296,41.735287],[-74.422124,41.735072],[-74.421432,41.734351],[-74.42107300000001,41.733935],[-74.42094299999999,41.733802],[-74.420841,41.733717],[-74.42066,41.733602],[-74.420529,41.733538],[-74.420309,41.733447],[-74.419946,41.733334],[-74.41977900000001,41.733296],[-74.418896,41.733159],[-74.418502,41.733079],[-74.418335,41.733045],[-74.418076,41.733014],[-74.417787,41.732961],[-74.41767900000001,41.732928],[-74.417562,41.732879],[-74.417421,41.732804],[-74.417275,41.732691],[-74.416994,41.732407],[-74.416549,41.731924],[-74.416132,41.73144],[-74.415772,41.731065],[-74.415634,41.73095],[-74.415423,41.73081],[-74.415206,41.730651],[-74.414451,41.730172],[-74.414323,41.730108],[-74.41412,41.730028],[-74.41362100000001,41.729878],[-74.413504,41.729843],[-74.413349,41.729768],[-74.41310799999999,41.729626],[-74.412789,41.729404],[-74.412541,41.7292],[-74.411936,41.728741],[-74.4114,41.728358],[-74.41109400000001,41.728176],[-74.410436,41.727852],[-74.409812,41.72752],[-74.40955099999999,41.727389],[-74.409347,41.727327],[-74.40924200000001,41.727312],[-74.408997,41.727323],[-74.408706,41.727374],[-74.408483,41.727429],[-74.407993,41.727575],[-74.407873,41.7276],[-74.407781,41.727604],[-74.407708,41.727593],[-74.407577,41.727531],[-74.40752999999999,41.727491],[-74.40749,41.727433],[-74.40748000000001,41.7274],[-74.407464,41.727352],[-74.407439,41.727141],[-74.407426,41.727032],[-74.40740700000001,41.726961],[-74.407327,41.726773],[-74.40676999999999,41.726078],[-74.406491,41.725684],[-74.406323,41.725495],[-74.406232,41.725414],[-74.40586399999999,41.725145],[-74.405649,41.725014],[-74.40532,41.724839],[-74.40509299999999,41.724733],[-74.404752,41.72459],[-74.40452399999999,41.724496],[-74.404405,41.724438],[-74.404263,41.724368],[-74.403809,41.724114],[-74.403572,41.723954],[-74.40340999999999,41.723833],[-74.403009,41.723582],[-74.40286999999999,41.723473],[-74.402776,41.723349],[-74.402732,41.723243],[-74.402699,41.723039],[-74.402694,41.722726],[-74.402689,41.722616],[-74.402683,41.722515],[-74.402666,41.722296],[-74.40263299999999,41.722008],[-74.402557,41.72164],[-74.40234,41.721036],[-74.402337,41.720966],[-74.402359,41.720884],[-74.402576,41.720944],[-74.40328,41.721138],[-74.403571,41.721181],[-74.403862,41.721237],[-74.404208,41.72138],[-74.404616,41.72153],[-74.404658,41.721496],[-74.404703,41.721481],[-74.404764,41.721479],[-74.40481800000001,41.72149],[-74.405253,41.721639],[-74.40539699999999,41.721651],[-74.40547599999999,41.721651],[-74.405573,41.721632],[-74.405653,41.721597],[-74.405742,41.721532],[-74.405857,41.721355],[-74.405946,41.721284],[-74.406031,41.721253],[-74.40611800000001,41.721256],[-74.406268,41.721293],[-74.406781,41.721497],[-74.407112,41.721654],[-74.406527,41.722244],[-74.406628,41.722283],[-74.407184,41.722504],[-74.407369,41.722589],[-74.407968,41.722895],[-74.408597,41.723292],[-74.409802,41.724158],[-74.410293,41.724456],[-74.41056399999999,41.724604],[-74.410928,41.724771],[-74.410996,41.724802],[-74.411372,41.724955],[-74.411908,41.725134],[-74.412469,41.725282],[-74.412722,41.725336],[-74.413402,41.72544],[-74.41386900000001,41.725493],[-74.415221,41.725619],[-74.415342,41.72534],[-74.41542699999999,41.725222],[-74.415493,41.725169],[-74.415566,41.725132],[-74.415595,41.725128],[-74.41565199999999,41.72512],[-74.41579,41.72512],[-74.415982,41.725148],[-74.416133,41.72521],[-74.41636099999999,41.72534],[-74.416523,41.725452],[-74.41664400000001,41.725448],[-74.41686799999999,41.725448],[-74.416949,41.725471],[-74.417145,41.725579],[-74.417388,41.725694],[-74.41753199999999,41.725746],[-74.417748,41.7258],[-74.41784,41.7258],[-74.417933,41.725789],[-74.418167,41.725689],[-74.41827499999999,41.725669],[-74.41840999999999,41.725673],[-74.418572,41.725696],[-74.418649,41.725731],[-74.41871399999999,41.725777],[-74.419166,41.726287],[-74.419347,41.726437],[-74.41953599999999,41.72656],[-74.42061200000001,41.7271],[-74.420905,41.727293],[-74.421178,41.727408],[-74.42175,41.727591],[-74.42193,41.727641],[-74.42301999999999,41.727864],[-74.423388,41.727916],[-74.424548,41.72801],[-74.424933,41.728091],[-74.425076,41.728106],[-74.42523,41.728102],[-74.42538,41.728087],[-74.425603,41.728041],[-74.42588000000001,41.727998],[-74.42650999999999,41.727981],[-74.42752400000001,41.72801],[-74.427682,41.728025],[-74.427797,41.728048],[-74.427909,41.728091],[-74.428032,41.728156],[-74.428256,41.728294],[-74.428348,41.728375],[-74.42861000000001,41.728652],[-74.42873299999999,41.728756],[-74.428887,41.728829],[-74.429232,41.728904],[-74.42951600000001,41.728893],[-74.429755,41.728835],[-74.430808,41.728452],[-74.43100099999999,41.728415],[-74.43111399999999,41.72841],[-74.431439,41.728425],[-74.431601,41.728456],[-74.43180099999999,41.72851],[-74.43214399999999,41.728629],[-74.432492,41.7288],[-74.432958,41.729046],[-74.433826,41.729429],[-74.433949,41.72946],[-74.43406899999999,41.729479],[-74.434315,41.729483],[-74.434692,41.729464],[-74.43525200000001,41.729404],[-74.43535300000001,41.729381],[-74.43610700000001,41.729158],[-74.436313,41.729075],[-74.436864,41.728802],[-74.437014,41.728764],[-74.43712499999999,41.728756],[-74.437468,41.728749],[-74.437713,41.728713],[-74.438321,41.728542],[-74.438692,41.728418],[-74.43925400000001,41.728192],[-74.43979400000001,41.727908],[-74.439925,41.727857],[-74.440173,41.727813],[-74.440708,41.727776],[-74.441467,41.727653],[-74.441802,41.727565],[-74.442016,41.727491],[-74.44247300000001,41.727244],[-74.443071,41.726902],[-74.44384700000001,41.726491],[-74.44416,41.726353],[-74.444408,41.726273],[-74.445137,41.726098],[-74.445808,41.725923],[-74.446341,41.725821],[-74.447183,41.725644],[-74.44743800000001,41.725579],[-74.44760599999999,41.725513],[-74.44775199999999,41.725433],[-74.447934,41.725309],[-74.44832100000001,41.725018],[-74.448503,41.724909],[-74.44869300000001,41.724821],[-74.448941,41.724734],[-74.449495,41.724603],[-74.44972799999999,41.724573],[-74.449961,41.724566],[-74.451336,41.724594],[-74.451584,41.724616],[-74.451846,41.724667],[-74.452371,41.724798],[-74.453068,41.724911],[-74.453779,41.725002],[-74.454142,41.725024],[-74.454628,41.725053],[-74.455015,41.725039],[-74.45527,41.725009],[-74.455635,41.724944],[-74.456203,41.724805],[-74.45750099999999,41.724543],[-74.458078,41.724419],[-74.45868,41.724265],[-74.45938,41.724032],[-74.459671,41.723952],[-74.459919,41.7239],[-74.46016,41.723886],[-74.460539,41.723915],[-74.461181,41.723988],[-74.461443,41.724003],[-74.46207800000001,41.7239],[-74.46257799999999,41.723784],[-74.46277499999999,41.723747],[-74.462869,41.72374],[-74.462942,41.723755],[-74.463292,41.723944],[-74.46389000000001,41.724345],[-74.464022,41.724388],[-74.46410899999999,41.724396],[-74.46428400000001,41.724396],[-74.464634,41.724374],[-74.464933,41.724316],[-74.465188,41.724228],[-74.46566199999999,41.72401],[-74.4659,41.723923],[-74.46602799999999,41.724178],[-74.46617000000001,41.724079],[-74.466371,41.723988],[-74.46666999999999,41.723894],[-74.46776,41.72361],[-74.46796399999999,41.723548],[-74.46830300000001,41.723413],[-74.468529,41.723285],[-74.468784,41.723114],[-74.46896599999999,41.723008],[-74.469083,41.722954],[-74.469302,41.722881],[-74.46991800000001,41.722739],[-74.470173,41.722721],[-74.470294,41.722724],[-74.471023,41.722797],[-74.47138699999999,41.722808],[-74.471577,41.722804],[-74.472047,41.722761],[-74.472346,41.72271],[-74.472565,41.722651],[-74.47292899999999,41.72252],[-74.47319899999999,41.722342],[-74.47330100000001,41.722258],[-74.473564,41.722079],[-74.474118,41.721773],[-74.474661,41.7215],[-74.474818,41.721435],[-74.475047,41.721373],[-74.47525899999999,41.721347],[-74.47572599999999,41.721388],[-74.476097,41.721409],[-74.47651999999999,41.721416],[-74.476961,41.721435],[-74.47711099999999,41.721457],[-74.47732999999999,41.721518],[-74.477767,41.721708],[-74.47846,41.722083],[-74.47863099999999,41.722214],[-74.478937,41.722484],[-74.479061,41.722568],[-74.479328,41.72271],[-74.479874,41.722932],[-74.48033,41.723103],[-74.48150800000001,41.723504],[-74.48224,41.723766],[-74.482383,41.72381],[-74.48251,41.723835],[-74.48305000000001,41.72389],[-74.48365099999999,41.723934],[-74.484009,41.723986],[-74.484246,41.724025],[-74.48445700000001,41.724072],[-74.484956,41.724225],[-74.485401,41.724429],[-74.48554300000001,41.724506],[-74.485671,41.72459],[-74.48576199999999,41.724677],[-74.48585,41.724786],[-74.48592600000001,41.724932],[-74.48596999999999,41.725049],[-74.485992,41.725314],[-74.486011,41.726024],[-74.48603199999999,41.726115],[-74.48767599999999,41.726701],[-74.489856,41.727483],[-74.49058100000001,41.727747],[-74.49147000000001,41.728038],[-74.49706,41.729763],[-74.497322,41.729852],[-74.49763299999999,41.729957],[-74.498321,41.730212],[-74.499399,41.730657],[-74.499565,41.730723],[-74.499647,41.730756],[-74.500685,41.731184],[-74.501238,41.731414],[-74.506125,41.733443],[-74.509086,41.734669],[-74.510662,41.735323],[-74.51146300000001,41.735664],[-74.514409,41.736887],[-74.51449100000001,41.736921],[-74.520703,41.739489],[-74.525791,41.741574],[-74.53138300000001,41.743866],[-74.53205800000001,41.744135],[-74.53290699999999,41.744487],[-74.53345400000001,41.744725],[-74.534555,41.745262],[-74.535048,41.745527],[-74.53556,41.745816],[-74.53588999999999,41.746016],[-74.53655000000001,41.746438],[-74.53736499999999,41.746972],[-74.537448,41.747026],[-74.53801300000001,41.747379],[-74.538201,41.747497],[-74.538428,41.747625],[-74.53868199999999,41.74777],[-74.539332,41.748121],[-74.541393,41.749139],[-74.54250399999999,41.749691],[-74.543149,41.750001],[-74.543229,41.750048],[-74.54341700000001,41.750137],[-74.543662,41.750254],[-74.544572,41.750639],[-74.545359,41.750935],[-74.54804300000001,41.751933],[-74.548649,41.752169],[-74.549204,41.752413],[-74.549689,41.752644],[-74.54995599999999,41.75279],[-74.55407200000001,41.755183],[-74.55439800000001,41.755379],[-74.555193,41.755819],[-74.55567499999999,41.756043],[-74.556437,41.75635],[-74.55707200000001,41.756561],[-74.55761200000001,41.756711],[-74.55830899999999,41.756869],[-74.558666,41.756935],[-74.559229,41.75702],[-74.559926,41.757127],[-74.561694,41.757384],[-74.562586,41.75747],[-74.56289,41.757486],[-74.563193,41.757491]]],"type":"Polygon"}
}