{
  "id": "360710013002",
  "type": "Feature",
  "properties": {
    "area_land":769418,
    "area_water":0,
    "geoid":"360710013002",
    "name":"Block Group 2",
    "state":"ny"
},
  "bbox": [
    -74.424124,
    41.449193,
    -74.413012,
    41.470171
],
  "geometry": {"coordinates":[[[-74.42305,41.451335],[-74.422563,41.451791],[-74.4221,41.452202],[-74.421628,41.451894],[-74.420467,41.451158],[-74.42033000000001,41.451366],[-74.419628,41.452444],[-74.419845,41.452563],[-74.420948,41.453273],[-74.421673,41.453732],[-74.421014,41.45473],[-74.420396,41.455694],[-74.419453,41.457147],[-74.418869,41.458031],[-74.419676,41.458355],[-74.41864099999999,41.45994],[-74.417903,41.46102],[-74.417841,41.461103],[-74.417807,41.461194],[-74.417807,41.461264],[-74.41782600000001,41.461315],[-74.41788,41.461384],[-74.417997,41.461479],[-74.418459,41.461782],[-74.418722,41.46196],[-74.418853,41.462062],[-74.418931,41.462135],[-74.419009,41.462238],[-74.419067,41.462318],[-74.419111,41.462403],[-74.41917100000001,41.462561],[-74.419212,41.462743],[-74.419235,41.463046],[-74.419224,41.463684],[-74.41918699999999,41.463935],[-74.419134,41.464167],[-74.41904,41.464453],[-74.41891699999999,41.464671],[-74.418648,41.465012],[-74.41833,41.465385],[-74.418212,41.46554],[-74.417976,41.465939],[-74.417625,41.466634],[-74.417564,41.466803],[-74.417536,41.466969],[-74.417562,41.467137],[-74.417661,41.46734],[-74.41777,41.467469],[-74.418007,41.46765],[-74.41825,41.467817],[-74.41886700000001,41.468239],[-74.41903600000001,41.468356],[-74.419279,41.468555],[-74.419448,41.468751],[-74.419539,41.468947],[-74.419588,41.469122],[-74.419595,41.469336],[-74.419574,41.469466],[-74.419507,41.469637],[-74.419448,41.469736],[-74.41931700000001,41.469904],[-74.41904100000001,41.470171],[-74.418471,41.469876],[-74.41854499999999,41.469782],[-74.417,41.468775],[-74.415701,41.46797],[-74.41520199999999,41.467275],[-74.41536499999999,41.467022],[-74.41575,41.466656],[-74.414772,41.465876],[-74.416748,41.46395],[-74.416481,41.463683],[-74.41736,41.462716],[-74.414434,41.461951],[-74.413054,41.461636],[-74.41342299999999,41.461285],[-74.413736,41.460991],[-74.413659,41.460942],[-74.41363800000001,41.460898],[-74.413804,41.459873],[-74.414017,41.45853],[-74.41301199999999,41.457887],[-74.413222,41.456702],[-74.41331,41.456314],[-74.413444,41.455984],[-74.413552,41.455782],[-74.41439699999999,41.454791],[-74.414924,41.454212],[-74.415588,41.454631],[-74.415612,41.454636],[-74.415648,41.454623],[-74.41612499999999,41.454069],[-74.416968,41.45311],[-74.417331,41.452677],[-74.417833,41.452087],[-74.418145,41.451719],[-74.418611,41.451209],[-74.418879,41.450964],[-74.418954,41.450924],[-74.419376,41.45077],[-74.41862,41.450155],[-74.418807,41.449961],[-74.41948499999999,41.449813],[-74.420474,41.449586],[-74.421342,41.449382],[-74.421566,41.449342],[-74.42228,41.449193],[-74.42304900000001,41.44968],[-74.42412400000001,41.450367],[-74.42305,41.451335]]],"type":"Polygon"}
}