{
  "id": "360810884003",
  "type": "Feature",
  "properties": {
    "area_land":160145,
    "area_water":42862,
    "geoid":"360810884003",
    "name":"Block Group 3",
    "state":"ny"
},
  "bbox": [
    -73.839725,
    40.655892,
    -73.834376,
    40.661516
],
  "geometry": {"coordinates":[[[-73.839725,40.660951],[-73.838785,40.661088],[-73.838375,40.661123],[-73.837457,40.661253],[-73.836534,40.661385],[-73.835617,40.661516],[-73.83520300000001,40.659845],[-73.83478700000001,40.658172],[-73.83437600000001,40.656498],[-73.83529799999999,40.656366],[-73.83621100000001,40.656236],[-73.837132,40.656105],[-73.837757,40.656],[-73.838554,40.655892],[-73.838959,40.657551],[-73.839725,40.660951]]],"type":"Polygon"}
}