{
  "id": "361031462051",
  "type": "Feature",
  "properties": {
    "area_land":623511,
    "area_water":0,
    "geoid":"361031462051",
    "name":"Block Group 1",
    "state":"ny"
},
  "bbox": [
    -73.215937,
    40.741421,
    -73.207429,
    40.754892
],
  "geometry": {"coordinates":[[[-73.215807,40.742205],[-73.215546,40.742699],[-73.21540899999999,40.743547],[-73.214631,40.744835],[-73.212774,40.744809],[-73.21274099999999,40.746052],[-73.212706,40.747283],[-73.212666,40.74835],[-73.21267,40.748526],[-73.212633,40.749534],[-73.21258899999999,40.751078],[-73.21324799999999,40.753026],[-73.21378199999999,40.754581],[-73.21225099999999,40.754867],[-73.212076,40.754888],[-73.21192499999999,40.754892],[-73.21174999999999,40.754888],[-73.211533,40.75485],[-73.211371,40.754807],[-73.21029299999999,40.75443],[-73.209506,40.75416],[-73.20932999999999,40.754121],[-73.209041,40.754116],[-73.208871,40.752884],[-73.208707,40.751661],[-73.208539,40.75042],[-73.208367,40.749199],[-73.208201,40.747962],[-73.208028,40.746729],[-73.207869,40.745505],[-73.20774299999999,40.744697],[-73.207688,40.744295],[-73.20762499999999,40.743871],[-73.207617,40.743801],[-73.207584,40.743772],[-73.207573,40.743749],[-73.207511,40.743367],[-73.207452,40.743053],[-73.207429,40.74263],[-73.207528,40.742371],[-73.20752899999999,40.74223],[-73.20833399999999,40.742161],[-73.20956200000001,40.74207],[-73.211349,40.741856],[-73.21292699999999,40.741625],[-73.213285,40.741573],[-73.214332,40.741421],[-73.214703,40.741609],[-73.21496399999999,40.741698],[-73.21523500000001,40.741774],[-73.215345,40.741805],[-73.215937,40.741947],[-73.215807,40.742205]]],"type":"Polygon"}
}