{
  "id": "360270400012",
  "type": "Feature",
  "properties": {
    "area_land":14175667,
    "area_water":342503,
    "geoid":"360270400012",
    "name":"Block Group 2",
    "state":"ny"
},
  "bbox": [
    -73.58672,
    41.657909,
    -73.547372,
    41.742133
],
  "geometry": {"coordinates":[[[-73.58671699999999,41.71409],[-73.586692,41.714364],[-73.58665000000001,41.714626],[-73.586611,41.714807],[-73.586558,41.715015],[-73.58647000000001,41.715284],[-73.586079,41.716217],[-73.584971,41.718744],[-73.584416,41.719993],[-73.58288,41.723501],[-73.582328,41.724763],[-73.58184300000001,41.725931],[-73.581767,41.726124],[-73.581716,41.726252],[-73.581656,41.726385],[-73.581588,41.726521],[-73.581523,41.726628],[-73.58145500000001,41.726734],[-73.581372,41.726868],[-73.581304,41.726967],[-73.58117900000001,41.72712],[-73.581042,41.727279],[-73.580898,41.727439],[-73.580586,41.72778],[-73.58035700000001,41.728056],[-73.580262,41.728194],[-73.580127,41.728473],[-73.580055,41.728655],[-73.579964,41.729043],[-73.579965,41.729442],[-73.579981,41.729565],[-73.580001,41.729726],[-73.580101,41.730163],[-73.580118,41.730222],[-73.58015,41.730339],[-73.580258,41.730692],[-73.58071099999999,41.732394],[-73.580732,41.732495],[-73.58084700000001,41.732979],[-73.580895,41.733342],[-73.580913,41.733592],[-73.580912,41.734033],[-73.58090199999999,41.734168],[-73.58087999999999,41.734312],[-73.580866,41.734476],[-73.58083999999999,41.734637],[-73.580814,41.734786],[-73.58078399999999,41.734916],[-73.580758,41.735025],[-73.58072900000001,41.735146],[-73.580709,41.735217],[-73.580685,41.735296],[-73.580648,41.735417],[-73.580628,41.735482],[-73.580545,41.73571],[-73.580485,41.73586],[-73.580378,41.736091],[-73.579882,41.737104],[-73.57974299999999,41.737416],[-73.579705,41.737558],[-73.579683,41.737719],[-73.57967600000001,41.737916],[-73.579706,41.738215],[-73.579731,41.738321],[-73.579516,41.738182],[-73.57941700000001,41.738088],[-73.579331,41.737979],[-73.578973,41.73746],[-73.57860599999999,41.736842],[-73.578424,41.736531],[-73.57820599999999,41.736186],[-73.57813,41.73611],[-73.57805399999999,41.736072],[-73.577741,41.735946],[-73.577609,41.735881],[-73.577583,41.735868],[-73.575669,41.734942],[-73.575531,41.735089],[-73.57535799999999,41.735438],[-73.575306,41.735501],[-73.57521199999999,41.735507],[-73.57514999999999,41.73549],[-73.575112,41.735462],[-73.57503199999999,41.735373],[-73.57498699999999,41.735345],[-73.574887,41.735314],[-73.574783,41.735303],[-73.574686,41.735317],[-73.574641,41.735348],[-73.574589,41.735449],[-73.574568,41.735459],[-73.57446400000001,41.735469],[-73.57425600000001,41.73543],[-73.57420399999999,41.735402],[-73.574118,41.735388],[-73.574021,41.735447],[-73.573982,41.735488],[-73.573903,41.735571],[-73.573858,41.735585],[-73.57381700000001,41.735585],[-73.573775,41.735571],[-73.573695,41.735526],[-73.573643,41.735526],[-73.57356,41.735561],[-73.57355699999999,41.735592],[-73.573616,41.735921],[-73.573605,41.735952],[-73.57357399999999,41.735976],[-73.57346,41.735994],[-73.573408,41.735983],[-73.573353,41.735956],[-73.573308,41.735949],[-73.573269,41.735973],[-73.573269,41.736004],[-73.573294,41.736035],[-73.573301,41.736066],[-73.57329,41.736094],[-73.573263,41.736115],[-73.573211,41.736122],[-73.573159,41.736118],[-73.5731,41.736125],[-73.572982,41.736219],[-73.57293,41.736288],[-73.5727,41.736449],[-73.572497,41.736591],[-73.572338,41.736677],[-73.5722,41.736722],[-73.571853,41.736784],[-73.571161,41.736814],[-73.57102,41.736802],[-73.570944,41.737382],[-73.57064,41.73757],[-73.57040499999999,41.737507],[-73.570238,41.737314],[-73.569874,41.737257],[-73.569568,41.737272],[-73.56917799999999,41.737406],[-73.56916699999999,41.737417],[-73.568302,41.738046],[-73.568049,41.738333],[-73.568005,41.738797],[-73.56805799999999,41.739081],[-73.568528,41.739713],[-73.568669,41.739987],[-73.568746,41.74052],[-73.568774,41.740689],[-73.56900899999999,41.740943],[-73.570207,41.741154],[-73.57048899999999,41.741444],[-73.570697,41.74212],[-73.57049600000001,41.742128],[-73.570319,41.742132],[-73.57027600000001,41.742133],[-73.57020799999999,41.742125],[-73.57005100000001,41.742105],[-73.569868,41.74206],[-73.568652,41.741553],[-73.568056,41.741335],[-73.56652,41.74075],[-73.565061,41.740162],[-73.564685,41.739994],[-73.56357,41.739544],[-73.563462,41.739503],[-73.56319499999999,41.7394],[-73.562641,41.739223],[-73.561931,41.739008],[-73.56196199999999,41.738924],[-73.562,41.738699],[-73.562034,41.738088],[-73.56206299999999,41.737783],[-73.562094,41.737671],[-73.562394,41.73697],[-73.562662,41.736343],[-73.562726,41.736193],[-73.563023,41.735497],[-73.56316200000001,41.735172],[-73.56331299999999,41.734838],[-73.563598,41.73421],[-73.563676,41.734037],[-73.563917,41.733532],[-73.564024,41.733294],[-73.564159,41.732931],[-73.564239,41.73265],[-73.564342,41.732199],[-73.564453,41.731901],[-73.564689,41.731429],[-73.565746,41.7295],[-73.566096,41.728901],[-73.56643699999999,41.728287],[-73.56651599999999,41.728118],[-73.56658400000001,41.727933],[-73.56663399999999,41.727759],[-73.566665,41.727598],[-73.566703,41.727231],[-73.566699,41.727091],[-73.566649,41.726638],[-73.56659999999999,41.726434],[-73.56653799999999,41.72605],[-73.566517,41.725735],[-73.566548,41.725314],[-73.56659399999999,41.72507],[-73.566666,41.724673],[-73.566705,41.724551],[-73.566979,41.723869],[-73.567238,41.723148],[-73.567363,41.722642],[-73.56741700000001,41.721909],[-73.567414,41.721816],[-73.56742199999999,41.721671],[-73.567441,41.721466],[-73.567532,41.721056],[-73.56728200000001,41.721285],[-73.567116,41.721385],[-73.567037,41.72142],[-73.566947,41.721433],[-73.56688800000001,41.721427],[-73.56652800000001,41.721271],[-73.56622299999999,41.72116],[-73.566157,41.721112],[-73.56607,41.721029],[-73.565309,41.719826],[-73.56523900000001,41.719702],[-73.565122,41.719452],[-73.56507000000001,41.719373],[-73.564987,41.719276],[-73.56487199999999,41.719172],[-73.564724,41.718973],[-73.564623,41.718807],[-73.564504,41.718541],[-73.56437099999999,41.718183],[-73.564258,41.717966],[-73.564048,41.717748],[-73.563844,41.71758],[-73.562658,41.716815],[-73.562202,41.716492],[-73.562004,41.716322],[-73.561708,41.716217],[-73.561356,41.716117],[-73.560901,41.716008],[-73.560525,41.715928],[-73.559878,41.715788],[-73.559735,41.715729],[-73.559595,41.715616],[-73.559479,41.715536],[-73.559518,41.715237],[-73.559552,41.714953],[-73.559552,41.71446],[-73.55951,41.713941],[-73.55951,41.713264],[-73.55951,41.71283],[-73.559585,41.712153],[-73.55962700000001,41.711559],[-73.55961000000001,41.711141],[-73.55962700000001,41.710715],[-73.559652,41.710389],[-73.55971,41.710004],[-73.559878,41.709553],[-73.560028,41.709235],[-73.560103,41.709035],[-73.560103,41.708809],[-73.55998599999999,41.708416],[-73.55988600000001,41.708031],[-73.559777,41.707781],[-73.55971,41.707547],[-73.559669,41.707296],[-73.559585,41.707137],[-73.559468,41.707062],[-73.559117,41.706936],[-73.55874900000001,41.706769],[-73.558532,41.70656],[-73.558331,41.706243],[-73.55828099999999,41.705674],[-73.55828099999999,41.705189],[-73.558223,41.704629],[-73.558226,41.699508],[-73.558133,41.693399],[-73.558104,41.691495],[-73.557714,41.687792],[-73.557574,41.68725],[-73.557486,41.686856],[-73.55736400000001,41.686638],[-73.557323,41.686494],[-73.557247,41.686297],[-73.55708,41.685943],[-73.556926,41.685698],[-73.556595,41.68523],[-73.55632799999999,41.68491],[-73.55564800000001,41.684158],[-73.555522,41.683973],[-73.555288,41.683545],[-73.554895,41.682763],[-73.554777,41.682561],[-73.554665,41.682407],[-73.554309,41.681984],[-73.553963,41.681477],[-73.553783,41.681158],[-73.553495,41.680529],[-73.553229,41.679914],[-73.553106,41.679705],[-73.552498,41.678836],[-73.552333,41.678626],[-73.55219200000001,41.678444],[-73.551839,41.677914],[-73.551562,41.677453],[-73.551537,41.677392],[-73.55152200000001,41.677316],[-73.551526,41.677007],[-73.55134099999999,41.676443],[-73.551305,41.676299],[-73.551213,41.675544],[-73.551028,41.673817],[-73.550945,41.673512],[-73.550855,41.673214],[-73.550788,41.67306],[-73.55032799999999,41.67225],[-73.55026599999999,41.67212],[-73.55010799999999,41.671626],[-73.550078,41.671511],[-73.550021,41.671107],[-73.549947,41.670834],[-73.54983300000001,41.670583],[-73.549373,41.669768],[-73.549353,41.669738],[-73.549029,41.669204],[-73.548934,41.669059],[-73.548502,41.668448],[-73.54788000000001,41.667644],[-73.547432,41.667292],[-73.547372,41.667255],[-73.54748600000001,41.667209],[-73.547629,41.667113],[-73.547763,41.667006],[-73.547899,41.666912],[-73.54827,41.666643],[-73.54848699999999,41.666483],[-73.549359,41.665884],[-73.55038500000001,41.665261],[-73.550612,41.665113],[-73.55083500000001,41.664954],[-73.551461,41.664459],[-73.55176899999999,41.664244],[-73.552077,41.664027],[-73.55228,41.663907],[-73.55241100000001,41.663843],[-73.552663,41.66375],[-73.55279899999999,41.663718],[-73.552937,41.663686],[-73.55317599999999,41.663661],[-73.55352499999999,41.663637],[-73.554411,41.66356],[-73.556027,41.663363],[-73.556845,41.663285],[-73.55804500000001,41.663137],[-73.558832,41.66306],[-73.55915,41.663049],[-73.559415,41.663063],[-73.55973,41.66308],[-73.559952,41.663092],[-73.55978500000001,41.662398],[-73.55962599999999,41.661832],[-73.55953100000001,41.661493],[-73.559409,41.661193],[-73.559342,41.661063],[-73.55926100000001,41.66095],[-73.55911,41.66074],[-73.558694,41.660186],[-73.55865799999999,41.660105],[-73.55862500000001,41.659992],[-73.55861400000001,41.659897],[-73.558634,41.659685],[-73.558764,41.659107],[-73.55887,41.65857],[-73.55887300000001,41.658503],[-73.558863,41.658337],[-73.558807,41.658079],[-73.558734,41.657909],[-73.558967,41.658102],[-73.55921499999999,41.658324],[-73.559344,41.65841],[-73.559586,41.658506],[-73.559791,41.658562],[-73.56037600000001,41.658711],[-73.560821,41.658768],[-73.56096100000001,41.658776],[-73.56146200000001,41.658779],[-73.56229500000001,41.658761],[-73.562505,41.658747],[-73.56262599999999,41.658759],[-73.562889,41.658764],[-73.563,41.658774],[-73.563256,41.658836],[-73.56343200000001,41.658888],[-73.56356700000001,41.65895],[-73.56383099999999,41.659083],[-73.56397,41.659194],[-73.564041,41.659252],[-73.56414100000001,41.659368],[-73.564268,41.659606],[-73.564537,41.660209],[-73.564663,41.660549],[-73.564921,41.66152],[-73.564949,41.661689],[-73.565091,41.662129],[-73.565242,41.662453],[-73.565594,41.663113],[-73.565753,41.66341],[-73.56640899999999,41.664372],[-73.566463,41.664439],[-73.567178,41.66534],[-73.567256,41.665446],[-73.56772100000001,41.666078],[-73.567797,41.666182],[-73.567987,41.666568],[-73.568153,41.667083],[-73.56845800000001,41.668194],[-73.568601,41.669233],[-73.568811,41.671124],[-73.56912699999999,41.672964],[-73.569303,41.673871],[-73.569362,41.674044],[-73.569453,41.674218],[-73.569867,41.674814],[-73.57051199999999,41.675713],[-73.57063100000001,41.675837],[-73.57092799999999,41.676069],[-73.57111500000001,41.676206],[-73.571934,41.676732],[-73.572464,41.676987],[-73.57288,41.677142],[-73.573374,41.677266],[-73.573835,41.677353],[-73.57402999999999,41.677382],[-73.574496,41.67741],[-73.575024,41.677426],[-73.57558400000001,41.677394],[-73.576042,41.677363],[-73.576531,41.67738],[-73.576939,41.677416],[-73.576944,41.677715],[-73.57694100000001,41.677969],[-73.576931,41.678204],[-73.576916,41.678441],[-73.576903,41.678594],[-73.576888,41.678755],[-73.576874,41.678921],[-73.57685499999999,41.679061],[-73.57681599999999,41.679424],[-73.57660300000001,41.680645],[-73.576538,41.681055],[-73.576483,41.681565],[-73.57647799999999,41.681987],[-73.576488,41.682311],[-73.576519,41.682595],[-73.576556,41.682921],[-73.5766,41.683291],[-73.576628,41.683488],[-73.576685,41.683983],[-73.576707,41.684147],[-73.576735,41.684393],[-73.576768,41.684682],[-73.576804,41.684954],[-73.57682,41.68509],[-73.576842,41.685253],[-73.576859,41.685358],[-73.576926,41.685748],[-73.576966,41.685962],[-73.577011,41.686176],[-73.577063,41.686392],[-73.57709800000001,41.686531],[-73.577186,41.686867],[-73.57724,41.687046],[-73.577359,41.687472],[-73.577426,41.687715],[-73.577477,41.6879],[-73.577849,41.689214],[-73.578007,41.689806],[-73.57819600000001,41.690532],[-73.578332,41.691202],[-73.578402,41.691559],[-73.57859500000001,41.692727],[-73.578856,41.694363],[-73.578908,41.69468],[-73.579019,41.695353],[-73.579082,41.695655],[-73.57910699999999,41.695907],[-73.579154,41.696114],[-73.57919099999999,41.696284],[-73.579262,41.696528],[-73.579336,41.69671],[-73.57940000000001,41.696851],[-73.57946200000001,41.696981],[-73.579542,41.697135],[-73.579599,41.697223],[-73.579773,41.697503],[-73.580046,41.697846],[-73.580276,41.6981],[-73.580472,41.698331],[-73.58106600000001,41.698992],[-73.58256900000001,41.700675],[-73.583815,41.702065],[-73.584473,41.702785],[-73.58456700000001,41.70289],[-73.584883,41.703277],[-73.58511900000001,41.703615],[-73.585272,41.703835],[-73.585358,41.703988],[-73.585514,41.704283],[-73.585551,41.70438],[-73.58561899999999,41.704533],[-73.585668,41.704654],[-73.585714,41.704775],[-73.585753,41.704889],[-73.585779,41.704975],[-73.58581599999999,41.705097],[-73.58584500000001,41.705207],[-73.585869,41.705298],[-73.58588899999999,41.705395],[-73.58590599999999,41.705487],[-73.58591800000001,41.705561],[-73.585938,41.705682],[-73.58595800000001,41.705807],[-73.585975,41.70593],[-73.58598000000001,41.706009],[-73.586038,41.706559],[-73.586213,41.708447],[-73.58650799999999,41.7115],[-73.586629,41.712612],[-73.58670499999999,41.713426],[-73.58672,41.713854],[-73.58671699999999,41.71409]]],"type":"Polygon"}
}