{
  "id": "360471156003",
  "type": "Feature",
  "properties": {
    "area_land":27356,
    "area_water":0,
    "geoid":"360471156003",
    "name":"Block Group 3",
    "state":"ny"
},
  "bbox": [
    -73.89802,
    40.667419,
    -73.895805,
    40.669227
],
  "geometry": {"coordinates":[[[-73.89802,40.668958],[-73.89709999999999,40.669093],[-73.896198,40.669227],[-73.895805,40.667688],[-73.896704,40.667555],[-73.897633,40.667419],[-73.89802,40.668958]]],"type":"Polygon"}
}