{
  "id": "360810757021",
  "type": "Feature",
  "properties": {
    "area_land":33384,
    "area_water":0,
    "geoid":"360810757021",
    "name":"Block Group 1",
    "state":"ny"
},
  "bbox": [
    -73.840858,
    40.719602,
    -73.837957,
    40.721644
],
  "geometry": {"coordinates":[[[-73.840858,40.720984],[-73.838641,40.721644],[-73.83829799999999,40.720979],[-73.837957,40.720313],[-73.839534,40.719843],[-73.83981199999999,40.719602],[-73.840748,40.720019],[-73.840852,40.720065],[-73.840529,40.720324],[-73.840858,40.720984]]],"type":"Polygon"}
}