{
  "id": "360850021003",
  "type": "Feature",
  "properties": {
    "area_land":235906,
    "area_water":0,
    "geoid":"360850021003",
    "name":"Block Group 3",
    "state":"ny"
},
  "bbox": [
    -74.08525,
    40.622801,
    -74.075647,
    40.628951
],
  "geometry": {"coordinates":[[[-74.084962,40.624625],[-74.084154,40.626267],[-74.08376199999999,40.626776],[-74.083395,40.62712],[-74.083033,40.627372],[-74.08257399999999,40.627441],[-74.082335,40.627473],[-74.082206,40.627475],[-74.08205700000001,40.627437],[-74.08187700000001,40.627403],[-74.081695,40.627366],[-74.081531,40.627339],[-74.081372,40.627332],[-74.08113899999999,40.627326],[-74.08101600000001,40.627343],[-74.080924,40.627365],[-74.080831,40.627408],[-74.080787,40.627434],[-74.080725,40.627494],[-74.08068400000001,40.627564],[-74.080645,40.627676],[-74.080626,40.627737],[-74.080613,40.627819],[-74.080592,40.627922],[-74.080586,40.628016],[-74.080569,40.628073],[-74.080513,40.628146],[-74.08044700000001,40.628223],[-74.08037899999999,40.628262],[-74.079725,40.628951],[-74.077518,40.627743],[-74.07638,40.627138],[-74.075943,40.627166],[-74.075647,40.626664],[-74.077624,40.626493],[-74.078166,40.626466],[-74.079435,40.625072],[-74.07997,40.624483],[-74.08032300000001,40.624366],[-74.08118899999999,40.624091],[-74.082773,40.623588],[-74.08382400000001,40.623252],[-74.08525,40.622801],[-74.084962,40.624625]]],"type":"Polygon"}
}