{
  "id": "360050090003",
  "type": "Feature",
  "properties": {
    "area_land":42049,
    "area_water":0,
    "geoid":"360050090003",
    "name":"Block Group 3",
    "state":"ny"
},
  "bbox": [
    -73.848341,
    40.818932,
    -73.844968,
    40.820784
],
  "geometry": {"coordinates":[[[-73.848341,40.820363],[-73.84528899999999,40.820784],[-73.84496799999999,40.819428],[-73.845068,40.81935],[-73.84800799999999,40.818932],[-73.848028,40.819017],[-73.848045,40.819091],[-73.848341,40.820363]]],"type":"Polygon"}
}