{
  "id": "360811277002",
  "type": "Feature",
  "properties": {
    "area_land":226220,
    "area_water":0,
    "geoid":"360811277002",
    "name":"Block Group 2",
    "state":"ny"
},
  "bbox": [
    -73.789459,
    40.722916,
    -73.780485,
    40.729213
],
  "geometry": {"coordinates":[[[-73.789113,40.726606],[-73.78825000000001,40.726887],[-73.78738300000001,40.727172],[-73.78655000000001,40.727445],[-73.78619,40.727564],[-73.785685,40.72773],[-73.78482099999999,40.728015],[-73.78397699999999,40.728291],[-73.783601,40.728413],[-73.782923,40.728636],[-73.782059,40.728919],[-73.781161,40.729213],[-73.780799,40.728425],[-73.780485,40.727752],[-73.782,40.727237],[-73.782921,40.726817],[-73.782904,40.726654],[-73.78286799999999,40.726492],[-73.782815,40.726332],[-73.78274399999999,40.726176],[-73.782657,40.726026],[-73.782555,40.725882],[-73.782365,40.725642],[-73.782157,40.72541],[-73.781932,40.725188],[-73.781691,40.724975],[-73.78203000000001,40.724892],[-73.782363,40.724792],[-73.782689,40.724675],[-73.783005,40.724542],[-73.78330800000001,40.724394],[-73.783598,40.724231],[-73.783872,40.724055],[-73.78412899999999,40.723867],[-73.784389,40.723626],[-73.784683,40.723374],[-73.78497900000001,40.72314],[-73.785287,40.722916],[-73.78542299999999,40.72313],[-73.785573,40.723338],[-73.785736,40.723541],[-73.785911,40.723738],[-73.78609899999999,40.723928],[-73.78680300000001,40.724571],[-73.787571,40.725282],[-73.788309,40.725956],[-73.78842,40.726053],[-73.78854699999999,40.72614],[-73.788687,40.726215],[-73.788837,40.726277],[-73.788994,40.726324],[-73.78945899999999,40.726493],[-73.789113,40.726606]]],"type":"Polygon"}
}