{
  "id": "360470152003",
  "type": "Feature",
  "properties": {
    "area_land":56432,
    "area_water":0,
    "geoid":"360470152003",
    "name":"Block Group 3",
    "state":"ny"
},
  "bbox": [
    -74.024624,
    40.616169,
    -74.021216,
    40.619502
],
  "geometry": {"coordinates":[[[-74.024624,40.617389],[-74.023634,40.618537],[-74.02293299999999,40.619502],[-74.022876,40.619466],[-74.022004,40.618938],[-74.021216,40.618472],[-74.021486,40.617866],[-74.02162199999999,40.6175],[-74.022161,40.616169],[-74.02281499999999,40.616488],[-74.023717,40.616937],[-74.024002,40.617079],[-74.024624,40.617389]]],"type":"Polygon"}
}