{
  "id": "360810394002",
  "type": "Feature",
  "properties": {
    "area_land":108431,
    "area_water":0,
    "geoid":"360810394002",
    "name":"Block Group 2",
    "state":"ny"
},
  "bbox": [
    -73.762203,
    40.686451,
    -73.758124,
    40.691179
],
  "geometry": {"coordinates":[[[-73.762203,40.690226],[-73.761335,40.690468],[-73.760486,40.690704],[-73.758788,40.691179],[-73.758489,40.690528],[-73.758681,40.690475],[-73.758124,40.689537],[-73.75898100000001,40.689245],[-73.759839,40.688953],[-73.758858,40.687287],[-73.759736,40.68697],[-73.761174,40.686451],[-73.76146799999999,40.68713],[-73.761585,40.687355],[-73.761793,40.687751],[-73.761954,40.688235],[-73.762044,40.688958],[-73.762203,40.690226]]],"type":"Polygon"}
}