{
  "id": "361190055003",
  "type": "Feature",
  "properties": {
    "area_land":1040516,
    "area_water":6571,
    "geoid":"361190055003",
    "name":"Block Group 3",
    "state":"ny"
},
  "bbox": [
    -73.823264,
    40.890206,
    -73.805761,
    40.902806
],
  "geometry": {"coordinates":[[[-73.82326399999999,40.891357],[-73.822762,40.892694],[-73.822097,40.893791],[-73.821895,40.894125],[-73.821217,40.895043],[-73.821077,40.895187],[-73.82086099999999,40.895299],[-73.820627,40.895378],[-73.819468,40.895805],[-73.818333,40.896594],[-73.81814300000001,40.896834],[-73.818139,40.896907],[-73.818174,40.896966],[-73.81823300000001,40.897011],[-73.818269,40.89702],[-73.818254,40.897078],[-73.81802999999999,40.89796],[-73.817909,40.89825],[-73.81767000000001,40.898676],[-73.81741,40.899038],[-73.817334,40.899173],[-73.81732,40.899269],[-73.817369,40.899436],[-73.817531,40.899801],[-73.81756300000001,40.899974],[-73.817545,40.900133],[-73.817421,40.900351],[-73.81657,40.901365],[-73.816351,40.901626],[-73.81611599999999,40.901847],[-73.816068,40.901892],[-73.816018,40.901939],[-73.81591,40.902016],[-73.815776,40.902112],[-73.815409,40.902313],[-73.815308,40.902399],[-73.815167,40.902608],[-73.81496199999999,40.902667],[-73.814875,40.902691],[-73.81479299999999,40.902715],[-73.814757,40.902725],[-73.81470400000001,40.90274],[-73.814397,40.90279],[-73.81421899999999,40.902806],[-73.814087,40.902806],[-73.813914,40.902789],[-73.81371799999999,40.902751],[-73.81263800000001,40.902506],[-73.812417,40.902439],[-73.81180999999999,40.902295],[-73.811436,40.902241],[-73.810973,40.902208],[-73.81031,40.902177],[-73.810278,40.902133],[-73.810259,40.902107],[-73.810084,40.901867],[-73.809622,40.901252],[-73.809141,40.900607],[-73.808522,40.89972],[-73.80809600000001,40.899156],[-73.807695,40.898574],[-73.80672800000001,40.89723],[-73.806597,40.897047],[-73.806381,40.896748],[-73.80624299999999,40.896583],[-73.805978,40.896266],[-73.805761,40.896057],[-73.80723399999999,40.895456],[-73.80742100000001,40.895397],[-73.808316,40.89502],[-73.809213,40.894655],[-73.810247,40.894226],[-73.81115200000001,40.893851],[-73.812324,40.893388],[-73.813231,40.893031],[-73.814199,40.892649],[-73.814718,40.892436],[-73.815203,40.892236],[-73.815383,40.892162],[-73.81586900000001,40.891958],[-73.815967,40.891916],[-73.816164,40.891832],[-73.816951,40.891494],[-73.817097,40.891431],[-73.81798499999999,40.891065],[-73.81829999999999,40.890918],[-73.81833399999999,40.8909],[-73.818468,40.890883],[-73.819136,40.890532],[-73.81961699999999,40.890265],[-73.81971900000001,40.890206],[-73.820994,40.890543],[-73.821703,40.89073],[-73.822959,40.891056],[-73.823003,40.891078],[-73.823244,40.891199],[-73.82326399999999,40.891357]]],"type":"Polygon"}
}