{
  "id": "360050090002",
  "type": "Feature",
  "properties": {
    "area_land":437584,
    "area_water":2318,
    "geoid":"360050090002",
    "name":"Block Group 2",
    "state":"ny"
},
  "bbox": [
    -73.842812,
    40.816341,
    -73.835941,
    40.829053
],
  "geometry": {"coordinates":[[[-73.842812,40.828637],[-73.84238499999999,40.828688],[-73.842249,40.828705],[-73.841446,40.828793],[-73.841234,40.828812],[-73.840501,40.828858],[-73.840344,40.828867],[-73.839252,40.828909],[-73.837575,40.828972],[-73.83717300000001,40.829018],[-73.837017,40.829053],[-73.836979,40.82893],[-73.836945,40.828821],[-73.836887,40.828646],[-73.836838,40.828464],[-73.83681300000001,40.828386],[-73.836777,40.828274],[-73.83674600000001,40.828198],[-73.83669399999999,40.827892],[-73.836544,40.82712],[-73.83643499999999,40.826374],[-73.83620999999999,40.824974],[-73.83602,40.82376],[-73.83594100000001,40.819987],[-73.836032,40.817856],[-73.83645,40.81784],[-73.83673400000001,40.817822],[-73.836708,40.817554],[-73.836738,40.817193],[-73.836961,40.816341],[-73.837327,40.816346],[-73.838959,40.816369],[-73.83998,40.816391],[-73.840225,40.817221],[-73.84007099999999,40.817549],[-73.83958800000001,40.818521],[-73.839251,40.818845],[-73.83873,40.819558],[-73.83886699999999,40.820381],[-73.83867499999999,40.82145],[-73.83864800000001,40.821971],[-73.83908099999999,40.823107],[-73.84119099999999,40.826278],[-73.841903,40.827811],[-73.841942,40.827885],[-73.841976,40.827933],[-73.84200800000001,40.827978],[-73.84207600000001,40.828125],[-73.84267,40.82804],[-73.842653,40.828263],[-73.84266700000001,40.828342],[-73.842736,40.828528],[-73.842748,40.828544],[-73.842812,40.828637]]],"type":"Polygon"}
}