{
  "id": "360470794001",
  "type": "Feature",
  "properties": {
    "area_land":180178,
    "area_water":0,
    "geoid":"360470794001",
    "name":"Block Group 1",
    "state":"ny"
},
  "bbox": [
    -73.958707,
    40.646518,
    -73.952189,
    40.65067
],
  "geometry": {"coordinates":[[[-73.958707,40.650387],[-73.955825,40.65053],[-73.95480000000001,40.65057],[-73.952951,40.650655],[-73.95246899999999,40.65067],[-73.95236300000001,40.649669],[-73.95227,40.648795],[-73.952189,40.648021],[-73.95276699999999,40.647995],[-73.954212,40.647936],[-73.954948,40.647903],[-73.955736,40.647869],[-73.955652,40.646631],[-73.956444,40.646595],[-73.958107,40.646518],[-73.958141,40.647504],[-73.95815,40.647768],[-73.95825600000001,40.648532],[-73.958288,40.648663],[-73.958444,40.649307],[-73.958707,40.650387]]],"type":"Polygon"}
}