{
  "id": "360550031005",
  "type": "Feature",
  "properties": {
    "area_land":189440,
    "area_water":0,
    "geoid":"360550031005",
    "name":"Block Group 5",
    "state":"ny"
},
  "bbox": [
    -77.592518,
    43.144051,
    -77.586293,
    43.15042
],
  "geometry": {"coordinates":[[[-77.591724,43.14719],[-77.591374,43.147787],[-77.590856,43.14871],[-77.59045999999999,43.149413],[-77.589877,43.15042],[-77.58766900000001,43.150116],[-77.587262,43.150068],[-77.586806,43.150007],[-77.586293,43.149881],[-77.58727,43.148015],[-77.58773600000001,43.147094],[-77.588094,43.146379],[-77.588938,43.144818],[-77.589361,43.144051],[-77.589693,43.144243],[-77.590512,43.14472],[-77.590825,43.144899],[-77.591329,43.145189],[-77.591718,43.14541],[-77.592518,43.145861],[-77.591724,43.14719]]],"type":"Polygon"}
}