{
  "id": "360710016003",
  "type": "Feature",
  "properties": {
    "area_land":1083004,
    "area_water":5506,
    "geoid":"360710016003",
    "name":"Block Group 3",
    "state":"ny"
},
  "bbox": [
    -74.438739,
    41.424961,
    -74.422125,
    41.441171
],
  "geometry": {"coordinates":[[[-74.438739,41.429003],[-74.438552,41.429175],[-74.437715,41.429977],[-74.436936,41.430699],[-74.434068,41.433338],[-74.43342699999999,41.433921],[-74.43275199999999,41.434537],[-74.432652,41.434626],[-74.432631,41.434645],[-74.43053999999999,41.436541],[-74.430468,41.436635],[-74.430414,41.436781],[-74.430346,41.437244],[-74.430331,41.437349],[-74.430294,41.437534],[-74.430229,41.43782],[-74.43019200000001,41.437913],[-74.430099,41.43809],[-74.430091,41.438105],[-74.429799,41.438393],[-74.42942499999999,41.438727],[-74.429131,41.438998],[-74.428572,41.439474],[-74.42738300000001,41.440416],[-74.427266,41.440491],[-74.42615000000001,41.441171],[-74.425601,41.440652],[-74.42548600000001,41.440547],[-74.424271,41.439608],[-74.423937,41.439363],[-74.4246,41.438985],[-74.42514199999999,41.438655],[-74.42532799999999,41.438529],[-74.42581300000001,41.438173],[-74.424931,41.437595],[-74.424601,41.437391],[-74.42374599999999,41.436841],[-74.42212499999999,41.435803],[-74.42217100000001,41.435292],[-74.422252,41.434322],[-74.42226100000001,41.434221],[-74.42230000000001,41.433704],[-74.42231099999999,41.433451],[-74.422324,41.433286],[-74.422409,41.432518],[-74.422809,41.432494],[-74.42303200000001,41.43249],[-74.424004,41.432522],[-74.42438300000001,41.432519],[-74.424899,41.432469],[-74.425146,41.432437],[-74.42564299999999,41.432351],[-74.42588000000001,41.432293],[-74.426221,41.432192],[-74.42664600000001,41.43203],[-74.426708,41.432006],[-74.42702199999999,41.431858],[-74.427251,41.431733],[-74.42751,41.431576],[-74.42784899999999,41.43134],[-74.428349,41.430943],[-74.428608,41.430748],[-74.42892000000001,41.430544],[-74.42920700000001,41.430371],[-74.42950999999999,41.430221],[-74.429851,41.430075],[-74.43030299999999,41.429917],[-74.43073200000001,41.429789],[-74.430902,41.429748],[-74.430967,41.428939],[-74.430955,41.428807],[-74.430905,41.428676],[-74.430837,41.428577],[-74.430797,41.428519],[-74.43047300000001,41.428159],[-74.43044,41.428123],[-74.430229,41.427901],[-74.42986500000001,41.427545],[-74.42981899999999,41.427501],[-74.429772,41.427462],[-74.429513,41.427247],[-74.429428,41.427182],[-74.428957,41.426881],[-74.42881800000001,41.426769],[-74.428737,41.426673],[-74.428658,41.426504],[-74.42863699999999,41.426221],[-74.428641,41.42606],[-74.428579,41.425831],[-74.42854199999999,41.425743],[-74.42857600000001,41.425683],[-74.42867099999999,41.425421],[-74.428736,41.425428],[-74.428895,41.425425],[-74.42912,41.425398],[-74.430155,41.425149],[-74.430514,41.425078],[-74.43088,41.425019],[-74.431274,41.424977],[-74.43166600000001,41.424961],[-74.431923,41.42497],[-74.432221,41.425002],[-74.432457,41.425033],[-74.432757,41.425087],[-74.433233,41.425183],[-74.433308,41.425183],[-74.43339,41.425156],[-74.433578,41.42507],[-74.43377,41.425246],[-74.43390100000001,41.425342],[-74.434073,41.42544],[-74.434957,41.425882],[-74.435131,41.42597],[-74.43529100000001,41.426051],[-74.4354,41.426106],[-74.435474,41.426149],[-74.435621,41.426235],[-74.435883,41.426403],[-74.436134,41.426565],[-74.43658000000001,41.42689],[-74.436626,41.426926],[-74.43702999999999,41.427245],[-74.437437,41.427567],[-74.437898,41.427958],[-74.438081,41.428146],[-74.438321,41.428412],[-74.438416,41.42854],[-74.438574,41.428753],[-74.438739,41.429003]]],"type":"Polygon"}
}