{
  "id": "360050358003",
  "type": "Feature",
  "properties": {
    "area_land":83512,
    "area_water":0,
    "geoid":"360050358003",
    "name":"Block Group 3",
    "state":"ny"
},
  "bbox": [
    -73.845114,
    40.872354,
    -73.839438,
    40.878751
],
  "geometry": {"coordinates":[[[-73.844234,40.874995],[-73.843413,40.875256],[-73.84257599999999,40.875538],[-73.842052,40.875709],[-73.841742,40.875811],[-73.8409,40.8761],[-73.840945,40.876196],[-73.841432,40.87715],[-73.84178,40.877721],[-73.842395,40.878751],[-73.84114099999999,40.878216],[-73.840988,40.878147],[-73.84019600000001,40.877787],[-73.84018,40.87778],[-73.839591,40.877515],[-73.839438,40.877446],[-73.840103,40.876733],[-73.84027,40.876625],[-73.84084,40.875988],[-73.841297,40.87544],[-73.842524,40.874039],[-73.84298099999999,40.873507],[-73.84332499999999,40.873103],[-73.843963,40.872354],[-73.844078,40.872657],[-73.84423,40.87307],[-73.845114,40.874715],[-73.844234,40.874995]]],"type":"Polygon"}
}