{
  "id": "360050004003",
  "type": "Feature",
  "properties": {
    "area_land":294876,
    "area_water":0,
    "geoid":"360050004003",
    "name":"Block Group 3",
    "state":"ny"
},
  "bbox": [
    -73.85653,
    40.804421,
    -73.847642,
    40.81005
],
  "geometry": {"coordinates":[[[-73.856478,40.805409],[-73.856487,40.80547],[-73.856498,40.805682],[-73.855861,40.805671],[-73.854417,40.80578],[-73.85460399999999,40.806527],[-73.85480699999999,40.807259],[-73.854984,40.807716],[-73.855159,40.808318],[-73.855295,40.808899],[-73.855312,40.809329],[-73.85477,40.809406],[-73.854225,40.809483],[-73.85322499999999,40.809618],[-73.852188,40.80976],[-73.851159,40.809897],[-73.850193,40.81005],[-73.85001800000001,40.810007],[-73.850258,40.809609],[-73.85028699999999,40.808475],[-73.849313,40.808047],[-73.849234,40.807798],[-73.84871200000001,40.807502],[-73.848485,40.807128],[-73.848451,40.806833],[-73.84854199999999,40.806549],[-73.84857599999999,40.806367],[-73.84844,40.806129],[-73.84802000000001,40.805993],[-73.847689,40.806065],[-73.84764199999999,40.80575],[-73.84764199999999,40.80513],[-73.848432,40.80499],[-73.84932499999999,40.805168],[-73.849767,40.805304],[-73.849954,40.805287],[-73.850022,40.805185],[-73.850022,40.804998],[-73.85017499999999,40.804489],[-73.850583,40.804421],[-73.85133,40.804608],[-73.851704,40.804726],[-73.85286000000001,40.804625],[-73.854311,40.804434],[-73.854406,40.804591],[-73.855256,40.804608],[-73.85542599999999,40.804506],[-73.85653000000001,40.804794],[-73.856478,40.805409]]],"type":"Polygon"}
}