{
  "id": "360050442001",
  "type": "Feature",
  "properties": {
    "area_land":19189,
    "area_water":0,
    "geoid":"360050442001",
    "name":"Block Group 1",
    "state":"ny"
},
  "bbox": [
    -73.84939,
    40.905223,
    -73.847071,
    40.906743
],
  "geometry": {"coordinates":[[[-73.84896500000001,40.906429],[-73.84868299999999,40.906743],[-73.847071,40.906173],[-73.847206,40.905879],[-73.847511,40.905223],[-73.84939,40.905735],[-73.84896500000001,40.906429]]],"type":"Polygon"}
}