{
  "id": "360010148012",
  "type": "Feature",
  "properties": {
    "area_land":69163864,
    "area_water":303521,
    "geoid":"360010148012",
    "name":"Block Group 2",
    "state":"ny"
},
  "bbox": [
    -74.241572,
    42.53784,
    -74.097417,
    42.632388
],
  "geometry": {"coordinates":[[[-74.24101899999999,42.55182],[-74.240993,42.551868],[-74.24042799999999,42.552911],[-74.240517,42.553105],[-74.236959,42.56012],[-74.237621,42.563124],[-74.237081,42.564629],[-74.23701800000001,42.564811],[-74.236954,42.564971],[-74.23691700000001,42.565063],[-74.23616699999999,42.567795],[-74.234505,42.573854],[-74.23442,42.574162],[-74.23412,42.575256],[-74.23411400000001,42.575276],[-74.23399499999999,42.575688],[-74.22748900000001,42.58028],[-74.226392,42.581054],[-74.22633399999999,42.581094],[-74.225303,42.581801],[-74.224323,42.58248],[-74.224586,42.582238],[-74.220274,42.585412],[-74.220204,42.586283],[-74.220012,42.588021],[-74.219639,42.591386],[-74.21961400000001,42.591406],[-74.21950200000001,42.591545],[-74.21914099999999,42.592066],[-74.219115,42.592107],[-74.21903,42.592241],[-74.218756,42.592646],[-74.218155,42.593644],[-74.21748700000001,42.59428],[-74.215166,42.597435],[-74.210509,42.60099],[-74.209492,42.602295],[-74.209383,42.602435],[-74.209035,42.602881],[-74.206763,42.605796],[-74.20669700000001,42.605993],[-74.205223,42.607431],[-74.204656,42.607985],[-74.202263,42.61032],[-74.20131600000001,42.61124],[-74.2012,42.611354],[-74.198504,42.613981],[-74.19843899999999,42.614044],[-74.197698,42.614768],[-74.197585,42.614882],[-74.193495,42.618999],[-74.193468,42.619183],[-74.192798,42.625076],[-74.19273699999999,42.625608],[-74.192735,42.625628],[-74.19273099999999,42.625658],[-74.19266500000001,42.626233],[-74.19256900000001,42.627069],[-74.192024,42.627849],[-74.189936,42.62814],[-74.187721,42.628434],[-74.187196,42.628503],[-74.185213,42.628793],[-74.184443,42.628879],[-74.18390100000001,42.629005],[-74.17245699999999,42.630638],[-74.170171,42.630947],[-74.1691,42.631113],[-74.16222999999999,42.632098],[-74.160135,42.632388],[-74.160214,42.632333],[-74.16061500000001,42.632059],[-74.160911,42.631878],[-74.160814,42.631658],[-74.160661,42.631247],[-74.160583,42.630999],[-74.160511,42.630704],[-74.16045699999999,42.63039],[-74.16038,42.629643],[-74.16031599999999,42.628891],[-74.16014,42.62713],[-74.160023,42.626354],[-74.159971,42.626161],[-74.159819,42.625741],[-74.15971399999999,42.625554],[-74.15956,42.625279],[-74.15938,42.625001],[-74.159172,42.624758],[-74.158896,42.624448],[-74.15868,42.624243],[-74.158421,42.624024],[-74.15816,42.623825],[-74.158079,42.623749],[-74.157926,42.623574],[-74.156161,42.621045],[-74.156104,42.620939],[-74.156019,42.620749],[-74.155963,42.620557],[-74.155719,42.619292],[-74.15561099999999,42.618495],[-74.15557099999999,42.618276],[-74.155384,42.617701],[-74.155255,42.617354],[-74.155125,42.617077],[-74.154634,42.616189],[-74.154068,42.615246],[-74.15320699999999,42.613776],[-74.15305499999999,42.613566],[-74.152869,42.613354],[-74.152461,42.612845],[-74.152141,42.612489],[-74.15203700000001,42.612394],[-74.15159800000001,42.612061],[-74.151509,42.611962],[-74.151419,42.611846],[-74.15136200000001,42.611722],[-74.151295,42.611441],[-74.15130600000001,42.610994],[-74.15135100000001,42.610474],[-74.15136200000001,42.609184],[-74.15130600000001,42.60858],[-74.151126,42.607555],[-74.151059,42.607108],[-74.150655,42.604827],[-74.150643,42.604571],[-74.150666,42.604356],[-74.150722,42.604174],[-74.150812,42.603951],[-74.151273,42.603041],[-74.151374,42.602802],[-74.15148600000001,42.602388],[-74.15157600000001,42.601892],[-74.15162100000001,42.601553],[-74.15165500000001,42.601051],[-74.151594,42.600899],[-74.151517,42.600792],[-74.151433,42.60073],[-74.151318,42.600668],[-74.149664,42.600206],[-74.148071,42.599805],[-74.14751200000001,42.599681],[-74.146924,42.59958],[-74.14565899999999,42.599335],[-74.140929,42.598411],[-74.139083,42.598],[-74.138835,42.597927],[-74.138628,42.597847],[-74.138216,42.597643],[-74.137158,42.596997],[-74.13652500000001,42.596637],[-74.136391,42.596556],[-74.135876,42.596233],[-74.135582,42.59601],[-74.13536499999999,42.595774],[-74.135087,42.595362],[-74.13471699999999,42.594656],[-74.133993,42.593412],[-74.133932,42.593235],[-74.13375000000001,42.592564],[-74.133398,42.590784],[-74.133309,42.590539],[-74.133199,42.590361],[-74.13309,42.59024],[-74.132852,42.590035],[-74.131056,42.588954],[-74.1296,42.588018],[-74.128905,42.587581],[-74.127714,42.586905],[-74.12729899999999,42.586692],[-74.126003,42.586073],[-74.125927,42.586038],[-74.124416,42.585345],[-74.122226,42.584327],[-74.121746,42.584096],[-74.12130000000001,42.583857],[-74.121075,42.583711],[-74.12082700000001,42.583531],[-74.120509,42.583256],[-74.119963,42.58274],[-74.11935099999999,42.582105],[-74.118713,42.581363],[-74.118589,42.581204],[-74.118399,42.580938],[-74.118346,42.580829],[-74.118255,42.580548],[-74.118235,42.580429],[-74.118242,42.579864],[-74.118291,42.578728],[-74.118331,42.578364],[-74.11838899999999,42.578009],[-74.11855,42.577435],[-74.11854700000001,42.577345],[-74.118503,42.577245],[-74.11846199999999,42.577203],[-74.118419,42.577176],[-74.118285,42.577132],[-74.118045,42.577092],[-74.117735,42.577067],[-74.11746599999999,42.57707],[-74.117025,42.577088],[-74.11676900000001,42.577116],[-74.116418,42.577171],[-74.116191,42.577193],[-74.11598499999999,42.577201],[-74.115848,42.577194],[-74.115675,42.577184],[-74.115455,42.577151],[-74.11529400000001,42.577112],[-74.114892,42.576965],[-74.114672,42.57686],[-74.114268,42.576632],[-74.11412300000001,42.576534],[-74.113944,42.576388],[-74.11387499999999,42.576272],[-74.113815,42.576047],[-74.11372799999999,42.575412],[-74.113714,42.575347],[-74.113626,42.57494],[-74.11359899999999,42.574662],[-74.113635,42.573729],[-74.113615,42.573372],[-74.11354799999999,42.572762],[-74.113529,42.572454],[-74.113545,42.572126],[-74.11375,42.570914],[-74.11379599999999,42.570549],[-74.113801,42.570427],[-74.11379599999999,42.570295],[-74.113739,42.569889],[-74.113668,42.569573],[-74.113586,42.569304],[-74.11350400000001,42.569093],[-74.113394,42.568886],[-74.113287,42.568723],[-74.113162,42.56856],[-74.113027,42.568415],[-74.11285700000001,42.568258],[-74.112645,42.568086],[-74.112504,42.567982],[-74.11171899999999,42.567475],[-74.111384,42.56722],[-74.11082,42.566716],[-74.110409,42.566311],[-74.109922,42.565794],[-74.10974899999999,42.565578],[-74.10964,42.565423],[-74.109313,42.564901],[-74.109247,42.564803],[-74.10906,42.564568],[-74.108609,42.564116],[-74.108093,42.563641],[-74.107868,42.563461],[-74.107434,42.563164],[-74.10686099999999,42.562825],[-74.105859,42.562276],[-74.10525199999999,42.561934],[-74.105046,42.561827],[-74.10477,42.561668],[-74.104562,42.56154],[-74.104366,42.561408],[-74.10414900000001,42.561249],[-74.103932,42.561078],[-74.10359800000001,42.560781],[-74.103129,42.560299],[-74.101906,42.558987],[-74.10177,42.558856],[-74.10150400000001,42.55864],[-74.101383,42.558556],[-74.100798,42.558246],[-74.100105,42.557878],[-74.100014,42.55783],[-74.099073,42.557397],[-74.098443,42.557133],[-74.09813800000001,42.557018],[-74.09800799999999,42.55697],[-74.09741699999999,42.556753],[-74.09765299999999,42.556398],[-74.09864,42.554989],[-74.09899299999999,42.554517],[-74.099208,42.554207],[-74.09932000000001,42.553966],[-74.09939199999999,42.553758],[-74.099418,42.553583],[-74.10196000000001,42.553286],[-74.104454,42.553019],[-74.105321,42.552896],[-74.106509,42.552744],[-74.10661399999999,42.552713],[-74.109405,42.552417],[-74.11678499999999,42.551517],[-74.11924999999999,42.551216],[-74.123242,42.550728],[-74.12415799999999,42.550612],[-74.124577,42.55057],[-74.125683,42.550439],[-74.139055,42.548889],[-74.14788900000001,42.547878],[-74.151848,42.547404],[-74.15407500000001,42.547142],[-74.15642,42.546839],[-74.15651800000001,42.546813],[-74.160938,42.546288],[-74.166083,42.545643],[-74.166342,42.54561],[-74.179496,42.543984],[-74.191551,42.54273],[-74.20644799999999,42.540841],[-74.206552,42.540827],[-74.210778,42.540407],[-74.22238900000001,42.539071],[-74.224602,42.538822],[-74.23146,42.538076],[-74.234419,42.53784],[-74.238151,42.543857],[-74.237977,42.544593],[-74.24157200000001,42.550802],[-74.24101899999999,42.55182]]],"type":"Polygon"}
}