{
  "id": "360050161003",
  "type": "Feature",
  "properties": {
    "area_land":16113,
    "area_water":0,
    "geoid":"360050161003",
    "name":"Block Group 3",
    "state":"ny"
},
  "bbox": [
    -73.886963,
    40.834806,
    -73.885107,
    40.836769
],
  "geometry": {"coordinates":[[[-73.88696299999999,40.835096],[-73.885964,40.836769],[-73.885107,40.836475],[-73.886111,40.834806],[-73.88696299999999,40.835096]]],"type":"Polygon"}
}