{
  "id": "360594167011",
  "type": "Feature",
  "properties": {
    "area_land":176984,
    "area_water":61819,
    "geoid":"360594167011",
    "name":"Block Group 1",
    "state":"ny"
},
  "bbox": [
    -73.656733,
    40.591635,
    -73.646574,
    40.595703
],
  "geometry": {"coordinates":[[[-73.656733,40.595364],[-73.65506000000001,40.595428],[-73.652547,40.595526],[-73.651392,40.59556],[-73.649449,40.595593],[-73.648827,40.595616],[-73.646574,40.595703],[-73.646897,40.59499],[-73.64681400000001,40.594447],[-73.646806,40.593819],[-73.64679700000001,40.593105],[-73.646788,40.592387],[-73.646778,40.591679],[-73.649648,40.591657],[-73.65251000000001,40.591635],[-73.652518,40.592346],[-73.65252599999999,40.59306],[-73.652534,40.593773],[-73.652539,40.594231],[-73.652861,40.59486],[-73.65309000000001,40.594855],[-73.655008,40.594793],[-73.655456,40.594779],[-73.656723,40.594739],[-73.656723,40.594767],[-73.65673,40.59496],[-73.656733,40.595364]]],"type":"Polygon"}
}