{
  "id": "360810275002",
  "type": "Feature",
  "properties": {
    "area_land":52687,
    "area_water":0,
    "geoid":"360810275002",
    "name":"Block Group 2",
    "state":"ny"
},
  "bbox": [
    -73.876668,
    40.750725,
    -73.874085,
    40.754806
],
  "geometry": {"coordinates":[[[-73.876668,40.75461],[-73.875739,40.754709],[-73.874809,40.754806],[-73.874455,40.752859],[-73.87408499999999,40.750823],[-73.875015,40.750725],[-73.87538600000001,40.752763],[-73.87631500000001,40.752666],[-73.876668,40.75461]]],"type":"Polygon"}
}