{
  "id": "360050119004",
  "type": "Feature",
  "properties": {
    "area_land":17987,
    "area_water":0,
    "geoid":"360050119004",
    "name":"Block Group 4",
    "state":"ny"
},
  "bbox": [
    -73.89042,
    40.820949,
    -73.889301,
    40.823191
],
  "geometry": {"coordinates":[[[-73.89042000000001,40.823144],[-73.889484,40.823191],[-73.889301,40.821432],[-73.889646,40.821205],[-73.890235,40.820949],[-73.89042000000001,40.823144]]],"type":"Polygon"}
}