{
  "id": "361190109022",
  "type": "Feature",
  "properties": {
    "area_land":791360,
    "area_water":7173,
    "geoid":"361190109022",
    "name":"Block Group 2",
    "state":"ny"
},
  "bbox": [
    -73.789417,
    41.051501,
    -73.771622,
    41.059521
],
  "geometry": {"coordinates":[[[-73.789365,41.051852],[-73.789225,41.052404],[-73.78913799999999,41.052678],[-73.78889599999999,41.053445],[-73.78882900000001,41.053689],[-73.78877,41.053913],[-73.788749,41.054073],[-73.788708,41.054399],[-73.788707,41.054468],[-73.788702,41.054735],[-73.788698,41.054949],[-73.78867200000001,41.055334],[-73.788569,41.055883],[-73.788523,41.056044],[-73.788426,41.056234],[-73.78827699999999,41.056459],[-73.78809699999999,41.056662],[-73.78738300000001,41.057416],[-73.78722399999999,41.057559],[-73.787065,41.057652],[-73.78649,41.05787],[-73.78628999999999,41.057962],[-73.786079,41.058075],[-73.785504,41.058447],[-73.78394400000001,41.059349],[-73.783659,41.059521],[-73.782449,41.05896],[-73.78214,41.058844],[-73.781942,41.058618],[-73.781876,41.058329],[-73.78182200000001,41.05785],[-73.782282,41.057751],[-73.782262,41.05766],[-73.781834,41.057714],[-73.78136600000001,41.057773],[-73.780463,41.057888],[-73.779584,41.057989],[-73.77916,41.058072],[-73.77868599999999,41.058134],[-73.777805,41.058252],[-73.77750899999999,41.058292],[-73.776746,41.058364],[-73.776704,41.05836],[-73.776588,41.058349],[-73.776414,41.058317],[-73.776231,41.058247],[-73.77604700000001,41.058158],[-73.775791,41.057985],[-73.77572000000001,41.05797],[-73.775606,41.057965],[-73.775479,41.057986],[-73.77522,41.058029],[-73.77488099999999,41.058111],[-73.77460499999999,41.058178],[-73.773825,41.058392],[-73.773751,41.058412],[-73.773083,41.058634],[-73.772747,41.058703],[-73.772609,41.058713],[-73.772446,41.058703],[-73.772351,41.058686],[-73.772141,41.058644],[-73.77203799999999,41.058637],[-73.771935,41.058666],[-73.77162199999999,41.057204],[-73.771665,41.05687],[-73.77175,41.056716],[-73.77198,41.056539],[-73.772165,41.056395],[-73.772254,41.056305],[-73.772299,41.056195],[-73.77237599999999,41.056],[-73.772389,41.055877],[-73.772434,41.055471],[-73.77246599999999,41.055144],[-73.772498,41.054841],[-73.772464,41.054522],[-73.77243900000001,41.054298],[-73.772437,41.054276],[-73.77234199999999,41.054075],[-73.772251,41.054283],[-73.77190299999999,41.05325],[-73.772026,41.053258],[-73.77221400000001,41.053297],[-73.772457,41.053367],[-73.77273,41.053479],[-73.773285,41.053701],[-73.773582,41.05384],[-73.773974,41.054063],[-73.774385,41.054315],[-73.77458,41.054465],[-73.77462,41.054492],[-73.774665,41.054524],[-73.77492700000001,41.054684],[-73.775119,41.054813],[-73.77529800000001,41.054892],[-73.77570799999999,41.055085],[-73.776054,41.055276],[-73.776201,41.055112],[-73.776448,41.054914],[-73.776577,41.054859],[-73.776696,41.054821],[-73.776855,41.05477],[-73.777041,41.054746],[-73.777531,41.054698],[-73.77791999999999,41.054654],[-73.778589,41.054545],[-73.778773,41.054508],[-73.778891,41.054037],[-73.778915,41.053763],[-73.778959,41.053552],[-73.779118,41.052995],[-73.780022,41.052889],[-73.78050500000001,41.052797],[-73.78089799999999,41.05267],[-73.781144,41.052586],[-73.781463,41.052442],[-73.781898,41.052186],[-73.78201799999999,41.052093],[-73.78229,41.051846],[-73.782394,41.051727],[-73.78246799999999,41.051624],[-73.78266499999999,41.051846],[-73.782759,41.052024],[-73.782858,41.052299],[-73.782918,41.052334],[-73.783007,41.052339],[-73.783359,41.052304],[-73.78566600000001,41.052018],[-73.786372,41.051929],[-73.78701599999999,41.051848],[-73.788093,41.051721],[-73.78846,41.051678],[-73.788703,41.051662],[-73.78885200000001,41.051634],[-73.789097,41.051611],[-73.789312,41.051544],[-73.789417,41.051501],[-73.789365,41.051852]]],"type":"Polygon"}
}