{
  "id": "360290151013",
  "type": "Feature",
  "properties": {
    "area_land":34252897,
    "area_water":75889,
    "geoid":"360290151013",
    "name":"Block Group 3",
    "state":"ny"
},
  "bbox": [
    -78.62513,
    42.605694,
    -78.579481,
    42.693865
],
  "geometry": {"coordinates":[[[-78.625004,42.609381],[-78.62499200000001,42.609751],[-78.62495800000001,42.610748],[-78.624527,42.621225],[-78.62450200000001,42.621856],[-78.624398,42.623233],[-78.624353,42.623819],[-78.624264,42.62499],[-78.62411299999999,42.626992],[-78.62406900000001,42.627993],[-78.62405699999999,42.628276],[-78.62376399999999,42.634946],[-78.623645,42.637676],[-78.623544,42.639983],[-78.623453,42.64289],[-78.623272,42.648666],[-78.623211,42.650643],[-78.623206,42.65071],[-78.623136,42.654631],[-78.62311099999999,42.656246],[-78.623082,42.658144],[-78.623065,42.659057],[-78.62300999999999,42.662037],[-78.622849,42.669318],[-78.622719,42.673354],[-78.62266,42.676435],[-78.622557,42.681737],[-78.622502,42.684215],[-78.622466,42.686491],[-78.622463,42.686688],[-78.622426,42.689854],[-78.62238499999999,42.693683],[-78.62238600000001,42.693833],[-78.6224,42.693865],[-78.61409,42.693716],[-78.606358,42.693578],[-78.596799,42.693349],[-78.595517,42.693324],[-78.57954599999999,42.69296],[-78.579481,42.691815],[-78.57954599999999,42.687541],[-78.579662,42.684332],[-78.579902,42.673274],[-78.579949,42.671073],[-78.580122,42.664036],[-78.580196,42.659534],[-78.580257,42.655478],[-78.580394,42.649727],[-78.580398,42.649436],[-78.580409,42.648673],[-78.58049800000001,42.642371],[-78.580544,42.639171],[-78.580591,42.63589],[-78.580675,42.629964],[-78.580707,42.627696],[-78.580708,42.627632],[-78.580744,42.624348],[-78.58080699999999,42.621233],[-78.580834,42.618932],[-78.58089200000001,42.617128],[-78.58089200000001,42.616991],[-78.58089099999999,42.616088],[-78.580917,42.615592],[-78.580957,42.613398],[-78.58098200000001,42.61083],[-78.58099199999999,42.610016],[-78.581022,42.607513],[-78.581031,42.60705],[-78.581048,42.605694],[-78.584959,42.605748],[-78.607293,42.60601],[-78.607573,42.606219],[-78.609381,42.60626],[-78.61227700000001,42.606323],[-78.613855,42.606357],[-78.616511,42.606428],[-78.61838400000001,42.606477],[-78.619817,42.606524],[-78.623317,42.606639],[-78.62384299999999,42.606656],[-78.6241,42.606661],[-78.624472,42.606669],[-78.62513,42.606686],[-78.625004,42.609381]]],"type":"Polygon"}
}