{
  "id": "360470600004",
  "type": "Feature",
  "properties": {
    "area_land":68139,
    "area_water":0,
    "geoid":"360470600004",
    "name":"Block Group 4",
    "state":"ny"
},
  "bbox": [
    -73.951889,
    40.584856,
    -73.947636,
    40.588628
],
  "geometry": {"coordinates":[[[-73.95188899999999,40.585936],[-73.95107,40.586025],[-73.950103,40.58613],[-73.948921,40.586261],[-73.949254,40.588028],[-73.94934499999999,40.588514],[-73.948313,40.588628],[-73.948246,40.58828],[-73.94788800000001,40.586375],[-73.947722,40.585496],[-73.947636,40.584999],[-73.948662,40.584894],[-73.94987,40.584856],[-73.951238,40.584925],[-73.95188899999999,40.585936]]],"type":"Polygon"}
}