{
  "id": "360010127001",
  "type": "Feature",
  "properties": {
    "area_land":562805,
    "area_water":355404,
    "geoid":"360010127001",
    "name":"Block Group 1",
    "state":"ny"
},
  "bbox": [
    -73.695146,
    42.769536,
    -73.676762,
    42.783576
],
  "geometry": {"coordinates":[[[-73.69514599999999,42.772038],[-73.6951,42.772323],[-73.694828,42.772977],[-73.69461200000001,42.773728],[-73.694732,42.773854],[-73.694453,42.77413],[-73.694338,42.775066],[-73.694481,42.775612],[-73.69376200000001,42.776977],[-73.69352499999999,42.776858],[-73.691362,42.775777],[-73.690262,42.775477],[-73.690065,42.775459],[-73.689162,42.775377],[-73.688362,42.775477],[-73.68776200000001,42.776377],[-73.687262,42.777077],[-73.685928,42.777743],[-73.684862,42.778277],[-73.68395200000001,42.778736],[-73.683457,42.779112],[-73.682704,42.779931],[-73.68186900000001,42.780962],[-73.681403,42.7819],[-73.681162,42.782977],[-73.680262,42.783377],[-73.68020199999999,42.783437],[-73.680188,42.783447],[-73.680064,42.783576],[-73.678262,42.783477],[-73.676762,42.783277],[-73.677508,42.781345],[-73.678462,42.778877],[-73.68131099999999,42.772759],[-73.68180700000001,42.771695],[-73.682856,42.771934],[-73.68340000000001,42.772068],[-73.68343,42.772076],[-73.683604,42.772112],[-73.68396799999999,42.772186],[-73.684286,42.772248],[-73.6844,42.772274],[-73.684589,42.77231],[-73.68652400000001,42.772683],[-73.68799199999999,42.772959],[-73.688447,42.773046],[-73.68848300000001,42.773053],[-73.689204,42.773191],[-73.68987,42.773309],[-73.69023799999999,42.773358],[-73.690764,42.77342],[-73.690876,42.77245],[-73.69085200000001,42.772249],[-73.690755,42.772088],[-73.69052499999999,42.771925],[-73.690352,42.771867],[-73.690208,42.771834],[-73.68978199999999,42.77176],[-73.690028,42.771046],[-73.690287,42.77032],[-73.69056399999999,42.769536],[-73.691847,42.769759],[-73.692083,42.769802],[-73.69229,42.769841],[-73.692561,42.769892],[-73.693245,42.769855],[-73.695038,42.769672],[-73.69472,42.770406],[-73.69511199999999,42.771173],[-73.69514599999999,42.772038]]],"type":"Polygon"}
}