{
  "id": "360610054003",
  "type": "Feature",
  "properties": {
    "area_land":27027,
    "area_water":0,
    "geoid":"360610054003",
    "name":"Block Group 3",
    "state":"ny"
},
  "bbox": [
    -73.99684,
    40.736005,
    -73.99312,
    40.738044
],
  "geometry": {"coordinates":[[[-73.996337,40.738044],[-73.99312,40.736691],[-73.993617,40.736005],[-73.99684000000001,40.737361],[-73.996337,40.738044]]],"type":"Polygon"}
}