{
  "id": "360470410002",
  "type": "Feature",
  "properties": {
    "area_land":62613,
    "area_water":0,
    "geoid":"360470410002",
    "name":"Block Group 2",
    "state":"ny"
},
  "bbox": [
    -73.977828,
    40.59887,
    -73.975543,
    40.603804
],
  "geometry": {"coordinates":[[[-73.977828,40.603586],[-73.976902,40.603687],[-73.975971,40.603804],[-73.975776,40.602763],[-73.975543,40.601465],[-73.976462,40.601364],[-73.976339,40.60071],[-73.97601,40.598979],[-73.976935,40.59887],[-73.977388,40.601263],[-73.977828,40.603586]]],"type":"Polygon"}
}