{
  "id": "360470290002",
  "type": "Feature",
  "properties": {
    "area_land":38140,
    "area_water":0,
    "geoid":"360470290002",
    "name":"Block Group 2",
    "state":"ny"
},
  "bbox": [
    -73.995429,
    40.602534,
    -73.992036,
    40.604996
],
  "geometry": {"coordinates":[[[-73.99484699999999,40.604437],[-73.994265,40.604996],[-73.992036,40.603651],[-73.992619,40.60309],[-73.993201,40.602534],[-73.995429,40.603877],[-73.99484699999999,40.604437]]],"type":"Polygon"}
}