{
  "id": "360870113031",
  "type": "Feature",
  "properties": {
    "area_land":777437,
    "area_water":0,
    "geoid":"360870113031",
    "name":"Block Group 1",
    "state":"ny"
},
  "bbox": [
    -74.010827,
    41.101758,
    -73.993032,
    41.109042
],
  "geometry": {"coordinates":[[[-74.01082700000001,41.10742],[-74.00985900000001,41.107576],[-74.00923,41.107678],[-74.00828300000001,41.107834],[-74.00790000000001,41.107889],[-74.007762,41.107909],[-74.00751200000001,41.107929],[-74.007363,41.107923],[-74.00714499999999,41.107864],[-74.005893,41.107421],[-74.005714,41.107717],[-74.005675,41.107784],[-74.005528,41.107993],[-74.005472,41.108045],[-74.005365,41.108114],[-74.005244,41.108163],[-74.004711,41.108318],[-74.004007,41.108524],[-74.00376,41.108593],[-74.00349799999999,41.108646],[-74.00298600000001,41.10871],[-74.002394,41.108767],[-74.001874,41.108821],[-74.001052,41.108925],[-74.000737,41.108953],[-74.000197,41.108983],[-73.99991900000001,41.108998],[-73.99942799999999,41.109042],[-73.99851200000001,41.108134],[-73.997569,41.107166],[-73.996877,41.106504],[-73.99663099999999,41.106257],[-73.99657500000001,41.106199],[-73.996416,41.106015],[-73.996291,41.105875],[-73.995761,41.105281],[-73.995611,41.105115],[-73.99532600000001,41.104817],[-73.99495899999999,41.104426],[-73.994557,41.10395],[-73.99399,41.103223],[-73.993876,41.103076],[-73.99382799999999,41.103007],[-73.993578,41.102644],[-73.99336,41.102278],[-73.993162,41.101941],[-73.993104,41.101862],[-73.993032,41.101758],[-73.993256,41.101777],[-73.993315,41.101782],[-73.997449,41.102127],[-73.997522,41.102136],[-73.997967,41.102178],[-73.9984,41.102204],[-73.99939999999999,41.102279],[-73.999842,41.102305],[-74.001392,41.102466],[-74.00159499999999,41.102481],[-74.002405,41.102545],[-74.003156,41.102605],[-74.004969,41.10278],[-74.006778,41.10292],[-74.00778,41.103017],[-74.008588,41.103095],[-74.010023,41.103211],[-74.010283,41.103231],[-74.010266,41.103376],[-74.010227,41.103704],[-74.010193,41.104002],[-74.010132,41.104529],[-74.010098,41.104828],[-74.010087,41.105167],[-74.010085,41.105275],[-74.01009999999999,41.10543],[-74.010155,41.10565],[-74.01025,41.105981],[-74.01082700000001,41.10742]]],"type":"Polygon"}
}