{
  "id": "360810437022",
  "type": "Feature",
  "properties": {
    "area_land":50836,
    "area_water":0,
    "geoid":"360810437022",
    "name":"Block Group 2",
    "state":"ny"
},
  "bbox": [
    -73.857702,
    40.738075,
    -73.853129,
    40.740422
],
  "geometry": {"coordinates":[[[-73.857309,40.739681],[-73.857051,40.73989],[-73.856454,40.740363],[-73.856382,40.740422],[-73.85452600000001,40.739825],[-73.85328,40.739424],[-73.853129,40.739374],[-73.853392,40.738689],[-73.853717,40.738075],[-73.85523000000001,40.738564],[-73.857702,40.73936],[-73.857309,40.739681]]],"type":"Polygon"}
}