{
  "id": "360010146143",
  "type": "Feature",
  "properties": {
    "area_land":615426,
    "area_water":0,
    "geoid":"360010146143",
    "name":"Block Group 3",
    "state":"ny"
},
  "bbox": [
    -73.894867,
    42.686474,
    -73.881136,
    42.697598
],
  "geometry": {"coordinates":[[[-73.894571,42.69216],[-73.89444399999999,42.692195],[-73.894299,42.692236],[-73.89405600000001,42.692294],[-73.89399,42.69231],[-73.89377,42.692374],[-73.893598,42.692432],[-73.89335800000001,42.692506],[-73.892939,42.69271],[-73.892736,42.692824],[-73.892555,42.692914],[-73.892391,42.693007],[-73.892223,42.693117],[-73.89163499999999,42.693499],[-73.89135400000001,42.693734],[-73.891012,42.694074],[-73.890951,42.694148],[-73.89031799999999,42.694926],[-73.890157,42.695129],[-73.889999,42.695319],[-73.889719,42.695646],[-73.889623,42.69576],[-73.88830900000001,42.697312],[-73.88818000000001,42.697488],[-73.88808400000001,42.697598],[-73.88691300000001,42.69731],[-73.885813,42.697031],[-73.884708,42.696724],[-73.884411,42.696649],[-73.88365899999999,42.696427],[-73.883455,42.696363],[-73.88311899999999,42.696249],[-73.88300099999999,42.696193],[-73.881266,42.695422],[-73.881136,42.695354],[-73.88123400000001,42.695224],[-73.88147600000001,42.694937],[-73.881574,42.694833],[-73.881638,42.694759],[-73.881705,42.694682],[-73.881726,42.694576],[-73.88178499999999,42.694525],[-73.881894,42.694449],[-73.88210100000001,42.694326],[-73.88229,42.694221],[-73.882469,42.694133],[-73.882583,42.694164],[-73.882779,42.694243],[-73.88282100000001,42.693977],[-73.882693,42.694034],[-73.884548,42.692087],[-73.884801,42.691822],[-73.884888,42.691818],[-73.884961,42.6918],[-73.88512900000001,42.69169],[-73.885227,42.691647],[-73.88543900000001,42.691592],[-73.885592,42.691578],[-73.885698,42.691552],[-73.885785,42.691519],[-73.885865,42.691468],[-73.8861,42.691272],[-73.886337,42.691137],[-73.886399,42.691075],[-73.886574,42.690958],[-73.886912,42.69059],[-73.88701,42.690437],[-73.887047,42.69035],[-73.887061,42.690226],[-73.887057,42.690174],[-73.88705400000001,42.690135],[-73.887012,42.689914],[-73.887012,42.689803],[-73.88703599999999,42.689697],[-73.88706500000001,42.689633],[-73.887108,42.689577],[-73.887147,42.689522],[-73.887159,42.689481],[-73.887118,42.689422],[-73.88706500000001,42.689387],[-73.886995,42.689381],[-73.88691799999999,42.689387],[-73.886872,42.689375],[-73.886819,42.689276],[-73.88679,42.689241],[-73.88676,42.689241],[-73.886719,42.689276],[-73.886661,42.689299],[-73.88661399999999,42.689293],[-73.88659,42.689258],[-73.886555,42.689127],[-73.88651400000001,42.689024],[-73.886459,42.688943],[-73.886347,42.688842],[-73.886326,42.688815],[-73.886273,42.688743],[-73.886252,42.688714],[-73.88621500000001,42.688645],[-73.886186,42.688499],[-73.88619,42.688426],[-73.886219,42.688353],[-73.88630999999999,42.688244],[-73.88655799999999,42.688102],[-73.88660900000001,42.688062],[-73.88664900000001,42.688015],[-73.88668199999999,42.687945],[-73.88679500000001,42.687595],[-73.886961,42.687409],[-73.887309,42.687178],[-73.887535,42.687043],[-73.887918,42.68684],[-73.88834,42.68666],[-73.888616,42.686564],[-73.888857,42.686507],[-73.88898399999999,42.686485],[-73.88916999999999,42.686474],[-73.889364,42.686474],[-73.889359,42.687408],[-73.889338,42.687406],[-73.88927,42.687426],[-73.88924,42.68747],[-73.889242,42.687526],[-73.88927700000001,42.687583],[-73.889335,42.687607],[-73.889398,42.687607],[-73.88946199999999,42.687591],[-73.88954,42.687698],[-73.889594,42.687817],[-73.88960899999999,42.6879],[-73.88961500000001,42.687977],[-73.889612,42.688069],[-73.88959699999999,42.688173],[-73.889543,42.688423],[-73.889411,42.688792],[-73.889365,42.689008],[-73.889608,42.689042],[-73.889841,42.689089],[-73.890941,42.689481],[-73.89111699999999,42.689533],[-73.891327,42.689569],[-73.891447,42.689573],[-73.891549,42.689562],[-73.89167,42.689537],[-73.89252999999999,42.689261],[-73.892634,42.689401],[-73.892724,42.689491],[-73.892887,42.689612],[-73.89342499999999,42.689966],[-73.893519,42.690048],[-73.89378000000001,42.690331],[-73.894159,42.690906],[-73.89456199999999,42.691539],[-73.894867,42.692082],[-73.894571,42.69216]]],"type":"Polygon"}
}