{
  "id": "360290175021",
  "type": "Feature",
  "properties": {
    "area_land":39162621,
    "area_water":12120,
    "geoid":"360290175021",
    "name":"Block Group 1",
    "state":"ny"
},
  "bbox": [
    -78.943973,
    42.476847,
    -78.844113,
    42.532674
],
  "geometry": {"coordinates":[[[-78.943952,42.516789],[-78.94393100000001,42.520185],[-78.943941,42.521544],[-78.943949,42.523765],[-78.943927,42.531239],[-78.933528,42.53123],[-78.93079899999999,42.531234],[-78.930815,42.532467],[-78.930814,42.532611],[-78.92355499999999,42.532623],[-78.915988,42.532632],[-78.91222,42.532648],[-78.908123,42.532663],[-78.90518299999999,42.532674],[-78.90483500000001,42.53267],[-78.90142,42.532588],[-78.893477,42.532395],[-78.893086,42.532557],[-78.892309,42.532597],[-78.891299,42.532588],[-78.88669899999999,42.532504],[-78.885065,42.532485],[-78.878404,42.532407],[-78.874617,42.532347],[-78.87274499999999,42.532339],[-78.861689,42.53241],[-78.856099,42.532224],[-78.855934,42.532229],[-78.853926,42.532241],[-78.85138600000001,42.53226],[-78.849311,42.532275],[-78.844696,42.532314],[-78.844239,42.532319],[-78.844234,42.53021],[-78.84419699999999,42.529424],[-78.844151,42.528114],[-78.844132,42.527101],[-78.844123,42.526657],[-78.84411299999999,42.524893],[-78.844123,42.523291],[-78.84415,42.521688],[-78.84417999999999,42.520536],[-78.844213,42.512641],[-78.844221,42.510738],[-78.84425400000001,42.502552],[-78.844264,42.500153],[-78.84425400000001,42.499997],[-78.844266,42.499762],[-78.844292,42.499607],[-78.84433300000001,42.499454],[-78.844388,42.499303],[-78.84445599999999,42.499155],[-78.844539,42.499011],[-78.844634,42.498871],[-78.844742,42.498737],[-78.844863,42.498608],[-78.844995,42.498486],[-78.845281,42.498256],[-78.84644299999999,42.497218],[-78.85010200000001,42.494077],[-78.850577,42.493671],[-78.850605,42.493648],[-78.850792,42.493682],[-78.851755,42.493799],[-78.855687,42.494168],[-78.856317,42.494227],[-78.85673199999999,42.494237],[-78.856769,42.494245],[-78.857528,42.494262],[-78.85976599999999,42.494315],[-78.860331,42.494328],[-78.860516,42.494332],[-78.861412,42.494366],[-78.861779,42.494374],[-78.86200700000001,42.494379],[-78.86490000000001,42.494445],[-78.864923,42.494459],[-78.872427,42.49463],[-78.873947,42.494639],[-78.87522800000001,42.494663],[-78.876366,42.494675],[-78.87636000000001,42.494041],[-78.876318,42.489808],[-78.876068,42.488315],[-78.876008,42.487959],[-78.87597,42.487256],[-78.876008,42.486845],[-78.876121,42.486525],[-78.876148,42.486448],[-78.87630799999999,42.48604],[-78.876667,42.485429],[-78.876887,42.48513],[-78.876971,42.484941],[-78.877047,42.484751],[-78.877116,42.48456],[-78.877177,42.484367],[-78.87723,42.484173],[-78.87727599999999,42.483977],[-78.87734500000001,42.483651],[-78.877381,42.483486],[-78.877489,42.48082],[-78.877522,42.479938],[-78.877595,42.477965],[-78.879717,42.477922],[-78.88067100000001,42.477914],[-78.88165499999999,42.477905],[-78.884862,42.477875],[-78.887736,42.477848],[-78.888008,42.477846],[-78.888279,42.477843],[-78.892726,42.477801],[-78.904296,42.477692],[-78.907882,42.477171],[-78.90888099999999,42.476892],[-78.909042,42.476847],[-78.91422,42.477608],[-78.91416099999999,42.477621],[-78.91802,42.480693],[-78.918452,42.481145],[-78.918781,42.481528],[-78.919427,42.482281],[-78.919034,42.482436],[-78.918905,42.482461],[-78.91838199999999,42.482562],[-78.91694200000001,42.482841],[-78.915741,42.483126],[-78.915267,42.483419],[-78.914175,42.484616],[-78.91408800000001,42.485051],[-78.91408699999999,42.486408],[-78.914085,42.488288],[-78.914078,42.493562],[-78.914063,42.494907],[-78.914046,42.496529],[-78.917631,42.496555],[-78.92006499999999,42.496573],[-78.92079,42.496578],[-78.921036,42.496579],[-78.92139899999999,42.496583],[-78.921547,42.496584],[-78.92186599999999,42.496588],[-78.922803,42.496601],[-78.923322,42.496608],[-78.92395399999999,42.496617],[-78.925657,42.496641],[-78.92870499999999,42.496684],[-78.928701,42.497228],[-78.92869399999999,42.497996],[-78.928702,42.498057],[-78.92880100000001,42.4988],[-78.928842,42.498974],[-78.92916200000001,42.50034],[-78.929175,42.500395],[-78.929604,42.500387],[-78.93122200000001,42.500371],[-78.93218400000001,42.500371],[-78.933438,42.500322],[-78.933904,42.500256],[-78.935998,42.500219],[-78.93961299999999,42.500154],[-78.940979,42.50013],[-78.941367,42.500123],[-78.942786,42.500098],[-78.942944,42.500095],[-78.94388600000001,42.500079],[-78.943973,42.500077],[-78.943952,42.516789]]],"type":"Polygon"}
}