{
  "id": "360470890006",
  "type": "Feature",
  "properties": {
    "area_land":58508,
    "area_water":0,
    "geoid":"360470890006",
    "name":"Block Group 6",
    "state":"ny"
},
  "bbox": [
    -73.914659,
    40.654135,
    -73.909726,
    40.656783
],
  "geometry": {"coordinates":[[[-73.91378,40.656783],[-73.913144,40.656221],[-73.912339,40.655531],[-73.911996,40.655561],[-73.911083,40.655702],[-73.910123,40.655852],[-73.909767,40.654472],[-73.90972600000001,40.654313],[-73.91060400000001,40.654187],[-73.910679,40.65418],[-73.912329,40.654135],[-73.912533,40.654314],[-73.912741,40.654497],[-73.914659,40.656214],[-73.91378,40.656783]]],"type":"Polygon"}
}