{
  "id": "360593039004",
  "type": "Feature",
  "properties": {
    "area_land":627167,
    "area_water":0,
    "geoid":"360593039004",
    "name":"Block Group 4",
    "state":"ny"
},
  "bbox": [
    -73.587914,
    40.763421,
    -73.56662,
    40.771551
],
  "geometry": {"coordinates":[[[-73.587914,40.767276],[-73.587059,40.767459],[-73.58620000000001,40.767644],[-73.58550700000001,40.767785],[-73.58483099999999,40.767931],[-73.584329,40.768056],[-73.583549,40.768308],[-73.583191,40.768419],[-73.58171900000001,40.769065],[-73.580709,40.769516],[-73.579404,40.770124],[-73.57805399999999,40.770738],[-73.577068,40.771233],[-73.57662999999999,40.77146],[-73.57649499999999,40.77153],[-73.576497,40.771397],[-73.576538,40.771243],[-73.576672,40.770961],[-73.57685600000001,40.770586],[-73.576919,40.770377],[-73.57692400000001,40.770295],[-73.576531,40.770242],[-73.57637,40.770183],[-73.57625,40.770097],[-73.576117,40.769847],[-73.57611799999999,40.769738],[-73.576185,40.769343],[-73.57615699999999,40.769266],[-73.57607400000001,40.769183],[-73.575987,40.769119],[-73.57576,40.769248],[-73.57486299999999,40.769703],[-73.572746,40.770771],[-73.572002,40.771147],[-73.571202,40.771551],[-73.57036600000001,40.770479],[-73.570188,40.770591],[-73.569647,40.771019],[-73.569444,40.771179],[-73.569328,40.771244],[-73.568849,40.771347],[-73.568281,40.771214],[-73.568138,40.77118],[-73.56812600000001,40.771154],[-73.56771999999999,40.771173],[-73.567363,40.771174],[-73.567019,40.77112],[-73.566779,40.771067],[-73.56662,40.771014],[-73.567193,40.770826],[-73.567542,40.770691],[-73.568039,40.770437],[-73.568851,40.769881],[-73.568974,40.769785],[-73.569964,40.768864],[-73.570211,40.768656],[-73.57061,40.768358],[-73.570987,40.768113],[-73.57136,40.7679],[-73.571679,40.767737],[-73.572041,40.767573],[-73.572436,40.76737],[-73.57275799999999,40.767249],[-73.573224,40.767107],[-73.574535,40.766844],[-73.576537,40.766586],[-73.576882,40.766524],[-73.57728400000001,40.766453],[-73.577702,40.766403],[-73.57866799999999,40.766162],[-73.579319,40.765989],[-73.580404,40.765677],[-73.581272,40.765409],[-73.58199999999999,40.765164],[-73.584371,40.764207],[-73.584872,40.764026],[-73.58583900000001,40.7637],[-73.586758,40.763421],[-73.586761,40.763588],[-73.586778,40.763879],[-73.586786,40.763972],[-73.586843,40.764411],[-73.586856,40.764462],[-73.586868,40.764524],[-73.587003,40.764879],[-73.58711,40.765144],[-73.587622,40.76649],[-73.587914,40.767276]]],"type":"Polygon"}
}