{
  "id": "360050504000",
  "type": "Feature",
  "properties": {
    "area_land":0,
    "area_water":8717524,
    "geoid":"360050504000",
    "name":"Block Group 0",
    "state":"ny"
},
  "bbox": [
    -73.817557,
    40.838034,
    -73.74806,
    40.883411
],
  "geometry": {"coordinates":[[[-73.81675199999999,40.864544],[-73.815089,40.865244],[-73.81516999999999,40.864126],[-73.81510400000001,40.863057],[-73.813845,40.86403],[-73.810968,40.862714],[-73.80759,40.858663],[-73.807579,40.860385],[-73.806648,40.860977],[-73.805655,40.861231],[-73.804575,40.861191],[-73.80562999999999,40.85471],[-73.804801,40.854721],[-73.804385,40.853298],[-73.804993,40.853237],[-73.80183100000001,40.850131],[-73.800206,40.847927],[-73.79932100000001,40.849913],[-73.79849299999999,40.850659],[-73.798196,40.851962],[-73.79816599999999,40.853751],[-73.79837499999999,40.854245],[-73.79876299999999,40.853821],[-73.798417,40.854963],[-73.797985,40.854849],[-73.79647199999999,40.856207],[-73.794032,40.856551],[-73.79368700000001,40.859176],[-73.791904,40.860829],[-73.79018000000001,40.868148],[-73.785828,40.869046],[-73.784081,40.870153],[-73.78251400000001,40.871658],[-73.78272699999999,40.872424],[-73.78305400000001,40.87268],[-73.783671,40.87268],[-73.783824,40.872805],[-73.783432,40.873179],[-73.78334,40.873513],[-73.783587,40.873781],[-73.783805,40.873737],[-73.78402199999999,40.873693],[-73.784678,40.873105],[-73.785389,40.872048],[-73.78556,40.872153],[-73.785681,40.872387],[-73.78578,40.87282],[-73.78570000000001,40.873229],[-73.78563800000001,40.873634],[-73.785723,40.873701],[-73.78581699999999,40.873635],[-73.78601500000001,40.873259],[-73.78635300000001,40.872811],[-73.787233,40.872374],[-73.78756199999999,40.872555],[-73.787576,40.872839],[-73.78770299999999,40.872997],[-73.78733800000001,40.873401],[-73.786906,40.87431],[-73.78609,40.875223],[-73.785794,40.875854],[-73.78530000000001,40.876634],[-73.785183,40.87775],[-73.785776,40.878884],[-73.78642499999999,40.87915],[-73.788107,40.878946],[-73.789244,40.878979],[-73.78979699999999,40.879223],[-73.790008,40.879515],[-73.789959,40.879694],[-73.789472,40.879759],[-73.78908199999999,40.879986],[-73.78908199999999,40.88036],[-73.78926,40.880783],[-73.789602,40.881043],[-73.79007300000001,40.881075],[-73.790902,40.880896],[-73.79093399999999,40.880685],[-73.790674,40.880474],[-73.790723,40.88023],[-73.791113,40.880051],[-73.791552,40.880068],[-73.791844,40.879938],[-73.792169,40.879678],[-73.792575,40.879661],[-73.79309499999999,40.879385],[-73.79329,40.878816],[-73.79366400000001,40.878735],[-73.794022,40.878378],[-73.79452499999999,40.8775],[-73.794363,40.877273],[-73.793437,40.877013],[-73.793502,40.876899],[-73.79369699999999,40.87672],[-73.793632,40.876298],[-73.793778,40.875745],[-73.79397299999999,40.875111],[-73.794022,40.874331],[-73.79467200000001,40.873129],[-73.795192,40.872885],[-73.795224,40.872316],[-73.795907,40.872089],[-73.797174,40.872446],[-73.79758,40.872414],[-73.797997,40.872134],[-73.80144799999999,40.866856],[-73.801805,40.865898],[-73.802325,40.865589],[-73.802829,40.865589],[-73.803089,40.865703],[-73.803138,40.866158],[-73.802982,40.866613],[-73.803073,40.866986],[-73.80390199999999,40.867116],[-73.804795,40.866596],[-73.80473000000001,40.867604],[-73.80490899999999,40.868254],[-73.805868,40.868368],[-73.806713,40.868741],[-73.80665500000001,40.86953],[-73.807574,40.869749],[-73.807834,40.869863],[-73.80747700000001,40.87022],[-73.807877,40.87052],[-73.80848400000001,40.870448],[-73.80848400000001,40.87061],[-73.808346,40.870878],[-73.80881599999999,40.871249],[-73.80787599999999,40.871031],[-73.80577,40.869521],[-73.80573800000001,40.869294],[-73.805933,40.869131],[-73.805819,40.868904],[-73.80547300000001,40.868852],[-73.805234,40.869115],[-73.80489300000001,40.869164],[-73.804552,40.868806],[-73.804097,40.868839],[-73.802975,40.868904],[-73.802553,40.870464],[-73.801383,40.871309],[-73.80096,40.871374],[-73.800343,40.872576],[-73.79970899999999,40.873665],[-73.79970899999999,40.873925],[-73.79899399999999,40.874478],[-73.798637,40.874201],[-73.79800299999999,40.874299],[-73.79684899999999,40.876135],[-73.796914,40.87646],[-73.796102,40.877013],[-73.795224,40.878816],[-73.794997,40.879678],[-73.79524000000001,40.880425],[-73.795062,40.880555],[-73.79468799999999,40.88062],[-73.794363,40.881351],[-73.79366400000001,40.881904],[-73.793702,40.882897],[-73.792942,40.883411],[-73.785797,40.8816],[-73.78370200000001,40.881078],[-73.78355500000001,40.881042],[-73.783519,40.881033],[-73.78340799999999,40.881006],[-73.782838,40.880868],[-73.782267,40.880729],[-73.78120199999999,40.880478],[-73.760988,40.875178],[-73.749483,40.872101],[-73.74806,40.871721],[-73.753732,40.856556],[-73.753787,40.856409],[-73.771004,40.860109],[-73.773231,40.860747],[-73.790063,40.860801],[-73.793575,40.856326],[-73.801855,40.840009],[-73.808787,40.838145],[-73.809303,40.838034],[-73.809265,40.842973],[-73.809335,40.849429],[-73.808831,40.852279],[-73.812325,40.860686],[-73.81546400000001,40.86254],[-73.81755699999999,40.863588],[-73.81675199999999,40.864544]],[[-73.806946,40.841462],[-73.805295,40.841135],[-73.802638,40.841081],[-73.802222,40.841635],[-73.803676,40.842258],[-73.80392999999999,40.842594],[-73.806808,40.842489],[-73.806946,40.841462]],[[-73.786727,40.873074],[-73.786625,40.873035],[-73.786486,40.87321],[-73.78632899999999,40.873271],[-73.78626199999999,40.873394],[-73.78649900000001,40.873481],[-73.786655,40.873394],[-73.786727,40.873074]],[[-73.786333,40.873677],[-73.78619,40.873599],[-73.78605399999999,40.873783],[-73.78619399999999,40.873886],[-73.786328,40.873805],[-73.786333,40.873677]],[[-73.785433,40.86247],[-73.78512000000001,40.862916],[-73.785774,40.862879],[-73.785433,40.86247]],[[-73.784847,40.861666],[-73.784575,40.862172],[-73.78530499999999,40.86203],[-73.784847,40.861666]],[[-73.781206,40.876285],[-73.78103299999999,40.876484],[-73.781127,40.876653],[-73.781327,40.876361],[-73.781206,40.876285]],[[-73.775431,40.861529],[-73.774276,40.861779],[-73.774355,40.862262],[-73.775176,40.86213],[-73.775431,40.861529]],[[-73.774581,40.874109],[-73.77448,40.874078],[-73.77435199999999,40.87417],[-73.774253,40.874285],[-73.77403200000001,40.874394],[-73.773976,40.874599],[-73.774151,40.874693],[-73.77407599999999,40.874815],[-73.774096,40.874896],[-73.774203,40.874881],[-73.774536,40.87471],[-73.77455399999999,40.874548],[-73.774513,40.874465],[-73.77457099999999,40.874332],[-73.774609,40.874203],[-73.774581,40.874109]],[[-73.770229,40.865139],[-73.769792,40.865128],[-73.76965,40.865486],[-73.77006900000001,40.865526],[-73.770229,40.865139]],[[-73.76779399999999,40.866781],[-73.767099,40.866705],[-73.766689,40.867098],[-73.767601,40.867497],[-73.76779399999999,40.866781]],[[-73.773231,40.860747],[-73.772902,40.861209],[-73.773107,40.861615],[-73.77351299999999,40.861242],[-73.773231,40.860747]]],"type":"Polygon"}
}