{
  "id": "360470610042",
  "type": "Feature",
  "properties": {
    "area_land":53631,
    "area_water":0,
    "geoid":"360470610042",
    "name":"Block Group 2",
    "state":"ny"
},
  "bbox": [
    -73.957523,
    40.579182,
    -73.954345,
    40.582448
],
  "geometry": {"coordinates":[[[-73.95752299999999,40.580222],[-73.95592000000001,40.582448],[-73.95517700000001,40.582092],[-73.955055,40.581609],[-73.954713,40.580622],[-73.954438,40.5796],[-73.954345,40.579196],[-73.95504099999999,40.579182],[-73.95584599999999,40.579524],[-73.95666799999999,40.579869],[-73.95752299999999,40.580222]]],"type":"Polygon"}
}