{
  "id": "360810265002",
  "type": "Feature",
  "properties": {
    "area_land":95546,
    "area_water":0,
    "geoid":"360810265002",
    "name":"Block Group 2",
    "state":"ny"
},
  "bbox": [
    -73.896453,
    40.742535,
    -73.890716,
    40.745203
],
  "geometry": {"coordinates":[[[-73.89645299999999,40.742861],[-73.89577300000001,40.74342],[-73.895501,40.743647],[-73.895425,40.743721],[-73.895343,40.7438],[-73.89530499999999,40.743843],[-73.895264,40.743882],[-73.89519300000001,40.743979],[-73.895121,40.744074],[-73.89501,40.744239],[-73.894975,40.744301],[-73.89489500000001,40.744442],[-73.894852,40.744522],[-73.894814,40.744607],[-73.89476500000001,40.744739],[-73.89455,40.744787],[-73.894192,40.744863],[-73.893878,40.744907],[-73.89349,40.744953],[-73.893445,40.744958],[-73.893244,40.744981],[-73.892005,40.745108],[-73.89119599999999,40.745193],[-73.89111,40.745203],[-73.890716,40.743128],[-73.89087499999999,40.743106],[-73.89160200000001,40.742986],[-73.892179,40.742873],[-73.892821,40.742741],[-73.893766,40.742609],[-73.894324,40.742535],[-73.89469200000001,40.742574],[-73.895653,40.742684],[-73.89613900000001,40.742795],[-73.896306,40.74283],[-73.89645299999999,40.742861]]],"type":"Polygon"}
}