{
  "id": "360710102001",
  "type": "Feature",
  "properties": {
    "area_land":3818058,
    "area_water":13265,
    "geoid":"360710102001",
    "name":"Block Group 1",
    "state":"ny"
},
  "bbox": [
    -74.028655,
    41.534709,
    -74.003348,
    41.562645
],
  "geometry": {"coordinates":[[[-74.028633,41.559156],[-74.028592,41.559399],[-74.02842200000001,41.560173],[-74.028384,41.560411],[-74.028334,41.560724],[-74.02833200000001,41.560842],[-74.02833,41.56094],[-74.028318,41.561358],[-74.02825799999999,41.561874],[-74.02815200000001,41.562593],[-74.027947,41.562538],[-74.027569,41.562462],[-74.027382,41.562405],[-74.027002,41.562291],[-74.026349,41.562135],[-74.025854,41.562031],[-74.024946,41.561867],[-74.023796,41.561626],[-74.023201,41.561482],[-74.021997,41.561283],[-74.02170099999999,41.561234],[-74.02076700000001,41.561059],[-74.019749,41.560831],[-74.018767,41.560626],[-74.01735499999999,41.560354],[-74.01585300000001,41.560039],[-74.015085,41.559894],[-74.01374,41.559689],[-74.01360200000001,41.559658],[-74.012514,41.55944],[-74.012405,41.559437],[-74.012326,41.559435],[-74.012232,41.559446],[-74.012094,41.559485],[-74.012001,41.559529],[-74.01192399999999,41.559584],[-74.011488,41.559962],[-74.01071399999999,41.560679],[-74.009973,41.561344],[-74.009939,41.561373],[-74.00909799999999,41.56211],[-74.008728,41.562448],[-74.00856,41.562645],[-74.008257,41.5625],[-74.007856,41.562349],[-74.007431,41.562216],[-74.007215,41.562165],[-74.006168,41.561968],[-74.00585599999999,41.5619],[-74.005719,41.561854],[-74.005594,41.561801],[-74.00551900000001,41.561757],[-74.00547400000001,41.561716],[-74.005414,41.56163],[-74.00538,41.561521],[-74.00527099999999,41.561058],[-74.005092,41.560472],[-74.004981,41.560246],[-74.004919,41.560175],[-74.00484299999999,41.560113],[-74.004732,41.560058],[-74.004581,41.560007],[-74.003348,41.559761],[-74.003441,41.559313],[-74.00348200000001,41.559093],[-74.003575,41.558761],[-74.00373500000001,41.558317],[-74.003942,41.557722],[-74.004251,41.556826],[-74.004654,41.555691],[-74.004721,41.555471],[-74.00485,41.554915],[-74.004927,41.554444],[-74.00496800000001,41.554003],[-74.005056,41.552926],[-74.00514800000001,41.551885],[-74.00517499999999,41.551572],[-74.005247,41.551172],[-74.00532699999999,41.550861],[-74.005387,41.550697],[-74.00540599999999,41.550644],[-74.005921,41.54947],[-74.00637999999999,41.548461],[-74.00648200000001,41.548265],[-74.006584,41.548109],[-74.00669000000001,41.547963],[-74.006968,41.54765],[-74.00704500000001,41.547578],[-74.007065,41.547565],[-74.00720200000001,41.547436],[-74.00748400000001,41.54724],[-74.00803999999999,41.546886],[-74.00837799999999,41.546687],[-74.008627,41.546524],[-74.009952,41.54568],[-74.010077,41.545591],[-74.010209,41.545485],[-74.010752,41.545027],[-74.01141800000001,41.54443],[-74.01152,41.544347],[-74.011695,41.54416],[-74.011763,41.54408],[-74.01178899999999,41.544045],[-74.011837,41.543983],[-74.011915,41.54386],[-74.011957,41.543797],[-74.01200900000001,41.543718],[-74.012047,41.543648],[-74.012227,41.543252],[-74.012326,41.542962],[-74.012765,41.541604],[-74.01281299999999,41.541375],[-74.012851,41.541134],[-74.012877,41.540873],[-74.01300999999999,41.538897],[-74.01306200000001,41.538509],[-74.013161,41.538111],[-74.013206,41.537961],[-74.01361300000001,41.53691],[-74.013728,41.53666],[-74.013926,41.536284],[-74.01479399999999,41.534709],[-74.014877,41.534734],[-74.014937,41.534754],[-74.014951,41.534759],[-74.015029,41.534796],[-74.015119,41.534864],[-74.01522199999999,41.534969],[-74.015531,41.535326],[-74.015778,41.535557],[-74.016488,41.536185],[-74.016688,41.536389],[-74.01696099999999,41.536705],[-74.017297,41.537131],[-74.01746900000001,41.53735],[-74.017687,41.537646],[-74.01786199999999,41.537939],[-74.01827400000001,41.538718],[-74.01848699999999,41.539158],[-74.01931999999999,41.540817],[-74.019403,41.540965],[-74.01952300000001,41.54114],[-74.01997799999999,41.541718],[-74.02027699999999,41.542076],[-74.020402,41.542212],[-74.020729,41.542513],[-74.020792,41.542572],[-74.021895,41.543504],[-74.02206,41.543629],[-74.02221400000001,41.54373],[-74.022535,41.543904],[-74.023291,41.544219],[-74.024558,41.544757],[-74.02535899999999,41.545118],[-74.025823,41.545328],[-74.02632699999999,41.545554],[-74.026707,41.545725],[-74.027456,41.546058],[-74.027541,41.546093],[-74.027522,41.546225],[-74.02753199999999,41.546787],[-74.02748699999999,41.547096],[-74.027429,41.547991],[-74.02739200000001,41.548229],[-74.02723400000001,41.548786],[-74.027134,41.549091],[-74.02700299999999,41.549521],[-74.026956,41.549751],[-74.026951,41.550014],[-74.026985,41.550378],[-74.026999,41.550528],[-74.027131,41.551579],[-74.02718400000001,41.551955],[-74.027174,41.552118],[-74.02714,41.552281],[-74.02705,41.55254],[-74.02691900000001,41.552894],[-74.02680599999999,41.553157],[-74.026656,41.553525],[-74.02628799999999,41.554299],[-74.026251,41.554431],[-74.02623199999999,41.554667],[-74.02626100000001,41.554871],[-74.026358,41.555143],[-74.026748,41.555956],[-74.026859,41.556133],[-74.027046,41.556352],[-74.027657,41.556953],[-74.02783599999999,41.557187],[-74.028272,41.557856],[-74.02838300000001,41.558089],[-74.028615,41.558675],[-74.028633,41.558738],[-74.028655,41.558885],[-74.028633,41.559156]]],"type":"Polygon"}
}