{
  "id": "361190056001",
  "type": "Feature",
  "properties": {
    "area_land":312476,
    "area_water":180612,
    "geoid":"361190056001",
    "name":"Block Group 1",
    "state":"ny"
},
  "bbox": [
    -73.775369,
    40.879217,
    -73.766385,
    40.888189
],
  "geometry": {"coordinates":[[[-73.77526400000001,40.884053],[-73.772859,40.884433],[-73.77235400000001,40.887304],[-73.770651,40.888189],[-73.76834700000001,40.887369],[-73.767365,40.886823],[-73.76724299999999,40.886052],[-73.76713100000001,40.885833],[-73.767107,40.885632],[-73.76712999999999,40.885556],[-73.76729,40.885346],[-73.76733400000001,40.885196],[-73.76732199999999,40.884973],[-73.76725500000001,40.884934],[-73.767194,40.884861],[-73.767186,40.884816],[-73.767194,40.884797],[-73.76719199999999,40.883484],[-73.766385,40.881058],[-73.767083,40.880046],[-73.770978,40.879217],[-73.775369,40.882072],[-73.77526400000001,40.884053]]],"type":"Polygon"}
}