{
  "id": "360810230002",
  "type": "Feature",
  "properties": {
    "area_land":79059,
    "area_water":0,
    "geoid":"360810230002",
    "name":"Block Group 2",
    "state":"ny"
},
  "bbox": [
    -73.809508,
    40.709357,
    -73.805482,
    40.71295
],
  "geometry": {"coordinates":[[[-73.80950799999999,40.712141],[-73.80863100000001,40.712389],[-73.807772,40.712633],[-73.80665399999999,40.71295],[-73.806495,40.712225],[-73.80645699999999,40.712056],[-73.80626599999999,40.711254],[-73.80558000000001,40.710237],[-73.805482,40.710089],[-73.80632799999999,40.709846],[-73.807179,40.709603],[-73.808046,40.709357],[-73.808142,40.709498],[-73.808897,40.710599],[-73.809031,40.711163],[-73.80918,40.71147],[-73.80950799999999,40.712141]]],"type":"Polygon"}
}