{
  "id": "360610005002",
  "type": "Feature",
  "properties": {
    "area_land":122933,
    "area_water":0,
    "geoid":"360610005002",
    "name":"Block Group 2",
    "state":"ny"
},
  "bbox": [
    -74.012121,
    40.683894,
    -74.000699,
    40.694044
],
  "geometry": {"coordinates":[[[[-74.004,40.693244],[-74.003474,40.694044],[-74.00343100000001,40.694044],[-74.001412,40.693333],[-74.001277,40.693298],[-74.001317,40.693208],[-74.001542,40.692786],[-74.001744,40.692407],[-74.003998,40.693223],[-74.004,40.693244]]],[[[-74.004441,40.692489],[-74.002059,40.691775],[-74.001969,40.691843],[-74.001332,40.691225],[-74.000699,40.690612],[-74.001155,40.69073],[-74.001626,40.690852],[-74.002396,40.691074],[-74.00482,40.691754],[-74.004441,40.692489]]],[[[-74.00536200000001,40.691065],[-74.002993,40.690427],[-74.003024,40.690349],[-74.003409,40.689613],[-74.004836,40.689994],[-74.00576100000001,40.690253],[-74.00536200000001,40.691065]]],[[[-74.00678600000001,40.688856],[-74.006438,40.689572],[-74.00639099999999,40.689614],[-74.006337,40.689634],[-74.00403799999999,40.689027],[-74.00382,40.68893],[-74.003919,40.68886],[-74.004593,40.688215],[-74.006743,40.68879],[-74.006782,40.688825],[-74.00678600000001,40.688856]]],[[[-74.00783199999999,40.687454],[-74.007474,40.688191],[-74.007424,40.688206],[-74.007355,40.688191],[-74.005038,40.687561],[-74.00563,40.686784],[-74.007784,40.687374],[-74.007842,40.687421],[-74.00783199999999,40.687454]]],[[[-74.01212099999999,40.684116],[-74.011948,40.684221],[-74.011078,40.684775],[-74.010563,40.685066],[-74.010437,40.685143],[-74.010133,40.685328],[-74.010034,40.685385],[-74.009546,40.685681],[-74.009463,40.685731],[-74.00936,40.685794],[-74.009169,40.685908],[-74.00899,40.68602],[-74.008785,40.686146],[-74.00859800000001,40.686253],[-74.008538,40.686293],[-74.008443,40.686351],[-74.008375,40.686393],[-74.00831599999999,40.68634],[-74.00828,40.686352],[-74.008212,40.686383],[-74.008156,40.686383],[-74.008104,40.68637],[-74.008038,40.686356],[-74.00799000000001,40.686325],[-74.00794999999999,40.686293],[-74.00816399999999,40.686175],[-74.008425,40.686016],[-74.00851299999999,40.685963],[-74.008595,40.685904],[-74.01094000000001,40.684485],[-74.01192399999999,40.683894],[-74.012029,40.683996],[-74.01212,40.684088],[-74.01212099999999,40.684116]]]],"type":"MultiPolygon"}
}