{
  "id": "360430102023",
  "type": "Feature",
  "properties": {
    "area_land":19872368,
    "area_water":0,
    "geoid":"360430102023",
    "name":"Block Group 3",
    "state":"ny"
},
  "bbox": [
    -75.15734,
    42.986495,
    -75.052071,
    43.029129
],
  "geometry": {"coordinates":[[[-75.157056,43.009072],[-75.156795,43.009151],[-75.15651200000001,43.009211],[-75.15629,43.009225],[-75.15595399999999,43.009211],[-75.155675,43.009174],[-75.155327,43.009069],[-75.15501399999999,43.008941],[-75.154185,43.008541],[-75.153902,43.008444],[-75.153479,43.008344],[-75.153244,43.008314],[-75.15247599999999,43.008287],[-75.151819,43.008224],[-75.15149099999999,43.008201],[-75.151177,43.008225],[-75.150606,43.008325],[-75.149936,43.008482],[-75.14949300000001,43.008572],[-75.14831,43.008725],[-75.148118,43.00876],[-75.14795700000001,43.008801],[-75.14769099999999,43.008891],[-75.147476,43.008996],[-75.147379,43.009084],[-75.147291,43.0092],[-75.147126,43.009503],[-75.146906,43.009871],[-75.146849,43.010023],[-75.146867,43.010751],[-75.146835,43.01095],[-75.14665599999999,43.011465],[-75.14643599999999,43.012002],[-75.146238,43.012347],[-75.14606000000001,43.01259],[-75.145804,43.012844],[-75.14541199999999,43.013161],[-75.14533900000001,43.01322],[-75.14513700000001,43.013386],[-75.144745,43.013741],[-75.144651,43.013795],[-75.144486,43.013841],[-75.144318,43.013865],[-75.143894,43.013835],[-75.143732,43.013847],[-75.143602,43.013897],[-75.14346500000001,43.014007],[-75.14313199999999,43.014352],[-75.143012,43.014406],[-75.14283,43.014442],[-75.14249700000001,43.014471],[-75.142116,43.014516],[-75.141884,43.014569],[-75.141283,43.014766],[-75.14108299999999,43.014856],[-75.140896,43.014983],[-75.140418,43.015377],[-75.140258,43.015487],[-75.13994599999999,43.015636],[-75.13966499999999,43.015747],[-75.139391,43.015829],[-75.13909099999999,43.0159],[-75.138544,43.015981],[-75.13828599999999,43.016011],[-75.137776,43.016055],[-75.137136,43.016061],[-75.13706999999999,43.016061],[-75.13685,43.016077],[-75.136709,43.016097],[-75.13557400000001,43.016327],[-75.135081,43.016438],[-75.13448,43.016596],[-75.133999,43.016739],[-75.13373,43.016843],[-75.13330499999999,43.0171],[-75.13303000000001,43.017275],[-75.132845,43.017363],[-75.13267999999999,43.017404],[-75.132437,43.017427],[-75.132114,43.017424],[-75.13107100000001,43.017391],[-75.13072099999999,43.017368],[-75.130235,43.017318],[-75.130009,43.017316],[-75.129698,43.017361],[-75.129295,43.017446],[-75.12863900000001,43.017474],[-75.128235,43.017507],[-75.127666,43.017587],[-75.127399,43.017636],[-75.12729,43.017678],[-75.127156,43.017772],[-75.126886,43.018018],[-75.126766,43.018092],[-75.12666,43.018119],[-75.126536,43.018113],[-75.126322,43.018059],[-75.125687,43.017858],[-75.125567,43.017795],[-75.12545,43.017696],[-75.125158,43.017374],[-75.125106,43.017326],[-75.124599,43.017157],[-75.12436099999999,43.0171],[-75.124184,43.017081],[-75.12385399999999,43.017086],[-75.12352799999999,43.017124],[-75.12317,43.017209],[-75.122753,43.017329],[-75.122507,43.017364],[-75.122355,43.017358],[-75.12191300000001,43.01729],[-75.121714,43.017296],[-75.12114200000001,43.017378],[-75.121,43.017375],[-75.12085399999999,43.01734],[-75.120215,43.017137],[-75.119997,43.017088],[-75.11956499999999,43.017037],[-75.117947,43.016875],[-75.11711,43.016761],[-75.11687499999999,43.016747],[-75.116589,43.016767],[-75.116304,43.016822],[-75.116001,43.016913],[-75.115771,43.017016],[-75.115639,43.017101],[-75.115284,43.017451],[-75.11511,43.017577],[-75.11500100000001,43.017638],[-75.114763,43.017731],[-75.114226,43.017864],[-75.113165,43.018137],[-75.11268800000001,43.018258],[-75.112292,43.01833],[-75.111931,43.018387],[-75.11167500000001,43.01847],[-75.11145,43.018549],[-75.11114600000001,43.018707],[-75.110902,43.018874],[-75.110231,43.019384],[-75.110005,43.019597],[-75.10985700000001,43.019765],[-75.109224,43.020672],[-75.109044,43.020975],[-75.108727,43.021856],[-75.10852300000001,43.022237],[-75.108377,43.02244],[-75.10821900000001,43.022588],[-75.107716,43.022927],[-75.107615,43.023027],[-75.107499,43.023186],[-75.107164,43.023674],[-75.107101,43.023843],[-75.107011,43.024392],[-75.106938,43.024595],[-75.106848,43.024752],[-75.106765,43.024849],[-75.106341,43.025211],[-75.105966,43.025503],[-75.105619,43.025747],[-75.105369,43.025875],[-75.104916,43.026086],[-75.10477899999999,43.026164],[-75.104659,43.026257],[-75.10458199999999,43.026346],[-75.104519,43.026495],[-75.104438,43.026844],[-75.10440699999999,43.026983],[-75.104384,43.027079],[-75.104366,43.02715],[-75.104285,43.027465],[-75.104196,43.027648],[-75.104128,43.027736],[-75.10404699999999,43.027799],[-75.10390200000001,43.027852],[-75.10372,43.027887],[-75.103363,43.027905],[-75.10315799999999,43.027887],[-75.102853,43.027827],[-75.102102,43.027588],[-75.101951,43.027566],[-75.10178500000001,43.027571],[-75.10166599999999,43.027588],[-75.101607,43.027596],[-75.10142500000001,43.027649],[-75.101022,43.027831],[-75.100707,43.02798],[-75.10050699999999,43.028029],[-75.100298,43.02805],[-75.100067,43.028039],[-75.099431,43.027916],[-75.09929099999999,43.027925],[-75.099166,43.02798],[-75.09863900000001,43.028333],[-75.09843499999999,43.02844],[-75.098271,43.028494],[-75.098084,43.028523],[-75.097769,43.028514],[-75.097599,43.028493],[-75.097224,43.028394],[-75.09657799999999,43.028213],[-75.096318,43.028166],[-75.09606700000001,43.02816],[-75.095221,43.028237],[-75.09492899999999,43.028243],[-75.094741,43.028211],[-75.094539,43.028145],[-75.094161,43.028001],[-75.094022,43.02798],[-75.093142,43.028005],[-75.09285300000001,43.028026],[-75.092578,43.028081],[-75.091945,43.028285],[-75.09159699999999,43.028346],[-75.09099999999999,43.028412],[-75.090783,43.028421],[-75.090548,43.028399],[-75.089848,43.028264],[-75.089539,43.028226],[-75.089061,43.028198],[-75.08789400000001,43.02806],[-75.08676199999999,43.027926],[-75.086178,43.02782],[-75.08580600000001,43.027737],[-75.08550700000001,43.027669],[-75.08534299999999,43.027632],[-75.085221,43.027604],[-75.08493,43.027538],[-75.084639,43.027492],[-75.08436399999999,43.027465],[-75.084093,43.027452],[-75.083738,43.027467],[-75.083513,43.027485],[-75.08325000000001,43.02752],[-75.08296900000001,43.027576],[-75.08270400000001,43.027642],[-75.082488,43.027715],[-75.081395,43.028162],[-75.080307,43.028629],[-75.079972,43.028785],[-75.079545,43.02901],[-75.079336,43.029129],[-75.07896700000001,43.028483],[-75.07874099999999,43.028101],[-75.07859999999999,43.027891],[-75.078402,43.027629],[-75.078233,43.027428],[-75.077792,43.026986],[-75.07741,43.026669],[-75.07695200000001,43.02634],[-75.076368,43.026005],[-75.07606,43.025851],[-75.0758,43.025735],[-75.07574099999999,43.025709],[-75.075277,43.025535],[-75.074949,43.025423],[-75.074296,43.025256],[-75.07384,43.025164],[-75.073272,43.025079],[-75.072851,43.025042],[-75.07166700000001,43.024995],[-75.071415,43.024986],[-75.070211,43.024942],[-75.06505900000001,43.024749],[-75.06302100000001,43.024673],[-75.062425,43.024665],[-75.06178800000001,43.02465],[-75.06063399999999,43.024594],[-75.059957,43.024536],[-75.05945,43.024487],[-75.058943,43.024427],[-75.058491,43.024362],[-75.057562,43.0242],[-75.05734200000001,43.024161],[-75.056811,43.024055],[-75.05446999999999,43.023574],[-75.05358200000001,43.02339],[-75.053179,43.02331],[-75.053127,43.0233],[-75.052269,43.022637],[-75.052071,43.022485],[-75.05242800000001,43.022139],[-75.052527,43.021879],[-75.053121,43.020736],[-75.054075,43.019313],[-75.05410000000001,43.019276],[-75.05427400000001,43.018898],[-75.05432399999999,43.018822],[-75.054512,43.018542],[-75.05505700000001,43.017719],[-75.055149,43.017595],[-75.055381,43.017265],[-75.05564200000001,43.016892],[-75.05669899999999,43.015386],[-75.057132,43.014768],[-75.057164,43.014718],[-75.05756100000001,43.014125],[-75.063051,43.006387],[-75.063731,43.005406],[-75.067503,43.000133],[-75.067584,43.000024],[-75.068113,42.999268],[-75.071029,42.995065],[-75.07212800000001,42.993423],[-75.076826,42.986495],[-75.081795,42.98861],[-75.087551,42.991044],[-75.088241,42.991352],[-75.09508700000001,42.994268],[-75.098235,42.99499],[-75.10654,42.996958],[-75.10705400000001,42.997056],[-75.129205,43.002103],[-75.14285099999999,43.005194],[-75.14615999999999,43.006039],[-75.156781,43.008588],[-75.156801,43.008615],[-75.156915,43.008708],[-75.156976,43.008758],[-75.15734,43.008964],[-75.157056,43.009072]]],"type":"Polygon"}
}