{
  "id": "360470520001",
  "type": "Feature",
  "properties": {
    "area_land":71588,
    "area_water":0,
    "geoid":"360470520001",
    "name":"Block Group 1",
    "state":"ny"
},
  "bbox": [
    -73.966174,
    40.636279,
    -73.963186,
    40.64161
],
  "geometry": {"coordinates":[[[-73.966174,40.640431],[-73.965301,40.640823],[-73.96442999999999,40.641214],[-73.964037,40.641389],[-73.96355699999999,40.64161],[-73.96318599999999,40.639672],[-73.963674,40.639443],[-73.964056,40.639263],[-73.96492499999999,40.638851],[-73.964513,40.636688],[-73.964957,40.636479],[-73.96538200000001,40.636279],[-73.96579199999999,40.638441],[-73.966174,40.640431]]],"type":"Polygon"}
}