{
  "id": "360050195001",
  "type": "Feature",
  "properties": {
    "area_land":50913,
    "area_water":0,
    "geoid":"360050195001",
    "name":"Block Group 1",
    "state":"ny"
},
  "bbox": [
    -73.924261,
    40.830053,
    -73.921223,
    40.834163
],
  "geometry": {"coordinates":[[[-73.92348800000001,40.831973],[-73.922217,40.834163],[-73.921223,40.833833],[-73.922516,40.831633],[-73.921661,40.831337],[-73.92241300000001,40.830053],[-73.92327299999999,40.830344],[-73.924261,40.830681],[-73.92348800000001,40.831973]]],"type":"Polygon"}
}