{
  "id": "360050201003",
  "type": "Feature",
  "properties": {
    "area_land":39024,
    "area_water":0,
    "geoid":"360050201003",
    "name":"Block Group 3",
    "state":"ny"
},
  "bbox": [
    -73.927396,
    40.838512,
    -73.925268,
    40.842099
],
  "geometry": {"coordinates":[[[-73.927396,40.840281],[-73.927021,40.840899],[-73.92666,40.841494],[-73.926231,40.842099],[-73.925487,40.841771],[-73.92645899999999,40.840179],[-73.92596,40.840125],[-73.925268,40.840176],[-73.92578,40.839233],[-73.926191,40.838512],[-73.927092,40.838625],[-73.927125,40.838804],[-73.927351,40.840037],[-73.927396,40.840281]]],"type":"Polygon"}
}