{
  "id": "360050389001",
  "type": "Feature",
  "properties": {
    "area_land":48230,
    "area_water":0,
    "geoid":"360050389001",
    "name":"Block Group 1",
    "state":"ny"
},
  "bbox": [
    -73.885433,
    40.855057,
    -73.88183,
    40.857999
],
  "geometry": {"coordinates":[[[-73.88543300000001,40.855759],[-73.884646,40.856695],[-73.883611,40.857916],[-73.883522,40.857999],[-73.882662,40.857743],[-73.88182999999999,40.857455],[-73.881911,40.857315],[-73.882519,40.856112],[-73.88287800000001,40.856237],[-73.883011,40.856237],[-73.883083,40.856176],[-73.88327,40.856028],[-73.884002,40.855057],[-73.884675,40.855388],[-73.88543300000001,40.855759]]],"type":"Polygon"}
}