{
  "id": "360595216021",
  "type": "Feature",
  "properties": {
    "area_land":277487,
    "area_water":0,
    "geoid":"360595216021",
    "name":"Block Group 1",
    "state":"ny"
},
  "bbox": [
    -73.443667,
    40.68513,
    -73.438001,
    40.692106
],
  "geometry": {"coordinates":[[[-73.44322200000001,40.687816],[-73.442778,40.68996],[-73.44232599999999,40.692106],[-73.44138100000001,40.691995],[-73.440456,40.691886],[-73.43952899999999,40.691774],[-73.438603,40.691662],[-73.438113,40.691598],[-73.438001,40.691586],[-73.43830800000001,40.689428],[-73.43872,40.687281],[-73.438777,40.686631],[-73.438796,40.686531],[-73.439066,40.68513],[-73.439494,40.685171],[-73.439941,40.68523],[-73.440871,40.685345],[-73.441795,40.685456],[-73.442719,40.685566],[-73.443667,40.685677],[-73.44322200000001,40.687816]]],"type":"Polygon"}
}