{
  "id": "360850147001",
  "type": "Feature",
  "properties": {
    "area_land":324247,
    "area_water":0,
    "geoid":"360850147001",
    "name":"Block Group 1",
    "state":"ny"
},
  "bbox": [
    -74.125133,
    40.620971,
    -74.117127,
    40.627823
],
  "geometry": {"coordinates":[[[-74.12513300000001,40.627102],[-74.12424799999999,40.627212],[-74.123649,40.62729],[-74.122956,40.627377],[-74.12264500000001,40.627416],[-74.122162,40.627477],[-74.121257,40.627823],[-74.12056800000001,40.626988],[-74.12012900000001,40.626536],[-74.119666,40.626185],[-74.119165,40.625824],[-74.118459,40.625269],[-74.11823099999999,40.625077],[-74.1181,40.624963],[-74.11787699999999,40.624834],[-74.11755700000001,40.624693],[-74.117127,40.624533],[-74.11840599999999,40.623761],[-74.118532,40.622837],[-74.118572,40.622544],[-74.119669,40.621745],[-74.12007800000001,40.621667],[-74.12373599999999,40.620971],[-74.123998,40.621625],[-74.12402400000001,40.621702],[-74.12426600000001,40.622304],[-74.124516,40.623029],[-74.124697,40.623681],[-74.124742,40.623955],[-74.124746,40.62438],[-74.12473,40.625042],[-74.124842,40.625825],[-74.12513300000001,40.627102]]],"type":"Polygon"}
}