{
  "id": "361031456032",
  "type": "Feature",
  "properties": {
    "area_land":739760,
    "area_water":0,
    "geoid":"361031456032",
    "name":"Block Group 2",
    "state":"ny"
},
  "bbox": [
    -73.274397,
    40.780924,
    -73.261096,
    40.795421
],
  "geometry": {"coordinates":[[[-73.27439699999999,40.792688],[-73.266887,40.795153],[-73.26662899999999,40.795421],[-73.266012,40.793568],[-73.265762,40.792833],[-73.265438,40.792005],[-73.265422,40.791948],[-73.26537,40.791784],[-73.265128,40.791125],[-73.264858,40.790432],[-73.264759,40.790154],[-73.264273,40.788958],[-73.263822,40.787775],[-73.26351699999999,40.786992],[-73.263211,40.786212],[-73.263103,40.785934],[-73.262815,40.785211],[-73.26273399999999,40.784997],[-73.262277,40.783855],[-73.261967,40.783073],[-73.261866,40.782803],[-73.261661,40.782299],[-73.26146900000001,40.781816],[-73.26140100000001,40.781643],[-73.26109599999999,40.780924],[-73.26124799999999,40.781101],[-73.261443,40.78129],[-73.261515,40.781355],[-73.261639,40.781467],[-73.261803,40.781581],[-73.262062,40.781719],[-73.262416,40.781884],[-73.26328100000001,40.78225],[-73.26437799999999,40.78269],[-73.26567900000001,40.783214],[-73.266909,40.783726],[-73.267079,40.783804],[-73.267528,40.784037],[-73.267886,40.784257],[-73.268559,40.784923],[-73.268827,40.785279],[-73.269065,40.785615],[-73.269642,40.786438],[-73.270095,40.787055],[-73.27047399999999,40.787559],[-73.27089700000001,40.788175],[-73.271923,40.789554],[-73.27232600000001,40.79009],[-73.272974,40.790888],[-73.27300200000001,40.79092],[-73.27304700000001,40.790972],[-73.273044,40.791055],[-73.27439699999999,40.792688]]],"type":"Polygon"}
}