{
  "id": "360290067022",
  "type": "Feature",
  "properties": {
    "area_land":190384,
    "area_water":0,
    "geoid":"360290067022",
    "name":"Block Group 2",
    "state":"ny"
},
  "bbox": [
    -78.877136,
    42.90221,
    -78.868169,
    42.904732
],
  "geometry": {"coordinates":[[[-78.877135,42.903483],[-78.877126,42.904732],[-78.875128,42.904703],[-78.872297,42.904668],[-78.870237,42.904655],[-78.869686,42.904651],[-78.86816899999999,42.904631],[-78.868179,42.904601],[-78.86848000000001,42.903708],[-78.86860799999999,42.903311],[-78.868656,42.903163],[-78.868751,42.902867],[-78.868971,42.90221],[-78.87019100000001,42.902214],[-78.871015,42.902215],[-78.87136,42.902217],[-78.87302,42.902227],[-78.875027,42.90224],[-78.87510399999999,42.90224],[-78.875609,42.902245],[-78.87597,42.90225],[-78.87713599999999,42.902263],[-78.877135,42.903483]]],"type":"Polygon"}
}