{
  "id": "360594132002",
  "type": "Feature",
  "properties": {
    "area_land":567467,
    "area_water":75361,
    "geoid":"360594132002",
    "name":"Block Group 2",
    "state":"ny"
},
  "bbox": [
    -73.65432,
    40.620509,
    -73.640863,
    40.633616
],
  "geometry": {"coordinates":[[[-73.65366899999999,40.633616],[-73.65361,40.633427],[-73.65358500000001,40.633284],[-73.653476,40.632885],[-73.65328599999999,40.632185],[-73.653097,40.63149],[-73.65079900000001,40.63184],[-73.648651,40.632164],[-73.647368,40.632357],[-73.647318,40.632376],[-73.64722399999999,40.632448],[-73.64524299999999,40.63235],[-73.641758,40.632186],[-73.64181499999999,40.631471],[-73.641025,40.631434],[-73.640863,40.631418],[-73.640947,40.630451],[-73.640974,40.630008],[-73.641932,40.63005],[-73.64541800000001,40.630216],[-73.645471,40.629517],[-73.645526,40.628831],[-73.64558599999999,40.628147],[-73.645641,40.627461],[-73.645697,40.626777],[-73.64641,40.62681],[-73.646756,40.626795],[-73.64761,40.626663],[-73.64847,40.626529],[-73.648687,40.626102],[-73.64836099999999,40.626151],[-73.648268,40.62612],[-73.648222,40.626023],[-73.648217,40.625948],[-73.64843500000001,40.625727],[-73.64843999999999,40.625658],[-73.648224,40.624784],[-73.64796699999999,40.623821],[-73.647907,40.623595],[-73.64805,40.623329],[-73.64842400000001,40.623147],[-73.64862100000001,40.622999],[-73.648847,40.622896],[-73.649074,40.622945],[-73.649238,40.622929],[-73.649379,40.622916],[-73.649462,40.622857],[-73.64958,40.622709],[-73.649635,40.622601],[-73.649694,40.622345],[-73.64948200000001,40.621725],[-73.649546,40.621139],[-73.649349,40.620947],[-73.64959,40.620849],[-73.64968399999999,40.620908],[-73.64979700000001,40.621032],[-73.65000499999999,40.620774],[-73.650161,40.620581],[-73.65025900000001,40.620575],[-73.650536,40.620537],[-73.650738,40.620509],[-73.65122700000001,40.622383],[-73.651498,40.62341],[-73.65160400000001,40.623782],[-73.652244,40.626006],[-73.65266,40.627453],[-73.65313,40.628928],[-73.653288,40.629498],[-73.65366,40.630813],[-73.65432,40.633518],[-73.65366899999999,40.633616]]],"type":"Polygon"}
}