{
  "id": "360470351002",
  "type": "Feature",
  "properties": {
    "area_land":49996,
    "area_water":0,
    "geoid":"360470351002",
    "name":"Block Group 2",
    "state":"ny"
},
  "bbox": [
    -73.933982,
    40.667825,
    -73.931033,
    40.669891
],
  "geometry": {"coordinates":[[[-73.933909,40.668725],[-73.933888,40.66895],[-73.93386599999999,40.669176],[-73.933798,40.669891],[-73.931033,40.669738],[-73.931099,40.669019],[-73.931119,40.668798],[-73.93114,40.668581],[-73.931214,40.667825],[-73.933982,40.667976],[-73.933909,40.668725]]],"type":"Polygon"}
}