{
  "id": "360595200014",
  "type": "Feature",
  "properties": {
    "area_land":348315,
    "area_water":0,
    "geoid":"360595200014",
    "name":"Block Group 4",
    "state":"ny"
},
  "bbox": [
    -73.492898,
    40.741856,
    -73.481673,
    40.749505
],
  "geometry": {"coordinates":[[[-73.492886,40.749505],[-73.49255100000001,40.749486],[-73.492008,40.749456],[-73.49114,40.749408],[-73.490272,40.74936],[-73.48940899999999,40.749311],[-73.48854300000001,40.749264],[-73.487713,40.749218],[-73.48685500000001,40.749171],[-73.485984,40.749121],[-73.485345,40.749081],[-73.485122,40.74907],[-73.484255,40.74902],[-73.48339,40.74897],[-73.482759,40.748932],[-73.48245199999999,40.748918],[-73.48237,40.748384],[-73.482373,40.748345],[-73.48234100000001,40.748327],[-73.482356,40.748307],[-73.48229600000001,40.747786],[-73.482258,40.747412],[-73.482229,40.747366],[-73.482226,40.747305],[-73.482241,40.747253],[-73.48214900000001,40.74635],[-73.482135,40.746205],[-73.482084,40.745676],[-73.482032,40.745148],[-73.481962,40.744466],[-73.481752,40.742667],[-73.48174299999999,40.742595],[-73.481692,40.742058],[-73.481673,40.741856],[-73.48389400000001,40.743313],[-73.485535,40.74434],[-73.48512599999999,40.744299],[-73.485473,40.744525],[-73.486396,40.745124],[-73.48757999999999,40.745899],[-73.488247,40.746337],[-73.489189,40.746954],[-73.490193,40.747607],[-73.490431,40.747775],[-73.490685,40.747937],[-73.491039,40.748162],[-73.491953,40.748762],[-73.492622,40.749198],[-73.492898,40.749378],[-73.492886,40.749505]]],"type":"Polygon"}
}