{
  "id": "360610291002",
  "type": "Feature",
  "properties": {
    "area_land":20999,
    "area_water":0,
    "geoid":"360610291002",
    "name":"Block Group 2",
    "state":"ny"
},
  "bbox": [
    -73.925005,
    40.865365,
    -73.922498,
    40.867016
],
  "geometry": {"coordinates":[[[-73.925005,40.866336],[-73.92310999999999,40.867016],[-73.922498,40.866064],[-73.924385,40.865365],[-73.925005,40.866336]]],"type":"Polygon"}
}