{
  "id": "360610063003",
  "type": "Feature",
  "properties": {
    "area_land":23201,
    "area_water":0,
    "geoid":"360610063003",
    "name":"Block Group 3",
    "state":"ny"
},
  "bbox": [
    -73.999188,
    40.732847,
    -73.995489,
    40.734784
],
  "geometry": {"coordinates":[[[-73.999188,40.734134],[-73.99871400000001,40.734784],[-73.996118,40.733699],[-73.99548900000001,40.733437],[-73.995914,40.732847],[-73.99862,40.733981],[-73.999019,40.734149],[-73.999188,40.734134]]],"type":"Polygon"}
}