{
  "id": "360630207002",
  "type": "Feature",
  "properties": {
    "area_land":141506,
    "area_water":0,
    "geoid":"360630207002",
    "name":"Block Group 2",
    "state":"ny"
},
  "bbox": [
    -79.036112,
    43.101616,
    -79.027148,
    43.103505
],
  "geometry": {"coordinates":[[[-79.03611100000001,43.10185],[-79.03610999999999,43.102127],[-79.036109,43.102387],[-79.036109,43.102567],[-79.03610500000001,43.102754],[-79.036101,43.103037],[-79.036096,43.103317],[-79.03609400000001,43.103505],[-79.035578,43.103498],[-79.034915,43.103491],[-79.03403299999999,43.103491],[-79.033518,43.103491],[-79.03148,43.103475],[-79.03032899999999,43.103461],[-79.029392,43.103461],[-79.02827600000001,43.103464],[-79.027993,43.103464],[-79.027939,43.103348],[-79.027888,43.103253],[-79.027835,43.103143],[-79.02775200000001,43.102975],[-79.02763,43.102734],[-79.027553,43.102581],[-79.02747100000001,43.102403],[-79.02731799999999,43.102067],[-79.02722799999999,43.101871],[-79.027148,43.101694],[-79.02731199999999,43.101632],[-79.02740799999999,43.101616],[-79.02758300000001,43.101618],[-79.028425,43.101632],[-79.028927,43.101633],[-79.029376,43.101634],[-79.030208,43.101639],[-79.032704,43.101655],[-79.033536,43.101661],[-79.03405100000001,43.101663],[-79.035596,43.101669],[-79.036112,43.101672],[-79.03611100000001,43.10185]]],"type":"Polygon"}
}