{
  "id": "360470317021",
  "type": "Feature",
  "properties": {
    "area_land":46598,
    "area_water":0,
    "geoid":"360470317021",
    "name":"Block Group 1",
    "state":"ny"
},
  "bbox": [
    -73.950418,
    40.670597,
    -73.94748,
    40.67253
],
  "geometry": {"coordinates":[[[-73.950334,40.671638],[-73.95025099999999,40.67253],[-73.94748,40.67238],[-73.947564,40.671488],[-73.947642,40.670664],[-73.947647,40.670597],[-73.950418,40.670748],[-73.950334,40.671638]]],"type":"Polygon"}
}