{
  "id": "360050153001",
  "type": "Feature",
  "properties": {
    "area_land":150119,
    "area_water":0,
    "geoid":"360050153001",
    "name":"Block Group 1",
    "state":"ny"
},
  "bbox": [
    -73.896966,
    40.832242,
    -73.890823,
    40.836687
],
  "geometry": {"coordinates":[[[-73.89696600000001,40.834343],[-73.895139,40.835429],[-73.894946,40.835665],[-73.89463000000001,40.835992],[-73.894334,40.836226],[-73.893946,40.836431],[-73.89364,40.836512],[-73.893377,40.83654],[-73.891481,40.836687],[-73.89138699999999,40.835758],[-73.890823,40.835809],[-73.891552,40.834653],[-73.89215799999999,40.833645],[-73.89173700000001,40.832664],[-73.892685,40.832344],[-73.89400000000001,40.832242],[-73.89419100000001,40.833291],[-73.895123,40.833197],[-73.896473,40.833047],[-73.89636900000001,40.83351],[-73.89696600000001,40.834343]]],"type":"Polygon"}
}