{
  "id": "360470298003",
  "type": "Feature",
  "properties": {
    "area_land":58034,
    "area_water":0,
    "geoid":"360470298003",
    "name":"Block Group 3",
    "state":"ny"
},
  "bbox": [
    -73.991599,
    40.599255,
    -73.987608,
    40.602303
],
  "geometry": {"coordinates":[[[-73.990972,40.601185],[-73.99039,40.601743],[-73.989808,40.602303],[-73.98760799999999,40.600973],[-73.988186,40.600412],[-73.988769,40.599855],[-73.989395,40.599255],[-73.99015,40.599705],[-73.990864,40.600134],[-73.99159899999999,40.600581],[-73.990972,40.601185]]],"type":"Polygon"}
}