{
  "id": "360271904022",
  "type": "Feature",
  "properties": {
    "area_land":4903103,
    "area_water":31882,
    "geoid":"360271904022",
    "name":"Block Group 2",
    "state":"ny"
},
  "bbox": [
    -73.88532,
    41.554692,
    -73.844532,
    41.574915
],
  "geometry": {"coordinates":[[[-73.88531999999999,41.556787],[-73.885295,41.55693],[-73.885221,41.557085],[-73.885122,41.557231],[-73.885004,41.557375],[-73.88479100000001,41.557595],[-73.884604,41.557749],[-73.884226,41.558042],[-73.88400900000001,41.558164],[-73.883506,41.558384],[-73.882856,41.558773],[-73.88236000000001,41.559041],[-73.88207,41.559163],[-73.88168400000001,41.559286],[-73.88132400000001,41.559419],[-73.88093499999999,41.559642],[-73.880841,41.559705],[-73.879959,41.560297],[-73.87967,41.560458],[-73.879237,41.560647],[-73.87872400000001,41.560895],[-73.878485,41.56099],[-73.87791199999999,41.561273],[-73.87832,41.56212],[-73.87850400000001,41.5625],[-73.878714,41.562989],[-73.87920800000001,41.56423],[-73.87934799999999,41.564526],[-73.879397,41.564607],[-73.87969699999999,41.564942],[-73.87990600000001,41.565217],[-73.880191,41.565556],[-73.880251,41.565644],[-73.88033900000001,41.565828],[-73.88052,41.566399],[-73.88073199999999,41.56698],[-73.880814,41.567281],[-73.880904,41.567556],[-73.880978,41.567739],[-73.881187,41.568039],[-73.881456,41.568335],[-73.88188,41.568939],[-73.882099,41.569295],[-73.882223,41.569521],[-73.88239400000001,41.569958],[-73.88249999999999,41.570286],[-73.882729,41.571232],[-73.882786,41.571574],[-73.88279799999999,41.571833],[-73.88281600000001,41.572671],[-73.88284400000001,41.572971],[-73.882904,41.573147],[-73.88328300000001,41.573799],[-73.883432,41.574025],[-73.88348499999999,41.574152],[-73.88352,41.574364],[-73.883515,41.574558],[-73.88344600000001,41.574915],[-73.88173500000001,41.574566],[-73.88134599999999,41.574504],[-73.881147,41.57446],[-73.880585,41.574358],[-73.88043399999999,41.57433],[-73.880167,41.574269],[-73.879649,41.574153],[-73.87881899999999,41.573991],[-73.877737,41.573854],[-73.877501,41.573829],[-73.877065,41.573818],[-73.876228,41.573787],[-73.875004,41.573815],[-73.873942,41.573777],[-73.872884,41.573662],[-73.872226,41.573628],[-73.871529,41.573623],[-73.87065200000001,41.573689],[-73.87008299999999,41.573766],[-73.869568,41.573839],[-73.86763500000001,41.574179],[-73.866686,41.57434],[-73.86614400000001,41.574387],[-73.864256,41.574501],[-73.863654,41.574506],[-73.863034,41.574474],[-73.862972,41.574471],[-73.861182,41.574415],[-73.86090299999999,41.574402],[-73.859405,41.574333],[-73.85907899999999,41.574314],[-73.858272,41.574206],[-73.856876,41.573981],[-73.855785,41.573794],[-73.855943,41.573451],[-73.856011,41.573354],[-73.85609100000001,41.573267],[-73.856212,41.573164],[-73.856594,41.572921],[-73.85667599999999,41.572838],[-73.856706,41.57275],[-73.856691,41.572639],[-73.856652,41.572602],[-73.856585,41.572584],[-73.85635000000001,41.572595],[-73.85624300000001,41.572627],[-73.855858,41.572876],[-73.855653,41.572972],[-73.855504,41.573018],[-73.855414,41.573036],[-73.855249,41.573051],[-73.855158,41.573048],[-73.855099,41.573036],[-73.855069,41.57302],[-73.85504299999999,41.572991],[-73.855017,41.572937],[-73.855009,41.572869],[-73.855048,41.572791],[-73.855154,41.572651],[-73.85516,41.572625],[-73.854986,41.572427],[-73.854929,41.572353],[-73.85491399999999,41.572306],[-73.85491500000001,41.572251],[-73.85496500000001,41.572113],[-73.854972,41.572008],[-73.85492000000001,41.571631],[-73.854815,41.571329],[-73.854811,41.571215],[-73.854855,41.571129],[-73.85499,41.570956],[-73.855047,41.570843],[-73.855064,41.570716],[-73.85501499999999,41.570405],[-73.855014,41.570189],[-73.854985,41.570098],[-73.854913,41.570009],[-73.854793,41.569928],[-73.854564,41.56982],[-73.854339,41.569648],[-73.854247,41.56959],[-73.854021,41.569507],[-73.853583,41.569425],[-73.85345700000001,41.569416],[-73.85335600000001,41.569421],[-73.853216,41.569453],[-73.853005,41.56952],[-73.85287,41.569541],[-73.85276399999999,41.569526],[-73.852698,41.569485],[-73.85262899999999,41.569394],[-73.85257300000001,41.569249],[-73.852546,41.569177],[-73.852526,41.569013],[-73.852541,41.568877],[-73.85257300000001,41.568768],[-73.85274699999999,41.568364],[-73.852782,41.568188],[-73.852772,41.568028],[-73.85269700000001,41.567751],[-73.852627,41.567545],[-73.852576,41.567396],[-73.85254,41.56722],[-73.852521,41.566994],[-73.85253,41.566707],[-73.85256,41.566523],[-73.85260100000001,41.566417],[-73.852782,41.566153],[-73.852808,41.566058],[-73.852802,41.565965],[-73.852733,41.565764],[-73.85269700000001,41.565707],[-73.852627,41.565648],[-73.852532,41.565614],[-73.852284,41.565588],[-73.85217400000001,41.565582],[-73.852053,41.565589],[-73.851929,41.565623],[-73.851747,41.565702],[-73.85160399999999,41.565734],[-73.851432,41.565743],[-73.850917,41.565709],[-73.850697,41.565713],[-73.850582,41.565735],[-73.850492,41.565771],[-73.850385,41.565849],[-73.85030399999999,41.565941],[-73.85024,41.566042],[-73.850027,41.566482],[-73.849942,41.566594],[-73.849875,41.566639],[-73.8498,41.566659],[-73.849667,41.566655],[-73.849389,41.566595],[-73.849192,41.56651],[-73.849071,41.566423],[-73.84903,41.566356],[-73.84903300000001,41.566263],[-73.849098,41.566112],[-73.849188,41.565985],[-73.84927399999999,41.565894],[-73.849441,41.565739],[-73.84949400000001,41.565651],[-73.84949899999999,41.565548],[-73.849468,41.565479],[-73.84941600000001,41.565441],[-73.84927999999999,41.565409],[-73.849091,41.565401],[-73.848844,41.565428],[-73.848786,41.565421],[-73.848732,41.56539],[-73.84870100000001,41.565336],[-73.84869,41.56529],[-73.84865499999999,41.565243],[-73.848613,41.565209],[-73.848536,41.565186],[-73.848281,41.565167],[-73.848119,41.565106],[-73.847962,41.565004],[-73.847857,41.564902],[-73.847843,41.564888],[-73.84773300000001,41.56473],[-73.847663,41.564554],[-73.847646,41.564406],[-73.847668,41.564275],[-73.84773800000001,41.564119],[-73.847804,41.563973],[-73.84782300000001,41.563837],[-73.847793,41.563685],[-73.84774299999999,41.563606],[-73.84768,41.563556],[-73.847584,41.563522],[-73.847516,41.563516],[-73.847371,41.563542],[-73.847262,41.563567],[-73.84717999999999,41.563563],[-73.84706199999999,41.563497],[-73.846969,41.563434],[-73.84687599999999,41.5634],[-73.846559,41.563355],[-73.846464,41.563313],[-73.845944,41.562918],[-73.84584,41.562852],[-73.84552600000001,41.56273],[-73.84533500000001,41.562615],[-73.845265,41.562559],[-73.845212,41.5625],[-73.845054,41.562353],[-73.84493399999999,41.562216],[-73.844857,41.562066],[-73.844857,41.562025],[-73.844882,41.562003],[-73.844927,41.562007],[-73.844967,41.562025],[-73.84508099999999,41.562113],[-73.845198,41.562187],[-73.84524999999999,41.562194],[-73.845327,41.562168],[-73.84536,41.562146],[-73.845437,41.561875],[-73.84552499999999,41.561618],[-73.845529,41.561563],[-73.845477,41.561504],[-73.845257,41.56146],[-73.84518,41.561434],[-73.845119,41.561383],[-73.845046,41.561233],[-73.845024,41.561177],[-73.844998,41.561152],[-73.844855,41.5611],[-73.84480000000001,41.561089],[-73.844759,41.561071],[-73.844708,41.561034],[-73.844638,41.560932],[-73.844605,41.560833],[-73.844543,41.560495],[-73.844532,41.560359],[-73.844559,41.560209],[-73.84463599999999,41.560018],[-73.844677,41.559948],[-73.844717,41.559908],[-73.844838,41.559856],[-73.84504,41.559867],[-73.845378,41.560018],[-73.84547000000001,41.560025],[-73.845569,41.560022],[-73.84565000000001,41.560007],[-73.845724,41.559963],[-73.845775,41.559915],[-73.845793,41.559864],[-73.845775,41.559772],[-73.845742,41.559724],[-73.845646,41.559658],[-73.845477,41.559566],[-73.845467,41.559558],[-73.850156,41.558984],[-73.853888,41.558556],[-73.858582,41.557921],[-73.859751,41.557714],[-73.86277200000001,41.557292],[-73.864064,41.557135],[-73.86744899999999,41.556725],[-73.867771,41.55668],[-73.870988,41.556328],[-73.873378,41.55611],[-73.874504,41.55597],[-73.878507,41.555475],[-73.88484,41.554692],[-73.884964,41.555224],[-73.884979,41.555382],[-73.884968,41.555565],[-73.88494799999999,41.555638],[-73.88493800000001,41.555675],[-73.884913,41.555855],[-73.884935,41.555995],[-73.88503799999999,41.556211],[-73.88524700000001,41.556435],[-73.885306,41.556556],[-73.88531999999999,41.556637],[-73.88531999999999,41.556787]]],"type":"Polygon"}
}