{
  "id": "360670152022",
  "type": "Feature",
  "properties": {
    "area_land":4955008,
    "area_water":0,
    "geoid":"360670152022",
    "name":"Block Group 2",
    "state":"ny"
},
  "bbox": [
    -75.976743,
    42.992659,
    -75.946048,
    43.024261
],
  "geometry": {"coordinates":[[[-75.976743,43.024261],[-75.97440400000001,43.023785],[-75.973795,43.023671],[-75.972072,43.023367],[-75.971847,43.023331],[-75.971132,43.023196],[-75.970359,43.023049],[-75.96946800000001,43.022896],[-75.967719,43.022551],[-75.966317,43.022258],[-75.962379,43.021479],[-75.961381,43.021262],[-75.95757,43.020331],[-75.95713600000001,43.020205],[-75.956574,43.020027],[-75.956176,43.019868],[-75.95590799999999,43.019728],[-75.955612,43.019546],[-75.955281,43.019328],[-75.954493,43.018793],[-75.95374099999999,43.018217],[-75.951305,43.016233],[-75.950875,43.015879],[-75.948027,43.013583],[-75.946048,43.012006],[-75.946309,43.01192],[-75.951261,43.010228],[-75.95133800000001,43.0102],[-75.956332,43.008526],[-75.95626799999999,43.00764],[-75.95616200000001,43.006161],[-75.956058,43.004565],[-75.956008,43.003846],[-75.95597600000001,43.003403],[-75.95581799999999,43.001322],[-75.955744,43.000341],[-75.955736,43.000138],[-75.95573400000001,43.000072],[-75.955731,43.000019],[-75.95572199999999,42.99992],[-75.955693,42.999657],[-75.95562099999999,42.998572],[-75.955579,42.998017],[-75.95552600000001,42.997349],[-75.955495,42.996832],[-75.955432,42.996062],[-75.9554,42.995719],[-75.9554,42.995525],[-75.955409,42.995391],[-75.955455,42.995247],[-75.955513,42.995126],[-75.955735,42.994813],[-75.95612,42.994337],[-75.956287,42.99416],[-75.957161,42.993354],[-75.957504,42.99304],[-75.957947,42.992659],[-75.960167,42.994308],[-75.961305,42.995164],[-75.962132,42.995785],[-75.96338799999999,42.996716],[-75.963707,42.996925],[-75.963921,42.997054],[-75.964277,42.99727],[-75.96588199999999,42.998139],[-75.96754900000001,42.999032],[-75.968649,42.999624],[-75.968968,42.999785],[-75.969283,42.999927],[-75.974189,43.001234],[-75.975894,43.001689],[-75.976535,43.001909],[-75.97635699999999,43.001953],[-75.97527599999999,43.002232],[-75.975314,43.002529],[-75.97537199999999,43.003195],[-75.975382,43.00354],[-75.97545700000001,43.004905],[-75.975505,43.005386],[-75.97555800000001,43.00641],[-75.975567,43.00653],[-75.97568099999999,43.00824],[-75.975723,43.009208],[-75.97589499999999,43.011663],[-75.975955,43.012634],[-75.976043,43.013848],[-75.976184,43.015967],[-75.976288,43.017381],[-75.97632900000001,43.018188],[-75.976477,43.02022],[-75.976652,43.02295],[-75.976743,43.024261]]],"type":"Polygon"}
}