{
  "id": "360610068005",
  "type": "Feature",
  "properties": {
    "area_land":24250,
    "area_water":0,
    "geoid":"360610068005",
    "name":"Block Group 5",
    "state":"ny"
},
  "bbox": [
    -73.984261,
    40.739497,
    -73.981762,
    40.741408
],
  "geometry": {"coordinates":[[[-73.983812,40.74079],[-73.983362,40.741408],[-73.98291,40.741217],[-73.982254,40.740941],[-73.981762,40.740733],[-73.98221100000001,40.740115],[-73.982665,40.739497],[-73.983119,40.739689],[-73.984261,40.740172],[-73.983812,40.74079]]],"type":"Polygon"}
}