{
  "id": "360910614032",
  "type": "Feature",
  "properties": {
    "area_land":5506451,
    "area_water":3761,
    "geoid":"360910614032",
    "name":"Block Group 2",
    "state":"ny"
},
  "bbox": [
    -73.886822,
    42.997985,
    -73.85822,
    43.026842
],
  "geometry": {"coordinates":[[[-73.886638,43.026708],[-73.886267,43.026613],[-73.88593899999999,43.026577],[-73.885595,43.026552],[-73.88171199999999,43.026625],[-73.87954000000001,43.026685],[-73.878941,43.026704],[-73.877517,43.02673],[-73.87653299999999,43.026758],[-73.873299,43.026842],[-73.872422,43.026832],[-73.872186,43.026813],[-73.871672,43.02673],[-73.87071299999999,43.026517],[-73.869518,43.026305],[-73.869409,43.026301],[-73.86853600000001,43.026191],[-73.867992,43.026123],[-73.867028,43.025999],[-73.866438,43.025966],[-73.866457,43.025284],[-73.866404,43.024607],[-73.86631800000001,43.023882],[-73.86626699999999,43.023368],[-73.866276,43.023237],[-73.866317,43.023101],[-73.866437,43.022826],[-73.866721,43.022282],[-73.867487,43.020645],[-73.867771,43.020085],[-73.867867,43.019837],[-73.867923,43.019632],[-73.867918,43.019443],[-73.86791599999999,43.019328],[-73.867901,43.019029],[-73.867875,43.018792],[-73.86781999999999,43.018609],[-73.867774,43.018543],[-73.86771299999999,43.018485],[-73.867615,43.018412],[-73.86697100000001,43.018003],[-73.86680699999999,43.017899],[-73.866631,43.017787],[-73.866502,43.01769],[-73.866355,43.017591],[-73.86615399999999,43.017457],[-73.86589499999999,43.017258],[-73.86582,43.017199],[-73.865745,43.017141],[-73.865279,43.016811],[-73.865185,43.01675],[-73.86515,43.016727],[-73.864644,43.016355],[-73.864463,43.016217],[-73.86359,43.015605],[-73.863411,43.015471],[-73.863642,43.015103],[-73.86193900000001,43.013922],[-73.86134699999999,43.013288],[-73.860466,43.012485],[-73.860113,43.012151],[-73.85963099999999,43.010942],[-73.85951799999999,43.010682],[-73.85915,43.010425],[-73.85856200000001,43.010338],[-73.85822,43.010285],[-73.860015,43.009022],[-73.861767,43.007862],[-73.86171299999999,43.007748],[-73.861417,43.003668],[-73.860975,43.000135],[-73.86091999999999,43.000133],[-73.86091399999999,42.999913],[-73.861329,42.999881],[-73.863133,42.999741],[-73.864536,42.999616],[-73.8657,42.999506],[-73.86741600000001,42.999387],[-73.86802400000001,42.999337],[-73.869089,42.999225],[-73.86953,42.999198],[-73.870698,42.999087],[-73.87178,42.999023],[-73.875142,42.99875],[-73.877782,42.998556],[-73.878338,42.998516],[-73.879606,42.998413],[-73.88215,42.998181],[-73.88404800000001,42.997985],[-73.88432899999999,42.998952],[-73.88438499999999,42.999164],[-73.884443,43.00008],[-73.884522,43.003108],[-73.88467799999999,43.004641],[-73.88481,43.005723],[-73.884861,43.006046],[-73.885124,43.007865],[-73.88533200000001,43.009224],[-73.885425,43.009935],[-73.885465,43.010365],[-73.88545000000001,43.010637],[-73.885396,43.010867],[-73.88527999999999,43.011214],[-73.884952,43.011951],[-73.88484099999999,43.012269],[-73.88478600000001,43.01256],[-73.884782,43.012937],[-73.88500999999999,43.014634],[-73.885215,43.016003],[-73.885532,43.018105],[-73.88602299999999,43.021865],[-73.886358,43.024029],[-73.886822,43.026768],[-73.886638,43.026708]]],"type":"Polygon"}
}