{
  "id": "360070018002",
  "type": "Feature",
  "properties": {
    "area_land":476181,
    "area_water":0,
    "geoid":"360070018002",
    "name":"Block Group 2",
    "state":"ny"
},
  "bbox": [
    -75.886829,
    42.090947,
    -75.875161,
    42.099456
],
  "geometry": {"coordinates":[[[-75.88682900000001,42.095296],[-75.88637300000001,42.095472],[-75.885324,42.09585],[-75.88425700000001,42.096245],[-75.884101,42.096297],[-75.884024,42.096311],[-75.88416700000001,42.097536],[-75.88305,42.097868],[-75.88194799999999,42.098201],[-75.88085599999999,42.098535],[-75.87972499999999,42.098876],[-75.87859400000001,42.099225],[-75.878325,42.099281],[-75.87783399999999,42.099337],[-75.87652199999999,42.099456],[-75.876484,42.099302],[-75.876133,42.09835],[-75.875941,42.097926],[-75.875567,42.097085],[-75.875263,42.096379],[-75.87516100000001,42.096166],[-75.87958,42.093729],[-75.879639,42.093499],[-75.879733,42.093453],[-75.880038,42.093176],[-75.88076,42.09276],[-75.88284,42.091575],[-75.88340100000001,42.091319],[-75.88394,42.091074],[-75.884163,42.090947],[-75.884288,42.091144],[-75.884336,42.091218],[-75.884609,42.091676],[-75.884722,42.091866],[-75.885223,42.092657],[-75.885577,42.093222],[-75.885685,42.093396],[-75.88655300000001,42.094902],[-75.886746,42.095206],[-75.88682900000001,42.095296]]],"type":"Polygon"}
}