{
  "id": "360272201001",
  "type": "Feature",
  "properties": {
    "area_land":448367,
    "area_water":182700,
    "geoid":"360272201001",
    "name":"Block Group 1",
    "state":"ny"
},
  "bbox": [
    -73.944971,
    41.710471,
    -73.929385,
    41.716161
],
  "geometry": {"coordinates":[[[-73.944971,41.710582],[-73.94448199999999,41.714393],[-73.944435,41.714634],[-73.939457,41.714572],[-73.937843,41.714558],[-73.937596,41.71455],[-73.937556,41.714554],[-73.93710299999999,41.714555],[-73.93707499999999,41.714559],[-73.937059,41.714563],[-73.937026,41.714572],[-73.93699599999999,41.714585],[-73.936966,41.7146],[-73.936943,41.714613],[-73.936841,41.714678],[-73.936814,41.714696],[-73.936787,41.714714],[-73.936762,41.714733],[-73.93673699999999,41.714753],[-73.93671399999999,41.714773],[-73.936691,41.714794],[-73.936644,41.714861],[-73.936588,41.714939],[-73.936531,41.715016],[-73.936502,41.715051],[-73.936137,41.71544],[-73.935796,41.715361],[-73.93529700000001,41.715294],[-73.935131,41.715293],[-73.933201,41.715284],[-73.93081599999999,41.715862],[-73.930638,41.715925],[-73.93040999999999,41.715979],[-73.930221,41.716004],[-73.92981899999999,41.716055],[-73.92979699999999,41.716059],[-73.92976899999999,41.716066],[-73.92973000000001,41.716078],[-73.929676,41.7161],[-73.92959399999999,41.716141],[-73.929568,41.716158],[-73.92943200000001,41.716161],[-73.929421,41.716005],[-73.929407,41.715797],[-73.929385,41.715643],[-73.929385,41.71554],[-73.929388,41.71545],[-73.929396,41.715336],[-73.929429,41.715112],[-73.929472,41.714767],[-73.929519,41.714415],[-73.929528,41.714227],[-73.929568,41.713767],[-73.92960100000001,41.713329],[-73.92966199999999,41.712559],[-73.92971,41.711762],[-73.929692,41.711525],[-73.929664,41.711328],[-73.929582,41.710788],[-73.93021299999999,41.710664],[-73.930806,41.710565],[-73.931513,41.710492],[-73.931961,41.710483],[-73.933854,41.710485],[-73.935067,41.710479],[-73.93623599999999,41.710475],[-73.936334,41.710475],[-73.936622,41.710475],[-73.936699,41.710475],[-73.936903,41.710475],[-73.937027,41.710475],[-73.937062,41.710475],[-73.937141,41.710475],[-73.93723,41.710475],[-73.93770000000001,41.710478],[-73.93772300000001,41.710478],[-73.937888,41.710471],[-73.940268,41.710495],[-73.94477999999999,41.710582],[-73.944971,41.710582]]],"type":"Polygon"}
}