{
  "id": "360470250001",
  "type": "Feature",
  "properties": {
    "area_land":115315,
    "area_water":0,
    "geoid":"360470250001",
    "name":"Block Group 1",
    "state":"ny"
},
  "bbox": [
    -73.997484,
    40.621994,
    -73.99255,
    40.626826
],
  "geometry": {"coordinates":[[[-73.997241,40.625289],[-73.997017,40.626062],[-73.996878,40.62653],[-73.996788,40.626826],[-73.995079,40.625807],[-73.994649,40.625698],[-73.99473399999999,40.625615],[-73.99489199999999,40.625462],[-73.994325,40.625343],[-73.993982,40.625142],[-73.99254999999999,40.624274],[-73.99312999999999,40.623715],[-73.993711,40.623156],[-73.99394100000001,40.622935],[-73.994293,40.622597],[-73.99491999999999,40.621994],[-73.997122,40.623323],[-73.996498,40.623923],[-73.997484,40.62452],[-73.997241,40.625289]]],"type":"Polygon"}
}