{
  "id": "360259709001",
  "type": "Feature",
  "properties": {
    "area_land":822009,
    "area_water":0,
    "geoid":"360259709001",
    "name":"Block Group 1",
    "state":"ny"
},
  "bbox": [
    -74.932319,
    42.264923,
    -74.921521,
    42.279859
],
  "geometry": {"coordinates":[[[-74.931095,42.274931],[-74.92739,42.279859],[-74.927347,42.279801],[-74.92722000000001,42.279603],[-74.92710099999999,42.279386],[-74.92692,42.279175],[-74.92670200000001,42.278985],[-74.92648699999999,42.278823],[-74.926107,42.278512],[-74.92598099999999,42.278395],[-74.92593599999999,42.278354],[-74.925777,42.278174],[-74.92563699999999,42.277971],[-74.92550199999999,42.277755],[-74.925375,42.277539],[-74.92517100000001,42.277226],[-74.925152,42.277197],[-74.925051,42.277084],[-74.92502,42.277064],[-74.924989,42.277016],[-74.924965,42.276973],[-74.92493,42.276909],[-74.924893,42.276827],[-74.924871,42.27681],[-74.924871,42.276788],[-74.924853,42.276775],[-74.924834,42.276717],[-74.92480500000001,42.276701],[-74.92480500000001,42.276673],[-74.92478300000001,42.276646],[-74.924746,42.276558],[-74.924723,42.27653],[-74.924672,42.276448],[-74.92455099999999,42.276306],[-74.924531,42.276283],[-74.924502,42.276267],[-74.924494,42.276249],[-74.924295,42.27608],[-74.923903,42.275816],[-74.923807,42.27574],[-74.923748,42.275668],[-74.923733,42.27563],[-74.923711,42.275613],[-74.92369600000001,42.275547],[-74.92369600000001,42.275394],[-74.923711,42.275131],[-74.923727,42.275114],[-74.923748,42.274916],[-74.923755,42.27468],[-74.923742,42.274581],[-74.923725,42.274564],[-74.923704,42.274411],[-74.923693,42.274395],[-74.92366699999999,42.274301],[-74.92364499999999,42.274285],[-74.92364499999999,42.274251],[-74.92362900000001,42.274235],[-74.92359999999999,42.274136],[-74.923571,42.27412],[-74.923563,42.274082],[-74.923534,42.274065],[-74.923497,42.273999],[-74.923475,42.273972],[-74.923327,42.273834],[-74.923209,42.273741],[-74.923185,42.273737],[-74.923068,42.273681],[-74.922957,42.27362],[-74.922787,42.273538],[-74.92276200000001,42.273536],[-74.922743,42.273522],[-74.922719,42.273517],[-74.922676,42.273494],[-74.922651,42.273493],[-74.922595,42.273467],[-74.922543,42.273456],[-74.922484,42.273428],[-74.92244700000001,42.273417],[-74.92241799999999,42.273401],[-74.922393,42.2734],[-74.922358,42.273384],[-74.922336,42.273362],[-74.922307,42.273362],[-74.922284,42.273346],[-74.922253,42.273333],[-74.922211,42.273324],[-74.922191,42.273309],[-74.922166,42.273307],[-74.922146,42.273295],[-74.9221,42.273291],[-74.922078,42.273269],[-74.922028,42.273259],[-74.921989,42.273252],[-74.921967,42.27323],[-74.921907,42.273225],[-74.92187800000001,42.273203],[-74.921853,42.273194],[-74.92182699999999,42.273187],[-74.92181100000001,42.273087],[-74.921778,42.27293],[-74.92173200000001,42.272701],[-74.921717,42.272626],[-74.921656,42.27232],[-74.92162999999999,42.272191],[-74.921606,42.272007],[-74.92156199999999,42.27166],[-74.921531,42.271237],[-74.921521,42.270804],[-74.921537,42.270372],[-74.921556,42.270237],[-74.921561,42.270093],[-74.921572,42.269953],[-74.92161299999999,42.269688],[-74.92165900000001,42.269575],[-74.92167000000001,42.269534],[-74.921736,42.2693],[-74.92183199999999,42.26903],[-74.92194499999999,42.268756],[-74.92201300000001,42.268621],[-74.92209,42.268485],[-74.922173,42.268355],[-74.92236,42.268098],[-74.922528,42.26789],[-74.92265399999999,42.267734],[-74.92282,42.267545],[-74.922963,42.267383],[-74.923075,42.26727],[-74.923186,42.267149],[-74.92335,42.266982],[-74.923424,42.266906],[-74.923554,42.266785],[-74.92368399999999,42.266663],[-74.923957,42.266433],[-74.924233,42.266213],[-74.924514,42.266006],[-74.92495,42.265707],[-74.926227,42.264923],[-74.926506,42.26504],[-74.928657,42.268097],[-74.93231900000001,42.2733],[-74.931095,42.274931]]],"type":"Polygon"}
}