{
  "id": "360430102022",
  "type": "Feature",
  "properties": {
    "area_land":53256804,
    "area_water":68550,
    "geoid":"360430102022",
    "name":"Block Group 2",
    "state":"ny"
},
  "bbox": [
    -75.209822,
    43.008201,
    -75.077769,
    43.091557
],
  "geometry": {"coordinates":[[[-75.20981999999999,43.025296],[-75.209788,43.025613],[-75.20972399999999,43.025952],[-75.20958299999999,43.026365],[-75.20902599999999,43.027762],[-75.208769,43.028418],[-75.208685,43.028634],[-75.208534,43.029037],[-75.208242,43.02989],[-75.207976,43.030862],[-75.207798,43.03146],[-75.20756299999999,43.032441],[-75.207463,43.032808],[-75.20737699999999,43.033078],[-75.206801,43.034559],[-75.206464,43.035339],[-75.20615599999999,43.035976],[-75.20587399999999,43.036496],[-75.205735,43.036728],[-75.20563900000001,43.03685],[-75.20554,43.036918],[-75.20548599999999,43.036951],[-75.20496799999999,43.0374],[-75.204521,43.037816],[-75.204261,43.038044],[-75.20376,43.038498],[-75.20347099999999,43.038809],[-75.20327899999999,43.039051],[-75.203007,43.039498],[-75.20290300000001,43.039722],[-75.20284100000001,43.039928],[-75.202806,43.04014],[-75.202797,43.040445],[-75.202906,43.042624],[-75.202928,43.042864],[-75.202985,43.043045],[-75.203047,43.04314],[-75.202539,43.043563],[-75.202167,43.043893],[-75.201532,43.044525],[-75.201342,43.044697],[-75.20109100000001,43.044877],[-75.201037,43.04491],[-75.19948100000001,43.045721],[-75.199332,43.045846],[-75.19925000000001,43.04597],[-75.19919,43.046137],[-75.199153,43.046331],[-75.19446600000001,43.045246],[-75.193703,43.045151],[-75.192965,43.045036],[-75.18943899999999,43.044443],[-75.188705,43.044292],[-75.188355,43.044238],[-75.18826799999999,43.044238],[-75.18802700000001,43.044268],[-75.187651,43.044357],[-75.186812,43.0446],[-75.18652400000001,43.044652],[-75.186296,43.044655],[-75.186071,43.04461],[-75.18548800000001,43.044429],[-75.185377,43.044225],[-75.185253,43.043918],[-75.185152,43.043513],[-75.18513299999999,43.043276],[-75.18513299999999,43.043065],[-75.185164,43.042751],[-75.18526,43.042181],[-75.185151,43.04219],[-75.18504299999999,43.042231],[-75.184839,43.042353],[-75.183288,43.043454],[-75.182782,43.043785],[-75.182102,43.044178],[-75.180406,43.045049],[-75.179822,43.045301],[-75.179401,43.04549],[-75.179102,43.04566],[-75.17887500000001,43.045844],[-75.178785,43.045929],[-75.17863199999999,43.046114],[-75.177576,43.047424],[-75.17723100000001,43.047834],[-75.174727,43.050681],[-75.174626,43.050781],[-75.17422999999999,43.050584],[-75.172681,43.049874],[-75.171262,43.049209],[-75.169664,43.051104],[-75.16894600000001,43.051964],[-75.168595,43.052371],[-75.167655,43.053507],[-75.167376,43.053795],[-75.167205,43.053928],[-75.16703800000001,43.054009],[-75.16688000000001,43.054051],[-75.163544,43.054513],[-75.162718,43.054612],[-75.16271,43.054661],[-75.16247799999999,43.054898],[-75.161464,43.056087],[-75.161175,43.056475],[-75.161118,43.056598],[-75.161106,43.056741],[-75.16113199999999,43.056861],[-75.161169,43.056959],[-75.161288,43.057157],[-75.161559,43.057537],[-75.161925,43.057988],[-75.162081,43.058144],[-75.162403,43.058398],[-75.163158,43.058927],[-75.16400400000001,43.059494],[-75.164174,43.059639],[-75.164266,43.059749],[-75.164349,43.059902],[-75.164626,43.060816],[-75.16486500000001,43.061718],[-75.164956,43.061934],[-75.165117,43.062152],[-75.165554,43.062691],[-75.16577700000001,43.06295],[-75.16644700000001,43.063637],[-75.166786,43.063992],[-75.16699800000001,43.064172],[-75.167389,43.064449],[-75.16824099999999,43.065006],[-75.168993,43.065491],[-75.169133,43.065613],[-75.16916500000001,43.065658],[-75.16918099999999,43.065735],[-75.169162,43.065832],[-75.168977,43.06609],[-75.16843900000001,43.066716],[-75.16699699999999,43.068492],[-75.166791,43.068753],[-75.166169,43.069484],[-75.16605800000001,43.069636],[-75.16674,43.069977],[-75.167429,43.070298],[-75.168498,43.070759],[-75.168795,43.070896],[-75.16924299999999,43.07109],[-75.169703,43.071288],[-75.170305,43.071531],[-75.172102,43.072177],[-75.172538,43.072301],[-75.17291,43.072389],[-75.174324,43.072696],[-75.175408,43.07301],[-75.176678,43.073366],[-75.17712400000001,43.073519],[-75.176209,43.074649],[-75.175191,43.075876],[-75.17454499999999,43.076663],[-75.173771,43.077605],[-75.17293100000001,43.078632],[-75.172856,43.078723],[-75.172082,43.079666],[-75.170813,43.081215],[-75.16901900000001,43.083406],[-75.167998,43.084684],[-75.16776,43.08501],[-75.167063,43.084882],[-75.166595,43.084828],[-75.166014,43.084795],[-75.16503899999999,43.084776],[-75.164562,43.085322],[-75.164495,43.085407],[-75.164434,43.085484],[-75.164267,43.085684],[-75.164134,43.085845],[-75.164081,43.085904],[-75.164064,43.085923],[-75.16385699999999,43.086148],[-75.163764,43.086246],[-75.163567,43.086442],[-75.163248,43.086708],[-75.16305199999999,43.086846],[-75.162688,43.087082],[-75.162542,43.087171],[-75.16231000000001,43.08732],[-75.162059,43.087479],[-75.161602,43.087792],[-75.16135,43.087982],[-75.161177,43.088123],[-75.160967,43.088299],[-75.16047399999999,43.088738],[-75.16040099999999,43.088808],[-75.16030499999999,43.0889],[-75.16022599999999,43.088978],[-75.160128,43.089072],[-75.159941,43.089252],[-75.157539,43.091557],[-75.157473,43.091408],[-75.15753100000001,43.091011],[-75.157465,43.090716],[-75.15716999999999,43.090361],[-75.156357,43.090006],[-75.155512,43.089543],[-75.154922,43.089037],[-75.154602,43.088297],[-75.154273,43.087443],[-75.15405,43.086582],[-75.154043,43.086496],[-75.153845,43.086034],[-75.15346700000001,43.085745],[-75.152663,43.085584],[-75.151826,43.085354],[-75.150841,43.084991],[-75.149953,43.084494],[-75.148917,43.083989],[-75.14809,43.083732],[-75.146998,43.083252],[-75.146856,43.083197],[-75.146011,43.082872],[-75.144936,43.082469],[-75.144435,43.082206],[-75.143722,43.082003],[-75.143236,43.08178],[-75.14281,43.081479],[-75.142533,43.081242],[-75.14197900000001,43.080865],[-75.14161900000001,43.080647],[-75.14096499999999,43.080464],[-75.14066200000001,43.080398],[-75.140275,43.080357],[-75.139714,43.080341],[-75.13941800000001,43.080338],[-75.139273,43.080352],[-75.139003,43.08044],[-75.138499,43.080525],[-75.138352,43.080564],[-75.138216,43.080633],[-75.13781,43.080795],[-75.13739200000001,43.081006],[-75.137045,43.081224],[-75.136922,43.081333],[-75.13681800000001,43.081407],[-75.136707,43.081454],[-75.13661,43.081477],[-75.136521,43.081479],[-75.13639000000001,43.081448],[-75.136157,43.081315],[-75.135862,43.08088],[-75.13573700000001,43.080516],[-75.135886,43.079686],[-75.136178,43.078961],[-75.13584,43.078469],[-75.134638,43.078097],[-75.13353600000001,43.078127],[-75.13273599999999,43.078293],[-75.131314,43.078068],[-75.128097,43.077336],[-75.126313,43.076148],[-75.12587000000001,43.075359],[-75.125274,43.074729],[-75.12469900000001,43.073854],[-75.124381,43.073521],[-75.124078,43.073332],[-75.124078,43.073311],[-75.124167,43.073255],[-75.124172,43.073215],[-75.124154,43.0732],[-75.124127,43.073193],[-75.124098,43.073197],[-75.12396099999999,43.073272],[-75.123936,43.073275],[-75.12391599999999,43.073264],[-75.12391100000001,43.073246],[-75.12392199999999,43.073222],[-75.123982,43.073171],[-75.12405800000001,43.073137],[-75.124056,43.073102],[-75.12396699999999,43.073106],[-75.123938,43.073077],[-75.123949,43.073037],[-75.124047,43.072993],[-75.12406900000001,43.072968],[-75.124072,43.072941],[-75.124038,43.072792],[-75.12372999999999,43.072104],[-75.123591,43.071923],[-75.12343,43.071773],[-75.123316,43.071697],[-75.123037,43.071492],[-75.12128300000001,43.070409],[-75.120169,43.069704],[-75.119603,43.069383],[-75.11939099999999,43.069275],[-75.11913300000001,43.069167],[-75.118695,43.068964],[-75.11717400000001,43.068148],[-75.117062,43.068067],[-75.11689699999999,43.067929],[-75.11677400000001,43.067844],[-75.116654,43.067775],[-75.1163,43.06761],[-75.11610400000001,43.067529],[-75.11584999999999,43.067454],[-75.114987,43.067308],[-75.114653,43.067265],[-75.114414,43.067219],[-75.112943,43.066883],[-75.11147699999999,43.066565],[-75.110787,43.066394],[-75.110491,43.066298],[-75.110052,43.066117],[-75.109471,43.065831],[-75.108582,43.065183],[-75.10834699999999,43.064967],[-75.108266,43.064852],[-75.10822400000001,43.06476],[-75.108131,43.064215],[-75.107962,43.063198],[-75.107889,43.063079],[-75.107827,43.063006],[-75.107727,43.062925],[-75.107585,43.062852],[-75.107427,43.062787],[-75.106471,43.062501],[-75.105965,43.062398],[-75.105761,43.062366],[-75.10559600000001,43.062355],[-75.105411,43.062355],[-75.104353,43.062435],[-75.10408,43.062442],[-75.103857,43.062428],[-75.103719,43.062402],[-75.10326000000001,43.062289],[-75.102423,43.062012],[-75.100977,43.061637],[-75.100438,43.061524],[-75.099885,43.06144],[-75.09859299999999,43.061331],[-75.098367,43.061346],[-75.098203,43.061375],[-75.097944,43.061462],[-75.09760300000001,43.061659],[-75.09748999999999,43.061739],[-75.09724199999999,43.062009],[-75.09709599999999,43.062125],[-75.096473,43.062501],[-75.096307,43.062616],[-75.096093,43.062726],[-75.095692,43.062803],[-75.095161,43.062849],[-75.094734,43.062849],[-75.094533,43.062823],[-75.094326,43.062771],[-75.093951,43.062635],[-75.093639,43.062501],[-75.093003,43.062033],[-75.09276300000001,43.061829],[-75.092653,43.06172],[-75.092551,43.0616],[-75.092446,43.061447],[-75.092322,43.061173],[-75.092276,43.061017],[-75.092243,43.060849],[-75.092203,43.060528],[-75.092201,43.060255],[-75.09227799999999,43.059949],[-75.092648,43.059068],[-75.092724,43.05894],[-75.092983,43.058638],[-75.09321799999999,43.058343],[-75.09339,43.058029],[-75.093445,43.057876],[-75.09347699999999,43.057563],[-75.09346600000001,43.057447],[-75.09339199999999,43.057141],[-75.09331899999999,43.05702],[-75.093282,43.056987],[-75.09322,43.056973],[-75.093166,43.056973],[-75.093107,43.056991],[-75.09274600000001,43.057217],[-75.09262200000001,43.057275],[-75.092535,43.057294],[-75.092429,43.057304],[-75.09194599999999,43.057272],[-75.091652,43.057203],[-75.09111799999999,43.057031],[-75.090311,43.056867],[-75.09016099999999,43.056853],[-75.090008,43.05686],[-75.08991,43.056875],[-75.08980099999999,43.056904],[-75.089079,43.057177],[-75.088599,43.057326],[-75.08842799999999,43.057359],[-75.08828200000001,43.057366],[-75.08812500000001,43.057359],[-75.08793900000001,43.057323],[-75.087772,43.057246],[-75.08732500000001,43.056827],[-75.086913,43.056408],[-75.086355,43.055989],[-75.08622800000001,43.055858],[-75.086151,43.05576],[-75.086096,43.055669],[-75.08606399999999,43.055592],[-75.086022,43.055432],[-75.086,43.055283],[-75.086018,43.05513],[-75.086051,43.054984],[-75.086106,43.054864],[-75.086231,43.05451],[-75.08625000000001,43.054365],[-75.08623900000001,43.054197],[-75.086191,43.05404],[-75.085998,43.053589],[-75.08572100000001,43.053079],[-75.08557500000001,43.052904],[-75.085272,43.052583],[-75.085156,43.052474],[-75.085087,43.052423],[-75.084806,43.052277],[-75.08335700000001,43.051756],[-75.08244000000001,43.05137],[-75.08181999999999,43.05109],[-75.081253,43.050816],[-75.08107800000001,43.05074],[-75.080899,43.050711],[-75.08075700000001,43.0507],[-75.08036300000001,43.050711],[-75.080066,43.050732],[-75.079953,43.050762],[-75.079869,43.050794],[-75.079778,43.050842],[-75.079476,43.051082],[-75.079352,43.05117],[-75.079228,43.051221],[-75.07914,43.051246],[-75.078991,43.051257],[-75.078799,43.051253],[-75.078675,43.051232],[-75.07850000000001,43.051144],[-75.07799,43.050762],[-75.077791,43.050477],[-75.077769,43.050372],[-75.07777900000001,43.050289],[-75.07778399999999,43.050241],[-75.077816,43.050171],[-75.077871,43.050077],[-75.07807200000001,43.049891],[-75.07829099999999,43.049749],[-75.078506,43.049658],[-75.07885,43.049563],[-75.07898900000001,43.049487],[-75.07911300000001,43.049374],[-75.079182,43.049243],[-75.07922600000001,43.0491],[-75.079256,43.049084],[-75.07991800000001,43.048343],[-75.080471,43.04772],[-75.080544,43.047656],[-75.08035,43.047493],[-75.080274,43.04743],[-75.080321,43.047352],[-75.081081,43.046457],[-75.08148199999999,43.045985],[-75.082544,43.04473],[-75.08292899999999,43.044252],[-75.08404,43.042913],[-75.084276,43.042634],[-75.084937,43.041834],[-75.085103,43.041631],[-75.085427,43.041245],[-75.085487,43.041166],[-75.08583299999999,43.04098],[-75.08601899999999,43.04088],[-75.08531600000001,43.039646],[-75.084957,43.039013],[-75.083596,43.036626],[-75.080646,43.031425],[-75.080023,43.030334],[-75.079848,43.030026],[-75.07957,43.02954],[-75.079336,43.029129],[-75.079545,43.02901],[-75.079972,43.028785],[-75.080307,43.028629],[-75.081395,43.028162],[-75.082488,43.027715],[-75.08270400000001,43.027642],[-75.08296900000001,43.027576],[-75.08325000000001,43.02752],[-75.083513,43.027485],[-75.083738,43.027467],[-75.084093,43.027452],[-75.08436399999999,43.027465],[-75.084639,43.027492],[-75.08493,43.027538],[-75.085221,43.027604],[-75.08534299999999,43.027632],[-75.08550700000001,43.027669],[-75.08580600000001,43.027737],[-75.086178,43.02782],[-75.08676199999999,43.027926],[-75.08789400000001,43.02806],[-75.089061,43.028198],[-75.089539,43.028226],[-75.089848,43.028264],[-75.090548,43.028399],[-75.090783,43.028421],[-75.09099999999999,43.028412],[-75.09159699999999,43.028346],[-75.091945,43.028285],[-75.092578,43.028081],[-75.09285300000001,43.028026],[-75.093142,43.028005],[-75.094022,43.02798],[-75.094161,43.028001],[-75.094539,43.028145],[-75.094741,43.028211],[-75.09492899999999,43.028243],[-75.095221,43.028237],[-75.09606700000001,43.02816],[-75.096318,43.028166],[-75.09657799999999,43.028213],[-75.097224,43.028394],[-75.097599,43.028493],[-75.097769,43.028514],[-75.098084,43.028523],[-75.098271,43.028494],[-75.09843499999999,43.02844],[-75.09863900000001,43.028333],[-75.099166,43.02798],[-75.09929099999999,43.027925],[-75.099431,43.027916],[-75.100067,43.028039],[-75.100298,43.02805],[-75.10050699999999,43.028029],[-75.100707,43.02798],[-75.101022,43.027831],[-75.10142500000001,43.027649],[-75.101607,43.027596],[-75.10166599999999,43.027588],[-75.10178500000001,43.027571],[-75.101951,43.027566],[-75.102102,43.027588],[-75.102853,43.027827],[-75.10315799999999,43.027887],[-75.103363,43.027905],[-75.10372,43.027887],[-75.10390200000001,43.027852],[-75.10404699999999,43.027799],[-75.104128,43.027736],[-75.104196,43.027648],[-75.104285,43.027465],[-75.104366,43.02715],[-75.104384,43.027079],[-75.10440699999999,43.026983],[-75.104438,43.026844],[-75.104519,43.026495],[-75.10458199999999,43.026346],[-75.104659,43.026257],[-75.10477899999999,43.026164],[-75.104916,43.026086],[-75.105369,43.025875],[-75.105619,43.025747],[-75.105966,43.025503],[-75.106341,43.025211],[-75.106765,43.024849],[-75.106848,43.024752],[-75.106938,43.024595],[-75.107011,43.024392],[-75.107101,43.023843],[-75.107164,43.023674],[-75.107499,43.023186],[-75.107615,43.023027],[-75.107716,43.022927],[-75.10821900000001,43.022588],[-75.108377,43.02244],[-75.10852300000001,43.022237],[-75.108727,43.021856],[-75.109044,43.020975],[-75.109224,43.020672],[-75.10985700000001,43.019765],[-75.110005,43.019597],[-75.110231,43.019384],[-75.110902,43.018874],[-75.11114600000001,43.018707],[-75.11145,43.018549],[-75.11167500000001,43.01847],[-75.111931,43.018387],[-75.112292,43.01833],[-75.11268800000001,43.018258],[-75.113165,43.018137],[-75.114226,43.017864],[-75.114763,43.017731],[-75.11500100000001,43.017638],[-75.11511,43.017577],[-75.115284,43.017451],[-75.115639,43.017101],[-75.115771,43.017016],[-75.116001,43.016913],[-75.116304,43.016822],[-75.116589,43.016767],[-75.11687499999999,43.016747],[-75.11711,43.016761],[-75.117947,43.016875],[-75.11956499999999,43.017037],[-75.119997,43.017088],[-75.120215,43.017137],[-75.12085399999999,43.01734],[-75.121,43.017375],[-75.12114200000001,43.017378],[-75.121714,43.017296],[-75.12191300000001,43.01729],[-75.122355,43.017358],[-75.122507,43.017364],[-75.122753,43.017329],[-75.12317,43.017209],[-75.12352799999999,43.017124],[-75.12385399999999,43.017086],[-75.124184,43.017081],[-75.12436099999999,43.0171],[-75.124599,43.017157],[-75.125106,43.017326],[-75.125158,43.017374],[-75.12545,43.017696],[-75.125567,43.017795],[-75.125687,43.017858],[-75.126322,43.018059],[-75.126536,43.018113],[-75.12666,43.018119],[-75.126766,43.018092],[-75.126886,43.018018],[-75.127156,43.017772],[-75.12729,43.017678],[-75.127399,43.017636],[-75.127666,43.017587],[-75.128235,43.017507],[-75.12863900000001,43.017474],[-75.129295,43.017446],[-75.129698,43.017361],[-75.130009,43.017316],[-75.130235,43.017318],[-75.13072099999999,43.017368],[-75.13107100000001,43.017391],[-75.132114,43.017424],[-75.132437,43.017427],[-75.13267999999999,43.017404],[-75.132845,43.017363],[-75.13303000000001,43.017275],[-75.13330499999999,43.0171],[-75.13373,43.016843],[-75.133999,43.016739],[-75.13448,43.016596],[-75.135081,43.016438],[-75.13557400000001,43.016327],[-75.136709,43.016097],[-75.13685,43.016077],[-75.13706999999999,43.016061],[-75.137136,43.016061],[-75.137776,43.016055],[-75.13828599999999,43.016011],[-75.138544,43.015981],[-75.13909099999999,43.0159],[-75.139391,43.015829],[-75.13966499999999,43.015747],[-75.13994599999999,43.015636],[-75.140258,43.015487],[-75.140418,43.015377],[-75.140896,43.014983],[-75.14108299999999,43.014856],[-75.141283,43.014766],[-75.141884,43.014569],[-75.142116,43.014516],[-75.14249700000001,43.014471],[-75.14283,43.014442],[-75.143012,43.014406],[-75.14313199999999,43.014352],[-75.14346500000001,43.014007],[-75.143602,43.013897],[-75.143732,43.013847],[-75.143894,43.013835],[-75.144318,43.013865],[-75.144486,43.013841],[-75.144651,43.013795],[-75.144745,43.013741],[-75.14513700000001,43.013386],[-75.14533900000001,43.01322],[-75.14541199999999,43.013161],[-75.145804,43.012844],[-75.14606000000001,43.01259],[-75.146238,43.012347],[-75.14643599999999,43.012002],[-75.14665599999999,43.011465],[-75.146835,43.01095],[-75.146867,43.010751],[-75.146849,43.010023],[-75.146906,43.009871],[-75.147126,43.009503],[-75.147291,43.0092],[-75.147379,43.009084],[-75.147476,43.008996],[-75.14769099999999,43.008891],[-75.14795700000001,43.008801],[-75.148118,43.00876],[-75.14831,43.008725],[-75.14949300000001,43.008572],[-75.149936,43.008482],[-75.150606,43.008325],[-75.151177,43.008225],[-75.15149099999999,43.008201],[-75.151819,43.008224],[-75.15247599999999,43.008287],[-75.153244,43.008314],[-75.153479,43.008344],[-75.153902,43.008444],[-75.154185,43.008541],[-75.15501399999999,43.008941],[-75.155327,43.009069],[-75.155675,43.009174],[-75.15595399999999,43.009211],[-75.15629,43.009225],[-75.15651200000001,43.009211],[-75.156795,43.009151],[-75.157056,43.009072],[-75.15734,43.008964],[-75.156976,43.008758],[-75.156915,43.008708],[-75.156801,43.008615],[-75.156781,43.008588],[-75.15795799999999,43.00887],[-75.167766,43.011223],[-75.178056,43.013678],[-75.17904299999999,43.013939],[-75.20051599999999,43.018957],[-75.209411,43.021051],[-75.20942100000001,43.021092],[-75.209582,43.022179],[-75.209681,43.023173],[-75.209822,43.024851],[-75.20981999999999,43.025296]]],"type":"Polygon"}
}