{
  "id": "360272101013",
  "type": "Feature",
  "properties": {
    "area_land":644479,
    "area_water":0,
    "geoid":"360272101013",
    "name":"Block Group 3",
    "state":"ny"
},
  "bbox": [
    -73.976632,
    41.508044,
    -73.959988,
    41.517184
],
  "geometry": {"coordinates":[[[-73.976632,41.512644],[-73.975871,41.513148],[-73.975756,41.513216],[-73.975319,41.513502],[-73.974985,41.513669],[-73.97493,41.513703],[-73.974508,41.513912],[-73.97413299999999,41.514097],[-73.97390900000001,41.514216],[-73.973823,41.514269],[-73.97377899999999,41.5143],[-73.973664,41.514381],[-73.97357,41.514472],[-73.973495,41.51455],[-73.97339599999999,41.514675],[-73.973316,41.514777],[-73.973247,41.51492],[-73.97320000000001,41.51504],[-73.97315,41.515221],[-73.97312700000001,41.515441],[-73.97313,41.515837],[-73.97314900000001,41.516014],[-73.97150000000001,41.515166],[-73.97118399999999,41.514992],[-73.970966,41.515291],[-73.970703,41.515662],[-73.970406,41.515847],[-73.968022,41.516966],[-73.969013,41.516342],[-73.96570199999999,41.513926],[-73.96472900000001,41.514594],[-73.96560700000001,41.515382],[-73.96412100000001,41.515878],[-73.96247700000001,41.517184],[-73.959988,41.514479],[-73.960352,41.514306],[-73.960476,41.514247],[-73.96163,41.513701],[-73.963905,41.512616],[-73.96413200000001,41.512508],[-73.964358,41.512402],[-73.965005,41.512102],[-73.965056,41.51207],[-73.965118,41.512032],[-73.965242,41.511926],[-73.965371,41.511679],[-73.96560700000001,41.511118],[-73.965734,41.510864],[-73.966047,41.510458],[-73.96701400000001,41.509219],[-73.967476,41.508607],[-73.96787500000001,41.508116],[-73.967918,41.508084],[-73.968034,41.508044],[-73.968338,41.508207],[-73.96892800000001,41.508446],[-73.969201,41.508567],[-73.969627,41.508729],[-73.96998499999999,41.508847],[-73.970054,41.508869],[-73.970107,41.508884],[-73.970264,41.508928],[-73.970983,41.509223],[-73.971524,41.509445],[-73.97170199999999,41.509547],[-73.97176399999999,41.509582],[-73.972272,41.509975],[-73.97307600000001,41.510582],[-73.97327300000001,41.510715],[-73.974172,41.511204],[-73.974811,41.511554],[-73.97557500000001,41.511992],[-73.97583299999999,41.512119],[-73.976249,41.512365],[-73.976443,41.512492],[-73.976632,41.512644]]],"type":"Polygon"}
}