{
  "id": "360811033003",
  "type": "Feature",
  "properties": {
    "area_land":159392,
    "area_water":0,
    "geoid":"360811033003",
    "name":"Block Group 3",
    "state":"ny"
},
  "bbox": [
    -73.809452,
    40.77561,
    -73.803226,
    40.779726
],
  "geometry": {"coordinates":[[[-73.809341,40.776766],[-73.809219,40.777476],[-73.809163,40.778119],[-73.807935,40.778367],[-73.806196,40.778716],[-73.805111,40.779039],[-73.804801,40.77912],[-73.80351400000001,40.779726],[-73.803226,40.779703],[-73.803327,40.778996],[-73.803423,40.778338],[-73.80346299999999,40.778008],[-73.803596,40.777031],[-73.803693,40.77632],[-73.80379000000001,40.77561],[-73.80659199999999,40.775832],[-73.80945199999999,40.776058],[-73.809341,40.776766]]],"type":"Polygon"}
}