{
  "id": "360710111022",
  "type": "Feature",
  "properties": {
    "area_land":1644152,
    "area_water":0,
    "geoid":"360710111022",
    "name":"Block Group 2",
    "state":"ny"
},
  "bbox": [
    -74.37432,
    41.463385,
    -74.347158,
    41.481239
],
  "geometry": {"coordinates":[[[-74.37427599999999,41.46774],[-74.373402,41.469056],[-74.372754,41.470044],[-74.37232899999999,41.470661],[-74.371796,41.471456],[-74.371173,41.472326],[-74.370749,41.472876],[-74.370327,41.473377],[-74.369518,41.474415],[-74.369055,41.475031],[-74.368911,41.475248],[-74.36874899999999,41.475548],[-74.36856899999999,41.475947],[-74.368346,41.47645],[-74.367789,41.477674],[-74.367468,41.477611],[-74.36724,41.477589],[-74.36703199999999,41.477588],[-74.36694900000001,41.477594],[-74.366811,41.477605],[-74.366287,41.477694],[-74.364645,41.477994],[-74.363775,41.478135],[-74.363432,41.478199],[-74.363247,41.478254],[-74.363088,41.478326],[-74.36275999999999,41.478538],[-74.36159000000001,41.479341],[-74.360427,41.480046],[-74.360523,41.480287],[-74.360534,41.48035],[-74.36053200000001,41.480507],[-74.360488,41.480641],[-74.36036300000001,41.480798],[-74.360238,41.480927],[-74.359951,41.481239],[-74.359376,41.480674],[-74.359008,41.480265],[-74.358603,41.479813],[-74.35818500000001,41.479347],[-74.357101,41.47814],[-74.357715,41.477819],[-74.35828600000001,41.477528],[-74.358535,41.477372],[-74.358694,41.477242],[-74.358772,41.477164],[-74.35887200000001,41.477034],[-74.35949599999999,41.475965],[-74.35966000000001,41.475741],[-74.359925,41.475478],[-74.360122,41.475577],[-74.360457,41.475723],[-74.36112799999999,41.474737],[-74.361558,41.474109],[-74.36272200000001,41.472394],[-74.36297500000001,41.472016],[-74.362464,41.471843],[-74.36219699999999,41.471782],[-74.36196,41.471755],[-74.36169200000001,41.471769],[-74.36133,41.471835],[-74.36106100000001,41.471885],[-74.360871,41.471896],[-74.360769,41.471889],[-74.36015500000001,41.471791],[-74.360195,41.471639],[-74.360224,41.471343],[-74.360193,41.470821],[-74.36012599999999,41.470181],[-74.36011000000001,41.469945],[-74.360105,41.469252],[-74.360117,41.469113],[-74.360153,41.468967],[-74.36025600000001,41.468752],[-74.360299,41.468705],[-74.359803,41.46855],[-74.359628,41.468519],[-74.359454,41.468513],[-74.359275,41.468523],[-74.35917999999999,41.468543],[-74.358929,41.468626],[-74.35885,41.468668],[-74.358768,41.468592],[-74.35872500000001,41.468552],[-74.358419,41.468257],[-74.358351,41.468172],[-74.358299,41.468033],[-74.35829,41.467857],[-74.358349,41.467488],[-74.358011,41.467484],[-74.357933,41.467494],[-74.35785300000001,41.467516],[-74.35772900000001,41.467591],[-74.35732,41.467961],[-74.356825,41.468438],[-74.356692,41.46856],[-74.35646800000001,41.468763],[-74.356162,41.469105],[-74.35567899999999,41.46955],[-74.355521,41.46967],[-74.35538,41.469741],[-74.35520200000001,41.469792],[-74.355046,41.469823],[-74.35486299999999,41.469845],[-74.354682,41.469855],[-74.354675,41.469678],[-74.354697,41.469504],[-74.354816,41.469194],[-74.35490900000001,41.46892],[-74.35492600000001,41.468752],[-74.354894,41.468648],[-74.354857,41.468595],[-74.354823,41.468565],[-74.354733,41.468509],[-74.35469000000001,41.468497],[-74.354563,41.468483],[-74.35443600000001,41.468502],[-74.35436799999999,41.468531],[-74.353953,41.46875],[-74.35350800000001,41.469024],[-74.352889,41.469364],[-74.352709,41.469439],[-74.35267399999999,41.469377],[-74.35217299999999,41.468752],[-74.352014,41.46859],[-74.351707,41.468309],[-74.351083,41.467706],[-74.350994,41.467638],[-74.35084500000001,41.467555],[-74.35062499999999,41.467479],[-74.350396,41.467443],[-74.350228,41.467438],[-74.350009,41.467464],[-74.34983800000001,41.467507],[-74.349434,41.467656],[-74.348949,41.467883],[-74.34849199999999,41.468115],[-74.348336,41.468208],[-74.34736100000001,41.467086],[-74.34715799999999,41.466829],[-74.349768,41.466704],[-74.35074299999999,41.466668],[-74.351241,41.466649],[-74.35208799999999,41.466608],[-74.352182,41.466603],[-74.352439,41.466589],[-74.35309100000001,41.466557],[-74.355137,41.466453],[-74.355617,41.466419],[-74.355897,41.4664],[-74.35705799999999,41.466267],[-74.357516,41.466193],[-74.358098,41.466099],[-74.359855,41.465789],[-74.361356,41.465516],[-74.36147,41.465495],[-74.364751,41.464889],[-74.36693200000001,41.464483],[-74.367435,41.464372],[-74.368101,41.464216],[-74.36824900000001,41.464238],[-74.36857500000001,41.464163],[-74.368701,41.464138],[-74.36975200000001,41.463933],[-74.370296,41.463831],[-74.370412,41.463809],[-74.370666,41.463761],[-74.37147400000001,41.46361],[-74.37252100000001,41.463413],[-74.372651,41.463385],[-74.372879,41.464051],[-74.37291,41.464197],[-74.372911,41.464232],[-74.372912,41.464302],[-74.372896,41.464358],[-74.37287600000001,41.464425],[-74.372789,41.464507],[-74.372653,41.464708],[-74.372597,41.464789],[-74.372405,41.465061],[-74.371855,41.465861],[-74.371666,41.466177],[-74.371573,41.466373],[-74.37154700000001,41.466491],[-74.37154700000001,41.466701],[-74.37158100000001,41.46686],[-74.371651,41.467023],[-74.371751,41.467174],[-74.371937,41.467376],[-74.372112,41.467515],[-74.372275,41.467596],[-74.37250400000001,41.467672],[-74.372777,41.467728],[-74.373043,41.467739],[-74.37330799999999,41.467729],[-74.373649,41.467688],[-74.37432,41.467592],[-74.37427599999999,41.46774]]],"type":"Polygon"}
}