{
  "id": "360470075001",
  "type": "Feature",
  "properties": {
    "area_land":57561,
    "area_water":0,
    "geoid":"360470075001",
    "name":"Block Group 1",
    "state":"ny"
},
  "bbox": [
    -73.995232,
    40.680818,
    -73.987279,
    40.68443
],
  "geometry": {"coordinates":[[[-73.994901,40.68443],[-73.99262299999999,40.683544],[-73.990424,40.682694],[-73.98827199999999,40.681863],[-73.987279,40.681467],[-73.987668,40.680818],[-73.988699,40.681217],[-73.99086699999999,40.682058],[-73.99305200000001,40.682909],[-73.995232,40.683741],[-73.994901,40.68443]]],"type":"Polygon"}
}