{
  "id": "360470946003",
  "type": "Feature",
  "properties": {
    "area_land":163804,
    "area_water":0,
    "geoid":"360470946003",
    "name":"Block Group 3",
    "state":"ny"
},
  "bbox": [
    -73.925721,
    40.6399,
    -73.919729,
    40.64503
],
  "geometry": {"coordinates":[[[-73.925721,40.644674],[-73.92492300000001,40.644755],[-73.92381899999999,40.644806],[-73.922849,40.644854],[-73.921916,40.644909],[-73.920984,40.644975],[-73.92053199999999,40.644999],[-73.91997600000001,40.64503],[-73.919951,40.644707],[-73.91990699999999,40.64433],[-73.919729,40.642725],[-73.921609,40.641687],[-73.922207,40.641065],[-73.923327,40.6399],[-73.923354,40.640177],[-73.92337499999999,40.640495],[-73.923565,40.642499],[-73.924542,40.642439],[-73.925382,40.642384],[-73.925721,40.644674]]],"type":"Polygon"}
}