{
  "id": "360099403001",
  "type": "Feature",
  "properties": {
    "area_land":37091855,
    "area_water":2130507,
    "geoid":"360099403001",
    "name":"Block Group 1",
    "state":"ny"
},
  "bbox": [
    -78.720978,
    42.071808,
    -78.566703,
    42.160242
],
  "geometry": {"coordinates":[[[-78.720978,42.147222],[-78.72019299999999,42.147359],[-78.717822,42.147731],[-78.717448,42.147806],[-78.71714799999999,42.147878],[-78.716785,42.147994],[-78.716589,42.148074],[-78.71610699999999,42.148298],[-78.715389,42.148619],[-78.715204,42.148684],[-78.715008,42.148739],[-78.714787,42.148779],[-78.714562,42.148808],[-78.714287,42.148831],[-78.714018,42.148824],[-78.71375399999999,42.148806],[-78.71349600000001,42.148773],[-78.71334,42.14874],[-78.713148,42.148684],[-78.712996,42.148626],[-78.712851,42.148554],[-78.712706,42.148463],[-78.71257900000001,42.148365],[-78.711944,42.147806],[-78.71171200000001,42.147625],[-78.711263,42.147309],[-78.711038,42.147161],[-78.710871,42.147068],[-78.71071499999999,42.146996],[-78.710537,42.146931],[-78.710345,42.146887],[-78.71018599999999,42.146862],[-78.71000600000001,42.146857],[-78.709812,42.146851],[-78.709745,42.146856],[-78.70947099999999,42.146889],[-78.709301,42.146929],[-78.70913,42.146987],[-78.70898699999999,42.147059],[-78.708761,42.147204],[-78.708578,42.14735],[-78.70839100000001,42.147549],[-78.70824500000001,42.147786],[-78.708212,42.147848],[-78.70804099999999,42.148382],[-78.70768,42.149499],[-78.70766399999999,42.149553],[-78.707623,42.149669],[-78.70755699999999,42.149863],[-78.70748,42.150149],[-78.70733799999999,42.150577],[-78.707094,42.151398],[-78.70705,42.151634],[-78.707013,42.151895],[-78.70701099999999,42.151973],[-78.706997,42.152061],[-78.706968,42.152275],[-78.706948,42.15256],[-78.706926,42.15282],[-78.706896,42.153212],[-78.706991,42.153413],[-78.707123,42.15363],[-78.706998,42.153665],[-78.706875,42.153713],[-78.706779,42.153766],[-78.706704,42.153813],[-78.706456,42.154004],[-78.70584700000001,42.154479],[-78.705404,42.154819],[-78.703682,42.156156],[-78.70319600000001,42.156525],[-78.703068,42.156615],[-78.702957,42.156677],[-78.702815,42.156731],[-78.702609,42.156783],[-78.702296,42.15684],[-78.70156799999999,42.15697],[-78.701419,42.156991],[-78.701212,42.157033],[-78.70109100000001,42.157059],[-78.700407,42.157184],[-78.69934000000001,42.157366],[-78.699043,42.157421],[-78.698466,42.157571],[-78.698069,42.157687],[-78.696839,42.158037],[-78.69670499999999,42.15807],[-78.696072,42.158215],[-78.695069,42.158425],[-78.693738,42.158709],[-78.692401,42.158989],[-78.690449,42.159414],[-78.68949000000001,42.159629],[-78.689065,42.159677],[-78.688907,42.159686],[-78.688536,42.159707],[-78.68837000000001,42.159714],[-78.688337,42.159718],[-78.688112,42.159722],[-78.688011,42.159749],[-78.687967,42.159766],[-78.68773,42.159866],[-78.687533,42.159931],[-78.687392,42.159966],[-78.68722,42.160008],[-78.687135,42.160021],[-78.68690700000001,42.16003],[-78.68683799999999,42.160242],[-78.68586999999999,42.160019],[-78.683677,42.1594],[-78.683196,42.159269],[-78.680538,42.158514],[-78.679146,42.158123],[-78.676834,42.157487],[-78.676528,42.157402],[-78.67607099999999,42.157275],[-78.67185000000001,42.156104],[-78.669764,42.154787],[-78.66565799999999,42.152316],[-78.66542099999999,42.152177],[-78.65793600000001,42.147784],[-78.657871,42.147741],[-78.65379900000001,42.145121],[-78.65147899999999,42.139448],[-78.649593,42.134854],[-78.647944,42.130854],[-78.646642,42.127667],[-78.646186,42.126545],[-78.64609900000001,42.126344],[-78.645582,42.12508],[-78.645421,42.124598],[-78.644829,42.123257],[-78.642382,42.11784],[-78.63858399999999,42.10939],[-78.63737,42.106688],[-78.62465400000001,42.105609],[-78.601609,42.103549],[-78.60083400000001,42.103494],[-78.59883000000001,42.103312],[-78.581266,42.099497],[-78.57970299999999,42.098355],[-78.57787,42.09699],[-78.57731200000001,42.096375],[-78.577101,42.096211],[-78.57701299999999,42.096169],[-78.576823,42.096081],[-78.576245,42.095693],[-78.57609100000001,42.09559],[-78.57523,42.094896],[-78.574963,42.094664],[-78.57442,42.094252],[-78.573538,42.093678],[-78.573419,42.093522],[-78.57178,42.092596],[-78.56711300000001,42.089198],[-78.56692,42.089058],[-78.56675799999999,42.088947],[-78.566703,42.088903],[-78.56704000000001,42.088647],[-78.57841999999999,42.08024],[-78.579003,42.080407],[-78.5903,42.083647],[-78.592142,42.084134],[-78.59326900000001,42.084449],[-78.595575,42.085093],[-78.59776599999999,42.085697],[-78.597889,42.085754],[-78.600673,42.085645],[-78.604084,42.085497],[-78.61033500000001,42.085454],[-78.61030100000001,42.085075],[-78.610124,42.084006],[-78.609703,42.081859],[-78.60836999999999,42.074412],[-78.609476,42.074483],[-78.61029600000001,42.074537],[-78.61127399999999,42.074515],[-78.61193799999999,42.074606],[-78.61269299999999,42.074648],[-78.61297500000001,42.074663],[-78.616242,42.074843],[-78.62474,42.075197],[-78.631373,42.075735],[-78.633957,42.074268],[-78.63522,42.073552],[-78.635637,42.073197],[-78.635953,42.072892],[-78.636127,42.072726],[-78.636262,42.072648],[-78.63770599999999,42.071808],[-78.638547,42.071889],[-78.63901799999999,42.071963],[-78.639364,42.072005],[-78.64418499999999,42.072576],[-78.644485,42.072612],[-78.655609,42.073978],[-78.664895,42.090283],[-78.66785400000001,42.095445],[-78.66795999999999,42.09593],[-78.669245,42.101779],[-78.67000299999999,42.105454],[-78.674207,42.125097],[-78.674511,42.126384],[-78.675782,42.132167],[-78.68544900000001,42.136501],[-78.69586,42.140952],[-78.701606,42.143656],[-78.711566,42.145378],[-78.720889,42.147208],[-78.720978,42.147222]]],"type":"Polygon"}
}