{
  "id": "360470888003",
  "type": "Feature",
  "properties": {
    "area_land":82767,
    "area_water":0,
    "geoid":"360470888003",
    "name":"Block Group 3",
    "state":"ny"
},
  "bbox": [
    -73.921776,
    40.651158,
    -73.91737,
    40.655842
],
  "geometry": {"coordinates":[[[-73.92177599999999,40.654424],[-73.92149499999999,40.654604],[-73.92100499999999,40.654918],[-73.920293,40.655381],[-73.919578,40.655842],[-73.91806200000001,40.654493],[-73.917869,40.654322],[-73.91777,40.654379],[-73.917576,40.654314],[-73.91775199999999,40.654215],[-73.917835,40.654161],[-73.91847300000001,40.653745],[-73.919185,40.653289],[-73.91737000000001,40.651654],[-73.918137,40.651158],[-73.919962,40.652789],[-73.920773,40.652554],[-73.92087600000001,40.653608],[-73.92158000000001,40.654263],[-73.921696,40.654372],[-73.92177599999999,40.654424]]],"type":"Polygon"}
}