{
  "id": "360830409001",
  "type": "Feature",
  "properties": {
    "area_land":247290,
    "area_water":74802,
    "geoid":"360830409001",
    "name":"Block Group 1",
    "state":"ny"
},
  "bbox": [
    -73.700691,
    42.717363,
    -73.688655,
    42.723794
],
  "geometry": {"coordinates":[[[-73.70003699999999,42.7197],[-73.699609,42.72083],[-73.69947999999999,42.721169],[-73.69936300000001,42.721478],[-73.698612,42.723794],[-73.69733100000001,42.723593],[-73.697183,42.723553],[-73.696457,42.723526],[-73.69643000000001,42.723493],[-73.696394,42.723477],[-73.69634000000001,42.723461],[-73.695803,42.723414],[-73.69564099999999,42.723397],[-73.695155,42.723347],[-73.694587,42.723286],[-73.693957,42.723218],[-73.69333399999999,42.723149],[-73.692734,42.72308],[-73.692086,42.723005],[-73.691474,42.722936],[-73.69114399999999,42.7229],[-73.690879,42.722871],[-73.69022,42.722798],[-73.689616,42.722732],[-73.68939399999999,42.722707],[-73.689311,42.722503],[-73.689155,42.722023],[-73.688986,42.721606],[-73.688892,42.721382],[-73.688742,42.721165],[-73.688655,42.721072],[-73.68933800000001,42.721131],[-73.689904,42.721182],[-73.690065,42.721196],[-73.690551,42.721261],[-73.69119000000001,42.72133],[-73.691785,42.721398],[-73.692418,42.721492],[-73.693027,42.72156],[-73.693664,42.721637],[-73.694281,42.721707],[-73.694935,42.721777],[-73.69505700000001,42.721274],[-73.695161,42.720689],[-73.695198,42.720479],[-73.695284,42.720162],[-73.695464,42.71933],[-73.695554,42.718893],[-73.695877,42.717363],[-73.69687399999999,42.717486],[-73.696926,42.717495],[-73.697042,42.717519],[-73.69720100000001,42.717538],[-73.698882,42.717736],[-73.699009,42.717745],[-73.70069100000001,42.717982],[-73.70003699999999,42.7197]]],"type":"Polygon"}
}