{
  "id": "361031108033",
  "type": "Feature",
  "properties": {
    "area_land":2435726,
    "area_water":0,
    "geoid":"361031108033",
    "name":"Block Group 3",
    "state":"ny"
},
  "bbox": [
    -73.325198,
    40.897864,
    -73.296603,
    40.91251
],
  "geometry": {"coordinates":[[[-73.324642,40.900092],[-73.32413699999999,40.900334],[-73.32377700000001,40.900591],[-73.32355,40.900802],[-73.323493,40.900864],[-73.32349499999999,40.900915],[-73.32276299999999,40.901996],[-73.32235300000001,40.902588],[-73.32225200000001,40.902722],[-73.322121,40.902935],[-73.32167699999999,40.903505],[-73.32159799999999,40.903593],[-73.321541,40.903614],[-73.32131099999999,40.903919],[-73.320834,40.904437],[-73.320576,40.904654],[-73.320155,40.90489],[-73.31966199999999,40.905172],[-73.319163,40.905406],[-73.318241,40.905684],[-73.316761,40.906092],[-73.316455,40.906245],[-73.316242,40.90639],[-73.316135,40.90652],[-73.31592000000001,40.906726],[-73.315692,40.906962],[-73.31546299999999,40.907222],[-73.315265,40.907466],[-73.31511399999999,40.907748],[-73.31490700000001,40.908118],[-73.31469199999999,40.908438],[-73.31441,40.908698],[-73.314088,40.908957],[-73.313689,40.909213],[-73.313327,40.909297],[-73.312297,40.909457],[-73.311953,40.909491],[-73.311618,40.909507],[-73.31076299999999,40.909503],[-73.31032,40.909503],[-73.30997600000001,40.909522],[-73.309681,40.909568],[-73.308695,40.909941],[-73.308367,40.910079],[-73.307321,40.910498],[-73.306727,40.910777],[-73.306461,40.910891],[-73.30597899999999,40.911036],[-73.305729,40.911101],[-73.304759,40.911349],[-73.304309,40.911544],[-73.30394200000001,40.911715],[-73.303669,40.911837],[-73.303169,40.912002],[-73.302391,40.912258],[-73.301919,40.91236],[-73.301879,40.912411],[-73.301698,40.912437],[-73.301434,40.912478],[-73.30102100000001,40.91251],[-73.300982,40.912508],[-73.300937,40.912428],[-73.30077900000001,40.91204],[-73.300495,40.911428],[-73.30037900000001,40.911246],[-73.30032300000001,40.911166],[-73.300197,40.911017],[-73.299724,40.910581],[-73.29959599999999,40.910483],[-73.29931000000001,40.910235],[-73.299087,40.910007],[-73.298991,40.909858],[-73.298807,40.909635],[-73.29854899999999,40.909323],[-73.29816700000001,40.908061],[-73.298113,40.907851],[-73.298067,40.907706],[-73.297838,40.906962],[-73.29773299999999,40.906359],[-73.297656,40.906008],[-73.297603,40.905867],[-73.297389,40.905585],[-73.296801,40.904895],[-73.296734,40.904666],[-73.296603,40.904052],[-73.29664099999999,40.903735],[-73.296847,40.902137],[-73.29694499999999,40.901934],[-73.297175,40.901412],[-73.297358,40.901042],[-73.297404,40.900416],[-73.297118,40.89998],[-73.29683900000001,40.899554],[-73.296716,40.899302],[-73.296908,40.899176],[-73.29709,40.899009],[-73.297625,40.898371],[-73.297937,40.898101],[-73.298419,40.897959],[-73.298762,40.897891],[-73.299121,40.897864],[-73.299465,40.897864],[-73.299808,40.897891],[-73.30025000000001,40.897959],[-73.30134200000001,40.898139],[-73.301661,40.898177],[-73.30220300000001,40.898169],[-73.302616,40.898211],[-73.302905,40.898215],[-73.30374399999999,40.898177],[-73.303811,40.898161],[-73.30404900000001,40.898108],[-73.30471300000001,40.897975],[-73.30541599999999,40.898185],[-73.305887,40.898684],[-73.306415,40.89934],[-73.306703,40.899617],[-73.306873,40.899779],[-73.307163,40.900038],[-73.308902,40.899802],[-73.31005999999999,40.899676],[-73.311077,40.899573],[-73.311413,40.899531],[-73.311831,40.899459],[-73.312259,40.899329],[-73.31263300000001,40.899222],[-73.312923,40.899134],[-73.313304,40.899043],[-73.313778,40.899005],[-73.314027,40.898985],[-73.314243,40.898967],[-73.314502,40.898879],[-73.315624,40.898536],[-73.316936,40.898257],[-73.31786700000001,40.898219],[-73.318485,40.898215],[-73.31926300000001,40.898326],[-73.319637,40.898379],[-73.32082,40.898623],[-73.321933,40.898783],[-73.322399,40.898875],[-73.32282600000001,40.899031],[-73.323611,40.899321],[-73.324277,40.89955],[-73.325198,40.89989],[-73.324642,40.900092]]],"type":"Polygon"}
}