{
  "id": "360810938001",
  "type": "Feature",
  "properties": {
    "area_land":97303,
    "area_water":0,
    "geoid":"360810938001",
    "name":"Block Group 1",
    "state":"ny"
},
  "bbox": [
    -73.830214,
    40.580172,
    -73.825089,
    40.583583
],
  "geometry": {"coordinates":[[[-73.830214,40.582587],[-73.82796999999999,40.583141],[-73.82635999999999,40.583583],[-73.826065,40.583013],[-73.825878,40.582664],[-73.82508900000001,40.581183],[-73.82660199999999,40.580776],[-73.82744599999999,40.580548],[-73.82884799999999,40.580172],[-73.82910800000001,40.580669],[-73.829165,40.580778],[-73.82930399999999,40.581042],[-73.82934400000001,40.581118],[-73.829382,40.581191],[-73.82945599999999,40.581334],[-73.82953999999999,40.581494],[-73.829774,40.581916],[-73.830214,40.582587]]],"type":"Polygon"}
}