{
  "id": "360290146014",
  "type": "Feature",
  "properties": {
    "area_land":2362636,
    "area_water":0,
    "geoid":"360290146014",
    "name":"Block Group 4",
    "state":"ny"
},
  "bbox": [
    -78.696931,
    42.964957,
    -78.677037,
    42.978266
],
  "geometry": {"coordinates":[[[-78.69692999999999,42.976317],[-78.69687500000001,42.976994],[-78.696899,42.978192],[-78.694602,42.978226],[-78.694266,42.978231],[-78.69404,42.978234],[-78.69193300000001,42.978266],[-78.68997,42.978252],[-78.687423,42.978241],[-78.68722,42.97824],[-78.685821,42.978233],[-78.68282600000001,42.978219],[-78.681977,42.978215],[-78.677037,42.978175],[-78.67703899999999,42.977907],[-78.67705599999999,42.976203],[-78.67709499999999,42.97344],[-78.67713500000001,42.970292],[-78.677154,42.969147],[-78.677153,42.969103],[-78.677173,42.96806],[-78.67719200000001,42.96713],[-78.67721899999999,42.965049],[-78.679091,42.964984],[-78.680012,42.964957],[-78.682135,42.96498],[-78.68298,42.964986],[-78.68450300000001,42.964998],[-78.68565099999999,42.965001],[-78.686763,42.965019],[-78.69026599999999,42.965079],[-78.692198,42.965108],[-78.692593,42.965114],[-78.696708,42.965256],[-78.69691899999999,42.965264],[-78.69692000000001,42.9653],[-78.696922,42.965404],[-78.696928,42.968798],[-78.696924,42.971021],[-78.696921,42.971707],[-78.696916,42.972931],[-78.696921,42.974119],[-78.69692999999999,42.97483],[-78.69692999999999,42.975289],[-78.69693100000001,42.97594],[-78.69692999999999,42.976317]]],"type":"Polygon"}
}