{
  "id": "360630239011",
  "type": "Feature",
  "properties": {
    "area_land":1478954,
    "area_water":0,
    "geoid":"360630239011",
    "name":"Block Group 1",
    "state":"ny"
},
  "bbox": [
    -78.696876,
    43.149561,
    -78.67996,
    43.160467
],
  "geometry": {"coordinates":[[[-78.696876,43.158379],[-78.69687399999999,43.158579],[-78.696872,43.159179],[-78.696871,43.15938],[-78.69686799999999,43.159597],[-78.69686299999999,43.160249],[-78.696862,43.160467],[-78.696263,43.160463],[-78.696201,43.160461],[-78.694221,43.160424],[-78.694073,43.160422],[-78.693561,43.160409],[-78.69176899999999,43.160378],[-78.69063199999999,43.160352],[-78.690364,43.160346],[-78.68956300000001,43.160331],[-78.689296,43.160326],[-78.687316,43.160276],[-78.68581,43.160259],[-78.683153,43.160211],[-78.682181,43.160177],[-78.68043900000001,43.160153],[-78.68040999999999,43.159521],[-78.680378,43.158831],[-78.68037099999999,43.158692],[-78.68035,43.158276],[-78.68034299999999,43.158138],[-78.68033699999999,43.157998],[-78.68031999999999,43.157581],[-78.68031499999999,43.157442],[-78.680307,43.157276],[-78.680286,43.156781],[-78.68028,43.156616],[-78.680266,43.156223],[-78.680257,43.15605],[-78.68021,43.155103],[-78.680176,43.154355],[-78.680151,43.15379],[-78.68013999999999,43.153557],[-78.68011,43.15286],[-78.6801,43.152628],[-78.680097,43.152581],[-78.680091,43.15244],[-78.680089,43.152394],[-78.680081,43.152229],[-78.680059,43.151735],[-78.680052,43.151571],[-78.68003899999999,43.151283],[-78.68003299999999,43.151168],[-78.67999,43.150169],[-78.67998,43.149962],[-78.679968,43.149705],[-78.67995999999999,43.149561],[-78.68141300000001,43.149606],[-78.683144,43.14966],[-78.683289,43.150859],[-78.68471099999999,43.150859],[-78.686165,43.150859],[-78.686166,43.150794],[-78.68616900000001,43.150599],[-78.68617,43.150534],[-78.68830699999999,43.150575],[-78.69471900000001,43.150698],[-78.69685699999999,43.150739],[-78.69685800000001,43.150829],[-78.69686400000001,43.151101],[-78.696866,43.151192],[-78.69686400000001,43.15157],[-78.696862,43.152707],[-78.696862,43.153086],[-78.696862,43.153318],[-78.69686299999999,43.153559],[-78.69687,43.154014],[-78.69687500000001,43.154247],[-78.696873,43.154393],[-78.69687,43.154833],[-78.69686900000001,43.15498],[-78.69687,43.15542],[-78.696873,43.156741],[-78.69687500000001,43.157182],[-78.69687399999999,43.157299],[-78.696873,43.157651],[-78.696873,43.157769],[-78.696873,43.157891],[-78.69687500000001,43.158257],[-78.696876,43.158379]]],"type":"Polygon"}
}