{
  "id": "360470023002",
  "type": "Feature",
  "properties": {
    "area_land":35375,
    "area_water":0,
    "geoid":"360470023002",
    "name":"Block Group 2",
    "state":"ny"
},
  "bbox": [
    -73.982932,
    40.699703,
    -73.980455,
    40.701359
],
  "geometry": {"coordinates":[[[-73.98285,40.701359],[-73.980729,40.701268],[-73.98045500000001,40.700852],[-73.980462,40.699703],[-73.98293200000001,40.699772],[-73.98285,40.701359]]],"type":"Polygon"}
}