{
  "id": "360050184001",
  "type": "Feature",
  "properties": {
    "area_land":80967,
    "area_water":0,
    "geoid":"360050184001",
    "name":"Block Group 1",
    "state":"ny"
},
  "bbox": [
    -73.829674,
    40.838309,
    -73.825908,
    40.841372
],
  "geometry": {"coordinates":[[[-73.829674,40.840609],[-73.828767,40.840965],[-73.827913,40.841259],[-73.827032,40.841318],[-73.82608399999999,40.841372],[-73.825962,40.839977],[-73.825908,40.838745],[-73.826851,40.838716],[-73.82806600000001,40.838665],[-73.828929,40.838309],[-73.829363,40.839579],[-73.829427,40.839787],[-73.829674,40.840609]]],"type":"Polygon"}
}