{
  "id": "360910611003",
  "type": "Feature",
  "properties": {
    "area_land":433201,
    "area_water":0,
    "geoid":"360910611003",
    "name":"Block Group 3",
    "state":"ny"
},
  "bbox": [
    -73.776454,
    43.075149,
    -73.769402,
    43.084205
],
  "geometry": {"coordinates":[[[-73.776454,43.083359],[-73.77475699999999,43.083602],[-73.77224699999999,43.083995],[-73.771815,43.084051],[-73.77152100000001,43.084087],[-73.770675,43.08416],[-73.770149,43.084205],[-73.769938,43.082725],[-73.769727,43.081812],[-73.769648,43.081269],[-73.769402,43.079728],[-73.77100799999999,43.079589],[-73.77098700000001,43.079421],[-73.77093600000001,43.079119],[-73.770838,43.078548],[-73.770662,43.077574],[-73.770438,43.0763],[-73.770416,43.076196],[-73.77034500000001,43.075787],[-73.770303,43.075539],[-73.770297,43.075429],[-73.770303,43.075263],[-73.770352,43.075149],[-73.774118,43.075948],[-73.77588799999999,43.076318],[-73.775901,43.076441],[-73.775918,43.0766],[-73.775954,43.07677],[-73.776011,43.077147],[-73.776073,43.077561],[-73.77614699999999,43.078087],[-73.77623,43.078604],[-73.776298,43.079028],[-73.77631100000001,43.07914],[-73.77637,43.079558],[-73.776267,43.080065],[-73.77618699999999,43.080342],[-73.776105,43.080695],[-73.775972,43.081194],[-73.77585000000001,43.081652],[-73.775847,43.081695],[-73.77584400000001,43.081802],[-73.77586599999999,43.081927],[-73.775904,43.082027],[-73.77636699999999,43.083266],[-73.776454,43.083359]]],"type":"Polygon"}
}