{
  "id": "360594120003",
  "type": "Feature",
  "properties": {
    "area_land":368208,
    "area_water":0,
    "geoid":"360594120003",
    "name":"Block Group 3",
    "state":"ny"
},
  "bbox": [
    -73.666319,
    40.651944,
    -73.65574,
    40.659142
],
  "geometry": {"coordinates":[[[-73.666319,40.658121],[-73.666003,40.658153],[-73.665387,40.658194],[-73.66519,40.658208],[-73.664996,40.65822],[-73.66361499999999,40.65831],[-73.663461,40.658318],[-73.663205,40.658329],[-73.6627,40.658374],[-73.66227000000001,40.658395],[-73.66195,40.65841],[-73.661097,40.658418],[-73.660578,40.658433],[-73.660089,40.658448],[-73.659434,40.658474],[-73.65933699999999,40.658479],[-73.659204,40.658485],[-73.658978,40.658511],[-73.658396,40.658678],[-73.65830800000001,40.658715],[-73.65793600000001,40.658893],[-73.65771599999999,40.65898],[-73.657546,40.65904],[-73.65720899999999,40.659124],[-73.65702899999999,40.659142],[-73.656891,40.659141],[-73.656712,40.65776],[-73.656597,40.656964],[-73.657105,40.656951],[-73.65737,40.656969],[-73.657398,40.656773],[-73.657402,40.656747],[-73.657447,40.656495],[-73.65760400000001,40.65599],[-73.657685,40.655727],[-73.656263,40.655459],[-73.65612400000001,40.655437],[-73.656245,40.65469],[-73.656065,40.654024],[-73.65573999999999,40.653054],[-73.65634300000001,40.653119],[-73.657347,40.653229],[-73.657385,40.653199],[-73.657453,40.653028],[-73.657724,40.653081],[-73.657679,40.653289],[-73.65834599999999,40.653368],[-73.65841899999999,40.653321],[-73.65849300000001,40.653286],[-73.65866,40.652867],[-73.658917,40.652904],[-73.65894,40.652633],[-73.659126,40.652591],[-73.659239,40.652562],[-73.65946,40.652559],[-73.65956199999999,40.652214],[-73.66025500000001,40.652242],[-73.66029399999999,40.651971],[-73.660551,40.651944],[-73.66135800000001,40.652053],[-73.661249,40.652466],[-73.661163,40.652865],[-73.661112,40.653069],[-73.661086,40.653245],[-73.661109,40.653597],[-73.66192100000001,40.653595],[-73.66123899999999,40.654441],[-73.660965,40.654795],[-73.66173499999999,40.655152],[-73.662093,40.65532],[-73.66248899999999,40.655505],[-73.662683,40.655266],[-73.66283799999999,40.655598],[-73.662892,40.655669],[-73.662948,40.655743],[-73.663026,40.655882],[-73.663155,40.656111],[-73.66323,40.656214],[-73.663291,40.656304],[-73.663375,40.656429],[-73.66556,40.656075],[-73.665694,40.656124],[-73.665767,40.656322],[-73.665778,40.656357],[-73.66597299999999,40.656994],[-73.66619900000001,40.657695],[-73.666319,40.658121]]],"type":"Polygon"}
}