{
  "id": "360850226003",
  "type": "Feature",
  "properties": {
    "area_land":620216,
    "area_water":0,
    "geoid":"360850226003",
    "name":"Block Group 3",
    "state":"ny"
},
  "bbox": [
    -74.224541,
    40.526292,
    -74.21661,
    40.53775
],
  "geometry": {"coordinates":[[[-74.22453,40.537029],[-74.224268,40.537087],[-74.224143,40.537115],[-74.223788,40.537195],[-74.22329999999999,40.53729],[-74.221349,40.537456],[-74.22134800000001,40.537437],[-74.22077400000001,40.537505],[-74.219464,40.537614],[-74.21942799999999,40.537617],[-74.21893300000001,40.537657],[-74.2178,40.53775],[-74.217834,40.537368],[-74.217911,40.537029],[-74.218062,40.536496],[-74.218199,40.535859],[-74.218282,40.535487],[-74.218315,40.535312],[-74.218266,40.534803],[-74.218244,40.534529],[-74.218007,40.532299],[-74.21775599999999,40.531449],[-74.21748599999999,40.530623],[-74.217254,40.529874],[-74.21701400000001,40.529122],[-74.216846,40.528642],[-74.216736,40.528427],[-74.216713,40.528382],[-74.21661,40.528178],[-74.21748100000001,40.527939],[-74.218294,40.527718],[-74.221183,40.526922],[-74.223337,40.526364],[-74.223617,40.526292],[-74.22362099999999,40.526512],[-74.22362200000001,40.526602],[-74.223629,40.526995],[-74.223643,40.527728],[-74.223974,40.531077],[-74.22408299999999,40.531863],[-74.224137,40.532292],[-74.224253,40.533695],[-74.224419,40.534859],[-74.22448300000001,40.535718],[-74.224541,40.536411],[-74.22453,40.537029]]],"type":"Polygon"}
}