{
  "id": "360050462016",
  "type": "Feature",
  "properties": {
    "area_land":58468,
    "area_water":0,
    "geoid":"360050462016",
    "name":"Block Group 6",
    "state":"ny"
},
  "bbox": [
    -73.828278,
    40.870396,
    -73.824476,
    40.873171
],
  "geometry": {"coordinates":[[[-73.828278,40.871012],[-73.827928,40.871962],[-73.827459,40.872753],[-73.82722699999999,40.873171],[-73.82682,40.873022],[-73.826594,40.872939],[-73.825487,40.872561],[-73.825402,40.872533],[-73.82524100000001,40.87248],[-73.824476,40.872226],[-73.82449200000001,40.872179],[-73.824579,40.871961],[-73.82468299999999,40.871746],[-73.824786,40.871565],[-73.82493700000001,40.871336],[-73.825103,40.871123],[-73.82526,40.870946],[-73.82543699999999,40.870768],[-73.825632,40.870594],[-73.825886,40.870396],[-73.82616,40.870525],[-73.82642800000001,40.870633],[-73.826483,40.870651],[-73.82671499999999,40.870732],[-73.826989,40.870812],[-73.82729999999999,40.870885],[-73.827595,40.87094],[-73.827698,40.870953],[-73.827894,40.87098],[-73.82816099999999,40.871005],[-73.828278,40.871012]]],"type":"Polygon"}
}