{
  "id": "360070125005",
  "type": "Feature",
  "properties": {
    "area_land":21081450,
    "area_water":151601,
    "geoid":"360070125005",
    "name":"Block Group 5",
    "state":"ny"
},
  "bbox": [
    -75.783858,
    42.080561,
    -75.696841,
    42.127631
],
  "geometry": {"coordinates":[[[-75.783858,42.113876],[-75.782967,42.115765],[-75.780029,42.117924],[-75.778345,42.121236],[-75.779128,42.124792],[-75.779544,42.127188],[-75.77962599999999,42.127506],[-75.77883300000001,42.127488],[-75.772907,42.127579],[-75.771213,42.127569],[-75.770735,42.127574],[-75.77028799999999,42.127577],[-75.769921,42.127584],[-75.76976000000001,42.127564],[-75.76956800000001,42.127592],[-75.74897199999999,42.12748],[-75.748487,42.127631],[-75.748546,42.126175],[-75.748544,42.125886],[-75.74855700000001,42.125436],[-75.74865200000001,42.124941],[-75.748734,42.124644],[-75.74885500000001,42.124286],[-75.74821799999999,42.124271],[-75.74653499999999,42.124297],[-75.745671,42.124336],[-75.744455,42.124371],[-75.74400199999999,42.124367],[-75.74331599999999,42.124389],[-75.74270199999999,42.12443],[-75.742507,42.124416],[-75.74234300000001,42.124376],[-75.74225300000001,42.124341],[-75.742188,42.124303],[-75.742126,42.124249],[-75.74203799999999,42.124142],[-75.74197100000001,42.123989],[-75.741933,42.123808],[-75.741846,42.123134],[-75.741832,42.121994],[-75.741815,42.121896],[-75.741784,42.121828],[-75.74174600000001,42.121778],[-75.741688,42.121728],[-75.741607,42.121682],[-75.741522,42.121651],[-75.741438,42.121633],[-75.74117099999999,42.121608],[-75.740942,42.121603],[-75.740576,42.121633],[-75.73989,42.121726],[-75.739383,42.121813],[-75.738595,42.121927],[-75.737774,42.12203],[-75.737082,42.122097],[-75.736559,42.122113],[-75.735136,42.122065],[-75.734763,42.122056],[-75.733718,42.122042],[-75.73162000000001,42.122058],[-75.731307,42.12206],[-75.730963,42.122048],[-75.730812,42.122032],[-75.730558,42.121992],[-75.73045399999999,42.121957],[-75.730299,42.121877],[-75.73017,42.121789],[-75.729951,42.121619],[-75.72866500000001,42.120493],[-75.72816,42.120012],[-75.72658800000001,42.118536],[-75.72636,42.118356],[-75.72617099999999,42.118203],[-75.724723,42.116992],[-75.724538,42.116809],[-75.723991,42.116109],[-75.723597,42.115654],[-75.72333399999999,42.11531],[-75.723203,42.115109],[-75.72166199999999,42.112408],[-75.72139,42.111913],[-75.720439,42.110256],[-75.72030100000001,42.110012],[-75.71991300000001,42.109233],[-75.71978900000001,42.108932],[-75.719697,42.108626],[-75.71963700000001,42.108459],[-75.71957,42.108328],[-75.719503,42.108226],[-75.719325,42.108044],[-75.71910800000001,42.107857],[-75.718703,42.107534],[-75.718361,42.107294],[-75.717872,42.107006],[-75.716888,42.106494],[-75.716537,42.1063],[-75.716156,42.106048],[-75.715833,42.105774],[-75.715104,42.10511],[-75.71460999999999,42.104641],[-75.714382,42.104433],[-75.714246,42.104337],[-75.713898,42.104124],[-75.713703,42.103962],[-75.713565,42.103828],[-75.713465,42.103709],[-75.713314,42.103494],[-75.71266199999999,42.102461],[-75.712338,42.10197],[-75.711811,42.10134],[-75.711697,42.101216],[-75.711592,42.101103],[-75.711422,42.100947],[-75.710965,42.100576],[-75.710303,42.100001],[-75.710154,42.099857],[-75.70989899999999,42.099556],[-75.70967,42.099335],[-75.70957199999999,42.09926],[-75.709312,42.099091],[-75.708978,42.098938],[-75.70871099999999,42.098845],[-75.707724,42.098529],[-75.70702,42.098297],[-75.70662900000001,42.098185],[-75.705913,42.098064],[-75.70540699999999,42.097986],[-75.705094,42.097929],[-75.704865,42.097877],[-75.70419,42.097699],[-75.703389,42.097466],[-75.70285,42.097286],[-75.702439,42.097102],[-75.70222200000001,42.096974],[-75.701913,42.096773],[-75.70179899999999,42.096681],[-75.701652,42.096543],[-75.701149,42.096009],[-75.700991,42.095867],[-75.699326,42.094547],[-75.69917700000001,42.094443],[-75.698762,42.094193],[-75.698351,42.093921],[-75.697299,42.093091],[-75.697194,42.092961],[-75.69714,42.092807],[-75.69710000000001,42.092377],[-75.697095,42.092022],[-75.697068,42.091441],[-75.69702599999999,42.090959],[-75.69688499999999,42.089523],[-75.696845,42.088943],[-75.69684100000001,42.088553],[-75.69687500000001,42.088339],[-75.696934,42.08814],[-75.696974,42.088054],[-75.697028,42.087937],[-75.697171,42.087713],[-75.697357,42.086696],[-75.698215,42.08669],[-75.699867,42.086661],[-75.701021,42.08665],[-75.701645,42.086667],[-75.70229399999999,42.086693],[-75.702851,42.086679],[-75.703519,42.086714],[-75.704707,42.086777],[-75.70546899999999,42.08681],[-75.705866,42.086837],[-75.70723599999999,42.086936],[-75.708353,42.087048],[-75.70925200000001,42.087145],[-75.70934,42.087154],[-75.70988699999999,42.087222],[-75.714581,42.08783],[-75.71539300000001,42.087946],[-75.72063300000001,42.088856],[-75.72110499999999,42.088956],[-75.722469,42.089282],[-75.724647,42.089826],[-75.72581,42.090112],[-75.726314,42.090233],[-75.726761,42.090353],[-75.728894,42.090878],[-75.729372,42.090989],[-75.729893,42.091099],[-75.730684,42.091236],[-75.73153499999999,42.091347],[-75.732219,42.091407],[-75.73281299999999,42.091438],[-75.73399000000001,42.091431],[-75.734071,42.091428],[-75.734314,42.091415],[-75.734765,42.091392],[-75.73553699999999,42.091327],[-75.735834,42.09129],[-75.736948,42.091144],[-75.73945999999999,42.090846],[-75.73960599999999,42.090827],[-75.741981,42.090524],[-75.74280400000001,42.090448],[-75.743629,42.090414],[-75.744445,42.090408],[-75.7454,42.090446],[-75.745868,42.090489],[-75.746008,42.090502],[-75.74626000000001,42.090527],[-75.747012,42.090635],[-75.747148,42.090659],[-75.747694,42.090758],[-75.74837100000001,42.090905],[-75.748746,42.090997],[-75.74952999999999,42.091225],[-75.75000300000001,42.091374],[-75.75072900000001,42.091646],[-75.751924,42.092148],[-75.754453,42.093208],[-75.75532200000001,42.093582],[-75.756728,42.094156],[-75.756878,42.094216],[-75.757019,42.094273],[-75.757017,42.094226],[-75.757015,42.094161],[-75.756997,42.093665],[-75.75697599999999,42.092995],[-75.75696000000001,42.092772],[-75.75693699999999,42.092466],[-75.75690400000001,42.092279],[-75.756805,42.091849],[-75.756778,42.091676],[-75.75677399999999,42.091533],[-75.75684099999999,42.09072],[-75.756829,42.090585],[-75.756725,42.089982],[-75.756728,42.089654],[-75.756748,42.089534],[-75.756877,42.089163],[-75.757206,42.088496],[-75.75729800000001,42.088235],[-75.757498,42.087053],[-75.75755599999999,42.08657],[-75.75762,42.086241],[-75.757705,42.085939],[-75.757918,42.085293],[-75.757949,42.08517],[-75.757946,42.084777],[-75.75790000000001,42.084606],[-75.757848,42.084498],[-75.757256,42.083593],[-75.757093,42.083422],[-75.757304,42.08343],[-75.757645,42.083406],[-75.759023,42.083207],[-75.762147,42.082652],[-75.763811,42.08238],[-75.764532,42.082277],[-75.765607,42.0821],[-75.765913,42.082034],[-75.766302,42.081923],[-75.766695,42.08177],[-75.768829,42.080791],[-75.769426,42.080561],[-75.772779,42.096104],[-75.77304100000001,42.097169],[-75.77318,42.097811],[-75.773201,42.09791],[-75.776037,42.100728],[-75.777126,42.108106],[-75.777652,42.112428],[-75.782009,42.111987],[-75.783495,42.112502],[-75.783858,42.113876]]],"type":"Polygon"}
}