{
  "id": "360010018024",
  "type": "Feature",
  "properties": {
    "area_land":287459,
    "area_water":0,
    "geoid":"360010018024",
    "name":"Block Group 4",
    "state":"ny"
},
  "bbox": [
    -73.828847,
    42.672246,
    -73.81628,
    42.67754
],
  "geometry": {"coordinates":[[[-73.828847,42.676002],[-73.828784,42.6761],[-73.828728,42.676135],[-73.828665,42.676163],[-73.828315,42.676282],[-73.828104,42.676331],[-73.82742399999999,42.676445],[-73.82652899999999,42.67754],[-73.826453,42.677512],[-73.82633300000001,42.677471],[-73.82615199999999,42.677417],[-73.82582499999999,42.677305],[-73.82559500000001,42.677233],[-73.824619,42.676908],[-73.823097,42.67644],[-73.82225,42.676172],[-73.820263,42.675552],[-73.81894,42.675101],[-73.8186,42.675012],[-73.81828299999999,42.674895],[-73.81744999999999,42.674639],[-73.816829,42.674431],[-73.81628000000001,42.674257],[-73.81692700000001,42.673614],[-73.81738199999999,42.673184],[-73.817571,42.673016],[-73.817764,42.672823],[-73.81795,42.672703],[-73.818335,42.672536],[-73.81875599999999,42.672366],[-73.818951,42.672304],[-73.819171,42.672246],[-73.820441,42.673015],[-73.82203199999999,42.673948],[-73.822575,42.673472],[-73.822698,42.673376],[-73.82316,42.673552],[-73.823841,42.673784],[-73.824237,42.673901],[-73.82496,42.674092],[-73.825053,42.674029],[-73.82552200000001,42.673465],[-73.825658,42.673297],[-73.82580299999999,42.673354],[-73.826543,42.67367],[-73.826734,42.673752],[-73.82691,42.673823],[-73.828003,42.674319],[-73.828153,42.674381],[-73.828388,42.674482],[-73.82881,42.674684],[-73.828504,42.675673],[-73.828626,42.675735],[-73.828706,42.675784],[-73.82876400000001,42.675853],[-73.828833,42.675946],[-73.828847,42.676002]]],"type":"Polygon"}
}