{
  "id": "360670114012",
  "type": "Feature",
  "properties": {
    "area_land":7842007,
    "area_water":0,
    "geoid":"360670114012",
    "name":"Block Group 2",
    "state":"ny"
},
  "bbox": [
    -76.322712,
    43.161794,
    -76.284842,
    43.198739
],
  "geometry": {"coordinates":[[[-76.322712,43.197943],[-76.32132,43.198002],[-76.32046800000001,43.198022],[-76.31963399999999,43.198055],[-76.31787300000001,43.198108],[-76.316095,43.19817],[-76.314419,43.198235],[-76.312427,43.198332],[-76.311133,43.198377],[-76.31047,43.198395],[-76.310211,43.1984],[-76.309178,43.198452],[-76.30802799999999,43.19849],[-76.30530299999999,43.198624],[-76.303481,43.198739],[-76.30327699999999,43.19641],[-76.303004,43.193446],[-76.30271,43.189362],[-76.302663,43.189285],[-76.30257400000001,43.189204],[-76.302515,43.189159],[-76.30247799999999,43.189094],[-76.302378,43.188751],[-76.302217,43.188261],[-76.302164,43.188129],[-76.30208399999999,43.187986],[-76.301958,43.187827],[-76.30165599999999,43.187546],[-76.301191,43.187225],[-76.29969,43.186204],[-76.298221,43.185229],[-76.297327,43.184621],[-76.297185,43.184528],[-76.297162,43.184513],[-76.296814,43.184256],[-76.296699,43.184162],[-76.29658999999999,43.184054],[-76.29650700000001,43.183957],[-76.296397,43.18378],[-76.29633,43.18362],[-76.296306,43.183505],[-76.296306,43.183313],[-76.296351,43.183035],[-76.29643,43.182769],[-76.29648299999999,43.182574],[-76.296497,43.182362],[-76.29647199999999,43.18216],[-76.296374,43.181789],[-76.29636000000001,43.181678],[-76.29615099999999,43.181691],[-76.295767,43.181683],[-76.295491,43.181642],[-76.295351,43.181608],[-76.295096,43.181519],[-76.294763,43.181356],[-76.294532,43.181225],[-76.29447,43.181184],[-76.29372600000001,43.181747],[-76.29356199999999,43.181887],[-76.29337,43.182076],[-76.293085,43.182398],[-76.292424,43.183321],[-76.292165,43.183631],[-76.291899,43.183884],[-76.29156999999999,43.184127],[-76.29142,43.184225],[-76.291095,43.18439],[-76.290835,43.184478],[-76.290524,43.184547],[-76.290143,43.184575],[-76.289727,43.184552],[-76.289463,43.184503],[-76.289052,43.184397],[-76.288792,43.184319],[-76.288493,43.184247],[-76.288217,43.1842],[-76.288116,43.184182],[-76.287927,43.184163],[-76.287672,43.184155],[-76.287021,43.184172],[-76.286942,43.182709],[-76.28672400000001,43.179229],[-76.286635,43.1777],[-76.286584,43.176831],[-76.286575,43.176563],[-76.286528,43.175967],[-76.28648200000001,43.175558],[-76.28644300000001,43.175402],[-76.286338,43.17508],[-76.286247,43.174852],[-76.28615600000001,43.17467],[-76.28578400000001,43.174035],[-76.285331,43.173314],[-76.284952,43.172671],[-76.284842,43.172459],[-76.285203,43.172345],[-76.28856399999999,43.171391],[-76.294079,43.169834],[-76.294118,43.169823],[-76.296998,43.169014],[-76.298196,43.168681],[-76.299162,43.168425],[-76.300174,43.168129],[-76.300389,43.168067],[-76.300876,43.167921],[-76.302144,43.167575],[-76.30448,43.166912],[-76.30632900000001,43.166397],[-76.30900099999999,43.165663],[-76.30933899999999,43.165584],[-76.309954,43.16544],[-76.310755,43.165229],[-76.310942,43.165182],[-76.31107799999999,43.165149],[-76.31118600000001,43.165122],[-76.311303,43.165093],[-76.311601,43.16502],[-76.312288,43.164861],[-76.31272199999999,43.16475],[-76.313209,43.164607],[-76.313883,43.164356],[-76.316023,43.163469],[-76.317159,43.162999],[-76.317435,43.162885],[-76.317849,43.162714],[-76.317981,43.162661],[-76.31811500000001,43.162606],[-76.319101,43.162204],[-76.32011199999999,43.161794],[-76.320193,43.162842],[-76.320273,43.163744],[-76.320427,43.165809],[-76.32044,43.16597],[-76.32071500000001,43.169396],[-76.320886,43.171618],[-76.320959,43.172541],[-76.32100699999999,43.173228],[-76.321026,43.173479],[-76.3211,43.174267],[-76.321113,43.174508],[-76.321364,43.177688],[-76.321572,43.180541],[-76.32160500000001,43.180917],[-76.321656,43.181506],[-76.321708,43.182353],[-76.321721,43.182532],[-76.321898,43.184936],[-76.32216699999999,43.18918],[-76.322636,43.196757],[-76.322712,43.197943]]],"type":"Polygon"}
}