{
  "id": "361031907043",
  "type": "Feature",
  "properties": {
    "area_land":11521721,
    "area_water":4596857,
    "geoid":"361031907043",
    "name":"Block Group 3",
    "state":"ny"
},
  "bbox": [
    -72.295059,
    40.899119,
    -72.236549,
    40.95315
],
  "geometry": {"coordinates":[[[-72.294994,40.913894],[-72.294866,40.914135],[-72.294673,40.914473],[-72.294511,40.914795],[-72.294319,40.91502],[-72.294062,40.915294],[-72.29372499999999,40.915664],[-72.29342,40.916002],[-72.293132,40.916356],[-72.292907,40.916629],[-72.292714,40.916919],[-72.29252200000001,40.91716],[-72.292264,40.917418],[-72.291943,40.917756],[-72.291622,40.918062],[-72.291302,40.918352],[-72.291077,40.918529],[-72.29098500000001,40.91871],[-72.29088900000001,40.918806],[-72.290729,40.918934],[-72.290537,40.919062],[-72.29028099999999,40.91927],[-72.29002199999999,40.919647],[-72.288422,40.921365],[-72.286468,40.923364],[-72.28609400000001,40.923796],[-72.28563800000001,40.924324],[-72.28565399999999,40.924532],[-72.28565399999999,40.924612],[-72.28563800000001,40.924772],[-72.28563800000001,40.924916],[-72.285622,40.925124],[-72.285574,40.925284],[-72.287459,40.93018],[-72.28751699999999,40.930306],[-72.28759100000001,40.930466],[-72.287446,40.931491],[-72.28711,40.933571],[-72.287088,40.933824],[-72.287081,40.933903],[-72.287015,40.934675],[-72.286867,40.936413],[-72.28663400000001,40.938013],[-72.286276,40.939592],[-72.28618899999999,40.939938],[-72.286012,40.94065],[-72.285674,40.940687],[-72.28552999999999,40.940703],[-72.28538,40.941412],[-72.285737,40.941344],[-72.28823300000001,40.940873],[-72.288442,40.940834],[-72.288921,40.940706],[-72.290187,40.944941],[-72.28994400000001,40.945023],[-72.289395,40.945514],[-72.289191,40.945859],[-72.29054600000001,40.946588],[-72.290666,40.946612],[-72.291533,40.947016],[-72.291524,40.947105],[-72.291511,40.947251],[-72.291546,40.947676],[-72.290646,40.947801],[-72.289619,40.947942],[-72.28518200000001,40.948793],[-72.281828,40.94941],[-72.276099,40.950481],[-72.266739,40.952207],[-72.261276,40.953074],[-72.260812,40.95315],[-72.260778,40.953074],[-72.260366,40.952031],[-72.259908,40.951162],[-72.25960499999999,40.95064],[-72.25870999999999,40.949358],[-72.258234,40.94866],[-72.258179,40.948534],[-72.25811299999999,40.948442],[-72.257712,40.947879],[-72.257274,40.947243],[-72.25683600000001,40.946603],[-72.256519,40.946102],[-72.257392,40.945928],[-72.25789,40.945828],[-72.258196,40.94576],[-72.259793,40.945405],[-72.261287,40.945127],[-72.261578,40.945072],[-72.26295,40.944804],[-72.262845,40.94471],[-72.262483,40.944278],[-72.261003,40.942472],[-72.260334,40.941666],[-72.259084,40.940131],[-72.258391,40.939073],[-72.25748400000001,40.937686],[-72.257166,40.937208],[-72.256657,40.936462],[-72.25636299999999,40.936076],[-72.25599099999999,40.935607],[-72.255576,40.935047],[-72.255132,40.934499],[-72.254845,40.934135],[-72.25460699999999,40.933818],[-72.254237,40.933364],[-72.253803,40.932804],[-72.25353200000001,40.932465],[-72.253259,40.932099],[-72.252993,40.931766],[-72.2525,40.931127],[-72.252364,40.930959],[-72.252235,40.9308],[-72.251715,40.930141],[-72.25108,40.929448],[-72.250606,40.928966],[-72.250395,40.92873],[-72.250176,40.928493],[-72.24996400000001,40.928237],[-72.249741,40.928003],[-72.24939000000001,40.927625],[-72.246168,40.924275],[-72.24574800000001,40.923838],[-72.245614,40.923699],[-72.245482,40.923668],[-72.236727,40.914838],[-72.236549,40.914659],[-72.249477,40.911299],[-72.253061,40.912099],[-72.26611800000001,40.906787],[-72.28494999999999,40.899268],[-72.285319,40.899119],[-72.285928,40.90026],[-72.287891,40.903328],[-72.290038,40.906165],[-72.290184,40.906358],[-72.29013500000001,40.906477],[-72.29027499999999,40.906644],[-72.291848,40.908786],[-72.292197,40.909262],[-72.292828,40.910241],[-72.29421499999999,40.912322],[-72.294506,40.912759],[-72.29505899999999,40.913588],[-72.294994,40.913894]]],"type":"Polygon"}
}