{
  "id": "360290142061",
  "type": "Feature",
  "properties": {
    "area_land":5458113,
    "area_water":0,
    "geoid":"360290142061",
    "name":"Block Group 1",
    "state":"ny"
},
  "bbox": [
    -78.676733,
    42.863958,
    -78.640424,
    42.88109
],
  "geometry": {"coordinates":[[[-78.676733,42.880702],[-78.674171,42.880741],[-78.670884,42.880809],[-78.66899100000001,42.880847],[-78.66781899999999,42.880871],[-78.666214,42.880903],[-78.66618800000001,42.880904],[-78.663346,42.880924],[-78.660698,42.880943],[-78.65958000000001,42.880949],[-78.657724,42.880959],[-78.656209,42.880967],[-78.656113,42.880967],[-78.651184,42.880999],[-78.646542,42.881071],[-78.645678,42.881086],[-78.640632,42.88109],[-78.64059399999999,42.878795],[-78.640559,42.87696],[-78.640558,42.876874],[-78.64055399999999,42.876477],[-78.640528,42.874081],[-78.640512,42.87261],[-78.640511,42.872569],[-78.640466,42.868176],[-78.64043599999999,42.865486],[-78.640424,42.86445],[-78.645651,42.864382],[-78.64661099999999,42.864365],[-78.647362,42.864396],[-78.66037799999999,42.864192],[-78.664748,42.864122],[-78.665836,42.864105],[-78.66586100000001,42.864105],[-78.66731799999999,42.864082],[-78.671387,42.864019],[-78.67533899999999,42.863958],[-78.67618899999999,42.863961],[-78.67619999999999,42.864331],[-78.67625,42.865864],[-78.676299,42.867398],[-78.67632500000001,42.868152],[-78.676354,42.869109],[-78.676389,42.870233],[-78.67639699999999,42.87045],[-78.676406,42.870698],[-78.67644300000001,42.871672],[-78.676529,42.874396],[-78.676599,42.876392],[-78.67661699999999,42.877042],[-78.676658,42.878335],[-78.67667899999999,42.878913],[-78.676733,42.880702]]],"type":"Polygon"}
}