{
  "id": "360290133003",
  "type": "Feature",
  "properties": {
    "area_land":293597,
    "area_water":0,
    "geoid":"360290133003",
    "name":"Block Group 3",
    "state":"ny"
},
  "bbox": [
    -78.829311,
    42.717472,
    -78.819833,
    42.721896
],
  "geometry": {"coordinates":[[[-78.82928099999999,42.718263],[-78.829255,42.718394],[-78.829212,42.718522],[-78.82915800000001,42.718637],[-78.82907,42.718774],[-78.82898,42.718883],[-78.82887599999999,42.718986],[-78.826925,42.720746],[-78.82642300000001,42.721196],[-78.82617,42.721422],[-78.826115,42.721471],[-78.82594,42.721317],[-78.825653,42.7214],[-78.82300499999999,42.721356],[-78.822988,42.721896],[-78.821876,42.721873],[-78.819833,42.721832],[-78.819872,42.720819],[-78.81990500000001,42.719774],[-78.819969,42.7178],[-78.820787,42.717819],[-78.821788,42.717843],[-78.82311300000001,42.717875],[-78.823127,42.717472],[-78.824569,42.717505],[-78.824961,42.717513],[-78.82599,42.717537],[-78.829311,42.717631],[-78.82928099999999,42.718263]]],"type":"Polygon"}
}