{
  "id": "360290049004",
  "type": "Feature",
  "properties": {
    "area_land":123107,
    "area_water":0,
    "geoid":"360290049004",
    "name":"Block Group 4",
    "state":"ny"
},
  "bbox": [
    -78.868146,
    42.943938,
    -78.856964,
    42.947753
],
  "geometry": {"coordinates":[[[-78.868146,42.944622],[-78.867981,42.944623],[-78.867412,42.944621],[-78.86427999999999,42.944607],[-78.863062,42.944594],[-78.86305,42.947375],[-78.86304800000001,42.947753],[-78.861823,42.947746],[-78.860477,42.947739],[-78.860483,42.947399],[-78.86048700000001,42.947367],[-78.86051,42.94718],[-78.860524,42.947125],[-78.860542,42.947079],[-78.860604,42.946967],[-78.860637,42.946849],[-78.860646,42.946747],[-78.860654,42.944568],[-78.859447,42.944555],[-78.858501,42.944548],[-78.857271,42.944538],[-78.856964,42.943938],[-78.859933,42.944066],[-78.860401,42.944067],[-78.868078,42.944074],[-78.868138,42.94457],[-78.868146,42.944622]]],"type":"Polygon"}
}