{
  "id": "360610184002",
  "type": "Feature",
  "properties": {
    "area_land":27241,
    "area_water":0,
    "geoid":"360610184002",
    "name":"Block Group 2",
    "state":"ny"
},
  "bbox": [
    -73.946974,
    40.799287,
    -73.944354,
    40.801342
],
  "geometry": {"coordinates":[[[-73.946462,40.800665],[-73.946325,40.800852],[-73.94596799999999,40.801342],[-73.944354,40.800663],[-73.94470699999999,40.800178],[-73.94484799999999,40.799986],[-73.945359,40.799287],[-73.946974,40.799961],[-73.946462,40.800665]]],"type":"Polygon"}
}