{
  "id": "360870105022",
  "type": "Feature",
  "properties": {
    "area_land":974332,
    "area_water":0,
    "geoid":"360870105022",
    "name":"Block Group 2",
    "state":"ny"
},
  "bbox": [
    -74.032206,
    41.186839,
    -74.011729,
    41.197417
],
  "geometry": {"coordinates":[[[-74.031991,41.187414],[-74.031937,41.187484],[-74.031924,41.187586],[-74.031933,41.187669],[-74.031989,41.18793],[-74.03213700000001,41.188504],[-74.032144,41.188659],[-74.032139,41.18887],[-74.032112,41.18898],[-74.03203600000001,41.189186],[-74.031766,41.189687],[-74.03173,41.189754],[-74.03171,41.189774],[-74.03178800000001,41.189883],[-74.03180500000001,41.189929],[-74.03190600000001,41.190041],[-74.03179299999999,41.190071],[-74.031727,41.190068],[-74.03159599999999,41.190093],[-74.031487,41.19013],[-74.03133800000001,41.190206],[-74.031008,41.19032],[-74.031097,41.190436],[-74.03139,41.190702],[-74.03149500000001,41.190767],[-74.031543,41.19078],[-74.031617,41.190774],[-74.031407,41.191269],[-74.031204,41.191214],[-74.03106099999999,41.191195],[-74.030958,41.19119],[-74.030884,41.191609],[-74.030835,41.191784],[-74.030832,41.191896],[-74.030868,41.191982],[-74.031077,41.192319],[-74.031188,41.192479],[-74.031282,41.192568],[-74.031209,41.192597],[-74.031127,41.192627],[-74.03071199999999,41.192776],[-74.03038100000001,41.192868],[-74.03039,41.192896],[-74.03037399999999,41.192926],[-74.029837,41.193121],[-74.029764,41.193138],[-74.029729,41.193126],[-74.029701,41.193063],[-74.02951400000001,41.193123],[-74.02861300000001,41.193371],[-74.028181,41.193489],[-74.027546,41.193663],[-74.02737999999999,41.19369],[-74.02713900000001,41.194437],[-74.02708800000001,41.194593],[-74.026847,41.194651],[-74.025749,41.196037],[-74.023252,41.196853],[-74.02264099999999,41.197053],[-74.019966,41.197417],[-74.01660800000001,41.196515],[-74.015998,41.196348],[-74.011729,41.195184],[-74.012168,41.194626],[-74.012314,41.194465],[-74.012519,41.194302],[-74.012764,41.19416],[-74.012953,41.194066],[-74.013363,41.193895],[-74.013595,41.193809],[-74.013879,41.193705],[-74.014982,41.193391],[-74.015208,41.193308],[-74.015445,41.193202],[-74.01577899999999,41.193021],[-74.01603900000001,41.192845],[-74.01628100000001,41.192635],[-74.016969,41.191915],[-74.017022,41.191872],[-74.017094,41.191786],[-74.01718099999999,41.191702],[-74.017425,41.191521],[-74.017618,41.191419],[-74.017777,41.191347],[-74.01904500000001,41.190916],[-74.019293,41.190813],[-74.01978200000001,41.190544],[-74.020301,41.19026],[-74.02050300000001,41.190156],[-74.02073300000001,41.190064],[-74.021068,41.189972],[-74.02132400000001,41.189924],[-74.021494,41.189908],[-74.021687,41.189904],[-74.022327,41.189892],[-74.02286700000001,41.189869],[-74.023191,41.18985],[-74.02371100000001,41.18979],[-74.024103,41.189705],[-74.02546700000001,41.189285],[-74.025567,41.189247],[-74.025802,41.189175],[-74.026571,41.1889],[-74.026949,41.188743],[-74.02743599999999,41.188494],[-74.027873,41.188265],[-74.028738,41.187856],[-74.028938,41.187765],[-74.029657,41.187391],[-74.02989700000001,41.187267],[-74.03027,41.187102],[-74.030613,41.186972],[-74.030884,41.186892],[-74.031109,41.186861],[-74.031684,41.186839],[-74.031937,41.187028],[-74.032206,41.187233],[-74.031991,41.187414]]],"type":"Polygon"}
}