{
  "id": "360070127014",
  "type": "Feature",
  "properties": {
    "area_land":12021934,
    "area_water":297354,
    "geoid":"360070127014",
    "name":"Block Group 4",
    "state":"ny"
},
  "bbox": [
    -75.866594,
    42.055982,
    -75.815014,
    42.103514
],
  "geometry": {"coordinates":[[[-75.86659400000001,42.101043],[-75.866316,42.101092],[-75.86457299999999,42.101506],[-75.863786,42.101739],[-75.86333,42.101832],[-75.86250200000001,42.1024],[-75.860561,42.102936],[-75.859376,42.102879],[-75.857894,42.103514],[-75.851952,42.101757],[-75.851364,42.101656],[-75.85084999999999,42.101568],[-75.84664100000001,42.101304],[-75.841521,42.09608],[-75.839563,42.095155],[-75.838257,42.094823],[-75.838212,42.094812],[-75.83253499999999,42.093363],[-75.83023900000001,42.092981],[-75.827732,42.091598],[-75.827136,42.091276],[-75.82706,42.090652],[-75.826964,42.09038],[-75.826932,42.09006],[-75.826932,42.08974],[-75.82728400000001,42.088844],[-75.82786,42.087372],[-75.828052,42.086636],[-75.82818,42.085612],[-75.828068,42.084924],[-75.827893,42.084267],[-75.82743600000001,42.083578],[-75.82676600000001,42.082793],[-75.82734499999999,42.082423],[-75.827499,42.082336],[-75.825287,42.080364],[-75.824657,42.079773],[-75.824736,42.079748],[-75.826108,42.079642],[-75.828266,42.079507],[-75.829403,42.079427],[-75.828902,42.078911],[-75.82551100000001,42.075348],[-75.82259999999999,42.072305],[-75.821327,42.070961],[-75.819486,42.069047],[-75.815575,42.064945],[-75.81501400000001,42.064358],[-75.816396,42.064266],[-75.817624,42.064174],[-75.817916,42.064157],[-75.81921800000001,42.064039],[-75.821184,42.063927],[-75.82252200000001,42.06385],[-75.823435,42.063783],[-75.823954,42.063713],[-75.82416600000001,42.063668],[-75.824484,42.063577],[-75.824755,42.063476],[-75.82519600000001,42.06326],[-75.825512,42.063062],[-75.82734000000001,42.061734],[-75.828272,42.06105],[-75.830626,42.059347],[-75.83149899999999,42.05874],[-75.832016,42.058369],[-75.832678,42.057914],[-75.833384,42.057416],[-75.834602,42.056583],[-75.834896,42.056422],[-75.83532099999999,42.056261],[-75.83548999999999,42.056212],[-75.835933,42.056104],[-75.83630700000001,42.056043],[-75.836726,42.055999],[-75.83710499999999,42.055982],[-75.837248,42.055982],[-75.83762400000001,42.055985],[-75.838027,42.056009],[-75.83816400000001,42.05603],[-75.838296,42.056066],[-75.838345,42.056083],[-75.83846800000001,42.056124],[-75.838943,42.056284],[-75.83939599999999,42.056465],[-75.839626,42.056592],[-75.839707,42.056658],[-75.83976800000001,42.056729],[-75.840323,42.057744],[-75.840672,42.058344],[-75.840836,42.058527],[-75.841266,42.058936],[-75.841781,42.0594],[-75.84250400000001,42.060012],[-75.843619,42.060829],[-75.84429900000001,42.061339],[-75.84518199999999,42.061978],[-75.845451,42.062191],[-75.845844,42.062503],[-75.84790599999999,42.064068],[-75.84916,42.064991],[-75.84990500000001,42.065568],[-75.850004,42.065639],[-75.85055199999999,42.065977],[-75.850899,42.066177],[-75.851118,42.066282],[-75.851686,42.066472],[-75.85355800000001,42.067002],[-75.85370899999999,42.067062],[-75.853832,42.067137],[-75.853984,42.067268],[-75.85435,42.067744],[-75.854809,42.068401],[-75.85526900000001,42.069067],[-75.855383,42.069277],[-75.85550000000001,42.069597],[-75.855794,42.070867],[-75.855941,42.071331],[-75.856178,42.071987],[-75.85637,42.072404],[-75.856582,42.072773],[-75.85699099999999,42.073326],[-75.857153,42.073516],[-75.857381,42.073739],[-75.85773500000001,42.074049],[-75.85842599999999,42.074601],[-75.858733,42.074859],[-75.858813,42.074941],[-75.858889,42.075052],[-75.858957,42.075216],[-75.858999,42.075442],[-75.859078,42.075865],[-75.85914200000001,42.076063],[-75.85950699999999,42.077046],[-75.85967100000001,42.07743],[-75.85972099999999,42.077521],[-75.859798,42.077622],[-75.859863,42.077674],[-75.859995,42.077735],[-75.860141,42.077778],[-75.860337,42.077806],[-75.860759,42.077816],[-75.860882,42.077893],[-75.861008,42.07781],[-75.86108299999999,42.078788],[-75.861178,42.079843],[-75.861165,42.079919],[-75.861431,42.080485],[-75.863122,42.089172],[-75.863151,42.089174],[-75.86318900000001,42.089177],[-75.86538299999999,42.088683],[-75.865651,42.089739],[-75.86638000000001,42.094184],[-75.866536,42.094981],[-75.86643100000001,42.097953],[-75.866523,42.098873],[-75.866539,42.099079],[-75.866553,42.09993],[-75.86655399999999,42.099969],[-75.866569,42.100288],[-75.866567,42.100482],[-75.86659400000001,42.101043]]],"type":"Polygon"}
}