{
  "id": "360050345001",
  "type": "Feature",
  "properties": {
    "area_land":82123,
    "area_water":0,
    "geoid":"360050345001",
    "name":"Block Group 1",
    "state":"ny"
},
  "bbox": [
    -73.900717,
    40.904505,
    -73.896411,
    40.908129
],
  "geometry": {"coordinates":[[[-73.900384,40.906747],[-73.900007,40.908129],[-73.899674,40.907921],[-73.89919999999999,40.907712],[-73.898365,40.907589],[-73.898245,40.907571],[-73.89755700000001,40.907472],[-73.896546,40.907507],[-73.89649300000001,40.906339],[-73.896435,40.905093],[-73.896411,40.904505],[-73.897036,40.905007],[-73.897457,40.905346],[-73.898624,40.905662],[-73.89919,40.905682],[-73.899756,40.9056],[-73.900717,40.905468],[-73.900384,40.906747]]],"type":"Polygon"}
}