{
  "id": "360650245003",
  "type": "Feature",
  "properties": {
    "area_land":5856683,
    "area_water":0,
    "geoid":"360650245003",
    "name":"Block Group 3",
    "state":"ny"
},
  "bbox": [
    -75.764502,
    43.324724,
    -75.73195,
    43.348398
],
  "geometry": {"coordinates":[[[-75.76450199999999,43.346227],[-75.75923299999999,43.346625],[-75.757845,43.346707],[-75.754255,43.346922],[-75.75341,43.346973],[-75.75243399999999,43.347049],[-75.74963099999999,43.347265],[-75.747328,43.347458],[-75.736767,43.348256],[-75.73512599999999,43.348398],[-75.734967,43.347392],[-75.73437699999999,43.343616],[-75.73432200000001,43.343476],[-75.732437,43.34224],[-75.73311099999999,43.341716],[-75.732623,43.341573],[-75.733976,43.340313],[-75.733897,43.339852],[-75.733418,43.336623],[-75.733121,43.334663],[-75.73311200000001,43.334279],[-75.733037,43.333425],[-75.733017,43.333342],[-75.732491,43.331482],[-75.732502,43.330908],[-75.73236799999999,43.330111],[-75.732238,43.329337],[-75.73209199999999,43.328119],[-75.732051,43.327725],[-75.73195,43.326597],[-75.734145,43.326445],[-75.73459800000001,43.326405],[-75.7345,43.326217],[-75.734976,43.326193],[-75.741646,43.325854],[-75.743555,43.325932],[-75.74476799999999,43.325927],[-75.74963,43.325454],[-75.75059,43.325376],[-75.761793,43.324724],[-75.762907,43.333868],[-75.763353,43.337697],[-75.76412500000001,43.343861],[-75.76450199999999,43.346227]]],"type":"Polygon"}
}