{
  "id": "360290054004",
  "type": "Feature",
  "properties": {
    "area_land":437317,
    "area_water":0,
    "geoid":"360290054004",
    "name":"Block Group 4",
    "state":"ny"
},
  "bbox": [
    -78.868078,
    42.940449,
    -78.849841,
    42.944538
],
  "geometry": {"coordinates":[[[-78.868078,42.944074],[-78.860401,42.944067],[-78.859933,42.944066],[-78.856964,42.943938],[-78.857271,42.944538],[-78.855937,42.944521],[-78.854755,42.944505],[-78.85452100000001,42.944499],[-78.853611,42.94448],[-78.853134,42.944478],[-78.852942,42.944482],[-78.85275,42.944481],[-78.852558,42.944475],[-78.85208299999999,42.944447],[-78.851799,42.944424],[-78.851517,42.944395],[-78.85117700000001,42.944355],[-78.85084000000001,42.944308],[-78.850504,42.944252],[-78.850171,42.944189],[-78.849841,42.944118],[-78.84998299999999,42.943429],[-78.850212,42.942843],[-78.850246,42.942796],[-78.850337,42.94265],[-78.850392,42.942534],[-78.85044000000001,42.942434],[-78.850655,42.941961],[-78.850696,42.941836],[-78.850736,42.941659],[-78.850753,42.941488],[-78.850751,42.941216],[-78.850759,42.940964],[-78.850759,42.940777],[-78.85099700000001,42.940813],[-78.851231,42.940859],[-78.85134600000001,42.940886],[-78.851674,42.940948],[-78.851787,42.940972],[-78.851957,42.941007],[-78.852006,42.941016],[-78.85209500000001,42.941031],[-78.853352,42.941255],[-78.853711,42.941308],[-78.853998,42.941337],[-78.85429600000001,42.941349],[-78.854591,42.941354],[-78.85473,42.94135],[-78.855225,42.941305],[-78.85564100000001,42.941252],[-78.85624,42.941119],[-78.85650099999999,42.941055],[-78.85751500000001,42.940789],[-78.85799900000001,42.940668],[-78.85834699999999,42.940567],[-78.85868499999999,42.940449],[-78.86028899999999,42.940462],[-78.86176500000001,42.940473],[-78.861864,42.940474],[-78.86223200000001,42.940477],[-78.862898,42.940482],[-78.863462,42.94049],[-78.863456,42.941472],[-78.863451,42.942389],[-78.86343100000001,42.943309],[-78.86483800000001,42.943328],[-78.867991,42.943349],[-78.868053,42.943862],[-78.868078,42.944074]]],"type":"Polygon"}
}