{
  "id": "360811463002",
  "type": "Feature",
  "properties": {
    "area_land":150112,
    "area_water":0,
    "geoid":"360811463002",
    "name":"Block Group 2",
    "state":"ny"
},
  "bbox": [
    -73.785274,
    40.755997,
    -73.777417,
    40.762029
],
  "geometry": {"coordinates":[[[-73.785274,40.761842],[-73.78423100000001,40.761924],[-73.78307700000001,40.762029],[-73.78219,40.759997],[-73.78144500000001,40.758392],[-73.781074,40.757593],[-73.780102,40.757626],[-73.77941800000001,40.757691],[-73.77916,40.757747],[-73.778271,40.757982],[-73.77766699999999,40.758148],[-73.777417,40.757362],[-73.779015,40.756934],[-73.780563,40.756515],[-73.782481,40.755997],[-73.782816,40.756666],[-73.783162,40.757326],[-73.78339200000001,40.757758],[-73.78345299999999,40.75787],[-73.784099,40.759038],[-73.784278,40.759443],[-73.784471,40.759864],[-73.785168,40.761433],[-73.785274,40.761842]]],"type":"Polygon"}
}