{
  "id": "360790111003",
  "type": "Feature",
  "properties": {
    "area_land":3733555,
    "area_water":207083,
    "geoid":"360790111003",
    "name":"Block Group 3",
    "state":"ny"
},
  "bbox": [
    -73.795007,
    41.367294,
    -73.771204,
    41.397722
],
  "geometry": {"coordinates":[[[-73.794275,41.380418],[-73.793646,41.38816],[-73.79371,41.388514],[-73.79062500000001,41.390079],[-73.79043900000001,41.390174],[-73.79009499999999,41.390246],[-73.78986500000001,41.390325],[-73.78939200000001,41.390468],[-73.789277,41.390523],[-73.788742,41.390861],[-73.788476,41.391007],[-73.788366,41.391044],[-73.78818,41.391065],[-73.78801799999999,41.391078],[-73.78791099999999,41.391095],[-73.787811,41.391122],[-73.787076,41.391309],[-73.78634700000001,41.391524],[-73.786254,41.391548],[-73.786174,41.391557],[-73.786089,41.391541],[-73.785828,41.391774],[-73.785639,41.392011],[-73.785175,41.392651],[-73.784852,41.39303],[-73.784418,41.393529],[-73.784271,41.393713],[-73.78370700000001,41.394509],[-73.783368,41.394954],[-73.78313,41.395231],[-73.78308199999999,41.395287],[-73.782876,41.395471],[-73.78275600000001,41.395557],[-73.782537,41.395684],[-73.781853,41.396025],[-73.781654,41.396144],[-73.781406,41.396293],[-73.78080799999999,41.396691],[-73.78044800000001,41.396915],[-73.77985200000001,41.397199],[-73.77956399999999,41.397312],[-73.77950199999999,41.397328],[-73.779175,41.397402],[-73.77897400000001,41.397434],[-73.778629,41.397464],[-73.778099,41.397519],[-73.777632,41.397563],[-73.77746,41.397578],[-73.776836,41.397634],[-73.77569099999999,41.397722],[-73.77537,41.397715],[-73.775199,41.397197],[-73.774914,41.39614],[-73.774719,41.395492],[-73.774626,41.395118],[-73.77454899999999,41.394697],[-73.77452,41.394418],[-73.774531,41.393899],[-73.774531,41.393591],[-73.774427,41.392894],[-73.77441399999999,41.392482],[-73.77442499999999,41.392096],[-73.774473,41.391802],[-73.774546,41.391606],[-73.774737,41.391239],[-73.774829,41.390983],[-73.774958,41.390394],[-73.774998,41.39021],[-73.775142,41.389716],[-73.77527000000001,41.389325],[-73.77542699999999,41.388789],[-73.775448,41.388719],[-73.775543,41.388395],[-73.77562399999999,41.388034],[-73.77576500000001,41.387519],[-73.775857,41.387013],[-73.775862,41.386702],[-73.775767,41.386029],[-73.775701,41.385376],[-73.77564,41.384907],[-73.77559100000001,41.384365],[-73.775561,41.384041],[-73.77543799999999,41.383491],[-73.775353,41.383192],[-73.775226,41.382569],[-73.77516,41.382332],[-73.77510700000001,41.382203],[-73.775007,41.38206],[-73.774962,41.382016],[-73.77480199999999,41.381919],[-73.774663,41.381883],[-73.774361,41.38184],[-73.77422900000001,41.381821],[-73.77384000000001,41.381755],[-73.77378,41.381742],[-73.77369,41.381706],[-73.77354800000001,41.381622],[-73.773433,41.381508],[-73.773393,41.381442],[-73.773369,41.381337],[-73.77338,41.381232],[-73.773501,41.380578],[-73.773521,41.380243],[-73.773568,41.380044],[-73.773594,41.379964],[-73.77370999999999,41.379612],[-73.773831,41.379193],[-73.77391799999999,41.378783],[-73.77391799999999,41.378629],[-73.773876,41.378408],[-73.773787,41.378122],[-73.773647,41.377849],[-73.77361000000001,41.377795],[-73.77355300000001,41.377709],[-73.77345699999999,41.377572],[-73.7734,41.37749],[-73.773377,41.377457],[-73.773326,41.377386],[-73.77319900000001,41.377144],[-73.773105,41.376885],[-73.77305699999999,41.376557],[-73.77305200000001,41.37633],[-73.77302899999999,41.375758],[-73.77300700000001,41.375304],[-73.772887,41.373503],[-73.77285999999999,41.373076],[-73.77282700000001,41.37246],[-73.772779,41.37179],[-73.772688,41.371156],[-73.772594,41.370782],[-73.77245000000001,41.370462],[-73.772333,41.370274],[-73.77199299999999,41.369796],[-73.77179700000001,41.369464],[-73.771593,41.369021],[-73.771378,41.36851],[-73.77128399999999,41.368248],[-73.77124999999999,41.36813],[-73.771204,41.367746],[-73.771208,41.367617],[-73.771266,41.367498],[-73.771326,41.367439],[-73.771548,41.367294],[-73.77174599999999,41.367504],[-73.771912,41.367638],[-73.772233,41.367817],[-73.77251,41.367912],[-73.772812,41.367974],[-73.773348,41.36806],[-73.77399699999999,41.368162],[-73.774406,41.368228],[-73.774719,41.36828],[-73.77492100000001,41.368328],[-73.77517,41.368416],[-73.775418,41.368533],[-73.775555,41.36862],[-73.77576500000001,41.368795],[-73.775904,41.368947],[-73.77602400000001,41.369123],[-73.77612999999999,41.36935],[-73.77624,41.3697],[-73.776293,41.369869],[-73.77641,41.370141],[-73.776484,41.370256],[-73.776588,41.37038],[-73.77680599999999,41.370579],[-73.7769,41.370643],[-73.776966,41.370683],[-73.777061,41.37074],[-73.77718400000001,41.370788],[-73.778003,41.371108],[-73.778409,41.371281],[-73.778436,41.371291],[-73.778791,41.371422],[-73.779248,41.371552],[-73.77971599999999,41.37166],[-73.779906,41.3717],[-73.780102,41.371726],[-73.780372,41.371749],[-73.780612,41.371751],[-73.780743,41.371746],[-73.780871,41.371726],[-73.780945,41.371706],[-73.781111,41.371635],[-73.781272,41.371538],[-73.781617,41.37127],[-73.78179900000001,41.371162],[-73.78205,41.371021],[-73.782312,41.370893],[-73.782571,41.370804],[-73.782723,41.370765],[-73.783298,41.370618],[-73.783619,41.370545],[-73.78388699999999,41.37047],[-73.78443900000001,41.370328],[-73.78472499999999,41.370278],[-73.78478699999999,41.370272],[-73.784948,41.370272],[-73.785051,41.370283],[-73.785242,41.370331],[-73.78630800000001,41.370727],[-73.78653,41.370795],[-73.786857,41.370867],[-73.787119,41.370891],[-73.787576,41.370884],[-73.787603,41.371516],[-73.787606,41.371737],[-73.78765199999999,41.372175],[-73.787676,41.372878],[-73.78769,41.373404],[-73.787728,41.373519],[-73.787753,41.373566],[-73.787813,41.373658],[-73.787947,41.373795],[-73.788488,41.374215],[-73.788815,41.374555],[-73.788893,41.37463],[-73.788977,41.374682],[-73.789113,41.374758],[-73.78916700000001,41.374863],[-73.789281,41.375032],[-73.789601,41.375423],[-73.790032,41.376034],[-73.790206,41.376308],[-73.790322,41.376521],[-73.79038799999999,41.37667],[-73.790571,41.377091],[-73.790646,41.37735],[-73.790689,41.377988],[-73.79071399999999,41.378521],[-73.79073699999999,41.378642],[-73.790808,41.379054],[-73.790851,41.37924],[-73.791014,41.379885],[-73.791134,41.380387],[-73.791158,41.380434],[-73.791183,41.380455],[-73.791223,41.380469],[-73.791279,41.380477],[-73.791605,41.380484],[-73.79246000000001,41.380441],[-73.792677,41.380429],[-73.793576,41.380408],[-73.793621,41.380399],[-73.79366,41.380374],[-73.793702,41.380305],[-73.79373200000001,41.379772],[-73.793764,41.379177],[-73.793817,41.378549],[-73.793859,41.377909],[-73.79391200000001,41.377251],[-73.79394600000001,41.376852],[-73.79394000000001,41.376567],[-73.79393899999999,41.376289],[-73.79398500000001,41.375919],[-73.794039,41.375251],[-73.794087,41.374592],[-73.79409699999999,41.374351],[-73.79413599999999,41.373898],[-73.79419,41.373255],[-73.794234,41.372588],[-73.794258,41.372211],[-73.794239,41.372119],[-73.794196,41.372068],[-73.794163,41.372038],[-73.794105,41.37201],[-73.794017,41.371994],[-73.793297,41.371995],[-73.79239,41.371988],[-73.792294,41.372009],[-73.792216,41.372063],[-73.792017,41.37246],[-73.79197499999999,41.372595],[-73.791974,41.372662],[-73.791771,41.372665],[-73.791534,41.372654],[-73.79143000000001,41.372623],[-73.791338,41.372555],[-73.791265,41.372471],[-73.79124,41.372398],[-73.79127200000001,41.372183],[-73.791588,41.371125],[-73.791768,41.37121],[-73.791968,41.371277],[-73.792249,41.371324],[-73.79255999999999,41.371352],[-73.792917,41.371384],[-73.7933,41.371406],[-73.795007,41.371471],[-73.794275,41.380418]]],"type":"Polygon"}
}