{
  "id": "360610226001",
  "type": "Feature",
  "properties": {
    "area_land":43236,
    "area_water":0,
    "geoid":"360610226001",
    "name":"Block Group 1",
    "state":"ny"
},
  "bbox": [
    -73.945102,
    40.812201,
    -73.941347,
    40.814634
],
  "geometry": {"coordinates":[[[-73.94510200000001,40.813388],[-73.944649,40.814009],[-73.944193,40.814634],[-73.942477,40.813912],[-73.94134699999999,40.813438],[-73.94180299999999,40.812815],[-73.942249,40.812201],[-73.94270299999999,40.81239],[-73.944485,40.813131],[-73.944759,40.813245],[-73.94510200000001,40.813388]]],"type":"Polygon"}
}