{
  "id": "360050407021",
  "type": "Feature",
  "properties": {
    "area_land":22763,
    "area_water":0,
    "geoid":"360050407021",
    "name":"Block Group 1",
    "state":"ny"
},
  "bbox": [
    -73.885738,
    40.866383,
    -73.883625,
    40.868705
],
  "geometry": {"coordinates":[[[-73.885738,40.867088],[-73.885026,40.867518],[-73.88555599999999,40.868143],[-73.884709,40.868705],[-73.88423899999999,40.868006],[-73.88362499999999,40.867258],[-73.884429,40.866801],[-73.88514000000001,40.866383],[-73.885738,40.867088]]],"type":"Polygon"}
}