{
  "id": "360050316002",
  "type": "Feature",
  "properties": {
    "area_land":78739,
    "area_water":0,
    "geoid":"360050316002",
    "name":"Block Group 2",
    "state":"ny"
},
  "bbox": [
    -73.850282,
    40.858657,
    -73.847261,
    40.862857
],
  "geometry": {"coordinates":[[[-73.85025,40.859812],[-73.850212,40.861026],[-73.849231,40.861009],[-73.848259,40.860991],[-73.848201,40.862857],[-73.847261,40.86284],[-73.84732099999999,40.860973],[-73.84735999999999,40.859794],[-73.847397,40.858683],[-73.848337,40.858702],[-73.84930900000001,40.858718],[-73.85028200000001,40.858657],[-73.85025,40.859812]]],"type":"Polygon"}
}