{
  "id": "360910614012",
  "type": "Feature",
  "properties": {
    "area_land":22154422,
    "area_water":30191,
    "geoid":"360910614012",
    "name":"Block Group 2",
    "state":"ny"
},
  "bbox": [
    -73.955565,
    42.992132,
    -73.884048,
    43.040966
],
  "geometry": {"coordinates":[[[-73.955387,43.020965],[-73.954643,43.020974],[-73.95444000000001,43.02097],[-73.95390999999999,43.020958],[-73.953084,43.020913],[-73.952406,43.020888],[-73.95215,43.020878],[-73.951876,43.020875],[-73.95088199999999,43.020832],[-73.950478,43.020823],[-73.94739300000001,43.020699],[-73.946693,43.020639],[-73.945403,43.020545],[-73.94487599999999,43.020541],[-73.942342,43.020781],[-73.941384,43.02089],[-73.939532,43.021079],[-73.938962,43.021166],[-73.938104,43.021492],[-73.93762,43.021705],[-73.93741799999999,43.02179],[-73.937099,43.021956],[-73.936266,43.022424],[-73.93478899999999,43.023235],[-73.933767,43.023824],[-73.93064699999999,43.025589],[-73.929312,43.026373],[-73.928787,43.026683],[-73.928521,43.026839],[-73.92837,43.026933],[-73.927993,43.027165],[-73.927908,43.027218],[-73.927792,43.027301],[-73.92763100000001,43.02741],[-73.92747300000001,43.027555],[-73.92718600000001,43.027945],[-73.927052,43.028161],[-73.927126,43.028531],[-73.92715800000001,43.028646],[-73.927677,43.029375],[-73.92775,43.029506],[-73.92776600000001,43.029641],[-73.927746,43.029743],[-73.927685,43.029923],[-73.927547,43.030257],[-73.927503,43.030484],[-73.927509,43.030755],[-73.927521,43.030982],[-73.927581,43.031591],[-73.927167,43.031651],[-73.926626,43.031732],[-73.925843,43.031848],[-73.92531099999999,43.03195],[-73.92495,43.032041],[-73.924396,43.032218],[-73.923773,43.03242],[-73.923451,43.032605],[-73.922994,43.032909],[-73.922439,43.033305],[-73.92178699999999,43.033741],[-73.921561,43.033878],[-73.921283,43.033995],[-73.92109499999999,43.034059],[-73.920638,43.034161],[-73.91988499999999,43.034268],[-73.918976,43.034361],[-73.918164,43.034414],[-73.91785900000001,43.034439],[-73.917553,43.034486],[-73.917399,43.034518],[-73.916828,43.034756],[-73.916459,43.034889],[-73.916253,43.034948],[-73.916141,43.034976],[-73.91518499999999,43.035231],[-73.91479200000001,43.035294],[-73.91323800000001,43.035436],[-73.91234300000001,43.035522],[-73.910735,43.035616],[-73.910235,43.035624],[-73.909665,43.035616],[-73.909133,43.035619],[-73.90818400000001,43.035657],[-73.907821,43.03568],[-73.907432,43.035736],[-73.907275,43.03575],[-73.907134,43.035778],[-73.907042,43.035819],[-73.906992,43.03584],[-73.906893,43.035899],[-73.906459,43.03622],[-73.90619599999999,43.036392],[-73.905055,43.037055],[-73.90412000000001,43.037537],[-73.903903,43.03762],[-73.90370299999999,43.037725],[-73.90351099999999,43.037853],[-73.903431,43.037943],[-73.903398,43.037987],[-73.90339,43.038018],[-73.903356,43.038129],[-73.903305,43.038234],[-73.903251,43.038318],[-73.901864,43.039728],[-73.901742,43.039867],[-73.901669,43.039911],[-73.899812,43.040072],[-73.895629,43.040456],[-73.89491599999999,43.0405],[-73.89351000000001,43.040626],[-73.89255199999999,43.040696],[-73.891533,43.0408],[-73.890916,43.040844],[-73.88953100000001,43.040966],[-73.889504,43.040798],[-73.889464,43.040663],[-73.88929899999999,43.040224],[-73.88881499999999,43.03889],[-73.88873599999999,43.038712],[-73.88864100000001,43.038453],[-73.88855700000001,43.038111],[-73.88825900000001,43.03596],[-73.887936,43.033894],[-73.88781,43.033083],[-73.88758199999999,43.031633],[-73.887197,43.029145],[-73.886822,43.026768],[-73.886358,43.024029],[-73.88602299999999,43.021865],[-73.885532,43.018105],[-73.885215,43.016003],[-73.88500999999999,43.014634],[-73.884782,43.012937],[-73.88478600000001,43.01256],[-73.88484099999999,43.012269],[-73.884952,43.011951],[-73.88527999999999,43.011214],[-73.885396,43.010867],[-73.88545000000001,43.010637],[-73.885465,43.010365],[-73.885425,43.009935],[-73.88533200000001,43.009224],[-73.885124,43.007865],[-73.884861,43.006046],[-73.88481,43.005723],[-73.88467799999999,43.004641],[-73.884522,43.003108],[-73.884443,43.00008],[-73.88438499999999,42.999164],[-73.88432899999999,42.998952],[-73.88404800000001,42.997985],[-73.884377,42.997948],[-73.8865,42.997735],[-73.88761599999999,42.997634],[-73.88867500000001,42.997526],[-73.892481,42.997165],[-73.893182,42.997089],[-73.89452300000001,42.996997],[-73.89702800000001,42.996792],[-73.89744899999999,42.996743],[-73.897999,42.9967],[-73.89887400000001,42.99662],[-73.900994,42.996455],[-73.902598,42.99632],[-73.903502,42.996256],[-73.905553,42.996095],[-73.907725,42.995915],[-73.910794,42.99567],[-73.912614,42.995503],[-73.91368799999999,42.995419],[-73.914214,42.995371],[-73.91803,42.995067],[-73.919631,42.994912],[-73.920068,42.994854],[-73.920778,42.994684],[-73.92125900000001,42.994537],[-73.921605,42.994418],[-73.921824,42.994327],[-73.92193399999999,42.99464],[-73.926614,42.994242],[-73.928759,42.994065],[-73.930725,42.993889],[-73.93450900000001,42.993612],[-73.94235500000001,42.992851],[-73.943973,42.992769],[-73.950715,42.992132],[-73.95148,42.996578],[-73.95208100000001,43.000015],[-73.952113,43.00011],[-73.952353,43.001689],[-73.953423,43.007938],[-73.95556500000001,43.020956],[-73.955387,43.020965]]],"type":"Polygon"}
}