{
  "id": "360470824002",
  "type": "Feature",
  "properties": {
    "area_land":37014,
    "area_water":0,
    "geoid":"360470824002",
    "name":"Block Group 2",
    "state":"ny"
},
  "bbox": [
    -73.94937,
    40.646886,
    -73.947241,
    40.649039
],
  "geometry": {"coordinates":[[[-73.94937,40.648923],[-73.948401,40.648982],[-73.947467,40.649039],[-73.94724100000001,40.646964],[-73.948177,40.646926],[-73.949152,40.646886],[-73.949285,40.648141],[-73.94937,40.648923]]],"type":"Polygon"}
}