{
  "id": "360610218004",
  "type": "Feature",
  "properties": {
    "area_land":45445,
    "area_water":0,
    "geoid":"360610218004",
    "name":"Block Group 4",
    "state":"ny"
},
  "bbox": [
    -73.955368,
    40.803222,
    -73.951572,
    40.805725
],
  "geometry": {"coordinates":[[[-73.954874,40.805096],[-73.95441599999999,40.805725],[-73.95276,40.805028],[-73.951572,40.804526],[-73.952034,40.803898],[-73.952524,40.803222],[-73.95536800000001,40.80442],[-73.954874,40.805096]]],"type":"Polygon"}
}