{
  "id": "360290056001",
  "type": "Feature",
  "properties": {
    "area_land":196058,
    "area_water":0,
    "geoid":"360290056001",
    "name":"Block Group 1",
    "state":"ny"
},
  "bbox": [
    -78.889573,
    42.956521,
    -78.878365,
    42.958636
],
  "geometry": {"coordinates":[[[-78.889471,42.957169],[-78.88936099999999,42.957864],[-78.88924900000001,42.958572],[-78.88916999999999,42.958575],[-78.887106,42.958588],[-78.885805,42.958593],[-78.885233,42.958597],[-78.88404800000001,42.958599],[-78.883422,42.958604],[-78.882761,42.95861],[-78.88258500000001,42.95861],[-78.882357,42.958611],[-78.88195399999999,42.958612],[-78.8814,42.958616],[-78.880381,42.958623],[-78.879368,42.958629],[-78.878737,42.958634],[-78.87838499999999,42.958636],[-78.878373,42.95758],[-78.878365,42.956727],[-78.880324,42.956715],[-78.883415,42.956705],[-78.884242,42.956705],[-78.884519,42.956693],[-78.884794,42.956666],[-78.885216,42.95661],[-78.885356,42.956592],[-78.885668,42.956564],[-78.88579300000001,42.956557],[-78.886201,42.956544],[-78.887525,42.956534],[-78.88852799999999,42.956531],[-78.889573,42.956521],[-78.889471,42.957169]]],"type":"Polygon"}
}