{
  "id": "360290076001",
  "type": "Feature",
  "properties": {
    "area_land":358133,
    "area_water":0,
    "geoid":"360290076001",
    "name":"Block Group 1",
    "state":"ny"
},
  "bbox": [
    -78.875253,
    43.001257,
    -78.860989,
    43.011187
],
  "geometry": {"coordinates":[[[-78.87525100000001,43.001354],[-78.875202,43.001759],[-78.875193,43.001828],[-78.87512599999999,43.002148],[-78.875005,43.002616],[-78.874934,43.002892],[-78.874796,43.003412],[-78.86994799999999,43.003397],[-78.865065,43.003377],[-78.865053,43.004172],[-78.865042,43.00497],[-78.865032,43.005683],[-78.865031,43.00588],[-78.86503,43.006457],[-78.865026,43.006894],[-78.865022,43.007257],[-78.86511299999999,43.007664],[-78.86515,43.007719],[-78.865734,43.008299],[-78.86708299999999,43.009648],[-78.867952,43.010515],[-78.867565,43.01066],[-78.866384,43.011187],[-78.86631300000001,43.011149],[-78.863978,43.006893],[-78.863404,43.005848],[-78.862993,43.005097],[-78.862987,43.005077],[-78.862972,43.00506],[-78.861176,43.001787],[-78.860989,43.001446],[-78.86509,43.00146],[-78.86996499999999,43.001346],[-78.875253,43.001257],[-78.87525100000001,43.001354]]],"type":"Polygon"}
}