{
  "id": "360910624061",
  "type": "Feature",
  "properties": {
    "area_land":5033224,
    "area_water":7687,
    "geoid":"360910624061",
    "name":"Block Group 1",
    "state":"ny"
},
  "bbox": [
    -73.772223,
    42.864896,
    -73.722331,
    42.887672
],
  "geometry": {"coordinates":[[[-73.772223,42.887672],[-73.77181899999999,42.887605],[-73.771677,42.887588],[-73.77067599999999,42.887464],[-73.769542,42.887267],[-73.768655,42.887055],[-73.766862,42.886637],[-73.766211,42.886477],[-73.765139,42.886185],[-73.764689,42.886042],[-73.763989,42.885834],[-73.763656,42.88576],[-73.763402,42.885721],[-73.763316,42.885646],[-73.762598,42.885326],[-73.761793,42.884983],[-73.76146,42.884824],[-73.76132,42.88471],[-73.761223,42.884613],[-73.761143,42.884498],[-73.761016,42.884217],[-73.76095599999999,42.884113],[-73.760817,42.883948],[-73.760598,42.883743],[-73.760215,42.883529],[-73.759175,42.88289],[-73.75815900000001,42.882278],[-73.757413,42.881721],[-73.757172,42.881542],[-73.757007,42.881428],[-73.756525,42.881081],[-73.75625700000001,42.880922],[-73.755931,42.880774],[-73.75536099999999,42.880602],[-73.75494500000001,42.880489],[-73.754283,42.880363],[-73.753556,42.880256],[-73.75277800000001,42.880173],[-73.752465,42.880154],[-73.75224799999999,42.880134],[-73.75177499999999,42.88014],[-73.751577,42.880167],[-73.751401,42.880232],[-73.750891,42.880426],[-73.75063299999999,42.880505],[-73.750378,42.880563],[-73.750092,42.880616],[-73.74983400000001,42.880649],[-73.74927599999999,42.880701],[-73.7487,42.880736],[-73.748397,42.880763],[-73.747659,42.880864],[-73.74684600000001,42.880916],[-73.74639500000001,42.880953],[-73.745672,42.881031],[-73.745424,42.88106],[-73.745092,42.88111],[-73.74484699999999,42.881177],[-73.74457200000001,42.881271],[-73.744343,42.881381],[-73.74385700000001,42.881725],[-73.743562,42.881868],[-73.74335499999999,42.881934],[-73.743038,42.881985],[-73.740875,42.882218],[-73.740267,42.882259],[-73.73947,42.882301],[-73.73859299999999,42.882283],[-73.73700599999999,42.882152],[-73.735263,42.881993],[-73.735011,42.881945],[-73.73480000000001,42.881868],[-73.734548,42.881693],[-73.73445700000001,42.881631],[-73.734256,42.881415],[-73.733975,42.881085],[-73.73349,42.880555],[-73.73319100000001,42.880338],[-73.732938,42.880166],[-73.732741,42.88001],[-73.732457,42.87967],[-73.732412,42.879536],[-73.73231199999999,42.879279],[-73.732135,42.878825],[-73.73201299999999,42.87854],[-73.73193999999999,42.878404],[-73.731843,42.87829],[-73.73174899999999,42.878247],[-73.731493,42.878162],[-73.731345,42.878136],[-73.731127,42.878111],[-73.730682,42.878154],[-73.73047699999999,42.878195],[-73.730191,42.878314],[-73.729325,42.878717],[-73.729043,42.878856],[-73.728768,42.878955],[-73.728487,42.879018],[-73.727532,42.879041],[-73.72727999999999,42.879057],[-73.726984,42.879129],[-73.72681900000001,42.87918],[-73.72621700000001,42.879465],[-73.726142,42.879507],[-73.725021,42.879912],[-73.724693,42.879999],[-73.724422,42.880042],[-73.724233,42.880056],[-73.723984,42.88006],[-73.723651,42.880022],[-73.72289499999999,42.879829],[-73.722331,42.879702],[-73.722821,42.878513],[-73.723142,42.877758],[-73.72342500000001,42.877056],[-73.72357599999999,42.876678],[-73.724278,42.875004],[-73.724611,42.874184],[-73.725515,42.872022],[-73.725668,42.871618],[-73.725973,42.870588],[-73.726089,42.870065],[-73.726164,42.869622],[-73.72626099999999,42.868832],[-73.726572,42.868748],[-73.727079,42.868585],[-73.727453,42.868433],[-73.727807,42.868266],[-73.729465,42.867499],[-73.730585,42.86699],[-73.731459,42.866625],[-73.73164,42.866567],[-73.73206500000001,42.866405],[-73.732636,42.866223],[-73.73311699999999,42.866093],[-73.73339199999999,42.866019],[-73.73437300000001,42.865815],[-73.734711,42.865772],[-73.735534,42.865669],[-73.73829499999999,42.865419],[-73.738562,42.865378],[-73.73858799999999,42.865692],[-73.73945999999999,42.866642],[-73.739639,42.866819],[-73.739711,42.866869],[-73.739963,42.866957],[-73.740312,42.867044],[-73.740278,42.867154],[-73.740262,42.86727],[-73.740303,42.867489],[-73.740358,42.867598],[-73.740441,42.867715],[-73.740584,42.867867],[-73.740663,42.86798],[-73.740711,42.868074],[-73.74079399999999,42.868349],[-73.740967,42.869114],[-73.74105900000001,42.869488],[-73.741193,42.870032],[-73.74125100000001,42.870173],[-73.741317,42.8703],[-73.74141,42.87044],[-73.741623,42.870687],[-73.74175700000001,42.870818],[-73.742221,42.871207],[-73.742257,42.871233],[-73.742457,42.871383],[-73.742735,42.871628],[-73.742937,42.871796],[-73.74326600000001,42.872068],[-73.744337,42.872921],[-73.74459400000001,42.873138],[-73.74597199999999,42.874212],[-73.746533,42.874662],[-73.746686,42.874783],[-73.74673900000001,42.874826],[-73.747061,42.875082],[-73.74816199999999,42.875795],[-73.74851700000001,42.876036],[-73.749211,42.876506],[-73.74999200000001,42.877083],[-73.750603,42.876884],[-73.751057,42.876665],[-73.7514,42.87641],[-73.751347,42.875624],[-73.751374,42.875434],[-73.751482,42.875276],[-73.751632,42.875175],[-73.75178099999999,42.875117],[-73.752039,42.875032],[-73.752194,42.874981],[-73.75269,42.874888],[-73.75311000000001,42.874819],[-73.75374600000001,42.874738],[-73.75505699999999,42.874597],[-73.756272,42.874441],[-73.756692,42.874411],[-73.757063,42.874411],[-73.757552,42.874439],[-73.758905,42.874541],[-73.75933000000001,42.874553],[-73.759574,42.874546],[-73.75962699999999,42.874536],[-73.759761,42.874508],[-73.759912,42.874453],[-73.760104,42.874334],[-73.760259,42.874217],[-73.760527,42.873944],[-73.761021,42.87335],[-73.761275,42.87303],[-73.761471,42.87279],[-73.761872,42.872264],[-73.76205400000001,42.871908],[-73.762111,42.871778],[-73.762396,42.870897],[-73.76267799999999,42.870165],[-73.762969,42.869491],[-73.76321,42.869051],[-73.76332600000001,42.868895],[-73.763453,42.868734],[-73.763632,42.868554],[-73.763869,42.868341],[-73.76414200000001,42.868145],[-73.764331,42.868044],[-73.76451299999999,42.867941],[-73.76486800000001,42.867708],[-73.76559399999999,42.867155],[-73.76703500000001,42.865988],[-73.76719199999999,42.865874],[-73.76751899999999,42.865593],[-73.76761,42.865504],[-73.767762,42.865335],[-73.767821,42.865258],[-73.767945,42.865048],[-73.768085,42.864896],[-73.768204,42.864925],[-73.76922500000001,42.86522],[-73.77006900000001,42.865507],[-73.770172,42.865463],[-73.77021999999999,42.865435],[-73.77024900000001,42.865393],[-73.770258,42.865322],[-73.770234,42.86512],[-73.77032699999999,42.86527],[-73.77034500000001,42.865584],[-73.770596,42.868568],[-73.77074,42.870458],[-73.77112200000001,42.875707],[-73.77116100000001,42.875853],[-73.77124499999999,42.876786],[-73.771253,42.876874],[-73.771344,42.877605],[-73.771379,42.878287],[-73.771477,42.879385],[-73.771501,42.879643],[-73.77152700000001,42.879927],[-73.771552,42.880212],[-73.771597,42.880704],[-73.77161599999999,42.880918],[-73.771624,42.88101],[-73.771632,42.881093],[-73.77163899999999,42.881186],[-73.771647,42.881293],[-73.771652,42.881326],[-73.771717,42.882059],[-73.771745,42.882366],[-73.771766,42.882593],[-73.771795,42.882918],[-73.77184200000001,42.883445],[-73.77186500000001,42.88369],[-73.771885,42.883917],[-73.771902,42.884103],[-73.772181,42.887216],[-73.772223,42.887672]]],"type":"Polygon"}
}