{
  "id": "361150870003",
  "type": "Feature",
  "properties": {
    "area_land":33263603,
    "area_water":3062674,
    "geoid":"361150870003",
    "name":"Block Group 3",
    "state":"ny"
},
  "bbox": [
    -73.505269,
    43.160548,
    -73.407466,
    43.239301
],
  "geometry": {"coordinates":[[[-73.505269,43.160816],[-73.505258,43.161014],[-73.505217,43.161282],[-73.50517499999999,43.161472],[-73.505088,43.161756],[-73.504999,43.161991],[-73.504902,43.162188],[-73.503035,43.165315],[-73.502526,43.166203],[-73.502488,43.166274],[-73.502235,43.166751],[-73.50201,43.167259],[-73.50128599999999,43.169009],[-73.50117400000001,43.169303],[-73.50094,43.170007],[-73.500625,43.171112],[-73.500528,43.171384],[-73.500438,43.171642],[-73.50031300000001,43.171912],[-73.500072,43.17235],[-73.498024,43.175474],[-73.497424,43.176423],[-73.49707100000001,43.177046],[-73.49635499999999,43.1785],[-73.49335600000001,43.184715],[-73.49328199999999,43.184856],[-73.493042,43.185359],[-73.492752,43.185964],[-73.49262,43.186241],[-73.492237,43.187133],[-73.49188599999999,43.187767],[-73.49155399999999,43.188277],[-73.49120499999999,43.188734],[-73.490825,43.189179],[-73.490649,43.189408],[-73.489985,43.19048],[-73.488984,43.192156],[-73.48866200000001,43.192716],[-73.488519,43.192995],[-73.488271,43.193631],[-73.488181,43.193906],[-73.488001,43.194529],[-73.487775,43.195484],[-73.487602,43.196458],[-73.48745099999999,43.197144],[-73.487127,43.19838],[-73.487009,43.198932],[-73.48689400000001,43.199796],[-73.486744,43.201195],[-73.486611,43.20204],[-73.486366,43.203091],[-73.486114,43.204034],[-73.48602,43.20446],[-73.485989,43.204741],[-73.485991,43.20514],[-73.48611099999999,43.205932],[-73.48618500000001,43.206284],[-73.486324,43.206802],[-73.48648,43.207248],[-73.4871,43.208763],[-73.487345,43.209458],[-73.48745700000001,43.209837],[-73.487557,43.210311],[-73.487673,43.21116],[-73.487821,43.212534],[-73.48793000000001,43.21458],[-73.487995,43.215277],[-73.48809300000001,43.21601],[-73.488258,43.217565],[-73.48829499999999,43.217908],[-73.488387,43.218484],[-73.488525,43.219344],[-73.48882999999999,43.220761],[-73.489282,43.222725],[-73.489333,43.223122],[-73.489339,43.223509],[-73.489282,43.223922],[-73.489233,43.224114],[-73.48916199999999,43.224316],[-73.48891999999999,43.224915],[-73.488742,43.225428],[-73.488725,43.225499],[-73.488617,43.225982],[-73.48858300000001,43.226194],[-73.488501,43.227094],[-73.48843599999999,43.228023],[-73.488446,43.228506],[-73.488479,43.228787],[-73.48855399999999,43.229115],[-73.48861100000001,43.22929],[-73.489428,43.231469],[-73.48952199999999,43.231719],[-73.489553,43.231802],[-73.489625,43.231994],[-73.48971299999999,43.232235],[-73.490073,43.23322],[-73.490151,43.233458],[-73.49034,43.234092],[-73.490471,43.234594],[-73.48974699999999,43.234716],[-73.488124,43.234959],[-73.488086,43.234981],[-73.48806500000001,43.23501],[-73.488063,43.235067],[-73.488293,43.235922],[-73.488445,43.236438],[-73.488865,43.237954],[-73.48895899999999,43.238346],[-73.48720400000001,43.238935],[-73.486496,43.23916],[-73.48643199999999,43.239183],[-73.486108,43.239301],[-73.486017,43.239235],[-73.485866,43.23917],[-73.485817,43.239155],[-73.485523,43.239066],[-73.48480600000001,43.238819],[-73.483705,43.238454],[-73.482783,43.238122],[-73.481397,43.237568],[-73.48114200000001,43.237475],[-73.48096,43.237428],[-73.48068499999999,43.237395],[-73.48053899999999,43.237391],[-73.47893999999999,43.23741],[-73.478559,43.237428],[-73.47762899999999,43.237473],[-73.47684,43.237526],[-73.476027,43.237564],[-73.473927,43.237628],[-73.473647,43.23765],[-73.47296799999999,43.237738],[-73.47232200000001,43.237894],[-73.47215300000001,43.237956],[-73.471879,43.238072],[-73.47156699999999,43.238194],[-73.471329,43.238287],[-73.470446,43.238609],[-73.470122,43.238704],[-73.46992,43.238746],[-73.469633,43.238774],[-73.46843,43.238756],[-73.468098,43.238738],[-73.467951,43.238701],[-73.467884,43.238674],[-73.467646,43.238533],[-73.46752499999999,43.238408],[-73.467476,43.238292],[-73.46747000000001,43.238076],[-73.467535,43.237837],[-73.467812,43.237224],[-73.468075,43.236713],[-73.468259,43.236322],[-73.46826900000001,43.236263],[-73.468261,43.236159],[-73.46822,43.235998],[-73.468024,43.23555],[-73.46799,43.235436],[-73.46803,43.234963],[-73.468022,43.234811],[-73.46799,43.234723],[-73.467899,43.234599],[-73.46779100000001,43.23451],[-73.46740800000001,43.234255],[-73.467269,43.234153],[-73.46718,43.234041],[-73.46713099999999,43.233923],[-73.46708599999999,43.233711],[-73.467084,43.233489],[-73.467231,43.23296],[-73.46726099999999,43.232772],[-73.467253,43.232636],[-73.46722699999999,43.232563],[-73.467174,43.232485],[-73.467084,43.232387],[-73.46673800000001,43.232114],[-73.466055,43.231601],[-73.46581399999999,43.23141],[-73.465649,43.231245],[-73.465529,43.23109],[-73.465416,43.230841],[-73.46532500000001,43.230438],[-73.46528600000001,43.2301],[-73.46526799999999,43.230025],[-73.46521300000001,43.2299],[-73.46516800000001,43.229847],[-73.46504299999999,43.229754],[-73.464811,43.229619],[-73.46401,43.229356],[-73.463123,43.2291],[-73.46283099999999,43.229057],[-73.46254999999999,43.229043],[-73.461978,43.229058],[-73.461727,43.229076],[-73.461433,43.229149],[-73.460928,43.229324],[-73.459774,43.229479],[-73.459549,43.229471],[-73.458477,43.229308],[-73.45774900000001,43.229247],[-73.457311,43.229231],[-73.45668999999999,43.229238],[-73.455808,43.229212],[-73.45504,43.22917],[-73.454125,43.229133],[-73.45213,43.22917],[-73.449977,43.229196],[-73.449485,43.229187],[-73.44827100000001,43.229188],[-73.447445,43.229197],[-73.447171,43.229182],[-73.446215,43.229161],[-73.44579400000001,43.229118],[-73.44551199999999,43.229053],[-73.445072,43.228902],[-73.44493900000001,43.228848],[-73.444001,43.228471],[-73.44361000000001,43.228289],[-73.443198,43.228063],[-73.44223599999999,43.227466],[-73.441388,43.226992],[-73.44118400000001,43.226906],[-73.440754,43.226786],[-73.440432,43.226719],[-73.43994000000001,43.226634],[-73.438913,43.226437],[-73.43852800000001,43.226352],[-73.438136,43.22624],[-73.437932,43.226167],[-73.437501,43.225964],[-73.435293,43.224719],[-73.434195,43.224152],[-73.433894,43.223978],[-73.43333699999999,43.223617],[-73.43242100000001,43.223001],[-73.43211599999999,43.222816],[-73.431911,43.222712],[-73.431749,43.222646],[-73.43152499999999,43.222588],[-73.431169,43.222559],[-73.43077099999999,43.22259],[-73.430082,43.222666],[-73.42982000000001,43.222661],[-73.429666,43.222623],[-73.429534,43.222576],[-73.429419,43.222515],[-73.429345,43.222464],[-73.42925200000001,43.222383],[-73.42868799999999,43.221806],[-73.428445,43.221532],[-73.427989,43.221049],[-73.427544,43.220607],[-73.42713500000001,43.220237],[-73.426698,43.219899],[-73.426385,43.219698],[-73.42580100000001,43.219378],[-73.42525999999999,43.219146],[-73.42410099999999,43.218758],[-73.42376899999999,43.218638],[-73.42371799999999,43.218721],[-73.423506,43.219039],[-73.422409,43.22044],[-73.42192799999999,43.22097],[-73.421492,43.221495],[-73.421064,43.222049],[-73.420395,43.2231],[-73.419995,43.223675],[-73.419844,43.223842],[-73.419657,43.224021],[-73.419494,43.224147],[-73.419331,43.224257],[-73.41914300000001,43.224351],[-73.418083,43.224795],[-73.41760600000001,43.224966],[-73.41739,43.225019],[-73.417145,43.225059],[-73.415969,43.225159],[-73.415431,43.225028],[-73.414956,43.224931],[-73.41467,43.22486],[-73.413476,43.224518],[-73.412189,43.224124],[-73.41110500000001,43.223804],[-73.410279,43.223558],[-73.409882,43.223425],[-73.40896600000001,43.223141],[-73.408711,43.223041],[-73.408537,43.222952],[-73.408367,43.222844],[-73.408224,43.22274],[-73.40816100000001,43.222682],[-73.408081,43.222609],[-73.407814,43.222286],[-73.407702,43.222105],[-73.40760899999999,43.221923],[-73.407482,43.221564],[-73.407466,43.221429],[-73.40751299999999,43.221118],[-73.407594,43.220871],[-73.40772200000001,43.220537],[-73.408131,43.219692],[-73.40851000000001,43.219056],[-73.40895,43.21839],[-73.409142,43.21803],[-73.409212,43.217897],[-73.40944500000001,43.2174],[-73.409654,43.216979],[-73.40983199999999,43.216549],[-73.410048,43.216085],[-73.410257,43.215692],[-73.410979,43.214479],[-73.411126,43.214271],[-73.411551,43.213732],[-73.412707,43.212394],[-73.413178,43.211879],[-73.413522,43.21147],[-73.41392,43.210931],[-73.41406600000001,43.210697],[-73.414693,43.20958],[-73.415014,43.208991],[-73.415255,43.208482],[-73.415335,43.208313],[-73.415594,43.207887],[-73.416196,43.207051],[-73.416363,43.206777],[-73.41647500000001,43.206564],[-73.416719,43.20621],[-73.41682900000001,43.206198],[-73.416938,43.206031],[-73.41708199999999,43.205862],[-73.417221,43.205752],[-73.417507,43.205327],[-73.41764999999999,43.204991],[-73.417947,43.204402],[-73.418295,43.203767],[-73.41838799999999,43.203667],[-73.418531,43.203431],[-73.418728,43.202804],[-73.418921,43.202283],[-73.418999,43.20202],[-73.41903000000001,43.201785],[-73.419076,43.201582],[-73.419122,43.201466],[-73.419203,43.201312],[-73.419346,43.201138],[-73.41944700000001,43.200995],[-73.41997600000001,43.200352],[-73.420069,43.200256],[-73.42017,43.200198],[-73.42045899999999,43.200171],[-73.420591,43.200113],[-73.42066,43.200009],[-73.420672,43.199962],[-73.420672,43.199889],[-73.420653,43.199762],[-73.420676,43.19968],[-73.420861,43.199348],[-73.42095,43.199163],[-73.421012,43.199063],[-73.421093,43.198978],[-73.421159,43.198924],[-73.421228,43.198889],[-73.421375,43.19885],[-73.42144500000001,43.198819],[-73.421511,43.198754],[-73.421592,43.198615],[-73.421785,43.198476],[-73.421924,43.19841],[-73.422144,43.198329],[-73.42244599999999,43.198275],[-73.422747,43.198198],[-73.423072,43.198088],[-73.423226,43.197991],[-73.42343099999999,43.197845],[-73.423559,43.197779],[-73.423767,43.197713],[-73.424069,43.197512],[-73.424312,43.197393],[-73.42483799999999,43.197082],[-73.424938,43.197043],[-73.425004,43.19704],[-73.425093,43.197009],[-73.425174,43.196962],[-73.42525500000001,43.196889],[-73.425408,43.196703],[-73.425603,43.196557],[-73.425746,43.196487],[-73.425901,43.196428],[-73.426171,43.196358],[-73.426283,43.196358],[-73.42657699999999,43.196408],[-73.42688200000001,43.196485],[-73.42699399999999,43.196543],[-73.427072,43.196609],[-73.427153,43.196733],[-73.427222,43.196928],[-73.427211,43.196989],[-73.42715699999999,43.197097],[-73.427126,43.197206],[-73.427149,43.197248],[-73.427385,43.197318],[-73.427431,43.197302],[-73.42747,43.197271],[-73.427528,43.197167],[-73.42763600000001,43.197086],[-73.427763,43.196901],[-73.42785600000001,43.196881],[-73.427988,43.196742],[-73.428015,43.196673],[-73.428045,43.196433],[-73.42815,43.196275],[-73.428299,43.196008],[-73.428321,43.195969],[-73.428416,43.195812],[-73.42870600000001,43.195451],[-73.428764,43.195362],[-73.42891899999999,43.194895],[-73.42898099999999,43.19475],[-73.42933600000001,43.19448],[-73.42973000000001,43.194005],[-73.42985400000001,43.193763],[-73.429908,43.193635],[-73.42991600000001,43.193558],[-73.42989300000001,43.193489],[-73.429862,43.193442],[-73.429754,43.193323],[-73.42961099999999,43.193244],[-73.429328,43.193143],[-73.42927400000001,43.193105],[-73.429209,43.192993],[-73.42905,43.192776],[-73.428876,43.192626],[-73.42881800000001,43.192591],[-73.42869899999999,43.192475],[-73.42863699999999,43.19239],[-73.428529,43.192288],[-73.428355,43.192203],[-73.428158,43.192149],[-73.428045,43.192145],[-73.42793,43.192106],[-73.42775899999999,43.192064],[-73.427694,43.192041],[-73.42753500000001,43.191971],[-73.427474,43.191925],[-73.427369,43.191801],[-73.42720300000001,43.191653],[-73.42711,43.191537],[-73.427052,43.191444],[-73.427025,43.191263],[-73.427052,43.191023],[-73.427054,43.190884],[-73.42704500000001,43.19067],[-73.426987,43.190466],[-73.42694400000001,43.190408],[-73.426917,43.190303],[-73.426913,43.190203],[-73.426952,43.189471],[-73.42697099999999,43.189359],[-73.42705599999999,43.189081],[-73.42710599999999,43.189004],[-73.42725299999999,43.188863],[-73.427443,43.188778],[-73.427555,43.188705],[-73.42762399999999,43.188632],[-73.427756,43.188516],[-73.427875,43.188199],[-73.428022,43.187931],[-73.428119,43.187846],[-73.428293,43.187718],[-73.428459,43.187572],[-73.428909,43.187214],[-73.42896,43.187112],[-73.429018,43.187081],[-73.429069,43.187069],[-73.42909899999999,43.187049],[-73.42913299999999,43.186989],[-73.42920100000001,43.186945],[-73.42925200000001,43.186945],[-73.42927400000001,43.186967],[-73.42927400000001,43.187014],[-73.42925700000001,43.18706],[-73.42921699999999,43.1871],[-73.429213,43.187127],[-73.42923,43.187156],[-73.429255,43.187163],[-73.429305,43.187156],[-73.429365,43.18712],[-73.429445,43.187036],[-73.429558,43.186848],[-73.429605,43.186794],[-73.42968,43.186754],[-73.42975300000001,43.186741],[-73.42985,43.186757],[-73.429884,43.186785],[-73.429901,43.186825],[-73.429901,43.186863],[-73.42986999999999,43.186914],[-73.429802,43.186976],[-73.429751,43.187052],[-73.429695,43.187218],[-73.429695,43.187298],[-73.42970699999999,43.187335],[-73.429733,43.187355],[-73.429768,43.187366],[-73.42983,43.18736],[-73.42989,43.187335],[-73.429952,43.187287],[-73.430176,43.186959],[-73.430229,43.186836],[-73.430232,43.186783],[-73.434106,43.186379],[-73.436308,43.186251],[-73.43720399999999,43.186202],[-73.443055,43.185804],[-73.448409,43.185446],[-73.462468,43.184473],[-73.457601,43.173984],[-73.457172,43.173059],[-73.453784,43.165613],[-73.465046,43.16446],[-73.473714,43.163582],[-73.48443399999999,43.162468],[-73.486604,43.162235],[-73.489549,43.161939],[-73.495981,43.161283],[-73.499377,43.16111],[-73.499562,43.1611],[-73.505263,43.160548],[-73.505269,43.160816]]],"type":"Polygon"}
}