{
  "id": "360550131042",
  "type": "Feature",
  "properties": {
    "area_land":1695150,
    "area_water":0,
    "geoid":"360550131042",
    "name":"Block Group 2",
    "state":"ny"
},
  "bbox": [
    -77.647092,
    43.067929,
    -77.618425,
    43.081923
],
  "geometry": {"coordinates":[[[-77.64455599999999,43.072703],[-77.643693,43.07431],[-77.643619,43.074445],[-77.640158,43.080924],[-77.639611,43.081923],[-77.6353,43.077587],[-77.634911,43.077126],[-77.63454299999999,43.076657],[-77.63419500000001,43.07618],[-77.63386800000001,43.075695],[-77.633562,43.075202],[-77.633278,43.074702],[-77.633016,43.074196],[-77.632857,43.073858],[-77.632775,43.073685],[-77.63255700000001,43.073167],[-77.63238200000001,43.072701],[-77.632019,43.072947],[-77.630482,43.073987],[-77.63015900000001,43.074205],[-77.628874,43.07501],[-77.626879,43.076162],[-77.626808,43.076203],[-77.626772,43.076164],[-77.626591,43.075963],[-77.626456,43.075811],[-77.626305,43.075639],[-77.625941,43.075159],[-77.62562,43.074674],[-77.625373,43.074137],[-77.62532899999999,43.074029],[-77.625227,43.073696],[-77.62512700000001,43.073266],[-77.62512,43.073107],[-77.625137,43.072899],[-77.625186,43.07267],[-77.62529499999999,43.072403],[-77.625461,43.072094],[-77.62624,43.070649],[-77.62571,43.070517],[-77.625551,43.070486],[-77.62521599999999,43.070438],[-77.625012,43.070419],[-77.624802,43.07041],[-77.624591,43.070408],[-77.624239,43.070417],[-77.62293099999999,43.070449],[-77.622928,43.070667],[-77.622907,43.070835],[-77.622867,43.070973],[-77.62283100000001,43.071063],[-77.622783,43.071165],[-77.621313,43.073902],[-77.62074800000001,43.074945],[-77.61953,43.074588],[-77.61872099999999,43.074363],[-77.61863099999999,43.074334],[-77.618556,43.074296],[-77.61849599999999,43.074249],[-77.618458,43.0742],[-77.61843399999999,43.074153],[-77.618425,43.074088],[-77.61842799999999,43.074016],[-77.618453,43.073945],[-77.61905299999999,43.072854],[-77.619764,43.07154],[-77.619821,43.071419],[-77.619855,43.071322],[-77.61987499999999,43.071225],[-77.619929,43.07066],[-77.61994300000001,43.070629],[-77.619969,43.0706],[-77.619996,43.07058],[-77.620074,43.070545],[-77.620125,43.070535],[-77.620193,43.070531],[-77.621257,43.070518],[-77.621234,43.07032],[-77.62117600000001,43.070142],[-77.621076,43.069991],[-77.621027,43.069886],[-77.62101199999999,43.069766],[-77.62100700000001,43.069421],[-77.62096099999999,43.069258],[-77.620881,43.069096],[-77.620833,43.068931],[-77.6208,43.068505],[-77.621802,43.068486],[-77.625017,43.068423],[-77.627531,43.068361],[-77.62958500000001,43.06832],[-77.630528,43.068301],[-77.630889,43.068292],[-77.631687,43.068272],[-77.63238699999999,43.068255],[-77.635554,43.068214],[-77.636079,43.0682],[-77.636252,43.068195],[-77.63667100000001,43.068189],[-77.636706,43.068189],[-77.637596,43.068169],[-77.64058,43.068064],[-77.64230000000001,43.068033],[-77.64355399999999,43.068006],[-77.647092,43.067929],[-77.64455599999999,43.072703]]],"type":"Polygon"}
}