{
  "id": "360470321003",
  "type": "Feature",
  "properties": {
    "area_land":23272,
    "area_water":0,
    "geoid":"360470321003",
    "name":"Block Group 3",
    "state":"ny"
},
  "bbox": [
    -73.95369,
    40.6654,
    -73.950835,
    40.66644
],
  "geometry": {"coordinates":[[[-73.95360599999999,40.66644],[-73.952226,40.666364],[-73.950835,40.666289],[-73.950919,40.6654],[-73.952305,40.665474],[-73.95368999999999,40.665549],[-73.95360599999999,40.66644]]],"type":"Polygon"}
}