{
  "id": "360550033002",
  "type": "Feature",
  "properties": {
    "area_land":137508,
    "area_water":0,
    "geoid":"360550033002",
    "name":"Block Group 2",
    "state":"ny"
},
  "bbox": [
    -77.6004,
    43.13719,
    -77.594755,
    43.142593
],
  "geometry": {"coordinates":[[[-77.599881,43.139036],[-77.599537,43.139641],[-77.599324,43.139924],[-77.599019,43.140356],[-77.59881300000001,43.14063],[-77.598004,43.141755],[-77.59748,43.142593],[-77.597407,43.142555],[-77.597103,43.142413],[-77.59688,43.142325],[-77.596666,43.142241],[-77.59607200000001,43.142091],[-77.595839,43.142033],[-77.596063,43.142248],[-77.59555899999999,43.142103],[-77.59475500000001,43.14194],[-77.594827,43.141806],[-77.594891,43.141703],[-77.59490099999999,43.141687],[-77.59511500000001,43.141284],[-77.59515,43.141229],[-77.595444,43.14073],[-77.595967,43.139856],[-77.596051,43.139722],[-77.596985,43.138145],[-77.597527,43.13719],[-77.59823299999999,43.137407],[-77.59889699999999,43.137609],[-77.60039999999999,43.138067],[-77.599881,43.139036]]],"type":"Polygon"}
}