{
  "id": "360270502042",
  "type": "Feature",
  "properties": {
    "area_land":10320238,
    "area_water":81904,
    "geoid":"360270502042",
    "name":"Block Group 2",
    "state":"ny"
},
  "bbox": [
    -73.827929,
    41.499814,
    -73.771702,
    41.538704
],
  "geometry": {"coordinates":[[[-73.827929,41.509775],[-73.827915,41.509891],[-73.827816,41.510135],[-73.827352,41.510996],[-73.826933,41.511774],[-73.826718,41.512191],[-73.826593,41.512516],[-73.826455,41.512953],[-73.826427,41.513186],[-73.82642300000001,41.514375],[-73.82643,41.514664],[-73.82642300000001,41.514854],[-73.82638799999999,41.515116],[-73.826277,41.515512],[-73.824555,41.515709],[-73.824274,41.51575],[-73.823624,41.515838],[-73.82273499999999,41.515948],[-73.821607,41.516083],[-73.821466,41.516125],[-73.82133899999999,41.516185],[-73.82124,41.516256],[-73.82118,41.516327],[-73.82111999999999,41.516446],[-73.82108599999999,41.516715],[-73.82110400000001,41.516926],[-73.82114799999999,41.517254],[-73.82111999999999,41.517371],[-73.821074,41.517448],[-73.820986,41.517561],[-73.820915,41.517621],[-73.82083799999999,41.51767],[-73.820583,41.517766],[-73.820499,41.517787],[-73.82017399999999,41.517794],[-73.820001,41.51778],[-73.819704,41.517684],[-73.819445,41.517614],[-73.81916699999999,41.517576],[-73.818901,41.517596],[-73.818679,41.517656],[-73.81831200000001,41.517801],[-73.817992,41.517914],[-73.817671,41.517981],[-73.81730399999999,41.518013],[-73.81702799999999,41.51802],[-73.816827,41.518005],[-73.816684,41.517995],[-73.816293,41.517944],[-73.816075,41.51902],[-73.816017,41.519193],[-73.815946,41.519355],[-73.81581199999999,41.519718],[-73.815794,41.519855],[-73.81576099999999,41.520103],[-73.81567200000001,41.520332],[-73.815566,41.520537],[-73.815191,41.521401],[-73.814995,41.52175],[-73.81485000000001,41.521912],[-73.814649,41.522054],[-73.814486,41.522149],[-73.814317,41.52223],[-73.81401700000001,41.522357],[-73.813918,41.52241],[-73.813847,41.522477],[-73.813787,41.522554],[-73.81372399999999,41.522667],[-73.81363,41.522893],[-73.813598,41.523031],[-73.813495,41.523663],[-73.81316,41.525532],[-73.813017,41.526244],[-73.81276099999999,41.527819],[-73.812713,41.528071],[-73.812681,41.528219],[-73.81256,41.528668],[-73.81249699999999,41.528855],[-73.812307,41.529335],[-73.81228400000001,41.529397],[-73.812265,41.529487],[-73.81220500000001,41.52973],[-73.812195,41.529766],[-73.812102,41.529762],[-73.811396,41.529763],[-73.810537,41.529756],[-73.80973899999999,41.529773],[-73.80865900000001,41.529836],[-73.807168,41.529977],[-73.805761,41.530157],[-73.80507299999999,41.530259],[-73.804287,41.530411],[-73.804086,41.530459],[-73.803252,41.530625],[-73.80281600000001,41.530723],[-73.80260800000001,41.530773],[-73.79989500000001,41.531425],[-73.798393,41.531797],[-73.796859,41.53216],[-73.796187,41.532309],[-73.79500899999999,41.532612],[-73.79431099999999,41.532775],[-73.793345,41.533001],[-73.792421,41.533224],[-73.791549,41.533433],[-73.79062,41.533664],[-73.789422,41.533926],[-73.788944,41.534042],[-73.78764099999999,41.534382],[-73.78618899999999,41.534813],[-73.78615600000001,41.534824],[-73.784229,41.535486],[-73.783078,41.535889],[-73.781721,41.536401],[-73.780402,41.536859],[-73.77982,41.537053],[-73.778904,41.537335],[-73.777556,41.537679],[-73.776532,41.537886],[-73.775713,41.538062],[-73.77513399999999,41.538171],[-73.773141,41.538484],[-73.772593,41.538572],[-73.77184,41.538697],[-73.771798,41.538704],[-73.771756,41.538297],[-73.771702,41.537555],[-73.771716,41.536732],[-73.771812,41.535854],[-73.772021,41.534893],[-73.772053,41.534803],[-73.772341,41.533876],[-73.77244,41.53356],[-73.772452,41.53352],[-73.772559,41.53322],[-73.77265800000001,41.532969],[-73.772789,41.532652],[-73.772953,41.53232],[-73.773093,41.532056],[-73.77324900000001,41.531796],[-73.77355900000001,41.531292],[-73.77375600000001,41.531016],[-73.774046,41.530641],[-73.774384,41.530178],[-73.774766,41.52968],[-73.77498,41.52941],[-73.775137,41.529216],[-73.775437,41.528851],[-73.775683,41.528568],[-73.77601,41.528207],[-73.776341,41.527845],[-73.776685,41.527494],[-73.777023,41.527146],[-73.77737399999999,41.526788],[-73.777896,41.52626],[-73.778066,41.526089],[-73.77834199999999,41.52581],[-73.77859100000001,41.525547],[-73.778734,41.52537],[-73.778959,41.525073],[-73.77916399999999,41.524794],[-73.779375,41.524504],[-73.779594,41.524214],[-73.779877,41.523822],[-73.780153,41.523433],[-73.780477,41.522946],[-73.78077999999999,41.522458],[-73.780903,41.52225],[-73.781206,41.521756],[-73.781408,41.521452],[-73.781537,41.521279],[-73.78168700000001,41.521081],[-73.782038,41.520638],[-73.782386,41.520232],[-73.782696,41.519874],[-73.782921,41.519632],[-73.783174,41.519362],[-73.78344,41.519114],[-73.78361700000001,41.51895],[-73.783818,41.518769],[-73.78416900000001,41.518428],[-73.78442800000001,41.518166],[-73.78468700000001,41.517893],[-73.784919,41.51762],[-73.785076,41.517436],[-73.785301,41.517177],[-73.78547399999999,41.516975],[-73.785838,41.516466],[-73.785948,41.516314],[-73.78607100000001,41.516151],[-73.786289,41.515816],[-73.786506,41.515475],[-73.78679200000001,41.51495],[-73.787246,41.51399],[-73.787603,41.513132],[-73.787798,41.512732],[-73.787961,41.512417],[-73.788144,41.51213],[-73.78845,41.511765],[-73.78871100000001,41.511509],[-73.78903200000001,41.511247],[-73.789387,41.51099],[-73.789609,41.510857],[-73.790014,41.510645],[-73.790556,41.510374],[-73.791129,41.510083],[-73.791563,41.509871],[-73.79207100000001,41.509609],[-73.792367,41.509461],[-73.792653,41.509298],[-73.79302199999999,41.509068],[-73.793533,41.508677],[-73.79374199999999,41.508516],[-73.793898,41.508377],[-73.79398399999999,41.508292],[-73.79419799999999,41.50803],[-73.794419,41.507705],[-73.79447,41.5076],[-73.79458700000001,41.507409],[-73.79474399999999,41.507092],[-73.794968,41.506521],[-73.795041,41.506326],[-73.795091,41.506095],[-73.79514500000001,41.505888],[-73.79516099999999,41.505776],[-73.795214,41.505561],[-73.795288,41.50513],[-73.795338,41.50481],[-73.795404,41.504349],[-73.795461,41.50381],[-73.795492,41.503475],[-73.79553799999999,41.502708],[-73.79556100000001,41.502268],[-73.79558400000001,41.502265],[-73.795694,41.502253],[-73.796344,41.502179],[-73.796503,41.502161],[-73.79656199999999,41.502154],[-73.796581,41.502152],[-73.796594,41.502151],[-73.796648,41.502145],[-73.79667999999999,41.502141],[-73.79728,41.502074],[-73.79845400000001,41.501939],[-73.799041,41.501871],[-73.799419,41.501827],[-73.79963499999999,41.501803],[-73.79970899999999,41.501796],[-73.800061,41.501762],[-73.80558000000001,41.501261],[-73.80642400000001,41.501172],[-73.80663699999999,41.501149],[-73.806726,41.50114],[-73.807788,41.501026],[-73.808137,41.500989],[-73.808193,41.500987],[-73.809102,41.500952],[-73.80975599999999,41.500905],[-73.809774,41.500904],[-73.809822,41.5009],[-73.81027,41.500857],[-73.81327400000001,41.500574],[-73.81451800000001,41.500457],[-73.81461400000001,41.500448],[-73.814638,41.500446],[-73.81477099999999,41.500433],[-73.814812,41.500429],[-73.814898,41.500421],[-73.814943,41.500416],[-73.81495700000001,41.500416],[-73.814986,41.500413],[-73.815012,41.500418],[-73.81504200000001,41.500419],[-73.815055,41.500406],[-73.816007,41.500316],[-73.816239,41.500294],[-73.816396,41.500279],[-73.816686,41.500252],[-73.81697200000001,41.500225],[-73.81702300000001,41.500219],[-73.81803600000001,41.500124],[-73.818714,41.500061],[-73.818991,41.500026],[-73.819692,41.499934],[-73.81998400000001,41.499902],[-73.81999999999999,41.4999],[-73.820356,41.499862],[-73.820807,41.499814],[-73.82083,41.499842],[-73.82095200000001,41.5],[-73.821032,41.500102],[-73.821206,41.500412],[-73.821352,41.500634],[-73.821445,41.500703],[-73.82158099999999,41.500717],[-73.821963,41.500724],[-73.82203699999999,41.500738],[-73.822108,41.50078],[-73.822182,41.500858],[-73.822378,41.501136],[-73.822462,41.501316],[-73.822468,41.501333],[-73.822498,41.501423],[-73.822543,41.501613],[-73.82265099999999,41.502198],[-73.822665,41.502352],[-73.82265099999999,41.502564],[-73.822501,41.503472],[-73.822266,41.504371],[-73.82227399999999,41.504441],[-73.82230199999999,41.504516],[-73.822394,41.504618],[-73.822563,41.504763],[-73.82283700000001,41.504964],[-73.823221,41.505288],[-73.82374799999999,41.505756],[-73.82478500000001,41.506669],[-73.825011,41.506868],[-73.825463,41.507299],[-73.825969,41.5078],[-73.826279,41.508084],[-73.826999,41.508777],[-73.827676,41.509376],[-73.82786,41.509577],[-73.827922,41.509726],[-73.827929,41.509775]]],"type":"Polygon"}
}