{
  "id": "360470191002",
  "type": "Feature",
  "properties": {
    "area_land":44110,
    "area_water":0,
    "geoid":"360470191002",
    "name":"Block Group 2",
    "state":"ny"
},
  "bbox": [
    -73.966425,
    40.693433,
    -73.964054,
    40.696107
],
  "geometry": {"coordinates":[[[-73.966425,40.695999],[-73.965442,40.695978],[-73.96515599999999,40.695972],[-73.964551,40.696107],[-73.964534,40.696035],[-73.964508,40.695926],[-73.96449800000001,40.695852],[-73.964484,40.695744],[-73.964467,40.695674],[-73.96424500000001,40.694585],[-73.964192,40.69432],[-73.964054,40.693628],[-73.964984,40.693515],[-73.965906,40.693433],[-73.966356,40.695645],[-73.966373,40.695733],[-73.966402,40.695877],[-73.966425,40.695999]]],"type":"Polygon"}
}