{
  "id": "360595217001",
  "type": "Feature",
  "properties": {
    "area_land":403472,
    "area_water":0,
    "geoid":"360595217001",
    "name":"Block Group 1",
    "state":"ny"
},
  "bbox": [
    -73.464437,
    40.671047,
    -73.447639,
    40.678376
],
  "geometry": {"coordinates":[[[-73.464201,40.67266],[-73.46333199999999,40.674519],[-73.46324199999999,40.675832],[-73.462397,40.676784],[-73.462244,40.676957],[-73.46176199999999,40.67744],[-73.456127,40.677861],[-73.45422600000001,40.678014],[-73.452448,40.678125],[-73.448958,40.678276],[-73.44844999999999,40.678326],[-73.44805700000001,40.678352],[-73.447856,40.678376],[-73.447639,40.678376],[-73.447704,40.678027],[-73.447756,40.677802],[-73.447941,40.677004],[-73.447903,40.676304],[-73.448803,40.675566],[-73.44938500000001,40.675538],[-73.45067899999999,40.675447],[-73.45301499999999,40.675296],[-73.45414599999999,40.675223],[-73.45575700000001,40.67512],[-73.45701,40.675037],[-73.45994,40.674849],[-73.462581,40.674677],[-73.462976,40.673955],[-73.463363,40.67325],[-73.463629,40.672766],[-73.463679,40.672532],[-73.46379399999999,40.671955],[-73.46381,40.671831],[-73.463927,40.671405],[-73.464034,40.671047],[-73.464437,40.671072],[-73.464201,40.67266]]],"type":"Polygon"}
}