{
  "id": "360593004005",
  "type": "Feature",
  "properties": {
    "area_land":243216,
    "area_water":0,
    "geoid":"360593004005",
    "name":"Block Group 5",
    "state":"ny"
},
  "bbox": [
    -73.725902,
    40.80108,
    -73.719182,
    40.807405
],
  "geometry": {"coordinates":[[[-73.725902,40.807131],[-73.725185,40.807203],[-73.725009,40.807218],[-73.72411700000001,40.807306],[-73.72331,40.807387],[-73.72304200000001,40.807405],[-73.72283400000001,40.806316],[-73.721926,40.806496],[-73.721863,40.806077],[-73.721718,40.805319],[-73.72166199999999,40.8052],[-73.72084700000001,40.804727],[-73.721683,40.804066],[-73.72158899999999,40.803576],[-73.720697,40.803406],[-73.719503,40.803533],[-73.719472,40.803436],[-73.719356,40.802822],[-73.719182,40.801737],[-73.720331,40.801602],[-73.72122400000001,40.801498],[-73.722117,40.801394],[-73.723009,40.801289],[-73.723901,40.801184],[-73.724797,40.80108],[-73.725072,40.802435],[-73.725078,40.802519],[-73.725104,40.802671],[-73.725106,40.802923],[-73.725385,40.804373],[-73.72581700000001,40.806619],[-73.725902,40.807131]]],"type":"Polygon"}
}