{
  "id": "360710118011",
  "type": "Feature",
  "properties": {
    "area_land":20098886,
    "area_water":223813,
    "geoid":"360710118011",
    "name":"Block Group 1",
    "state":"ny"
},
  "bbox": [
    -74.528375,
    41.397409,
    -74.373629,
    41.430873
],
  "geometry": {"coordinates":[[[-74.528375,41.397409],[-74.528009,41.39796],[-74.527317,41.39871],[-74.526499,41.399413],[-74.525507,41.400191],[-74.52467,41.401056],[-74.524449,41.401928],[-74.52421,41.402827],[-74.52345099999999,41.403302],[-74.52337199999999,41.403351],[-74.522024,41.404221],[-74.521344,41.404586],[-74.521226,41.404594],[-74.52148,41.404786],[-74.52155500000001,41.404851],[-74.52161099999999,41.404926],[-74.52168899999999,41.405061],[-74.52178499999999,41.40531],[-74.521857,41.405688],[-74.521959,41.406333],[-74.52203900000001,41.407266],[-74.522138,41.408097],[-74.522312,41.409449],[-74.52246100000001,41.410953],[-74.52258500000001,41.411914],[-74.522666,41.412422],[-74.52268599999999,41.412643],[-74.52279,41.413827],[-74.52312499999999,41.416441],[-74.523106,41.416528],[-74.523072,41.416559],[-74.52282200000001,41.416682],[-74.52236000000001,41.416891],[-74.5218,41.417024],[-74.521281,41.417235],[-74.520962,41.41744],[-74.52074500000001,41.417641],[-74.520588,41.417835],[-74.519948,41.418529],[-74.518773,41.419828],[-74.518513,41.420093],[-74.518342,41.420266],[-74.518044,41.420623],[-74.518095,41.4207],[-74.51816100000001,41.420807],[-74.51822,41.420928],[-74.518255,41.421035],[-74.518263,41.421111],[-74.51825700000001,41.421164],[-74.51822900000001,41.421232],[-74.518176,41.4213],[-74.51771100000001,41.42177],[-74.517636,41.421827],[-74.51746300000001,41.421911],[-74.51732800000001,41.421943],[-74.51634199999999,41.422044],[-74.515871,41.422109],[-74.515691,41.422146],[-74.515367,41.422252],[-74.515275,41.422292],[-74.51522900000001,41.422316],[-74.51472699999999,41.42234],[-74.511397,41.42254],[-74.51065,41.422583],[-74.507223,41.422783],[-74.50533900000001,41.422896],[-74.499712,41.423157],[-74.498548,41.423158],[-74.494276,41.423387],[-74.487224,41.423859],[-74.48523900000001,41.423975],[-74.483667,41.424066],[-74.46422200000001,41.425199],[-74.450147,41.426085],[-74.449534,41.426124],[-74.448528,41.426187],[-74.446423,41.426318],[-74.446245,41.426329],[-74.44379000000001,41.424867],[-74.442425,41.424074],[-74.442319,41.42401],[-74.445785,41.421671],[-74.445708,41.421602],[-74.445637,41.421539],[-74.44534,41.421187],[-74.445165,41.420983],[-74.44505100000001,41.42085],[-74.44501200000001,41.420739],[-74.44477000000001,41.420395],[-74.44411599999999,41.420768],[-74.443444,41.420383],[-74.44242199999999,41.420429],[-74.44235500000001,41.418796],[-74.44281100000001,41.41861],[-74.44224,41.417886],[-74.441862,41.417408],[-74.43507200000001,41.420671],[-74.434901,41.420596],[-74.433483,41.422158],[-74.430697,41.420459],[-74.429877,41.421211],[-74.428809,41.420914],[-74.42876,41.421296],[-74.42873899999999,41.421577],[-74.428274,41.421467],[-74.42831200000001,41.421601],[-74.428017,41.421612],[-74.428337,41.422604],[-74.428372,41.422654],[-74.428591,41.423474],[-74.429365,41.423581],[-74.430091,41.423745],[-74.42993300000001,41.42392],[-74.429694,41.423936],[-74.429779,41.425013],[-74.428703,41.425072],[-74.42871100000001,41.424918],[-74.428701,41.424306],[-74.42868199999999,41.424081],[-74.42864,41.423882],[-74.424312,41.424212],[-74.42300299999999,41.424313],[-74.422562,41.424909],[-74.422076,41.425271],[-74.421207,41.425657],[-74.420599,41.425973],[-74.42026199999999,41.426148],[-74.419273,41.427872],[-74.41883300000001,41.427902],[-74.417073,41.428026],[-74.416256,41.428108],[-74.41600200000001,41.428134],[-74.40440099999999,41.428869],[-74.402689,41.428955],[-74.40261,41.428964],[-74.39101599999999,41.429672],[-74.39078600000001,41.429706],[-74.390112,41.429731],[-74.389031,41.42977],[-74.386826,41.429909],[-74.38270300000001,41.430148],[-74.377775,41.430448],[-74.374318,41.430742],[-74.37367999999999,41.430868],[-74.373654,41.430873],[-74.373645,41.43082],[-74.37362899999999,41.430755],[-74.37363499999999,41.43073],[-74.373673,41.430743],[-74.373717,41.430731],[-74.373723,41.430682],[-74.37369700000001,41.430626],[-74.373701,41.430563],[-74.373755,41.430484],[-74.37373700000001,41.43035],[-74.37375900000001,41.430328],[-74.373828,41.430325],[-74.373858,41.430295],[-74.373904,41.430278],[-74.373909,41.430249],[-74.373884,41.430223],[-74.37388199999999,41.430198],[-74.374055,41.430026],[-74.374168,41.429929],[-74.37425500000001,41.429885],[-74.374368,41.429879],[-74.374382,41.429862],[-74.374375,41.429802],[-74.374393,41.429772],[-74.374469,41.42976],[-74.374599,41.429676],[-74.374627,41.429634],[-74.37467100000001,41.429631],[-74.374696,41.429612],[-74.374703,41.42956],[-74.37475499999999,41.429453],[-74.374787,41.429412],[-74.374889,41.429335],[-74.37496299999999,41.42933],[-74.375,41.429298],[-74.375049,41.429208],[-74.376148,41.428196],[-74.37616199999999,41.428132],[-74.37612,41.428082],[-74.376114,41.428011],[-74.376138,41.427874],[-74.376194,41.427817],[-74.37623000000001,41.427799],[-74.376265,41.427764],[-74.376272,41.427732],[-74.37625800000001,41.427668],[-74.376226,41.427658],[-74.376152,41.427668],[-74.376109,41.427654],[-74.376074,41.427612],[-74.376031,41.427502],[-74.376037,41.427452],[-74.37608299999999,41.427403],[-74.376076,41.427381],[-74.37598699999999,41.427357],[-74.375934,41.427328],[-74.375923,41.427311],[-74.375927,41.427289],[-74.375952,41.427268],[-74.375969,41.427233],[-74.37595899999999,41.427187],[-74.375923,41.427134],[-74.375888,41.427116],[-74.375792,41.427102],[-74.375739,41.426992],[-74.375714,41.426974],[-74.37558300000001,41.426939],[-74.37552700000001,41.426935],[-74.375495,41.426921],[-74.37548,41.426882],[-74.375495,41.426815],[-74.375484,41.42678],[-74.375445,41.426734],[-74.37541,41.426712],[-74.375349,41.426705],[-74.375326,41.426718],[-74.375289,41.426787],[-74.375266,41.426794],[-74.375225,41.426787],[-74.37517200000001,41.426766],[-74.375012,41.426662],[-74.374889,41.426505],[-74.374807,41.426441],[-74.37479399999999,41.426411],[-74.374684,41.426322],[-74.37453600000001,41.426152],[-74.374499,41.426139],[-74.37438899999999,41.426149],[-74.374342,41.426135],[-74.37426499999999,41.426055],[-74.374242,41.425987],[-74.374235,41.425893],[-74.374207,41.425819],[-74.374162,41.425742],[-74.37413100000001,41.425582],[-74.374098,41.425537],[-74.374109,41.425448],[-74.374139,41.425309],[-74.37410300000001,41.425154],[-74.374026,41.425097],[-74.37401,41.42503],[-74.374019,41.424989],[-74.37401300000001,41.424871],[-74.37396,41.424737],[-74.374,41.424655],[-74.373987,41.424619],[-74.37394399999999,41.4246],[-74.373912,41.424544],[-74.373881,41.424513],[-74.373878,41.42446],[-74.373886,41.424337],[-74.373828,41.423834],[-74.373777,41.423691],[-74.37375,41.423225],[-74.373761,41.423132],[-74.373711,41.423085],[-74.373698,41.422986],[-74.373698,41.422859],[-74.373681,41.422666],[-74.37366400000001,41.422481],[-74.373656,41.422104],[-74.373694,41.42179],[-74.373749,41.421602],[-74.373833,41.421399],[-74.37386600000001,41.421354],[-74.37391599999999,41.421336],[-74.373946,41.421352],[-74.373977,41.421348],[-74.374043,41.421288],[-74.374038,41.421234],[-74.374043,41.421176],[-74.374081,41.421148],[-74.37413599999999,41.42114],[-74.37446799999999,41.420783],[-74.374617,41.420673],[-74.37475999999999,41.420636],[-74.374751,41.420485],[-74.374757,41.42044],[-74.37481699999999,41.420319],[-74.37484600000001,41.420175],[-74.374914,41.419741],[-74.374953,41.419563],[-74.37497999999999,41.419491],[-74.375317,41.419016],[-74.375523,41.418754],[-74.375731,41.41851],[-74.376187,41.418025],[-74.376346,41.41783],[-74.37652,41.417561],[-74.376677,41.417189],[-74.376723,41.417044],[-74.376734,41.416874],[-74.376677,41.416414],[-74.37669200000001,41.416248],[-74.37673100000001,41.416142],[-74.376925,41.415738],[-74.377257,41.415201],[-74.37767100000001,41.415266],[-74.377852,41.415276],[-74.37800300000001,41.415251],[-74.378095,41.415223],[-74.378159,41.415188],[-74.378229,41.415128],[-74.37834599999999,41.41505],[-74.378483,41.415009],[-74.378559,41.414944],[-74.378612,41.414572],[-74.37863299999999,41.414462],[-74.37867199999999,41.414398],[-74.37875,41.414359],[-74.37881400000001,41.414349],[-74.378895,41.414352],[-74.37929200000001,41.414444],[-74.37942,41.414444],[-74.379554,41.41443],[-74.38007500000001,41.414218],[-74.380185,41.414186],[-74.38026600000001,41.414175],[-74.380606,41.414251],[-74.380651,41.414257],[-74.38120000000001,41.41447],[-74.381511,41.414501],[-74.381732,41.414518],[-74.381883,41.414523],[-74.38194799999999,41.41458],[-74.38203,41.414631],[-74.382217,41.414704],[-74.382368,41.414746],[-74.38254999999999,41.414778],[-74.38282,41.414794],[-74.383066,41.414775],[-74.383206,41.414764],[-74.383743,41.414698],[-74.38455500000001,41.414609],[-74.385031,41.414529],[-74.385448,41.414433],[-74.385749,41.414341],[-74.38640599999999,41.414118],[-74.387438,41.413716],[-74.388212,41.413445],[-74.38896699999999,41.413135],[-74.389337,41.413006],[-74.38973900000001,41.412879],[-74.38996,41.412827],[-74.39015999999999,41.412794],[-74.39044,41.412762],[-74.39108299999999,41.412722],[-74.391437,41.412717],[-74.39172000000001,41.413086],[-74.392274,41.413724],[-74.392561,41.414057],[-74.39303099999999,41.414611],[-74.393057,41.414643],[-74.393293,41.414929],[-74.393962,41.415696],[-74.39444399999999,41.416301],[-74.394863,41.4168],[-74.39495100000001,41.416882],[-74.395111,41.417009],[-74.39535100000001,41.417143],[-74.39617800000001,41.417542],[-74.399343,41.41891],[-74.400066,41.419211],[-74.400426,41.419366],[-74.401302,41.419716],[-74.401787,41.419926],[-74.401875,41.419965],[-74.403616,41.420926],[-74.40398500000001,41.42113],[-74.404036,41.421158],[-74.404337,41.421321],[-74.404747,41.421562],[-74.40497499999999,41.421478],[-74.4057,41.421211],[-74.406604,41.420903],[-74.407932,41.420488],[-74.408776,41.420249],[-74.40953399999999,41.420048],[-74.414269,41.418851],[-74.41586599999999,41.418452],[-74.41594499999999,41.418431],[-74.417062,41.418142],[-74.418254,41.417783],[-74.418746,41.417621],[-74.419962,41.417181],[-74.420894,41.4168],[-74.421578,41.416498],[-74.422952,41.415852],[-74.423187,41.41574],[-74.42376899999999,41.415464],[-74.423832,41.415443],[-74.424464,41.415135],[-74.425602,41.41458],[-74.42624600000001,41.414255],[-74.42768700000001,41.413571],[-74.42843999999999,41.413241],[-74.429196,41.41293],[-74.429897,41.412662],[-74.43031999999999,41.412509],[-74.431408,41.412132],[-74.432135,41.411906],[-74.4331,41.411626],[-74.433553,41.411503],[-74.43433400000001,41.411308],[-74.435063,41.411142],[-74.435131,41.411126],[-74.436149,41.410924],[-74.43727,41.410722],[-74.43866800000001,41.410528],[-74.43989000000001,41.410391],[-74.440966,41.410308],[-74.44178599999999,41.410245],[-74.44273,41.410176],[-74.444335,41.41006],[-74.44624899999999,41.409923],[-74.44868099999999,41.409731],[-74.44967200000001,41.409615],[-74.450928,41.4094],[-74.451459,41.409288],[-74.452701,41.409001],[-74.453262,41.408845],[-74.45417999999999,41.408551],[-74.455516,41.408104],[-74.45683099999999,41.407657],[-74.458341,41.407136],[-74.459874,41.406616],[-74.460904,41.406251],[-74.461755,41.405965],[-74.463285,41.405434],[-74.46406899999999,41.405188],[-74.464741,41.404997],[-74.46523000000001,41.404874],[-74.466058,41.404693],[-74.46646,41.404621],[-74.467202,41.404498],[-74.46798200000001,41.404409],[-74.468751,41.404343],[-74.469286,41.404311],[-74.469632,41.404299],[-74.470389,41.404297],[-74.471176,41.404318],[-74.471655,41.404352],[-74.472027,41.404378],[-74.473096,41.404493],[-74.47441999999999,41.40471],[-74.476518,41.405098],[-74.477974,41.405356],[-74.479168,41.405573],[-74.480143,41.40575],[-74.483467,41.406359],[-74.487174,41.407027],[-74.488061,41.407166],[-74.489222,41.407311],[-74.48991700000001,41.407386],[-74.490729,41.407467],[-74.4919,41.407546],[-74.493179,41.407601],[-74.49343399999999,41.407607],[-74.493909,41.407618],[-74.49471800000001,41.407619],[-74.495622,41.407609],[-74.496351,41.407584],[-74.49716100000001,41.407542],[-74.49813399999999,41.407478],[-74.499021,41.407398],[-74.499527,41.407349],[-74.49982199999999,41.40687],[-74.500737,41.406742],[-74.501171,41.406682],[-74.502353,41.406483],[-74.50394799999999,41.40617],[-74.50502899999999,41.405901],[-74.506399,41.405536],[-74.507791,41.405095],[-74.50900900000001,41.404664],[-74.511939,41.403479],[-74.518287,41.400886],[-74.51901700000001,41.400583],[-74.519535,41.400886],[-74.519949,41.400711],[-74.520398,41.400521],[-74.522424,41.399664],[-74.525693,41.398275],[-74.526415,41.397993],[-74.527261,41.397714],[-74.527646,41.397596],[-74.52817,41.397457],[-74.528375,41.397409]]],"type":"Polygon"}
}