{
  "id": "360470584002",
  "type": "Feature",
  "properties": {
    "area_land":129263,
    "area_water":0,
    "geoid":"360470584002",
    "name":"Block Group 2",
    "state":"ny"
},
  "bbox": [
    -73.961028,
    40.591598,
    -73.957003,
    40.596407
],
  "geometry": {"coordinates":[[[-73.961028,40.596161],[-73.96005100000001,40.596268],[-73.959777,40.596299],[-73.95878,40.596407],[-73.95836799999999,40.594228],[-73.95746200000001,40.594439],[-73.95702300000001,40.592109],[-73.957003,40.592002],[-73.95767600000001,40.591929],[-73.95899799999999,40.591784],[-73.959677,40.591707],[-73.96068,40.591598],[-73.960736,40.592327],[-73.96078900000001,40.593014],[-73.96084500000001,40.593743],[-73.960888,40.594365],[-73.960965,40.595349],[-73.961028,40.596161]]],"type":"Polygon"}
}