{
  "id": "360010017001",
  "type": "Feature",
  "properties": {
    "area_land":376686,
    "area_water":0,
    "geoid":"360010017001",
    "name":"Block Group 1",
    "state":"ny"
},
  "bbox": [
    -73.802406,
    42.66235,
    -73.788146,
    42.668528
],
  "geometry": {"coordinates":[[[-73.80240000000001,42.664579],[-73.80197099999999,42.664972],[-73.800783,42.666097],[-73.800369,42.666474],[-73.800157,42.666672],[-73.799668,42.667145],[-73.79876299999999,42.667984],[-73.79831,42.668453],[-73.79822799999999,42.668528],[-73.797588,42.668327],[-73.79691,42.668115],[-73.795776,42.667755],[-73.795546,42.667685],[-73.79535199999999,42.667616],[-73.795165,42.667559],[-73.794132,42.667234],[-73.79362999999999,42.667076],[-73.793511,42.667036],[-73.793108,42.666915],[-73.79281,42.666824],[-73.79257800000001,42.666753],[-73.792449,42.666713],[-73.79200299999999,42.666565],[-73.79167,42.666446],[-73.791325,42.666338],[-73.790121,42.66595],[-73.788146,42.665328],[-73.78836200000001,42.665127],[-73.788554,42.664945],[-73.788741,42.664756],[-73.788922,42.664587],[-73.79011199999999,42.663455],[-73.79068599999999,42.662915],[-73.791375,42.663302],[-73.792367,42.663868],[-73.79392199999999,42.664734],[-73.795278,42.665519],[-73.79558,42.665198],[-73.796193,42.664653],[-73.79731700000001,42.663605],[-73.798219,42.662733],[-73.798671,42.66235],[-73.799104,42.662624],[-73.799983,42.663077],[-73.800105,42.663138],[-73.80116200000001,42.663727],[-73.80137499999999,42.663866],[-73.801461,42.663916],[-73.801862,42.664189],[-73.802227,42.664415],[-73.80238900000001,42.664509],[-73.802406,42.664545],[-73.80240000000001,42.664579]]],"type":"Polygon"}
}