{
  "id": "361031594062",
  "type": "Feature",
  "properties": {
    "area_land":8243238,
    "area_water":51864,
    "geoid":"361031594062",
    "name":"Block Group 2",
    "state":"ny"
},
  "bbox": [
    -72.782687,
    40.806451,
    -72.723508,
    40.843946
],
  "geometry": {"coordinates":[[[-72.782687,40.811661],[-72.78103900000001,40.811747],[-72.781313,40.813086],[-72.780433,40.813976],[-72.781988,40.820404],[-72.782313,40.823358],[-72.782375,40.82408],[-72.782489,40.824057],[-72.78243500000001,40.824447],[-72.782399,40.824713],[-72.781859,40.82477],[-72.78137,40.824825],[-72.780378,40.824946],[-72.77982799999999,40.825054],[-72.77648000000001,40.825613],[-72.775058,40.825844],[-72.774103,40.826056],[-72.77361000000001,40.826155],[-72.77312000000001,40.826254],[-72.771489,40.826607],[-72.76605000000001,40.82794],[-72.76393899999999,40.828515],[-72.76234599999999,40.829011],[-72.760745,40.829514],[-72.76040999999999,40.829618],[-72.759383,40.829965],[-72.75919399999999,40.830021],[-72.758859,40.830131],[-72.757971,40.830448],[-72.757333,40.830673],[-72.75669600000001,40.830901],[-72.756558,40.83094],[-72.755861,40.831171],[-72.755437,40.831331],[-72.748987,40.833585],[-72.748395,40.833811],[-72.74708200000001,40.834252],[-72.746728,40.834372],[-72.745172,40.834916],[-72.741771,40.836101],[-72.741648,40.836145],[-72.73946599999999,40.836931],[-72.738062,40.83747],[-72.737073,40.837873],[-72.736515,40.838126],[-72.736014,40.83832],[-72.73624100000001,40.837883],[-72.733113,40.83961],[-72.72833799999999,40.841939],[-72.727785,40.841862],[-72.72638600000001,40.842548],[-72.723781,40.843825],[-72.723508,40.843946],[-72.723586,40.843852],[-72.723613,40.843762],[-72.72425800000001,40.841694],[-72.724887,40.83893],[-72.724985,40.838627],[-72.726142,40.833781],[-72.72633500000001,40.83257],[-72.726266,40.832004],[-72.726281,40.831203],[-72.72686899999999,40.830707],[-72.72696500000001,40.830275],[-72.727126,40.829667],[-72.727287,40.828995],[-72.727864,40.828387],[-72.728075,40.825699],[-72.72811299999999,40.825605],[-72.728143,40.825527],[-72.72815,40.825298],[-72.72835600000001,40.824676],[-72.729096,40.824772],[-72.73161500000001,40.825115],[-72.735542,40.825699],[-72.73764199999999,40.825989],[-72.737741,40.826004],[-72.738812,40.82617],[-72.73938099999999,40.826259],[-72.739816,40.82629],[-72.740216,40.826327],[-72.740343,40.82634],[-72.74127799999999,40.826382],[-72.74133399999999,40.826385],[-72.74176900000001,40.826339],[-72.74224,40.826228],[-72.742586,40.826148],[-72.742983,40.825989],[-72.743402,40.825793],[-72.74382900000001,40.825573],[-72.74405899999999,40.825443],[-72.74431,40.825283],[-72.74444,40.825153],[-72.74466099999999,40.824997],[-72.744899,40.824746],[-72.744951,40.824692],[-72.745195,40.824451],[-72.74543199999999,40.824161],[-72.748842,40.819759],[-72.751656,40.816498],[-72.754389,40.813331],[-72.75463499999999,40.813122],[-72.754999,40.812771],[-72.755366,40.81245],[-72.755786,40.812195],[-72.756197,40.81197],[-72.756647,40.811794],[-72.757029,40.811668],[-72.757143,40.811603],[-72.757304,40.8116],[-72.76401799999999,40.8102],[-72.76672600000001,40.80965],[-72.77410399999999,40.808098],[-72.77444,40.808037],[-72.77678899999999,40.807522],[-72.778278,40.80722],[-72.78216,40.806451],[-72.78230600000001,40.807792],[-72.782687,40.811661]]],"type":"Polygon"}
}