{
  "id": "360811017001",
  "type": "Feature",
  "properties": {
    "area_land":145940,
    "area_water":0,
    "geoid":"360811017001",
    "name":"Block Group 1",
    "state":"ny"
},
  "bbox": [
    -73.797994,
    40.776205,
    -73.793187,
    40.781892
],
  "geometry": {"coordinates":[[[-73.797904,40.777257],[-73.797814,40.777895],[-73.79772199999999,40.778551],[-73.79762599999999,40.779261],[-73.797529,40.779971],[-73.794732,40.77975],[-73.794636,40.780461],[-73.794546,40.781169],[-73.794464,40.781879],[-73.794325,40.781892],[-73.794017,40.780439],[-73.79387199999999,40.779684],[-73.793682,40.778734],[-73.793667,40.778652],[-73.79350700000001,40.777825],[-73.79334799999999,40.777019],[-73.793187,40.776205],[-73.795193,40.776363],[-73.797994,40.776587],[-73.797904,40.777257]]],"type":"Polygon"}
}