{
  "id": "360810351002",
  "type": "Feature",
  "properties": {
    "area_land":51557,
    "area_water":0,
    "geoid":"360810351002",
    "name":"Block Group 2",
    "state":"ny"
},
  "bbox": [
    -73.878315,
    40.756339,
    -73.876068,
    40.76021
],
  "geometry": {"coordinates":[[[-73.878315,40.758464],[-73.877385,40.758562],[-73.877668,40.760114],[-73.876738,40.76021],[-73.87645500000001,40.75866],[-73.876068,40.756536],[-73.876998,40.756439],[-73.87793000000001,40.756339],[-73.878315,40.758464]]],"type":"Polygon"}
}