{
  "id": "360710012001",
  "type": "Feature",
  "properties": {
    "area_land":985626,
    "area_water":0,
    "geoid":"360710012001",
    "name":"Block Group 1",
    "state":"ny"
},
  "bbox": [
    -74.4174,
    41.450297,
    -74.403095,
    41.474347
],
  "geometry": {"coordinates":[[[-74.41677300000001,41.451069],[-74.415767,41.452221],[-74.41434,41.453875],[-74.413873,41.454403],[-74.41248,41.456051],[-74.41241100000001,41.456151],[-74.412368,41.456291],[-74.41212899999999,41.457344],[-74.411739,41.459322],[-74.411708,41.459676],[-74.411748,41.460076],[-74.411795,41.460306],[-74.412015,41.461097],[-74.41210599999999,41.461388],[-74.411748,41.461295],[-74.411736,41.461366],[-74.411727,41.461472],[-74.411681,41.461624],[-74.411613,41.461782],[-74.41147100000001,41.461967],[-74.411317,41.462172],[-74.41119500000001,41.462399],[-74.41103699999999,41.462359],[-74.41088000000001,41.462574],[-74.410723,41.462815],[-74.410567,41.46307],[-74.410445,41.463257],[-74.410111,41.463538],[-74.40985000000001,41.463779],[-74.40964,41.46398],[-74.40944500000001,41.464127],[-74.409358,41.464194],[-74.4089,41.463981],[-74.408288,41.464677],[-74.40802499999999,41.464531],[-74.40727099999999,41.465174],[-74.407546,41.46533],[-74.40840900000001,41.465804],[-74.40779999999999,41.466507],[-74.407488,41.466842],[-74.407307,41.467075],[-74.40628100000001,41.467939],[-74.40636600000001,41.467983],[-74.40705,41.468477],[-74.407456,41.468089],[-74.407753,41.468318],[-74.408677,41.468948],[-74.40943799999999,41.469341],[-74.410325,41.470021],[-74.40858799999999,41.471518],[-74.408967,41.471822],[-74.40954000000001,41.47209],[-74.409171,41.472433],[-74.41000099999999,41.4733],[-74.408948,41.473919],[-74.40843099999999,41.473568],[-74.40731599999999,41.474347],[-74.40626899999999,41.474151],[-74.406519,41.473384],[-74.404967,41.471222],[-74.404523,41.471693],[-74.403599,41.471229],[-74.403795,41.470984],[-74.40412999999999,41.470566],[-74.404219,41.47046],[-74.40449,41.470061],[-74.404687,41.469769],[-74.404712,41.469733],[-74.40309499999999,41.468854],[-74.40321,41.468266],[-74.403378,41.467675],[-74.403622,41.467253],[-74.403885,41.466817],[-74.404224,41.466352],[-74.40443,41.466169],[-74.404712,41.465845],[-74.4049,41.465621],[-74.405199,41.465382],[-74.40544300000001,41.4651],[-74.405631,41.464902],[-74.405799,41.464749],[-74.406024,41.464565],[-74.40623100000001,41.464409],[-74.406418,41.464283],[-74.407055,41.463894],[-74.40722599999999,41.463814],[-74.407888,41.462925],[-74.40837500000001,41.462234],[-74.40907300000001,41.461274],[-74.409262,41.461054],[-74.408148,41.460663],[-74.407296,41.460326],[-74.405384,41.459987],[-74.40455799999999,41.459846],[-74.404143,41.459719],[-74.404183,41.459649],[-74.404478,41.459095],[-74.40516599999999,41.457763],[-74.40527899999999,41.457564],[-74.40567299999999,41.456871],[-74.40612900000001,41.456064],[-74.406738,41.454968],[-74.407098,41.454299],[-74.407185,41.454189],[-74.408168,41.454806],[-74.411573,41.451641],[-74.41265799999999,41.451378],[-74.41301,41.4513],[-74.413312,41.45123],[-74.414928,41.45087],[-74.415913,41.45065],[-74.416589,41.450487],[-74.4174,41.450297],[-74.41677300000001,41.451069]]],"type":"Polygon"}
}