{
  "id": "360750216011",
  "type": "Feature",
  "properties": {
    "area_land":379568,
    "area_water":1272481,
    "geoid":"360750216011",
    "name":"Block Group 1",
    "state":"ny"
},
  "bbox": [
    -76.527772,
    43.452144,
    -76.507122,
    43.481323
],
  "geometry": {"coordinates":[[[-76.527772,43.478055],[-76.520049,43.481323],[-76.52009700000001,43.481149],[-76.518799,43.478506],[-76.51656,43.473305],[-76.516358,43.472822],[-76.51558199999999,43.470432],[-76.514066,43.4675],[-76.51343799999999,43.465993],[-76.513357,43.465799],[-76.512823,43.464516],[-76.512795,43.464443],[-76.512156,43.462754],[-76.511932,43.4622],[-76.511539,43.461241],[-76.511177,43.46008],[-76.510728,43.459083],[-76.509924,43.457912],[-76.50936799999999,43.457102],[-76.50928399999999,43.457006],[-76.50917099999999,43.457104],[-76.50914899999999,43.457066],[-76.50911000000001,43.457067],[-76.50897399999999,43.456882],[-76.508622,43.456146],[-76.508494,43.455901],[-76.508427,43.45578],[-76.50766,43.454374],[-76.507223,43.453522],[-76.507122,43.453358],[-76.507166,43.453345],[-76.50747800000001,43.453254],[-76.50819799999999,43.453045],[-76.509129,43.452759],[-76.510178,43.452455],[-76.51123,43.452144],[-76.511923,43.453408],[-76.51222,43.453914],[-76.512641,43.45467],[-76.513017,43.455368],[-76.51333099999999,43.455923],[-76.514049,43.457188],[-76.51474899999999,43.458444],[-76.51493600000001,43.458769],[-76.515446,43.459709],[-76.515727,43.460187],[-76.516154,43.460963],[-76.51652900000001,43.461644],[-76.516972,43.462431],[-76.517752,43.462776],[-76.518648,43.463263],[-76.519019,43.463359],[-76.519929,43.464808],[-76.524686,43.472383],[-76.527772,43.478055]]],"type":"Polygon"}
}