{
  "id": "360050374002",
  "type": "Feature",
  "properties": {
    "area_land":100360,
    "area_water":0,
    "geoid":"360050374002",
    "name":"Block Group 2",
    "state":"ny"
},
  "bbox": [
    -73.868258,
    40.871442,
    -73.864975,
    40.877799
],
  "geometry": {"coordinates":[[[-73.868208,40.873235],[-73.86812999999999,40.875305],[-73.868077,40.877145],[-73.86806799999999,40.877368],[-73.86805,40.877799],[-73.867654,40.877703],[-73.867375,40.877634],[-73.86706100000001,40.877558],[-73.866874,40.877513],[-73.866271,40.877327],[-73.86700999999999,40.876133],[-73.867054,40.875219],[-73.866078,40.87509],[-73.865943,40.875052],[-73.864975,40.87493],[-73.865123,40.874102],[-73.86529400000001,40.873335],[-73.865345,40.873387],[-73.86542,40.873439],[-73.86551300000001,40.873481],[-73.86561,40.873507],[-73.865726,40.873518],[-73.865831,40.87351],[-73.86593999999999,40.873485],[-73.86602499999999,40.873448],[-73.866111,40.873392],[-73.866169,40.873335],[-73.866297,40.873212],[-73.867096,40.873213],[-73.867159,40.871442],[-73.868258,40.871462],[-73.868208,40.873235]]],"type":"Polygon"}
}