{
  "id": "360610177004",
  "type": "Feature",
  "properties": {
    "area_land":16546,
    "area_water":0,
    "geoid":"360610177004",
    "name":"Block Group 4",
    "state":"ny"
},
  "bbox": [
    -73.972458,
    40.789053,
    -73.96985,
    40.790597
],
  "geometry": {"coordinates":[[[-73.972177,40.790352],[-73.97218700000001,40.790385],[-73.972041,40.790597],[-73.971462,40.790353],[-73.96984999999999,40.789674],[-73.970299,40.789053],[-73.971969,40.78975],[-73.972458,40.789955],[-73.972177,40.790352]]],"type":"Polygon"}
}