{
  "id": "360870121031",
  "type": "Feature",
  "properties": {
    "area_land":456219,
    "area_water":0,
    "geoid":"360870121031",
    "name":"Block Group 1",
    "state":"ny"
},
  "bbox": [
    -74.07734,
    41.118844,
    -74.067785,
    41.126812
],
  "geometry": {"coordinates":[[[-74.07734000000001,41.126812],[-74.076452,41.126758],[-74.076368,41.126734],[-74.07624800000001,41.126665],[-74.076167,41.126588],[-74.076121,41.12651],[-74.076098,41.126419],[-74.076098,41.126346],[-74.074839,41.126246],[-74.07233600000001,41.126052],[-74.07199199999999,41.126026],[-74.07178,41.126],[-74.07003899999999,41.12586],[-74.069751,41.125839],[-74.0692,41.125808],[-74.068708,41.125765],[-74.068575,41.125754],[-74.067785,41.125693],[-74.06792,41.124609],[-74.067987,41.124199],[-74.06799700000001,41.123938],[-74.067987,41.123649],[-74.067984,41.123537],[-74.06798000000001,41.123419],[-74.06797899999999,41.12339],[-74.06793,41.122105],[-74.06847500000001,41.12211],[-74.06850799999999,41.12163],[-74.069183,41.121644],[-74.069126,41.122113],[-74.069008,41.122749],[-74.06983099999999,41.122839],[-74.07028099999999,41.122867],[-74.07035,41.122872],[-74.07181199999999,41.123007],[-74.07199300000001,41.123016],[-74.072048,41.122631],[-74.072068,41.122092],[-74.072078,41.121843],[-74.072078,41.121402],[-74.072048,41.120587],[-74.072063,41.120436],[-74.072204,41.119933],[-74.072278,41.119576],[-74.072293,41.119453],[-74.072322,41.118844],[-74.073004,41.1189],[-74.073419,41.118923],[-74.07359,41.118956],[-74.074279,41.119001],[-74.074746,41.119023],[-74.075154,41.119018],[-74.075795,41.11903],[-74.07602900000001,41.119034],[-74.076016,41.119223],[-74.075993,41.11956],[-74.075988,41.119634],[-74.075982,41.119711],[-74.07598900000001,41.119933],[-74.075947,41.120777],[-74.076279,41.120792],[-74.077112,41.120828],[-74.077112,41.121749],[-74.07714900000001,41.122375],[-74.07724399999999,41.123403],[-74.07730599999999,41.124469],[-74.07729999999999,41.125279],[-74.07733399999999,41.126523],[-74.07734000000001,41.126812]]],"type":"Polygon"}
}