{
  "id": "360870105032",
  "type": "Feature",
  "properties": {
    "area_land":33180961,
    "area_water":2208880,
    "geoid":"360870105032",
    "name":"Block Group 2",
    "state":"ny"
},
  "bbox": [
    -74.161789,
    41.187685,
    -74.022132,
    41.2408
],
  "geometry": {"coordinates":[[[-74.15100099999999,41.203462],[-74.14408899999999,41.208375],[-74.143328,41.208916],[-74.142149,41.209754],[-74.141389,41.210294],[-74.13642,41.213971],[-74.13638899999999,41.213994],[-74.133589,41.215994],[-74.13323200000001,41.216242],[-74.131339,41.21756],[-74.128264,41.219702],[-74.127989,41.219894],[-74.127797,41.220042],[-74.12543700000001,41.221857],[-74.125389,41.221894],[-74.124589,41.222458],[-74.123957,41.222902],[-74.116625,41.228068],[-74.11658799999999,41.228094],[-74.116418,41.228236],[-74.115988,41.228594],[-74.114231,41.230036],[-74.11417,41.230086],[-74.10903,41.233562],[-74.108688,41.233793],[-74.108627,41.233836],[-74.108566,41.233878],[-74.10854399999999,41.233895],[-74.107986,41.234292],[-74.105975,41.235724],[-74.104755,41.236592],[-74.104399,41.236845],[-74.09884,41.2408],[-74.086101,41.233644],[-74.083578,41.232227],[-74.08136399999999,41.230983],[-74.078925,41.229613],[-74.078485,41.229759],[-74.07795900000001,41.229854],[-74.07736199999999,41.229869],[-74.076279,41.229511],[-74.075828,41.229451],[-74.075373,41.229358],[-74.07471,41.228761],[-74.07380000000001,41.228376],[-74.07320799999999,41.228292],[-74.072716,41.228272],[-74.072458,41.228372],[-74.07183499999999,41.228567],[-74.071746,41.228594],[-74.07051,41.229059],[-74.069402,41.229507],[-74.068699,41.229804],[-74.06833399999999,41.229944],[-74.068145,41.230081],[-74.067939,41.230189],[-74.067519,41.230319],[-74.06679200000001,41.230501],[-74.066407,41.230571],[-74.066126,41.230577],[-74.066039,41.230565],[-74.06576200000001,41.230501],[-74.065462,41.23046],[-74.06532900000001,41.230449],[-74.06515,41.230453],[-74.064803,41.230491],[-74.064116,41.230595],[-74.06386000000001,41.230618],[-74.063541,41.230619],[-74.063219,41.230596],[-74.062715,41.230535],[-74.06242899999999,41.230474],[-74.061063,41.230072],[-74.059313,41.22955],[-74.059076,41.229451],[-74.058849,41.229337],[-74.05844999999999,41.229061],[-74.05809000000001,41.2288],[-74.05762799999999,41.228517],[-74.057202,41.228229],[-74.05711100000001,41.228164],[-74.057036,41.22811],[-74.056617,41.227773],[-74.056194,41.227452],[-74.05584500000001,41.227126],[-74.05544399999999,41.226659],[-74.055367,41.226563],[-74.055087,41.226214],[-74.05488699999999,41.226007],[-74.05482000000001,41.225953],[-74.054647,41.225835],[-74.05437999999999,41.225685],[-74.053994,41.225516],[-74.053152,41.225194],[-74.05262,41.22495],[-74.051582,41.224598],[-74.051301,41.224514],[-74.050543,41.224325],[-74.050336,41.224256],[-74.049958,41.224054],[-74.04986,41.223994],[-74.049725,41.223911],[-74.049576,41.223801],[-74.04933200000001,41.223567],[-74.049058,41.223279],[-74.04862900000001,41.222802],[-74.048597,41.222757],[-74.048407,41.222492],[-74.048192,41.22211],[-74.04813300000001,41.221992],[-74.04812099999999,41.22197],[-74.047927,41.221609],[-74.047837,41.221483],[-74.04753100000001,41.221221],[-74.047366,41.221111],[-74.047173,41.221019],[-74.046908,41.220932],[-74.046104,41.220745],[-74.045304,41.220565],[-74.04465500000001,41.220454],[-74.04421000000001,41.220404],[-74.04313399999999,41.220342],[-74.042901,41.220319],[-74.042436,41.220235],[-74.04186300000001,41.220096],[-74.041589,41.220045],[-74.040757,41.219925],[-74.040274,41.2198],[-74.039939,41.219709],[-74.039473,41.219614],[-74.039006,41.219569],[-74.038828,41.219564],[-74.038456,41.219557],[-74.03819799999999,41.219571],[-74.038022,41.219601],[-74.03715,41.219804],[-74.03635300000001,41.219935],[-74.03595,41.219992],[-74.035237,41.220093],[-74.03518800000001,41.220101],[-74.034391,41.220204],[-74.033838,41.220265],[-74.033739,41.220274],[-74.033631,41.220282],[-74.033102,41.220288],[-74.032403,41.220281],[-74.032352,41.22028],[-74.032004,41.220267],[-74.030804,41.220203],[-74.03030200000001,41.220191],[-74.03004900000001,41.220185],[-74.030033,41.220185],[-74.029528,41.220216],[-74.02936800000001,41.220226],[-74.02871,41.22029],[-74.028542,41.220301],[-74.028425,41.220305],[-74.027964,41.220325],[-74.027411,41.220303],[-74.02715600000001,41.220277],[-74.02663699999999,41.220148],[-74.02660299999999,41.220143],[-74.02633,41.220064],[-74.025785,41.219902],[-74.02536000000001,41.219765],[-74.025293,41.219739],[-74.02519700000001,41.219704],[-74.02505600000001,41.219652],[-74.02489300000001,41.219592],[-74.02358099999999,41.219074],[-74.023309,41.218984],[-74.02330499999999,41.218931],[-74.02322700000001,41.217712],[-74.022829,41.217696],[-74.022735,41.217686],[-74.02261300000001,41.217661],[-74.022426,41.217596],[-74.0223,41.217527],[-74.022228,41.217471],[-74.022156,41.217361],[-74.022132,41.217283],[-74.022138,41.217053],[-74.022238,41.216552],[-74.022413,41.216283],[-74.022459,41.216143],[-74.02249999999999,41.215776],[-74.02252799999999,41.215666],[-74.02274300000001,41.215289],[-74.02275299999999,41.215256],[-74.022807,41.215075],[-74.02282700000001,41.214864],[-74.022862,41.21474],[-74.022909,41.214676],[-74.023388,41.214444],[-74.023449,41.214396],[-74.02350300000001,41.214314],[-74.023561,41.213892],[-74.023582,41.213805],[-74.02361999999999,41.213768],[-74.023717,41.213737],[-74.02380700000001,41.213731],[-74.023954,41.212744],[-74.024128,41.212847],[-74.024356,41.21302],[-74.024535,41.213191],[-74.025019,41.213706],[-74.025654,41.214446],[-74.02605699999999,41.214902],[-74.026145,41.215025],[-74.026173,41.215104],[-74.026302,41.215117],[-74.02643,41.215159],[-74.02691799999999,41.215386],[-74.02732399999999,41.215549],[-74.02766800000001,41.215665],[-74.028172,41.21576],[-74.028234,41.215195],[-74.028521,41.215151],[-74.028688,41.215109],[-74.028711,41.215075],[-74.028735,41.21475],[-74.028873,41.213734],[-74.029044,41.212646],[-74.02924400000001,41.211257],[-74.029411,41.210092],[-74.029546,41.20909],[-74.029537,41.209004],[-74.029495,41.208936],[-74.029438,41.208888],[-74.02933299999999,41.208835],[-74.02922100000001,41.208807],[-74.029162,41.208802],[-74.02923800000001,41.208245],[-74.028935,41.208191],[-74.02928,41.206066],[-74.029319,41.205829],[-74.029543,41.204462],[-74.029594,41.203686],[-74.03138,41.203134],[-74.034622,41.202258],[-74.035054,41.202184],[-74.03536200000001,41.20213],[-74.035568,41.202095],[-74.035962,41.202017],[-74.03640799999999,41.201898],[-74.03711199999999,41.201603],[-74.03724699999999,41.20153],[-74.037243,41.201475],[-74.037987,41.201643],[-74.038145,41.201679],[-74.03845200000001,41.201749],[-74.038751,41.20182],[-74.037397,41.205206],[-74.03851299999999,41.205884],[-74.043345,41.208821],[-74.043914,41.209167],[-74.045337,41.210039],[-74.047005,41.211062],[-74.047028,41.21111],[-74.047484,41.211371],[-74.048042,41.211691],[-74.051467,41.213569],[-74.05157199999999,41.212896],[-74.05158900000001,41.212784],[-74.051642,41.212563],[-74.05193300000001,41.211667],[-74.052105,41.211139],[-74.052184,41.210898],[-74.052249,41.210694],[-74.052305,41.210514],[-74.05232599999999,41.210449],[-74.052363,41.210342],[-74.052497,41.209961],[-74.05254100000001,41.209836],[-74.05258600000001,41.209686],[-74.05264200000001,41.209503],[-74.052787,41.209027],[-74.053101,41.208568],[-74.053161,41.208438],[-74.05319299999999,41.208316],[-74.053201,41.208224],[-74.053167,41.207813],[-74.05315899999999,41.207707],[-74.05318,41.207486],[-74.053431,41.206846],[-74.053675,41.206396],[-74.053837,41.206118],[-74.053904,41.205958],[-74.054042,41.205407],[-74.05407200000001,41.205334],[-74.054315,41.204862],[-74.054396,41.204716],[-74.05464600000001,41.20433],[-74.05497699999999,41.203803],[-74.05576000000001,41.202172],[-74.055864,41.201985],[-74.056207,41.201255],[-74.05640200000001,41.200805],[-74.056533,41.200286],[-74.056625,41.200109],[-74.056791,41.199865],[-74.057247,41.199307],[-74.05748199999999,41.199037],[-74.057604,41.1989],[-74.058133,41.19825],[-74.058758,41.197442],[-74.05906299999999,41.197043],[-74.059178,41.196829],[-74.059304,41.196498],[-74.05945,41.19592],[-74.05959799999999,41.195228],[-74.05968900000001,41.194887],[-74.05994800000001,41.194101],[-74.06047100000001,41.192451],[-74.06063399999999,41.191899],[-74.06110700000001,41.190501],[-74.061246,41.190127],[-74.061656,41.189024],[-74.061797,41.188689],[-74.061858,41.188558],[-74.061938,41.188385],[-74.06205,41.188214],[-74.06210400000001,41.188157],[-74.062398,41.187947],[-74.062782,41.187723],[-74.062843,41.187685],[-74.064785,41.187827],[-74.065327,41.187866],[-74.065545,41.187881],[-74.066321,41.187935],[-74.066771,41.188447],[-74.067678,41.188488],[-74.06861600000001,41.188532],[-74.071269,41.188655],[-74.072428,41.188724],[-74.09809,41.190745],[-74.10469999999999,41.191264],[-74.104764,41.191272],[-74.10802200000001,41.191525],[-74.114622,41.192039],[-74.11904,41.192384],[-74.121545,41.192557],[-74.124421,41.192757],[-74.12567199999999,41.192903],[-74.136101,41.19372],[-74.136979,41.193786],[-74.137373,41.193903],[-74.139385,41.193985],[-74.161789,41.195794],[-74.15100099999999,41.203462]]],"type":"Polygon"}
}