{
  "id": "360470230002",
  "type": "Feature",
  "properties": {
    "area_land":37731,
    "area_water":0,
    "geoid":"360470230002",
    "name":"Block Group 2",
    "state":"ny"
},
  "bbox": [
    -73.985836,
    40.636285,
    -73.982466,
    40.638735
],
  "geometry": {"coordinates":[[[-73.985252,40.638175],[-73.984672,40.638735],[-73.982466,40.637406],[-73.983052,40.636846],[-73.983634,40.636285],[-73.98583600000001,40.637616],[-73.985252,40.638175]]],"type":"Polygon"}
}