{
  "id": "360639900000",
  "type": "Feature",
  "properties": {
    "area_land":0,
    "area_water":1550634322,
    "geoid":"360639900000",
    "name":"Block Group 0",
    "state":"ny"
},
  "bbox": [
    -79.200936,
    43.270168,
    -78.46432,
    43.634799
],
  "geometry": {"coordinates":[[[-79.173811,43.460402],[-79.172346,43.460929],[-79.157905,43.466251],[-79.12477,43.478464],[-79.06371900000001,43.50002],[-78.998166,43.5225],[-78.874247,43.565946],[-78.775043,43.600457],[-78.754516,43.607597],[-78.74976100000001,43.609258],[-78.711567,43.625413],[-78.70643,43.627527],[-78.704909,43.628157],[-78.701731,43.629441],[-78.69929,43.630404],[-78.69592799999999,43.631724],[-78.69454399999999,43.632265],[-78.694213,43.632401],[-78.69365000000001,43.632632],[-78.688295,43.634742],[-78.685264,43.634738],[-78.685215,43.634738],[-78.648357,43.634775],[-78.624745,43.634799],[-78.508467,43.633604],[-78.499752,43.633519],[-78.468711,43.633428],[-78.467832,43.606753],[-78.465198,43.526729],[-78.46432,43.500055],[-78.46448599999999,43.474716],[-78.46456499999999,43.462756],[-78.464994,43.421069],[-78.465222,43.398704],[-78.46530199999999,43.390967],[-78.465598,43.375056],[-78.465541,43.37337],[-78.470534,43.372987],[-78.475207,43.373626],[-78.480749,43.375977],[-78.48564399999999,43.377285],[-78.503973,43.37548],[-78.536422,43.372609],[-78.537813,43.372486],[-78.57019699999999,43.368401],[-78.604235,43.362798],[-78.624751,43.360708],[-78.62521099999999,43.36057],[-78.625544,43.36047],[-78.627752,43.360011],[-78.631753,43.359186],[-78.63244,43.359046],[-78.634854,43.358556],[-78.639123,43.357787],[-78.651933,43.355484],[-78.656203,43.354716],[-78.664857,43.353159],[-78.69082299999999,43.348489],[-78.699478,43.346933],[-78.703332,43.346239],[-78.714894,43.34416],[-78.718749,43.343467],[-78.72461699999999,43.342411],[-78.742222,43.339245],[-78.748091,43.33819],[-78.748574,43.338103],[-78.74934399999999,43.337963],[-78.75310399999999,43.337282],[-78.754358,43.337055],[-78.767578,43.334194],[-78.807239,43.325615],[-78.82046,43.322755],[-78.826021,43.322097],[-78.835661,43.320955],[-78.83879399999999,43.320145],[-78.848197,43.317716],[-78.851331,43.316907],[-78.86123600000001,43.314348],[-78.871662,43.311655],[-78.88006300000001,43.309355],[-78.89088700000001,43.306426],[-78.900763,43.303755],[-78.911124,43.301373],[-78.94220799999999,43.294228],[-78.95256999999999,43.291847],[-78.953783,43.291568],[-78.957424,43.290731],[-78.958006,43.290598],[-78.958648,43.290509],[-78.967485,43.289282],[-78.993999,43.285603],[-78.999751,43.284806],[-79.00281099999999,43.284217],[-79.005668,43.283667],[-79.01424,43.282019],[-79.017098,43.28147],[-79.02884899999999,43.279209],[-79.064103,43.272428],[-79.075855,43.270168],[-79.085622,43.284227],[-79.10530199999999,43.312555],[-79.114442,43.325649],[-79.11495600000001,43.326385],[-79.124757,43.340422],[-79.14877199999999,43.375055],[-79.200936,43.450422],[-79.173811,43.460402]]],"type":"Polygon"}
}