{
  "id": "360670140003",
  "type": "Feature",
  "properties": {
    "area_land":1303554,
    "area_water":0,
    "geoid":"360670140003",
    "name":"Block Group 3",
    "state":"ny"
},
  "bbox": [
    -76.163826,
    43.091882,
    -76.145235,
    43.112165
],
  "geometry": {"coordinates":[[[-76.16371700000001,43.093308],[-76.163607,43.093421],[-76.162313,43.094814],[-76.162263,43.09487],[-76.16180900000001,43.095368],[-76.160875,43.096289],[-76.160796,43.096367],[-76.159659,43.097458],[-76.158839,43.098278],[-76.156784,43.100258],[-76.155964,43.101068],[-76.1558,43.101229],[-76.15493600000001,43.102204],[-76.152805,43.104729],[-76.152308,43.105305],[-76.152028,43.105635],[-76.15167099999999,43.106054],[-76.15131700000001,43.106441],[-76.15077599999999,43.107029],[-76.149793,43.10802],[-76.14881699999999,43.108929],[-76.14807500000001,43.109642],[-76.147993,43.109718],[-76.14618400000001,43.111406],[-76.146156,43.111432],[-76.14589700000001,43.111674],[-76.14559800000001,43.111918],[-76.145235,43.112165],[-76.14528300000001,43.112051],[-76.14537300000001,43.111832],[-76.14545699999999,43.111627],[-76.14556,43.111371],[-76.145623,43.111196],[-76.14572699999999,43.110907],[-76.145993,43.110006],[-76.146049,43.109405],[-76.146056,43.109041],[-76.146056,43.108902],[-76.14599800000001,43.108044],[-76.145903,43.107087],[-76.14615499999999,43.106943],[-76.146101,43.106291],[-76.14606000000001,43.105694],[-76.145985,43.104745],[-76.14594200000001,43.104215],[-76.145805,43.102528],[-76.14570500000001,43.101335],[-76.145641,43.100544],[-76.145612,43.100272],[-76.1456,43.100155],[-76.145596,43.100122],[-76.145566,43.099658],[-76.146297,43.099621],[-76.14739899999999,43.09956],[-76.147336,43.098899],[-76.147329,43.098826],[-76.147283,43.098632],[-76.149682,43.098508],[-76.153048,43.098348],[-76.152967,43.097413],[-76.15288,43.09642],[-76.156268,43.096274],[-76.156171,43.095161],[-76.156057,43.094099],[-76.15269499999999,43.094249],[-76.14934100000001,43.094408],[-76.147322,43.094512],[-76.147221,43.094507],[-76.147144,43.094492],[-76.14706,43.094462],[-76.146975,43.094428],[-76.147119,43.094153],[-76.147178,43.09404],[-76.14800200000001,43.092454],[-76.148146,43.092175],[-76.15461000000001,43.091888],[-76.15506999999999,43.091882],[-76.156142,43.091894],[-76.15665,43.091907],[-76.15732800000001,43.091945],[-76.157957,43.091993],[-76.158962,43.092101],[-76.160062,43.092262],[-76.1604,43.092318],[-76.161349,43.092505],[-76.16211,43.092684],[-76.162464,43.092772],[-76.163629,43.093124],[-76.163826,43.093184],[-76.16371700000001,43.093308]]],"type":"Polygon"}
}