{
  "id": "360290079021",
  "type": "Feature",
  "properties": {
    "area_land":533626,
    "area_water":0,
    "geoid":"360290079021",
    "name":"Block Group 1",
    "state":"ny"
},
  "bbox": [
    -78.836338,
    42.995491,
    -78.82236,
    43.004343
],
  "geometry": {"coordinates":[[[-78.836305,43.000895],[-78.836296,43.001167],[-78.836293,43.00126],[-78.836285,43.001356],[-78.835937,43.001415],[-78.835263,43.001534],[-78.834534,43.001679],[-78.83402700000001,43.001765],[-78.833347,43.001903],[-78.83284,43.002019],[-78.831501,43.002439],[-78.829503,43.003141],[-78.82863,43.003477],[-78.827913,43.00371],[-78.826487,43.004041],[-78.825912,43.004143],[-78.82493700000001,43.004272],[-78.824133,43.004342],[-78.82236,43.004343],[-78.822362,43.004069],[-78.822366,43.003763],[-78.822374,43.003459],[-78.82237499999999,43.003157],[-78.822377,43.002657],[-78.822378,43.002383],[-78.82238,43.002157],[-78.82238700000001,43.001525],[-78.822389,43.001374],[-78.822401,43.00037],[-78.822451,42.997517],[-78.82245399999999,42.997364],[-78.822456,42.997254],[-78.822479,42.995852],[-78.822485,42.995491],[-78.82376499999999,42.995501],[-78.825036,42.995509],[-78.82605100000001,42.99551],[-78.826308,42.995511],[-78.827556,42.995527],[-78.82751399999999,42.997554],[-78.82751500000001,42.997792],[-78.82753,42.997913],[-78.827556,42.998033],[-78.82759299999999,42.998152],[-78.827669,42.998326],[-78.827731,42.998438],[-78.827804,42.998547],[-78.82843099999999,42.999368],[-78.82852800000001,42.999527],[-78.82860100000001,42.999691],[-78.82865200000001,42.999861],[-78.82867899999999,43.000034],[-78.82868499999999,43.000357],[-78.82868499999999,43.001346],[-78.82871,43.001346],[-78.830676,43.001342],[-78.83076199999999,43.001341],[-78.833507,43.001324],[-78.83359799999999,43.001312],[-78.83367,43.001287],[-78.833732,43.001249],[-78.833781,43.001202],[-78.83399799999999,43.000832],[-78.834068,43.000725],[-78.83413400000001,43.000648],[-78.83421300000001,43.000578],[-78.834304,43.000516],[-78.834405,43.000464],[-78.834459,43.000442],[-78.83457300000001,43.000406],[-78.834723,43.000376],[-78.83487700000001,43.000366],[-78.835031,43.000373],[-78.836338,43.000413],[-78.836305,43.000895]]],"type":"Polygon"}
}