{
  "id": "360290087005",
  "type": "Feature",
  "properties": {
    "area_land":210244,
    "area_water":0,
    "geoid":"360290087005",
    "name":"Block Group 5",
    "state":"ny"
},
  "bbox": [
    -78.87874,
    42.960925,
    -78.869827,
    42.963621
],
  "geometry": {"coordinates":[[[-78.87873999999999,42.963569],[-78.87633599999999,42.963588],[-78.87628599999999,42.963589],[-78.87370300000001,42.963599],[-78.87026,42.963621],[-78.870136,42.96362],[-78.870125,42.963528],[-78.87006100000001,42.962986],[-78.870041,42.962822],[-78.869973,42.962248],[-78.869933,42.961906],[-78.869889,42.961536],[-78.869827,42.960977],[-78.87362400000001,42.960951],[-78.876332,42.96093],[-78.876372,42.960931],[-78.878728,42.960925],[-78.878726,42.961393],[-78.87872900000001,42.961871],[-78.87873,42.962092],[-78.87873500000001,42.962761],[-78.87873500000001,42.962782],[-78.87873999999999,42.963487],[-78.87873999999999,42.963569]]],"type":"Polygon"}
}