{
  "id": "360750211031",
  "type": "Feature",
  "properties": {
    "area_land":1167182,
    "area_water":1601564,
    "geoid":"360750211031",
    "name":"Block Group 1",
    "state":"ny"
},
  "bbox": [
    -76.445897,
    43.30101,
    -76.411946,
    43.316114
],
  "geometry": {"coordinates":[[[-76.445897,43.313591],[-76.443337,43.31362],[-76.440894,43.313655],[-76.43987,43.313663],[-76.439775,43.313605],[-76.43955699999999,43.312896],[-76.439511,43.312706],[-76.43953399999999,43.31286],[-76.439519,43.312903],[-76.439446,43.312928],[-76.439396,43.312951],[-76.439121,43.313126],[-76.43909499999999,43.313159],[-76.439059,43.313267],[-76.439027,43.313297],[-76.438979,43.313319],[-76.43891600000001,43.313334],[-76.438782,43.313386],[-76.438667,43.313464],[-76.43861099999999,43.313486],[-76.43851100000001,43.313509],[-76.43824600000001,43.313531],[-76.437566,43.313496],[-76.43713099999999,43.313489],[-76.436767,43.31358],[-76.43644399999999,43.313685],[-76.43621899999999,43.313739],[-76.43604999999999,43.313762],[-76.435941,43.313766],[-76.435817,43.313748],[-76.435671,43.313704],[-76.435412,43.313609],[-76.435256,43.313576],[-76.435106,43.313562],[-76.43468900000001,43.313555],[-76.43455400000001,43.31358],[-76.434433,43.31362],[-76.434344,43.313671],[-76.434286,43.313719],[-76.43419799999999,43.31377],[-76.434093,43.313799],[-76.433965,43.313813],[-76.433637,43.31381],[-76.43328700000001,43.313926],[-76.43317399999999,43.313981],[-76.433075,43.314017],[-76.43280900000001,43.314032],[-76.432445,43.314017],[-76.432118,43.314028],[-76.431994,43.314046],[-76.431819,43.314094],[-76.431721,43.314105],[-76.431466,43.314076],[-76.431145,43.314065],[-76.43108100000001,43.314069],[-76.430707,43.314094],[-76.430272,43.314145],[-76.430162,43.314141],[-76.429947,43.314083],[-76.429787,43.314061],[-76.42966300000001,43.314079],[-76.429557,43.314105],[-76.429265,43.314145],[-76.428977,43.314156],[-76.42853100000001,43.314159],[-76.428428,43.314174],[-76.428228,43.314272],[-76.428162,43.314269],[-76.42808599999999,43.314239],[-76.42803600000001,43.314343],[-76.427787,43.314235],[-76.427497,43.314135],[-76.427053,43.314019],[-76.426717,43.313956],[-76.42641500000001,43.313925],[-76.42623,43.313909],[-76.42587,43.3139],[-76.42571599999999,43.313905],[-76.425622,43.313908],[-76.42526599999999,43.313948],[-76.424795,43.314015],[-76.424646,43.314049],[-76.424284,43.314174],[-76.424233,43.31419],[-76.424182,43.314205],[-76.423697,43.314366],[-76.422989,43.314595],[-76.42183900000001,43.314972],[-76.420688,43.315349],[-76.419545,43.315722],[-76.418353,43.316114],[-76.417742,43.315269],[-76.416888,43.314158],[-76.416032,43.313044],[-76.415175,43.311929],[-76.414316,43.310816],[-76.413466,43.309701],[-76.413178,43.309338],[-76.41202,43.307823],[-76.411946,43.307738],[-76.412004,43.30764],[-76.412688,43.306725],[-76.413433,43.305752],[-76.413729,43.305413],[-76.41434099999999,43.304843],[-76.415195,43.304055],[-76.416268,43.303064],[-76.41661999999999,43.302737],[-76.416651,43.302706],[-76.416797,43.302554],[-76.417125,43.302135],[-76.41737999999999,43.301769],[-76.41755999999999,43.301515],[-76.417739,43.301255],[-76.424531,43.301086],[-76.426928,43.30101],[-76.42731000000001,43.306516],[-76.445643,43.306219],[-76.445897,43.313591]]],"type":"Polygon"}
}