{
  "id": "361031580072",
  "type": "Feature",
  "properties": {
    "area_land":1015500,
    "area_water":0,
    "geoid":"361031580072",
    "name":"Block Group 2",
    "state":"ny"
},
  "bbox": [
    -73.118597,
    40.903084,
    -73.100268,
    40.916499
],
  "geometry": {"coordinates":[[[-73.11859699999999,40.908916],[-73.118583,40.909386],[-73.11852500000001,40.909747],[-73.118386,40.910192],[-73.118212,40.910653],[-73.117997,40.911058],[-73.11714600000001,40.912328],[-73.116511,40.91328],[-73.116221,40.913782],[-73.11607600000001,40.914068],[-73.116023,40.914184],[-73.11578,40.914953],[-73.11560299999999,40.915716],[-73.11553000000001,40.916098],[-73.11552,40.916499],[-73.114818,40.915771],[-73.11374499999999,40.915266],[-73.113699,40.914755],[-73.113167,40.914136],[-73.113084,40.913472],[-73.112324,40.913291],[-73.111194,40.913032],[-73.111598,40.911956],[-73.11195600000001,40.911082],[-73.112087,40.910769],[-73.112171,40.910618],[-73.11227100000001,40.910495],[-73.112281,40.909791],[-73.111301,40.90951],[-73.110157,40.909458],[-73.110029,40.909144],[-73.109703,40.90891],[-73.109526,40.908769],[-73.109393,40.908662],[-73.108934,40.908459],[-73.10840399999999,40.908208],[-73.108002,40.908054],[-73.107625,40.908047],[-73.107382,40.907945],[-73.10721700000001,40.907516],[-73.107141,40.907318],[-73.107033,40.907103],[-73.106863,40.90679],[-73.10621500000001,40.906823],[-73.105266,40.90696],[-73.104159,40.907141],[-73.103527,40.907206],[-73.10315,40.907424],[-73.102991,40.907347],[-73.10288,40.907239],[-73.10243699999999,40.907392],[-73.10198699999999,40.907672],[-73.101258,40.908083],[-73.101185,40.907908],[-73.101099,40.907698],[-73.101083,40.90766],[-73.101034,40.90753],[-73.100993,40.907421],[-73.100902,40.907122],[-73.10087900000001,40.907046],[-73.100819,40.906867],[-73.100764,40.906737],[-73.100711,40.906554],[-73.100658,40.906367],[-73.10060799999999,40.906208],[-73.10049600000001,40.905853],[-73.100404,40.905433],[-73.100268,40.90486],[-73.100269,40.904708],[-73.100497,40.904613],[-73.10100799999999,40.904467],[-73.10133500000001,40.904393],[-73.101581,40.904338],[-73.102023,40.904243],[-73.10345100000001,40.904072],[-73.104381,40.904036],[-73.104747,40.904018],[-73.10486899999999,40.903945],[-73.105119,40.903931],[-73.10773,40.903785],[-73.10814999999999,40.903739],[-73.108479,40.903685],[-73.109534,40.903602],[-73.109702,40.903672],[-73.109803,40.903692],[-73.11001400000001,40.903723],[-73.11027199999999,40.903731],[-73.110573,40.903766],[-73.111102,40.903861],[-73.11144,40.903838],[-73.111806,40.903802],[-73.112481,40.903736],[-73.11307499999999,40.903583],[-73.113827,40.903291],[-73.114266,40.903172],[-73.11488799999999,40.90314],[-73.115899,40.903084],[-73.11635200000001,40.903889],[-73.11662,40.904379],[-73.116867,40.904854],[-73.11769099999999,40.906198],[-73.118174,40.907122],[-73.118379,40.907638],[-73.118506,40.908075],[-73.11854,40.908247],[-73.118593,40.908828],[-73.11859699999999,40.908916]]],"type":"Polygon"}
}