{
  "id": "360470916003",
  "type": "Feature",
  "properties": {
    "area_land":58679,
    "area_water":0,
    "geoid":"360470916003",
    "name":"Block Group 3",
    "state":"ny"
},
  "bbox": [
    -73.909066,
    40.656133,
    -73.906369,
    40.659619
],
  "geometry": {"coordinates":[[[-73.909066,40.659339],[-73.90813,40.659478],[-73.907191,40.659619],[-73.906795,40.658084],[-73.906369,40.656412],[-73.907307,40.656273],[-73.90824499999999,40.656133],[-73.908674,40.657803],[-73.909066,40.659339]]],"type":"Polygon"}
}