{
  "id": "360471174002",
  "type": "Feature",
  "properties": {
    "area_land":105950,
    "area_water":0,
    "geoid":"360471174002",
    "name":"Block Group 2",
    "state":"ny"
},
  "bbox": [
    -73.881645,
    40.679111,
    -73.877429,
    40.683693
],
  "geometry": {"coordinates":[[[-73.88164500000001,40.68327],[-73.880725,40.683409],[-73.87980899999999,40.683648],[-73.87963000000001,40.683693],[-73.879572,40.68346],[-73.879126,40.681675],[-73.87786699999999,40.682039],[-73.87764,40.681116],[-73.87742900000001,40.680017],[-73.878379,40.679742],[-73.878625,40.679678],[-73.879279,40.679487],[-73.87970900000001,40.67937],[-73.880162,40.679239],[-73.88060900000001,40.679111],[-73.88109900000001,40.681075],[-73.881168,40.681354],[-73.88164500000001,40.68327]]],"type":"Polygon"}
}