{
  "id": "360010019011",
  "type": "Feature",
  "properties": {
    "area_land":269101,
    "area_water":0,
    "geoid":"360010019011",
    "name":"Block Group 1",
    "state":"ny"
},
  "bbox": [
    -73.791389,
    42.644716,
    -73.784991,
    42.653109
],
  "geometry": {"coordinates":[[[-73.791389,42.646912],[-73.790035,42.648123],[-73.789801,42.648385],[-73.789721,42.648493],[-73.78968,42.64862],[-73.789331,42.648604],[-73.788738,42.648744],[-73.788618,42.648774],[-73.788584,42.649244],[-73.788438,42.650662],[-73.78820399999999,42.653109],[-73.787285,42.653074],[-73.787128,42.653064],[-73.78650399999999,42.653026],[-73.786089,42.653005],[-73.78499100000001,42.65295],[-73.785095,42.651741],[-73.78524899999999,42.650488],[-73.78525999999999,42.650377],[-73.785467,42.648406],[-73.785725,42.645774],[-73.78577199999999,42.645698],[-73.786665,42.64483],[-73.78678600000001,42.644716],[-73.787209,42.6449],[-73.787437,42.645008],[-73.78801,42.645306],[-73.788805,42.645702],[-73.789294,42.645938],[-73.78989199999999,42.646206],[-73.790662,42.646562],[-73.790982,42.6467],[-73.791389,42.646912]]],"type":"Polygon"}
}