{
  "id": "361090017003",
  "type": "Feature",
  "properties": {
    "area_land":37960835,
    "area_water":56843,
    "geoid":"361090017003",
    "name":"Block Group 3",
    "state":"ny"
},
  "bbox": [
    -76.688212,
    42.360632,
    -76.591713,
    42.421454
],
  "geometry": {"coordinates":[[[-76.68821199999999,42.419644],[-76.687955,42.419675],[-76.68780599999999,42.419686],[-76.687752,42.419682],[-76.687303,42.419698],[-76.687162,42.4197],[-76.68699700000001,42.419707],[-76.686881,42.419709],[-76.685393,42.419758],[-76.68464899999999,42.419787],[-76.68294299999999,42.419838],[-76.682565,42.419849],[-76.680481,42.41992],[-76.67981399999999,42.419948],[-76.67948,42.419957],[-76.678237,42.420007],[-76.67771500000001,42.420027],[-76.677392,42.420037],[-76.67418000000001,42.420156],[-76.67312,42.42019],[-76.67243999999999,42.420218],[-76.669054,42.420343],[-76.668843,42.420347],[-76.668633,42.420345],[-76.667778,42.420367],[-76.66735300000001,42.420382],[-76.667141,42.420385],[-76.66622599999999,42.420416],[-76.665982,42.420429],[-76.664811,42.420467],[-76.664664,42.420472],[-76.664238,42.420481],[-76.662927,42.420523],[-76.66055299999999,42.420598],[-76.659632,42.42062],[-76.658558,42.420651],[-76.658053,42.42067],[-76.657397,42.420688],[-76.65706900000001,42.420702],[-76.65676999999999,42.420711],[-76.655736,42.420744],[-76.655485,42.420747],[-76.653851,42.420794],[-76.653024,42.420824],[-76.652142,42.42085],[-76.65097900000001,42.420871],[-76.65075400000001,42.420879],[-76.65039400000001,42.420884],[-76.64846799999999,42.420943],[-76.647983,42.420968],[-76.647864,42.420973],[-76.647817,42.420975],[-76.647679,42.420973],[-76.64493400000001,42.421048],[-76.644901,42.421049],[-76.644842,42.421054],[-76.64460099999999,42.421062],[-76.644362,42.421065],[-76.642826,42.42111],[-76.642555,42.421114],[-76.639488,42.421203],[-76.638766,42.421227],[-76.63792599999999,42.421243],[-76.636482,42.421282],[-76.63618099999999,42.421286],[-76.633493,42.421378],[-76.63144699999999,42.421412],[-76.631092,42.421422],[-76.631004,42.421423],[-76.63073,42.421427],[-76.630375,42.421436],[-76.629659,42.421446],[-76.62945000000001,42.421454],[-76.629428,42.420984],[-76.629408,42.420563],[-76.629296,42.418646],[-76.629266,42.418372],[-76.629232,42.41817],[-76.629189,42.417972],[-76.629121,42.417757],[-76.62901599999999,42.417523],[-76.628956,42.41741],[-76.62889800000001,42.417305],[-76.628833,42.417188],[-76.628691,42.416975],[-76.628531,42.416767],[-76.628277,42.416466],[-76.628012,42.41613],[-76.62782199999999,42.415913],[-76.627717,42.415812],[-76.62741699999999,42.415561],[-76.627252,42.415446],[-76.62706900000001,42.415332],[-76.626833,42.415209],[-76.62677499999999,42.415179],[-76.626563,42.415083],[-76.626243,42.414961],[-76.626108,42.414918],[-76.62584,42.414855],[-76.625674,42.414812],[-76.62539200000001,42.414771],[-76.625142,42.414743],[-76.62467599999999,42.414711],[-76.6237,42.414687],[-76.62260499999999,42.414655],[-76.621404,42.414607],[-76.621178,42.414601],[-76.620726,42.41458],[-76.620369,42.414569],[-76.620048,42.414558],[-76.61941400000001,42.414527],[-76.61899200000001,42.414515],[-76.618487,42.414513],[-76.61833799999999,42.41452],[-76.618191,42.414522],[-76.618043,42.414533],[-76.617897,42.414539],[-76.61764599999999,42.414565],[-76.617397,42.4146],[-76.61715100000001,42.41464],[-76.617014,42.414669],[-76.616607,42.414769],[-76.616332,42.414823],[-76.61609799999999,42.414857],[-76.615622,42.414905],[-76.615168,42.414915],[-76.614943,42.414901],[-76.614756,42.414881],[-76.614571,42.414852],[-76.614389,42.414814],[-76.614073,42.414733],[-76.61309900000001,42.414458],[-76.612799,42.414364],[-76.61229400000001,42.414195],[-76.61163500000001,42.413966],[-76.611154,42.413783],[-76.611001,42.413718],[-76.610771,42.413604],[-76.61043600000001,42.413429],[-76.610006,42.413173],[-76.60985100000001,42.413072],[-76.609672,42.412935],[-76.609324,42.412656],[-76.608901,42.412361],[-76.60870799999999,42.412237],[-76.608158,42.411912],[-76.607366,42.411423],[-76.607266,42.411361],[-76.60667599999999,42.411009],[-76.606556,42.410944],[-76.60629299999999,42.410812],[-76.606036,42.410676],[-76.605884,42.410579],[-76.60566900000001,42.410434],[-76.605442,42.410261],[-76.60514000000001,42.410009],[-76.60485,42.409756],[-76.604573,42.409539],[-76.60437400000001,42.409398],[-76.604231,42.409306],[-76.60361,42.408959],[-76.603255,42.408774],[-76.603132,42.408718],[-76.60293,42.408635],[-76.602619,42.408518],[-76.602512,42.408483],[-76.60245,42.408466],[-76.60239,42.408449],[-76.601882,42.40833],[-76.601731,42.408287],[-76.60168299999999,42.408274],[-76.60145900000001,42.408196],[-76.601208,42.408119],[-76.601011,42.408049],[-76.600711,42.407963],[-76.60030999999999,42.407874],[-76.600106,42.407841],[-76.59996,42.40783],[-76.59965,42.407713],[-76.599132,42.407495],[-76.59908,42.407473],[-76.598871,42.407367],[-76.59859,42.407209],[-76.59850400000001,42.407152],[-76.598339,42.407015],[-76.598185,42.406855],[-76.59806,42.40669],[-76.59774,42.406203],[-76.597725,42.40618],[-76.597465,42.405771],[-76.59736700000001,42.405628],[-76.597055,42.4052],[-76.596901,42.405018],[-76.596818,42.404929],[-76.596683,42.4048],[-76.59646100000001,42.404614],[-76.596217,42.404433],[-76.596039,42.404314],[-76.59586,42.404204],[-76.595585,42.404045],[-76.595213,42.403798],[-76.59513200000001,42.40375],[-76.594886,42.403591],[-76.594393,42.403283],[-76.593975,42.403028],[-76.59346600000001,42.402711],[-76.593114,42.402517],[-76.592856,42.40239],[-76.592589,42.402272],[-76.592364,42.40219],[-76.592247,42.402156],[-76.59213,42.402117],[-76.591893,42.402052],[-76.591713,42.40201],[-76.591758,42.401964],[-76.591809,42.401928],[-76.59206,42.401834],[-76.59221599999999,42.40176],[-76.592286,42.401718],[-76.592347,42.401672],[-76.592401,42.401622],[-76.592445,42.401568],[-76.59251999999999,42.401445],[-76.592596,42.401277],[-76.592663,42.401069],[-76.59271200000001,42.400951],[-76.59275,42.400897],[-76.592803,42.400856],[-76.59286899999999,42.400823],[-76.59293599999999,42.400795],[-76.593007,42.400776],[-76.59308299999999,42.400766],[-76.593245,42.400759],[-76.59332499999999,42.400763],[-76.59358,42.400747],[-76.593813,42.400733],[-76.594223,42.400719],[-76.59471600000001,42.400712],[-76.595045,42.400703],[-76.595455,42.400702],[-76.596166,42.400682],[-76.599552,42.400586],[-76.599799,42.400573],[-76.60153800000001,42.400524],[-76.602316,42.400502],[-76.602638,42.400489],[-76.602958,42.400484],[-76.60359800000001,42.400462],[-76.603858,42.400458],[-76.603278,42.398962],[-76.603016,42.398318],[-76.602949,42.398192],[-76.602868,42.398068],[-76.60278700000001,42.39797],[-76.602712,42.397894],[-76.602507,42.397712],[-76.601947,42.397243],[-76.60162699999999,42.396959],[-76.601299,42.396685],[-76.60084500000001,42.396331],[-76.60026999999999,42.395853],[-76.599688,42.395343],[-76.599047,42.394757],[-76.59875700000001,42.394509],[-76.598426,42.394248],[-76.598203,42.394094],[-76.59809199999999,42.394028],[-76.597984,42.393957],[-76.597891,42.393882],[-76.597808,42.393798],[-76.597734,42.393713],[-76.597705,42.393668],[-76.597672,42.393601],[-76.59763599999999,42.393498],[-76.59747400000001,42.393221],[-76.597435,42.39313],[-76.597418,42.393091],[-76.597398,42.393002],[-76.59739399999999,42.392907],[-76.59741699999999,42.392218],[-76.597369,42.392219],[-76.597302,42.392206],[-76.59724199999999,42.392189],[-76.59718100000001,42.392158],[-76.597117,42.392119],[-76.596994,42.392012],[-76.596959,42.391977],[-76.596654,42.391625],[-76.59652800000001,42.391501],[-76.596478,42.391461],[-76.596407,42.391422],[-76.59632999999999,42.391387],[-76.596197,42.391339],[-76.59609399999999,42.391313],[-76.595986,42.391297],[-76.595933,42.391284],[-76.595705,42.391242],[-76.595403,42.391192],[-76.595186,42.391164],[-76.594939,42.3911],[-76.594785,42.391039],[-76.59467600000001,42.390973],[-76.59461899999999,42.390929],[-76.594573,42.39088],[-76.594549,42.39084],[-76.594527,42.39075],[-76.594508,42.390529],[-76.594525,42.389957],[-76.59452400000001,42.388808],[-76.59452400000001,42.387981],[-76.59449499999999,42.386738],[-76.59448,42.386675],[-76.59445599999999,42.386613],[-76.594425,42.386555],[-76.59434,42.386511],[-76.594469,42.386441],[-76.594568,42.386382],[-76.595096,42.386018],[-76.59565499999999,42.38565],[-76.596467,42.385081],[-76.596555,42.385012],[-76.59683,42.384819],[-76.59692800000001,42.384759],[-76.59702900000001,42.384708],[-76.59713499999999,42.384662],[-76.597673,42.384452],[-76.598001,42.384312],[-76.598275,42.3842],[-76.598646,42.38406],[-76.59886400000001,42.383989],[-76.599419,42.383846],[-76.59968000000001,42.383771],[-76.601677,42.383243],[-76.60213299999999,42.383128],[-76.60257,42.383009],[-76.60308999999999,42.382867],[-76.60357500000001,42.382739],[-76.604281,42.38254],[-76.60451500000001,42.382478],[-76.604978,42.382346],[-76.606326,42.381998],[-76.60669900000001,42.381894],[-76.60699200000001,42.381804],[-76.60714900000001,42.381752],[-76.607299,42.38171],[-76.60752599999999,42.381653],[-76.60778000000001,42.381604],[-76.607949,42.381588],[-76.608118,42.381581],[-76.60839900000001,42.381605],[-76.608439,42.381608],[-76.608518,42.381423],[-76.608604,42.381304],[-76.608664,42.381249],[-76.60891700000001,42.381061],[-76.609369,42.380695],[-76.609814,42.380297],[-76.610263,42.379858],[-76.611493,42.378589],[-76.612452,42.377617],[-76.612469,42.3776],[-76.61396999999999,42.376084],[-76.615067,42.374977],[-76.61512500000001,42.374881],[-76.616175,42.373867],[-76.616552,42.373488],[-76.616975,42.373045],[-76.617114,42.372913],[-76.61720200000001,42.372831],[-76.61736399999999,42.372693],[-76.61761799999999,42.3725],[-76.6178,42.372376],[-76.617994,42.372265],[-76.618651,42.371905],[-76.618898,42.371784],[-76.618988,42.371747],[-76.619102,42.371701],[-76.619339,42.371616],[-76.619501,42.371564],[-76.619831,42.371474],[-76.620339,42.371359],[-76.62088799999999,42.371225],[-76.62107899999999,42.371182],[-76.62256499999999,42.370823],[-76.622804,42.37077],[-76.622919,42.370764],[-76.622975,42.370768],[-76.622983,42.370673],[-76.62302800000001,42.370474],[-76.623105,42.370248],[-76.623302,42.369601],[-76.623367,42.369321],[-76.623513,42.368284],[-76.623651,42.367255],[-76.62373700000001,42.366479],[-76.623846,42.365577],[-76.624033,42.363805],[-76.62412500000001,42.363079],[-76.624188,42.362695],[-76.624296,42.362117],[-76.624554,42.360636],[-76.624668,42.360635],[-76.624878,42.360632],[-76.625148,42.360637],[-76.62527900000001,42.360635],[-76.626554,42.360653],[-76.626863,42.360653],[-76.627144,42.360658],[-76.627291,42.360656],[-76.627886,42.360666],[-76.62803599999999,42.360673],[-76.62833000000001,42.360677],[-76.628531,42.360684],[-76.628632,42.360682],[-76.628832,42.360688],[-76.629428,42.360693],[-76.63007399999999,42.360693],[-76.631241,42.360708],[-76.631379,42.360706],[-76.631963,42.360716],[-76.63242099999999,42.360718],[-76.632633,42.360729],[-76.63275400000001,42.360727],[-76.632869,42.360734],[-76.632981,42.360769],[-76.633038,42.360795],[-76.633083,42.360826],[-76.633109,42.360866],[-76.633126,42.360906],[-76.633138,42.360951],[-76.63314699999999,42.361041],[-76.63314099999999,42.361127],[-76.633143,42.361217],[-76.63315900000001,42.361311],[-76.633177,42.36136],[-76.633214,42.361409],[-76.633264,42.361458],[-76.633323,42.361498],[-76.633375,42.36152],[-76.633436,42.361537],[-76.63350199999999,42.361549],[-76.633886,42.361598],[-76.634073,42.361609],[-76.63482,42.361625],[-76.635195,42.361642],[-76.63625500000001,42.361677],[-76.637114,42.361687],[-76.63924299999999,42.361643],[-76.64165300000001,42.361626],[-76.642178,42.361641],[-76.643094,42.361651],[-76.643432,42.361651],[-76.643539,42.361663],[-76.643641,42.361661],[-76.643715,42.361638],[-76.64376,42.361614],[-76.643837,42.361645],[-76.643916,42.361657],[-76.645138,42.361671],[-76.645212,42.361675],[-76.64544100000001,42.361671],[-76.645668,42.361673],[-76.64692700000001,42.361654],[-76.647176,42.361642],[-76.647424,42.361638],[-76.647611,42.361645],[-76.64767500000001,42.361644],[-76.647786,42.361665],[-76.64789,42.361659],[-76.64789,42.361708],[-76.647897,42.361762],[-76.64791099999999,42.361816],[-76.647964,42.361937],[-76.648039,42.362179],[-76.648132,42.362412],[-76.64832699999999,42.362936],[-76.64863200000001,42.363809],[-76.648704,42.364069],[-76.648736,42.364231],[-76.64875000000001,42.364348],[-76.648754,42.365158],[-76.648782,42.366054],[-76.648776,42.367887],[-76.648764,42.368189],[-76.648769,42.368342],[-76.648791,42.36853],[-76.648824,42.36862],[-76.648871,42.368687],[-76.649041,42.368856],[-76.649233,42.369024],[-76.649418,42.36917],[-76.649698,42.369368],[-76.649907,42.36955],[-76.65010700000001,42.369741],[-76.650346,42.369958],[-76.65067500000001,42.370268],[-76.651804,42.371409],[-76.65218,42.371805],[-76.65289199999999,42.372569],[-76.653171,42.372876],[-76.653353,42.373085],[-76.653548,42.373298],[-76.654178,42.373244],[-76.65431599999999,42.373228],[-76.654594,42.373224],[-76.654735,42.373227],[-76.655441,42.373217],[-76.655654,42.373209],[-76.65608400000001,42.373203],[-76.656296,42.373195],[-76.656747,42.373193],[-76.65742299999999,42.373183],[-76.657472,42.373183],[-76.657951,42.37318],[-76.658102,42.373183],[-76.658254,42.37318],[-76.658405,42.373183],[-76.658557,42.373181],[-76.659992,42.373205],[-76.660842,42.373215],[-76.661489,42.373228],[-76.66163299999999,42.373235],[-76.661923,42.37324],[-76.66266299999999,42.373229],[-76.663162,42.373226],[-76.66368900000001,42.373228],[-76.66403,42.373223],[-76.664689,42.373204],[-76.665133,42.373198],[-76.665272,42.373191],[-76.66555,42.373196],[-76.665769,42.373211],[-76.66601799999999,42.373248],[-76.666335,42.37332],[-76.666487,42.373372],[-76.666634,42.373428],[-76.66673400000001,42.373472],[-76.666922,42.373568],[-76.66710399999999,42.373673],[-76.667337,42.373814],[-76.66761200000001,42.373999],[-76.66788,42.374194],[-76.668492,42.374617],[-76.668758,42.37478],[-76.6692,42.37503],[-76.669505,42.375187],[-76.6698,42.375323],[-76.66998100000001,42.375388],[-76.670148,42.375457],[-76.670557,42.375609],[-76.670703,42.375598],[-76.6708,42.375601],[-76.670896,42.375613],[-76.67125900000001,42.375698],[-76.671533,42.375757],[-76.671612,42.375769],[-76.67169199999999,42.375786],[-76.671852,42.375811],[-76.671933,42.375818],[-76.67225000000001,42.375823],[-76.672462,42.375811],[-76.672693,42.375785],[-76.67306499999999,42.375707],[-76.67345299999999,42.375603],[-76.67359500000001,42.375556],[-76.674521,42.375209],[-76.67475899999999,42.375111],[-76.67498000000001,42.375004],[-76.675083,42.374948],[-76.675382,42.374769],[-76.67582400000001,42.374465],[-76.675985,42.374337],[-76.67610000000001,42.374236],[-76.676208,42.374131],[-76.67650999999999,42.373793],[-76.677054,42.3732],[-76.677114,42.373212],[-76.677256,42.373224],[-76.677638,42.373245],[-76.678248,42.373263],[-76.67847999999999,42.37326],[-76.678594,42.373263],[-76.67907200000001,42.373256],[-76.679191,42.373249],[-76.67977,42.373241],[-76.67988,42.373235],[-76.680105,42.373232],[-76.680212,42.373225],[-76.680317,42.373224],[-76.680531,42.373212],[-76.680745,42.373208],[-76.68126100000001,42.373228],[-76.681421,42.373226],[-76.68147399999999,42.37322],[-76.681527,42.37322],[-76.68167200000001,42.373204],[-76.681764,42.373189],[-76.68191,42.373178],[-76.68207200000001,42.373189],[-76.682243,42.373209],[-76.682479,42.373251],[-76.682501,42.373255],[-76.682565,42.373263],[-76.682721,42.37327],[-76.682892,42.373263],[-76.683077,42.373237],[-76.683335,42.373193],[-76.68345600000001,42.373187],[-76.68357899999999,42.373194],[-76.683639,42.373193],[-76.683702,42.373197],[-76.68411500000001,42.373191],[-76.684301,42.373192],[-76.685057,42.37319],[-76.685177,42.373193],[-76.68529599999999,42.373191],[-76.68541500000001,42.373194],[-76.68564499999999,42.373191],[-76.685844,42.373193],[-76.68593799999999,42.373194],[-76.685726,42.375108],[-76.686206,42.383244],[-76.686521,42.38867],[-76.686537,42.388919],[-76.686556,42.389183],[-76.686562,42.389311],[-76.686576,42.389585],[-76.686578,42.389612],[-76.686622,42.390351],[-76.686785,42.393136],[-76.68732799999999,42.402433],[-76.687697,42.408745],[-76.68770000000001,42.408797],[-76.687822,42.412175],[-76.687831,42.412274],[-76.687845,42.412985],[-76.687929,42.414677],[-76.687946,42.414772],[-76.687968,42.414892],[-76.688,42.415064],[-76.68799799999999,42.41519],[-76.687983,42.415325],[-76.687988,42.415685],[-76.688056,42.416895],[-76.688141,42.418592],[-76.68821199999999,42.419644]]],"type":"Polygon"}
}