{
  "id": "360870121032",
  "type": "Feature",
  "properties": {
    "area_land":475009,
    "area_water":0,
    "geoid":"360870121032",
    "name":"Block Group 2",
    "state":"ny"
},
  "bbox": [
    -74.077253,
    41.113065,
    -74.067912,
    41.123016
],
  "geometry": {"coordinates":[[[-74.077253,41.118217],[-74.07719,41.119191],[-74.077133,41.120136],[-74.077112,41.120498],[-74.077112,41.120828],[-74.076279,41.120792],[-74.075947,41.120777],[-74.07598900000001,41.119933],[-74.075982,41.119711],[-74.075988,41.119634],[-74.075993,41.11956],[-74.076016,41.119223],[-74.07602900000001,41.119034],[-74.075795,41.11903],[-74.075154,41.119018],[-74.074746,41.119023],[-74.074279,41.119001],[-74.07359,41.118956],[-74.073419,41.118923],[-74.073004,41.1189],[-74.072322,41.118844],[-74.072293,41.119453],[-74.072278,41.119576],[-74.072204,41.119933],[-74.072063,41.120436],[-74.072048,41.120587],[-74.072078,41.121402],[-74.072078,41.121843],[-74.072068,41.122092],[-74.072048,41.122631],[-74.07199300000001,41.123016],[-74.07181199999999,41.123007],[-74.07035,41.122872],[-74.07028099999999,41.122867],[-74.06983099999999,41.122839],[-74.069008,41.122749],[-74.069126,41.122113],[-74.069183,41.121644],[-74.06850799999999,41.12163],[-74.06847500000001,41.12211],[-74.06793,41.122105],[-74.067915,41.121706],[-74.067915,41.121691],[-74.06791200000001,41.121576],[-74.06791699999999,41.121186],[-74.067992,41.119972],[-74.068033,41.119634],[-74.068124,41.119153],[-74.06813,41.11912],[-74.068196,41.118792],[-74.068338,41.118233],[-74.068383,41.118152],[-74.068595,41.117844],[-74.0689,41.117427],[-74.06897600000001,41.117299],[-74.06903699999999,41.117158],[-74.06906600000001,41.11694],[-74.06907,41.115809],[-74.06908,41.114435],[-74.069084,41.113859],[-74.06909,41.113065],[-74.06968999999999,41.113074],[-74.069883,41.113098],[-74.070142,41.113163],[-74.070235,41.113192],[-74.070346,41.113215],[-74.07089499999999,41.11327],[-74.071584,41.113307],[-74.07188600000001,41.113316],[-74.071933,41.113675],[-74.071961,41.113831],[-74.072107,41.114648],[-74.072113,41.114682],[-74.072118,41.114715],[-74.072176,41.115067],[-74.072208,41.115278],[-74.07222400000001,41.115385],[-74.072248,41.115533],[-74.07288699999999,41.115462],[-74.07307,41.115453],[-74.07331499999999,41.115442],[-74.07348,41.115461],[-74.073577,41.115486],[-74.073598,41.115491],[-74.07378799999999,41.115567],[-74.074179,41.115776],[-74.07441,41.115875],[-74.07508199999999,41.116118],[-74.075419,41.116219],[-74.075816,41.116302],[-74.076449,41.116424],[-74.07647299999999,41.116433],[-74.07665799999999,41.116511],[-74.076784,41.116586],[-74.076885,41.116667],[-74.077016,41.116807],[-74.077061,41.116883],[-74.077164,41.117172],[-74.077202,41.117335],[-74.077251,41.117669],[-74.077253,41.118217]]],"type":"Polygon"}
}