{
  "id": "360811187001",
  "type": "Feature",
  "properties": {
    "area_land":65147,
    "area_water":0,
    "geoid":"360811187001",
    "name":"Block Group 1",
    "state":"ny"
},
  "bbox": [
    -73.812268,
    40.75882,
    -73.808595,
    40.761417
],
  "geometry": {"coordinates":[[[-73.812268,40.76113],[-73.81104999999999,40.761417],[-73.81044300000001,40.761377],[-73.80951399999999,40.7613],[-73.808595,40.761132],[-73.80886700000001,40.759115],[-73.809799,40.759192],[-73.81120199999999,40.75882],[-73.81151800000001,40.759495],[-73.811864,40.760234],[-73.812268,40.76113]]],"type":"Polygon"}
}