{
  "id": "360930322004",
  "type": "Feature",
  "properties": {
    "area_land":1367582,
    "area_water":378715,
    "geoid":"360930322004",
    "name":"Block Group 4",
    "state":"ny"
},
  "bbox": [
    -73.961634,
    42.819807,
    -73.941882,
    42.835656
],
  "geometry": {"coordinates":[[[-73.96141299999999,42.825725],[-73.961174,42.826403],[-73.96080600000001,42.827361],[-73.96064,42.827801],[-73.960274,42.828572],[-73.96008999999999,42.829051],[-73.95962900000001,42.829891],[-73.959266,42.830681],[-73.958943,42.831316],[-73.958445,42.832176],[-73.95676899999999,42.83304],[-73.956598,42.833275],[-73.956003,42.834012],[-73.95597600000001,42.834045],[-73.955935,42.834096],[-73.955406,42.83429],[-73.954166,42.834777],[-73.95392699999999,42.834897],[-73.95377000000001,42.834976],[-73.952078,42.835656],[-73.95142,42.83529],[-73.95040400000001,42.834638],[-73.949315,42.833882],[-73.949055,42.833662],[-73.948984,42.833602],[-73.948666,42.833333],[-73.94783200000001,42.832481],[-73.947384,42.831954],[-73.94698699999999,42.831371],[-73.94683999999999,42.831127],[-73.94642899999999,42.830447],[-73.946335,42.83025],[-73.94485,42.827149],[-73.944806,42.827055],[-73.944782,42.827005],[-73.94305300000001,42.823464],[-73.94188200000001,42.822954],[-73.94376699999999,42.822178],[-73.948252,42.820152],[-73.948657,42.819969],[-73.948823,42.819886],[-73.94946,42.819807],[-73.94977400000001,42.819808],[-73.949803,42.819871],[-73.94984100000001,42.8199],[-73.94989099999999,42.819929],[-73.950007,42.819949],[-73.950109,42.819959],[-73.950199,42.81996],[-73.950608,42.820011],[-73.95134899999999,42.820178],[-73.952411,42.820395],[-73.953509,42.820632],[-73.95398299999999,42.820702],[-73.955096,42.820835],[-73.955634,42.820868],[-73.956108,42.820892],[-73.956621,42.820896],[-73.95719099999999,42.821381],[-73.95747799999999,42.821703],[-73.957944,42.822224],[-73.95849,42.822935],[-73.958996,42.823475],[-73.959388,42.823841],[-73.959773,42.82412],[-73.96036700000001,42.824471],[-73.960712,42.824675],[-73.961634,42.825152],[-73.96141299999999,42.825725]]],"type":"Polygon"}
}