{
  "id": "360810294006",
  "type": "Feature",
  "properties": {
    "area_land":297131,
    "area_water":0,
    "geoid":"360810294006",
    "name":"Block Group 6",
    "state":"ny"
},
  "bbox": [
    -73.78941,
    40.666841,
    -73.78062,
    40.67301
],
  "geometry": {"coordinates":[[[-73.789158,40.668338],[-73.788831,40.669823],[-73.788476,40.671327],[-73.788085,40.67301],[-73.786868,40.672824],[-73.78576700000001,40.672396],[-73.785578,40.672305],[-73.785212,40.672099],[-73.784994,40.671937],[-73.784733,40.671676],[-73.78465199999999,40.671567],[-73.783586,40.670495],[-73.783112,40.670022],[-73.7825,40.669421],[-73.781937,40.668868],[-73.781667,40.66861],[-73.781075,40.668029],[-73.78062,40.667526],[-73.781796,40.667421],[-73.78265399999999,40.667369],[-73.7833,40.667315],[-73.785025,40.66723],[-73.785664,40.667188],[-73.78697,40.667085],[-73.78941,40.666841],[-73.789158,40.668338]]],"type":"Polygon"}
}