{
  "id": "360594123021",
  "type": "Feature",
  "properties": {
    "area_land":258917,
    "area_water":0,
    "geoid":"360594123021",
    "name":"Block Group 1",
    "state":"ny"
},
  "bbox": [
    -73.63471,
    40.653228,
    -73.622758,
    40.657669
],
  "geometry": {"coordinates":[[[-73.634468,40.65436],[-73.634384,40.654566],[-73.63433000000001,40.654711],[-73.63423899999999,40.654834],[-73.63383899999999,40.655262],[-73.63323,40.655907],[-73.632688,40.656493],[-73.632637,40.656547],[-73.63211800000001,40.657107],[-73.631984,40.657252],[-73.631636,40.657669],[-73.630619,40.657624],[-73.627635,40.657538],[-73.62519,40.657518],[-73.624983,40.657508],[-73.624464,40.657483],[-73.623918,40.657472],[-73.62307300000001,40.657442],[-73.622758,40.657434],[-73.62371400000001,40.656968],[-73.624172,40.656745],[-73.624898,40.656391],[-73.625857,40.655924],[-73.626366,40.655668],[-73.626441,40.65561],[-73.626453,40.655521],[-73.626768,40.655538],[-73.626813,40.655217],[-73.62728,40.65519],[-73.627391,40.655156],[-73.627509,40.655096],[-73.62846399999999,40.65462],[-73.629413,40.654164],[-73.629966,40.653899],[-73.63024799999999,40.653791],[-73.63153200000001,40.653228],[-73.63160000000001,40.653242],[-73.633518,40.653655],[-73.63471,40.65387],[-73.634468,40.65436]]],"type":"Polygon"}
}