{
  "id": "360595187003",
  "type": "Feature",
  "properties": {
    "area_land":1705987,
    "area_water":0,
    "geoid":"360595187003",
    "name":"Block Group 3",
    "state":"ny"
},
  "bbox": [
    -73.528323,
    40.794944,
    -73.502694,
    40.810105
],
  "geometry": {"coordinates":[[[-73.528323,40.802807],[-73.527556,40.803256],[-73.52751600000001,40.803287],[-73.527118,40.803486],[-73.52621600000001,40.803891],[-73.524737,40.80454],[-73.52347899999999,40.805059],[-73.52309099999999,40.805227],[-73.52228599999999,40.805577],[-73.521883,40.805753],[-73.521584,40.805889],[-73.52123,40.806082],[-73.520561,40.806493],[-73.51979900000001,40.807004],[-73.519465,40.80724],[-73.519323,40.807322],[-73.51860600000001,40.807781],[-73.51822300000001,40.808047],[-73.517888,40.808224],[-73.517455,40.808585],[-73.5167,40.808841],[-73.515854,40.80912],[-73.51580199999999,40.809137],[-73.51418099999999,40.809564],[-73.514127,40.809476],[-73.512773,40.809724],[-73.512708,40.809734],[-73.511791,40.809875],[-73.51160900000001,40.809903],[-73.510521,40.810042],[-73.510418,40.810056],[-73.509568,40.810105],[-73.509456,40.809097],[-73.510425,40.809071],[-73.511133,40.809066],[-73.5111,40.808327],[-73.51105200000001,40.807319],[-73.511048,40.806836],[-73.511066,40.806408],[-73.511121,40.805815],[-73.511219,40.805168],[-73.511258,40.804828],[-73.511279,40.804444],[-73.51127099999999,40.804312],[-73.51124799999999,40.804265],[-73.511197,40.804246],[-73.510896,40.804216],[-73.510863,40.803577],[-73.510856,40.803426],[-73.510875,40.803361],[-73.510941,40.803284],[-73.511028,40.803235],[-73.511169,40.803181],[-73.51122700000001,40.803145],[-73.511274,40.803093],[-73.511304,40.803041],[-73.51132200000001,40.802964],[-73.511343,40.802171],[-73.511329,40.802105],[-73.51129299999999,40.802028],[-73.51119300000001,40.801932],[-73.511095,40.801879],[-73.510991,40.80184],[-73.51056,40.801704],[-73.510025,40.801526],[-73.50991,40.801496],[-73.509838,40.80149],[-73.508826,40.801562],[-73.508681,40.801562],[-73.50844499999999,40.801527],[-73.508319,40.801678],[-73.508247,40.801746],[-73.507768,40.802083],[-73.507183,40.802488],[-73.50702699999999,40.802565],[-73.506839,40.802632],[-73.506889,40.802914],[-73.50691,40.803074],[-73.506907,40.803259],[-73.506803,40.803634],[-73.506738,40.803735],[-73.506713,40.80376],[-73.506641,40.803832],[-73.50655399999999,40.803908],[-73.506342,40.804023],[-73.506247,40.804051],[-73.50622199999999,40.804059],[-73.506017,40.804101],[-73.505824,40.804146],[-73.505621,40.80422],[-73.505182,40.803847],[-73.505139,40.803797],[-73.505104,40.803737],[-73.504864,40.803075],[-73.50453400000001,40.802175],[-73.504492,40.80201],[-73.504496,40.801944],[-73.50452900000001,40.801846],[-73.50459499999999,40.801758],[-73.50473,40.80163],[-73.503806,40.800934],[-73.503677,40.800868],[-73.503558,40.800826],[-73.50322,40.800775],[-73.503289,40.800051],[-73.503327,40.799784],[-73.503005,40.79977],[-73.50291199999999,40.799767],[-73.50269400000001,40.799758],[-73.502698,40.799676],[-73.502695,40.799638],[-73.50287299999999,40.798177],[-73.50293000000001,40.797724],[-73.502945,40.797607],[-73.503947,40.797339],[-73.505375,40.796904],[-73.50740500000001,40.796333],[-73.50878899999999,40.795912],[-73.50916100000001,40.795786],[-73.510412,40.795302],[-73.510919,40.795108],[-73.511375,40.794944],[-73.51147,40.795083],[-73.511543,40.795166],[-73.51163699999999,40.795273],[-73.51186199999999,40.795426],[-73.512006,40.795517],[-73.513206,40.796281],[-73.51494599999999,40.797348],[-73.51503200000001,40.797404],[-73.515277,40.797563],[-73.51559399999999,40.797743],[-73.515941,40.797916],[-73.516184,40.798036],[-73.516544,40.798189],[-73.51714,40.798416],[-73.517714,40.798626],[-73.518511,40.798924],[-73.520628,40.799726],[-73.52070399999999,40.799756],[-73.52083399999999,40.799799],[-73.522492,40.800387],[-73.52316399999999,40.800623],[-73.52430200000001,40.801025],[-73.52476900000001,40.801178],[-73.52600200000001,40.801583],[-73.52633899999999,40.801699],[-73.526831,40.801868],[-73.527075,40.801952],[-73.527542,40.802167],[-73.527734,40.802282],[-73.527947,40.802454],[-73.528013,40.802519],[-73.52810599999999,40.802609],[-73.528274,40.802753],[-73.528323,40.802807]]],"type":"Polygon"}
}