{
  "id": "360191001005",
  "type": "Feature",
  "properties": {
    "area_land":36300483,
    "area_water":16655263,
    "geoid":"360191001005",
    "name":"Block Group 5",
    "state":"ny"
},
  "bbox": [
    -73.450909,
    44.90824,
    -73.337907,
    44.992095
],
  "geometry": {"coordinates":[[[-73.448357,44.913435],[-73.44802,44.91417],[-73.44771299999999,44.914906],[-73.44741999999999,44.915647],[-73.447159,44.916386],[-73.446922,44.917106],[-73.446697,44.91784],[-73.44643499999999,44.918851],[-73.44632799999999,44.919296],[-73.446173,44.92004],[-73.44599700000001,44.921119],[-73.445858,44.922204],[-73.44578799999999,44.922978],[-73.44573,44.924102],[-73.44572599999999,44.924201],[-73.44572599999999,44.924305],[-73.445722,44.92507],[-73.445734,44.925786],[-73.445837,44.927258],[-73.446231,44.931086],[-73.446279,44.931539],[-73.446281,44.931555],[-73.44573800000001,44.93161],[-73.441962,44.93197],[-73.439644,44.932206],[-73.439145,44.932247],[-73.438328,44.932346],[-73.437387,44.932473],[-73.433375,44.932868],[-73.43111500000001,44.933099],[-73.43049000000001,44.933191],[-73.42990500000001,44.933315],[-73.429433,44.933441],[-73.42899800000001,44.933586],[-73.428338,44.933856],[-73.42778800000001,44.934131],[-73.42679800000001,44.934733],[-73.425876,44.935315],[-73.42227099999999,44.937547],[-73.42171,44.93786],[-73.421359,44.93804],[-73.420579,44.938405],[-73.418948,44.939155],[-73.41821899999999,44.93945],[-73.417481,44.939709],[-73.41309200000001,44.94102],[-73.411669,44.941472],[-73.41108,44.94165],[-73.40983799999999,44.942033],[-73.409721,44.942075],[-73.40901700000001,44.942355],[-73.40882999999999,44.94244],[-73.40861700000001,44.942538],[-73.408002,44.942837],[-73.408427,44.943481],[-73.410641,44.946954],[-73.41240500000001,44.949507],[-73.412509,44.949685],[-73.412621,44.949958],[-73.412683,44.950171],[-73.412735,44.950518],[-73.412722,44.951233],[-73.412735,44.951954],[-73.412716,44.953395],[-73.412722,44.954847],[-73.412712,44.956998],[-73.41273099999999,44.957738],[-73.412711,44.96062],[-73.41274300000001,44.961568],[-73.41280399999999,44.964894],[-73.41278800000001,44.966312],[-73.41281499999999,44.967755],[-73.412814,44.970605],[-73.412853,44.971251],[-73.412865,44.97134],[-73.41295700000001,44.971602],[-73.41314199999999,44.971966],[-73.413319,44.97221],[-73.413605,44.97251],[-73.413917,44.972778],[-73.414028,44.972854],[-73.414502,44.973102],[-73.415577,44.973626],[-73.41582,44.973773],[-73.41590100000001,44.973832],[-73.416113,44.973988],[-73.416298,44.974167],[-73.416417,44.974302],[-73.41665,44.974608],[-73.416732,44.974751],[-73.41680700000001,44.974924],[-73.416923,44.975305],[-73.41695300000001,44.975491],[-73.416965,44.975774],[-73.416871,44.976736],[-73.416494,44.980256],[-73.416276,44.982387],[-73.416225,44.98274],[-73.41608600000001,44.983835],[-73.415986,44.984211],[-73.41561400000001,44.985357],[-73.415498,44.985665],[-73.41368199999999,44.989109],[-73.413662,44.989146],[-73.413133,44.990145],[-73.413078,44.99025],[-73.412673,44.991015],[-73.412418,44.991448],[-73.41229800000001,44.991423],[-73.412154,44.991411],[-73.41183100000001,44.991409],[-73.40495,44.991587],[-73.40279,44.991662],[-73.40175499999999,44.991733],[-73.40104599999999,44.991804],[-73.400628,44.991833],[-73.399852,44.99186],[-73.397031,44.991915],[-73.395988,44.991926],[-73.394612,44.991952],[-73.393377,44.991965],[-73.391763,44.992006],[-73.390086,44.992034],[-73.388942,44.99204],[-73.38548,44.992095],[-73.385473,44.992055],[-73.385481,44.992037],[-73.386358,44.992036],[-73.38642,44.991999],[-73.386718,44.991536],[-73.38674899999999,44.991431],[-73.386752,44.99122],[-73.38683899999999,44.991158],[-73.387016,44.991115],[-73.387038,44.991102],[-73.387044,44.991074],[-73.386985,44.990904],[-73.386977,44.990839],[-73.386983,44.990758],[-73.38703599999999,44.990681],[-73.387101,44.990647],[-73.38724999999999,44.990609],[-73.38739,44.990606],[-73.387455,44.990619],[-73.387564,44.990619],[-73.387604,44.990606],[-73.387688,44.990532],[-73.387744,44.990392],[-73.38820200000001,44.98952],[-73.388513,44.988795],[-73.388599,44.988517],[-73.388583,44.988325],[-73.38855,44.988194],[-73.38855,44.988166],[-73.38855,44.988157],[-73.38857899999999,44.988092],[-73.38862899999999,44.98802],[-73.38878200000001,44.988058],[-73.388846,44.988058],[-73.388947,44.988033],[-73.389084,44.987961],[-73.389173,44.987897],[-73.38961999999999,44.987687],[-73.389697,44.987643],[-73.390007,44.987373],[-73.390084,44.987325],[-73.39033000000001,44.987071],[-73.39041,44.986942],[-73.390491,44.986753],[-73.39060600000001,44.98629],[-73.39063400000001,44.986225],[-73.39062199999999,44.986137],[-73.390602,44.986081],[-73.390529,44.985976],[-73.390469,44.985823],[-73.39046500000001,44.985734],[-73.39049300000001,44.985638],[-73.39052100000001,44.985598],[-73.39073500000001,44.985479],[-73.39079099999999,44.985403],[-73.390852,44.985161],[-73.391001,44.984416],[-73.391183,44.98372],[-73.391352,44.982965],[-73.391408,44.98251],[-73.389309,44.982541],[-73.388012,44.982574],[-73.386161,44.982619],[-73.384574,44.982641],[-73.381409,44.98266],[-73.380467,44.982651],[-73.379052,44.98259],[-73.378986,44.982586],[-73.378835,44.982578],[-73.37837399999999,44.982555],[-73.378056,44.982544],[-73.37756400000001,44.982541],[-73.37697,44.982558],[-73.376249,44.982614],[-73.375687,44.982668],[-73.375,44.982719],[-73.374593,44.982732],[-73.37451900000001,44.982734],[-73.37408499999999,44.982742],[-73.370693,44.982762],[-73.368579,44.982775],[-73.367863,44.982779],[-73.366472,44.982782],[-73.36403199999999,44.982799],[-73.362891,44.9828],[-73.362495,44.982783],[-73.357125,44.982907],[-73.353717,44.98296],[-73.352886,44.980644],[-73.35245,44.979921],[-73.350218,44.976222],[-73.349879,44.975814],[-73.347579,44.973038],[-73.34474,44.970468],[-73.34294199999999,44.969213],[-73.339709,44.966792],[-73.338735,44.965887],[-73.338244,44.964751],[-73.338098,44.96293],[-73.337907,44.960542],[-73.33902999999999,44.951338],[-73.339071,44.950765],[-73.339082,44.950611],[-73.33930100000001,44.947568],[-73.339603,44.943371],[-73.339229,44.934003],[-73.339192,44.933076],[-73.338483,44.924112],[-73.338492,44.923799],[-73.338622,44.919366],[-73.33897899999999,44.917681],[-73.339288,44.91691],[-73.348219,44.916008],[-73.35821199999999,44.915008],[-73.374544,44.913366],[-73.374742,44.913335],[-73.377178,44.913101],[-73.380307,44.91281],[-73.38171199999999,44.912665],[-73.389381,44.91187],[-73.39612200000001,44.911185],[-73.396255,44.911837],[-73.396671,44.913446],[-73.40161000000001,44.912942],[-73.40951800000001,44.912219],[-73.415784,44.911625],[-73.41668900000001,44.911532],[-73.41895700000001,44.911303],[-73.42008199999999,44.9112],[-73.426466,44.910591],[-73.42930800000001,44.910289],[-73.435272,44.909738],[-73.437567,44.909519],[-73.441315,44.909162],[-73.450909,44.90824],[-73.448357,44.913435]]],"type":"Polygon"}
}