{
  "id": "360594144001",
  "type": "Feature",
  "properties": {
    "area_land":239953,
    "area_water":0,
    "geoid":"360594144001",
    "name":"Block Group 1",
    "state":"ny"
},
  "bbox": [
    -73.576483,
    40.659114,
    -73.570635,
    40.665647
],
  "geometry": {"coordinates":[[[-73.576483,40.663341],[-73.57563,40.663829],[-73.575453,40.663937],[-73.57496399999999,40.664278],[-73.574849,40.664371],[-73.574715,40.664466],[-73.57466700000001,40.664489],[-73.574215,40.664782],[-73.57402999999999,40.664901],[-73.57377,40.665048],[-73.573471,40.665201],[-73.57270699999999,40.665571],[-73.572678,40.665579],[-73.57253900000001,40.665647],[-73.57244799999999,40.665318],[-73.572413,40.665213],[-73.57194200000001,40.664503],[-73.57138999999999,40.663705],[-73.570853,40.662933],[-73.57073800000001,40.662772],[-73.570635,40.662599],[-73.570635,40.662522],[-73.57072100000001,40.662051],[-73.570741,40.662003],[-73.57092,40.66099],[-73.571118,40.659883],[-73.571168,40.659873],[-73.571468,40.659808],[-73.573026,40.659517],[-73.573128,40.659487],[-73.575155,40.659114],[-73.575209,40.659681],[-73.575278,40.660371],[-73.57534800000001,40.661056],[-73.576246,40.661005],[-73.57637099999999,40.662235],[-73.576483,40.663341]]],"type":"Polygon"}
}