{
  "id": "360470021003",
  "type": "Feature",
  "properties": {
    "area_land":278624,
    "area_water":0,
    "geoid":"360470021003",
    "name":"Block Group 3",
    "state":"ny"
},
  "bbox": [
    -73.986786,
    40.700577,
    -73.979168,
    40.705907
],
  "geometry": {"coordinates":[[[-73.986784,40.70112],[-73.98674800000001,40.701526],[-73.98669,40.702423],[-73.986648,40.7031],[-73.986608,40.703757],[-73.98655599999999,40.704433],[-73.986563,40.704602],[-73.98653,40.704979],[-73.986429,40.705083],[-73.986434,40.705349],[-73.98585199999999,40.705415],[-73.984189,40.705582],[-73.983442,40.705645],[-73.98342599999999,40.705577],[-73.98339799999999,40.705467],[-73.983351,40.705451],[-73.983227,40.705482],[-73.98308,40.70548],[-73.98308,40.705519],[-73.98282500000001,40.705558],[-73.982741,40.705576],[-73.982748,40.705532],[-73.982572,40.705518],[-73.982455,40.705509],[-73.982449,40.705547],[-73.98232899999999,40.705552],[-73.98220999999999,40.70554],[-73.982033,40.705515],[-73.98185599999999,40.70549],[-73.980987,40.705374],[-73.980907,40.705907],[-73.980332,40.705846],[-73.979479,40.705825],[-73.97923299999999,40.705769],[-73.979372,40.705443],[-73.97917099999999,40.705301],[-73.979168,40.705279],[-73.979328,40.704746],[-73.979466,40.704462],[-73.979603,40.704177],[-73.97998800000001,40.703541],[-73.98022400000001,40.703063],[-73.980339,40.702659],[-73.980141,40.702386],[-73.98051100000001,40.702048],[-73.980649,40.701561],[-73.980729,40.701268],[-73.98285,40.701359],[-73.98476100000001,40.701439],[-73.984827,40.700577],[-73.985443,40.70059],[-73.985634,40.700595],[-73.98660099999999,40.700621],[-73.986786,40.701024],[-73.986784,40.70112]]],"type":"Polygon"}
}