{
  "id": "360550064003",
  "type": "Feature",
  "properties": {
    "area_land":226164,
    "area_water":0,
    "geoid":"360550064003",
    "name":"Block Group 3",
    "state":"ny"
},
  "bbox": [
    -77.632834,
    43.139814,
    -77.623043,
    43.143777
],
  "geometry": {"coordinates":[[[-77.632834,43.142328],[-77.632834,43.142804],[-77.63283199999999,43.143039],[-77.63283,43.143288],[-77.632834,43.143777],[-77.628981,43.143777],[-77.628981,43.143285],[-77.628973,43.142797],[-77.626063,43.142793],[-77.623053,43.142797],[-77.623045,43.141675],[-77.623043,43.140858],[-77.62343,43.140492],[-77.624182,43.139814],[-77.624225,43.139835],[-77.624281,43.139856],[-77.624341,43.139865],[-77.626036,43.139875],[-77.627348,43.139878],[-77.628951,43.139878],[-77.628958,43.14087],[-77.628958,43.141649],[-77.630599,43.141637],[-77.631804,43.141629],[-77.632834,43.141629],[-77.632834,43.142328]]],"type":"Polygon"}
}