{
  "id": "360470275003",
  "type": "Feature",
  "properties": {
    "area_land":40513,
    "area_water":0,
    "geoid":"360470275003",
    "name":"Block Group 3",
    "state":"ny"
},
  "bbox": [
    -73.941058,
    40.682833,
    -73.935155,
    40.684229
],
  "geometry": {"coordinates":[[[-73.941058,40.683567],[-73.93841500000001,40.683871],[-73.93822299999999,40.683894],[-73.93803699999999,40.683915],[-73.9353,40.684229],[-73.93515499999999,40.683497],[-73.93807700000001,40.683161],[-73.94091400000001,40.682833],[-73.941058,40.683567]]],"type":"Polygon"}
}