{
  "id": "360050072004",
  "type": "Feature",
  "properties": {
    "area_land":24219,
    "area_water":0,
    "geoid":"360050072004",
    "name":"Block Group 4",
    "state":"ny"
},
  "bbox": [
    -73.860886,
    40.830646,
    -73.857157,
    40.831822
],
  "geometry": {"coordinates":[[[-73.86088599999999,40.831344],[-73.85732299999999,40.831822],[-73.857157,40.831102],[-73.86057,40.830646],[-73.86088599999999,40.831344]]],"type":"Polygon"}
}