{
  "id": "361031584021",
  "type": "Feature",
  "properties": {
    "area_land":4719656,
    "area_water":0,
    "geoid":"361031584021",
    "name":"Block Group 1",
    "state":"ny"
},
  "bbox": [
    -72.906583,
    40.943208,
    -72.847594,
    40.958064
],
  "geometry": {"coordinates":[[[-72.906583,40.947383],[-72.906402,40.94762],[-72.906265,40.948029],[-72.90584800000001,40.948072],[-72.904943,40.948207],[-72.90426600000001,40.948301],[-72.903081,40.94854],[-72.902474,40.948701],[-72.90195799999999,40.948874],[-72.90110799999999,40.949112],[-72.900937,40.94915],[-72.900356,40.949318],[-72.899587,40.949524],[-72.89738199999999,40.950084],[-72.896275,40.950382],[-72.895931,40.950465],[-72.895177,40.950732],[-72.893468,40.951328],[-72.892629,40.951652],[-72.892239,40.95177],[-72.891919,40.951835],[-72.889966,40.952212],[-72.889668,40.952273],[-72.889454,40.952328],[-72.888158,40.952747],[-72.887837,40.952881],[-72.88768399999999,40.952956],[-72.887494,40.953071],[-72.88735699999999,40.95319],[-72.887264,40.95332],[-72.887196,40.953433],[-72.887013,40.953701],[-72.886899,40.953869],[-72.886807,40.954033],[-72.886678,40.954238],[-72.886296,40.95444],[-72.885907,40.954631],[-72.885273,40.954674],[-72.884519,40.954719],[-72.884083,40.954985],[-72.883426,40.955428],[-72.883038,40.955695],[-72.88242,40.956062],[-72.88203799999999,40.956077],[-72.881467,40.95607],[-72.880855,40.956052],[-72.880505,40.956042],[-72.87962,40.955776],[-72.87738400000001,40.955092],[-72.876569,40.954901],[-72.875713,40.955036],[-72.874593,40.955485],[-72.87422599999999,40.955722],[-72.87388199999999,40.955924],[-72.873546,40.95613],[-72.873127,40.956333],[-72.87238000000001,40.956507],[-72.872096,40.956562],[-72.87162499999999,40.956816],[-72.870594,40.957927],[-72.870327,40.958064],[-72.8698,40.957931],[-72.86935,40.957802],[-72.868572,40.957419],[-72.867574,40.956729],[-72.866665,40.956065],[-72.86527700000001,40.955848],[-72.864885,40.955628],[-72.86469700000001,40.955523],[-72.864316,40.955146],[-72.864011,40.954856],[-72.861294,40.953952],[-72.860799,40.953941],[-72.860073,40.953894],[-72.858684,40.953857],[-72.857342,40.953692],[-72.857021,40.953731],[-72.85629,40.954017],[-72.85555600000001,40.954311],[-72.854741,40.954482],[-72.853976,40.954498],[-72.853283,40.954521],[-72.85289400000001,40.954483],[-72.852261,40.954433],[-72.851887,40.95449],[-72.851551,40.954615],[-72.85122699999999,40.954763],[-72.85099599999999,40.954898],[-72.851018,40.954759],[-72.850976,40.954759],[-72.85073199999999,40.95475],[-72.85047400000001,40.954741],[-72.850433,40.95474],[-72.850408,40.954739],[-72.849418,40.954703],[-72.849402,40.954402],[-72.849082,40.952706],[-72.84907699999999,40.952689],[-72.849006,40.952429],[-72.84899,40.952371],[-72.848967,40.952283],[-72.848794,40.95165],[-72.84875099999999,40.951382],[-72.847606,40.944194],[-72.847594,40.944122],[-72.85065899999999,40.943992],[-72.854786,40.943863],[-72.860058,40.943653],[-72.861141,40.943615],[-72.86174200000001,40.943582],[-72.86192699999999,40.943573],[-72.86227,40.94355],[-72.863026,40.943435],[-72.86612100000001,40.94321],[-72.866753,40.943208],[-72.87178400000001,40.943809],[-72.87382100000001,40.944036],[-72.873913,40.944013],[-72.874279,40.944052],[-72.875484,40.944138],[-72.87634300000001,40.944226],[-72.877326,40.944342],[-72.878232,40.944448],[-72.878282,40.944455],[-72.87861599999999,40.944481],[-72.87981600000001,40.94465],[-72.880978,40.94498],[-72.882408,40.945162],[-72.882524,40.945147],[-72.882654,40.945161],[-72.885165,40.945455],[-72.888676,40.945717],[-72.89281099999999,40.946109],[-72.892889,40.946118],[-72.895561,40.946429],[-72.89766299999999,40.946719],[-72.898985,40.946861],[-72.899934,40.946974],[-72.900019,40.947028],[-72.900852,40.947138],[-72.902102,40.947267],[-72.90351099999999,40.947357],[-72.904769,40.947402],[-72.906527,40.947384],[-72.906583,40.947383]]],"type":"Polygon"}
}