{
  "id": "360259706004",
  "type": "Feature",
  "properties": {
    "area_land":83394623,
    "area_water":1130019,
    "geoid":"360259706004",
    "name":"Block Group 4",
    "state":"ny"
},
  "bbox": [
    -75.190163,
    42.068927,
    -74.999877,
    42.167461
],
  "geometry": {"coordinates":[[[-75.190112,42.101976],[-75.19006,42.102026],[-75.189359,42.102706],[-75.188177,42.103935],[-75.18816099999999,42.104035],[-75.18778,42.104517],[-75.187189,42.104842],[-75.186679,42.105273],[-75.18615,42.105719],[-75.18284300000001,42.107091],[-75.182074,42.10761],[-75.181381,42.108078],[-75.177014,42.110341],[-75.17564900000001,42.110606],[-75.175252,42.110716],[-75.174091,42.111039],[-75.17304799999999,42.111485],[-75.171544,42.11251],[-75.170776,42.113868],[-75.170213,42.115024],[-75.170157,42.115139],[-75.17013799999999,42.115157],[-75.169838,42.115923],[-75.169476,42.116239],[-75.169296,42.11669],[-75.16920500000001,42.11727],[-75.16913599999999,42.117466],[-75.169009,42.117731],[-75.168676,42.118764],[-75.168296,42.119835],[-75.168167,42.1202],[-75.168026,42.120598],[-75.167942,42.120836],[-75.167846,42.121108],[-75.16718400000001,42.122974],[-75.16580399999999,42.125088],[-75.165644,42.125362],[-75.164838,42.126541],[-75.164587,42.126907],[-75.164137,42.127241],[-75.16302399999999,42.128068],[-75.160844,42.128536],[-75.16006400000001,42.12851],[-75.159283,42.128485],[-75.159052,42.128483],[-75.15896100000001,42.128502],[-75.158044,42.128689],[-75.157582,42.128784],[-75.15699600000001,42.129563],[-75.156879,42.129718],[-75.156863,42.130747],[-75.156899,42.130943],[-75.15692199999999,42.131074],[-75.156946,42.131204],[-75.15687,42.131461],[-75.156874,42.133127],[-75.15705699999999,42.133757],[-75.157179,42.133892],[-75.157301,42.134252],[-75.15760400000001,42.134747],[-75.158029,42.135062],[-75.15821,42.135062],[-75.15924099999999,42.135826],[-75.15948299999999,42.136051],[-75.159544,42.136276],[-75.159666,42.136411],[-75.160332,42.136905],[-75.160696,42.137085],[-75.16081699999999,42.137084],[-75.16112,42.137309],[-75.161483,42.137444],[-75.161665,42.137444],[-75.162513,42.137803],[-75.162997,42.137802],[-75.163118,42.137892],[-75.16330000000001,42.137892],[-75.164632,42.138475],[-75.165358,42.138519],[-75.165904,42.138788],[-75.166267,42.138788],[-75.16663,42.138877],[-75.16753799999999,42.138876],[-75.16777999999999,42.139056],[-75.168204,42.1391],[-75.168628,42.139235],[-75.16893,42.139234],[-75.169415,42.139414],[-75.170323,42.139502],[-75.170686,42.139592],[-75.17122999999999,42.139591],[-75.171352,42.139681],[-75.17147300000001,42.139681],[-75.172139,42.13995],[-75.172321,42.13995],[-75.172866,42.140264],[-75.17335,42.140444],[-75.174139,42.141028],[-75.1742,42.141163],[-75.174503,42.141387],[-75.17462399999999,42.141567],[-75.174688,42.142783],[-75.17480999999999,42.143098],[-75.174931,42.143188],[-75.175054,42.143683],[-75.175236,42.143998],[-75.175481,42.144944],[-75.175663,42.145078],[-75.175667,42.146609],[-75.175546,42.146835],[-75.175488,42.147645],[-75.175489,42.147871],[-75.17527800000001,42.148074],[-75.175005,42.148096],[-75.17470299999999,42.148232],[-75.174522,42.148232],[-75.17428,42.148323],[-75.17349299999999,42.148414],[-75.172889,42.148685],[-75.172465,42.148731],[-75.17230499999999,42.14885],[-75.172224,42.148911],[-75.171679,42.148957],[-75.171317,42.149093],[-75.17113500000001,42.149093],[-75.17071199999999,42.149274],[-75.170288,42.149274],[-75.169865,42.14941],[-75.16901799999999,42.149547],[-75.168353,42.149818],[-75.16786999999999,42.150089],[-75.16714399999999,42.15036],[-75.166237,42.150406],[-75.165874,42.150587],[-75.165511,42.150632],[-75.164967,42.150858],[-75.164272,42.151287],[-75.164182,42.151265],[-75.163577,42.151491],[-75.16297299999999,42.151807],[-75.16261,42.152078],[-75.162429,42.152393],[-75.16243,42.152528],[-75.162423,42.152634],[-75.162316,42.152731],[-75.161866,42.153281],[-75.161078,42.153572],[-75.160898,42.153617],[-75.160847,42.15363],[-75.16064299999999,42.153637],[-75.160138,42.153653],[-75.15974900000001,42.153665],[-75.159668,42.153668],[-75.15956300000001,42.153671],[-75.15906099999999,42.153687],[-75.158338,42.153663],[-75.158153,42.153654],[-75.15797000000001,42.153656],[-75.15792999999999,42.153659],[-75.156865,42.153662],[-75.155776,42.153753],[-75.154929,42.1538],[-75.154202,42.153846],[-75.153476,42.153756],[-75.152749,42.153667],[-75.152205,42.153578],[-75.151055,42.153535],[-75.150552,42.153617],[-75.150153,42.153725],[-75.14958799999999,42.153879],[-75.147526,42.154074],[-75.14641399999999,42.154316],[-75.146218,42.154313],[-75.145788,42.154307],[-75.145307,42.154308],[-75.145005,42.154398],[-75.143613,42.154445],[-75.14300799999999,42.154581],[-75.141856,42.154693],[-75.141706,42.154767],[-75.14139299999999,42.15492],[-75.14114499999999,42.155071],[-75.14098,42.155518],[-75.140939,42.155862],[-75.14100000000001,42.156098],[-75.141075,42.156384],[-75.141138,42.157555],[-75.1412,42.158005],[-75.14122500000001,42.159345],[-75.14126899999999,42.161653],[-75.141148,42.161788],[-75.141149,42.162194],[-75.14102800000001,42.162509],[-75.14102800000001,42.162673],[-75.141034,42.164851],[-75.140913,42.164986],[-75.140868,42.165402],[-75.140854,42.165526],[-75.140733,42.165707],[-75.140733,42.165932],[-75.140613,42.166067],[-75.140613,42.166202],[-75.140441,42.166693],[-75.14036400000001,42.16691],[-75.140224,42.167263],[-75.140091,42.167412],[-75.13981099999999,42.167372],[-75.139691,42.167243],[-75.13933,42.167249],[-75.13927,42.167254],[-75.13909,42.167304],[-75.138783,42.16718],[-75.138362,42.166982],[-75.13810100000001,42.166924],[-75.13802800000001,42.166908],[-75.136655,42.166941],[-75.136275,42.166909],[-75.13582100000001,42.166678],[-75.135571,42.166433],[-75.134863,42.166434],[-75.1345,42.166344],[-75.134197,42.166345],[-75.133894,42.16621],[-75.132926,42.166256],[-75.131897,42.166528],[-75.13165499999999,42.166528],[-75.13141299999999,42.166618],[-75.13105,42.166619],[-75.130747,42.166709],[-75.12992800000001,42.16671],[-75.12917299999999,42.166711],[-75.12888,42.166799],[-75.12861100000001,42.167166],[-75.128242,42.167461],[-75.128176,42.167435],[-75.126454,42.166783],[-75.12634199999999,42.166752],[-75.126222,42.166702],[-75.125805,42.166527],[-75.125263,42.166271],[-75.124892,42.166083],[-75.124314,42.165768],[-75.12340500000001,42.165251],[-75.12291999999999,42.16499],[-75.122399,42.164734],[-75.122005,42.164564],[-75.121639,42.164406],[-75.12144000000001,42.164326],[-75.12071400000001,42.164009],[-75.120626,42.163971],[-75.12058399999999,42.163951],[-75.120424,42.163872],[-75.120025,42.163661],[-75.11982999999999,42.163548],[-75.119461,42.163305],[-75.11928399999999,42.163175],[-75.118942,42.162905],[-75.11807,42.16219],[-75.116974,42.161277],[-75.11622699999999,42.160665],[-75.11528199999999,42.159905],[-75.114535,42.159325],[-75.113361,42.158392],[-75.11326800000001,42.158318],[-75.113231,42.158291],[-75.11292299999999,42.158048],[-75.11172000000001,42.157103],[-75.111141,42.156654],[-75.11090799999999,42.15647],[-75.110572,42.156204],[-75.110382,42.15606],[-75.11018900000001,42.155925],[-75.11011000000001,42.155875],[-75.10999099999999,42.155799],[-75.109787,42.155682],[-75.109576,42.155574],[-75.109478,42.155532],[-75.109358,42.15548],[-75.109133,42.155395],[-75.108902,42.155323],[-75.108665,42.15526],[-75.108422,42.155206],[-75.10817400000001,42.155157],[-75.107153,42.154996],[-75.10555100000001,42.154727],[-75.105278,42.154687],[-75.105003,42.154637],[-75.104175,42.154503],[-75.103899,42.154463],[-75.10362499999999,42.154413],[-75.103078,42.154324],[-75.10276500000001,42.154277],[-75.102268,42.154194],[-75.10199900000001,42.154154],[-75.100656,42.15393],[-75.099565,42.15376],[-75.098178,42.153531],[-75.09644400000001,42.153258],[-75.095856,42.153177],[-75.095585,42.153155],[-75.095264,42.153128],[-75.09496799999999,42.15312],[-75.094674,42.15312],[-75.094566,42.153123],[-75.09438,42.153129],[-75.094088,42.153143],[-75.093509,42.153193],[-75.093221,42.153225],[-75.092935,42.153265],[-75.092651,42.153311],[-75.092372,42.153369],[-75.092101,42.153442],[-75.09184,42.153527],[-75.091588,42.153631],[-75.091345,42.153744],[-75.09111300000001,42.15387],[-75.090892,42.154005],[-75.090682,42.15415],[-75.090073,42.15461],[-75.089663,42.154912],[-75.088849,42.155525],[-75.088429,42.155822],[-75.088207,42.155962],[-75.087977,42.156097],[-75.087738,42.156223],[-75.08749,42.156341],[-75.08723500000001,42.156454],[-75.086977,42.156562],[-75.08439300000001,42.157599],[-75.08388600000001,42.157807],[-75.08363300000001,42.157906],[-75.083378,42.158015],[-75.08260900000001,42.158321],[-75.080258,42.159273],[-75.079736,42.159481],[-75.07921899999999,42.159693],[-75.078158,42.160119],[-75.077512,42.160378],[-75.07741900000001,42.160419],[-75.077208,42.160499],[-75.077157,42.160518],[-75.07662500000001,42.160703],[-75.076358,42.160789],[-75.07503,42.161191],[-75.074763,42.161263],[-75.07449099999999,42.16133],[-75.07421600000001,42.161385],[-75.07393500000001,42.16143],[-75.07374799999999,42.161451],[-75.073651,42.161462],[-75.073365,42.161475],[-75.073078,42.16148],[-75.072502,42.161462],[-75.072213,42.161458],[-75.071924,42.161467],[-75.071635,42.161481],[-75.071348,42.161517],[-75.07106400000001,42.161567],[-75.07078300000001,42.16163],[-75.070505,42.161702],[-75.06966799999999,42.161937],[-75.069096,42.162077],[-75.06880200000001,42.162137],[-75.06794499999999,42.162298],[-75.06737800000001,42.162398],[-75.066543,42.162551],[-75.066337,42.162581],[-75.06626300000001,42.162592],[-75.06598099999999,42.162624],[-75.065698,42.162646],[-75.065414,42.162655],[-75.06513,42.162651],[-75.064849,42.162629],[-75.064571,42.162593],[-75.064296,42.162548],[-75.063749,42.16244],[-75.063474,42.162391],[-75.063197,42.16235],[-75.06291899999999,42.162319],[-75.06263800000001,42.162283],[-75.06219900000001,42.162234],[-75.062073,42.16222],[-75.06179,42.162185],[-75.061223,42.162131],[-75.061061,42.162124],[-75.060939,42.162118],[-75.06065599999999,42.162118],[-75.06037499999999,42.162127],[-75.060096,42.162145],[-75.059819,42.162177],[-75.05954699999999,42.162217],[-75.05927800000001,42.162267],[-75.059015,42.162326],[-75.058502,42.162479],[-75.057243,42.162885],[-75.056989,42.162962],[-75.05647500000001,42.163093],[-75.05627800000001,42.163138],[-75.05595099999999,42.163192],[-75.05568700000001,42.163228],[-75.05542,42.163255],[-75.055154,42.163273],[-75.05500000000001,42.163277],[-75.054637,42.163287],[-75.05438599999999,42.163283],[-75.054137,42.163269],[-75.053892,42.163242],[-75.053652,42.163206],[-75.053456,42.163169],[-75.05341799999999,42.163162],[-75.053191,42.163108],[-75.053111,42.163082],[-75.052971,42.163036],[-75.052756,42.162959],[-75.052547,42.162874],[-75.05234400000001,42.162779],[-75.051542,42.162365],[-75.051333,42.162262],[-75.051117,42.162167],[-75.050893,42.162077],[-75.050662,42.161996],[-75.050422,42.161924],[-75.050175,42.161866],[-75.049922,42.161821],[-75.04966400000001,42.161781],[-75.048603,42.161674],[-75.048322,42.161651],[-75.048053,42.161637],[-75.047786,42.161637],[-75.047522,42.161647],[-75.047263,42.161669],[-75.04700699999999,42.161701],[-75.046755,42.16175],[-75.04650599999999,42.161809],[-75.046263,42.161877],[-75.046024,42.161958],[-75.045795,42.162048],[-75.045573,42.162152],[-75.045359,42.162264],[-75.045154,42.162386],[-75.04495799999999,42.162517],[-75.04477300000001,42.162652],[-75.0446,42.162801],[-75.04444100000001,42.162963],[-75.044293,42.163129],[-75.044158,42.163301],[-75.044038,42.163481],[-75.043933,42.16367],[-75.04384400000001,42.163864],[-75.043763,42.164062],[-75.04345499999999,42.16489],[-75.043412,42.164972],[-75.042872,42.164311],[-75.04280300000001,42.164229],[-75.043477,42.163066],[-75.043753,42.162364],[-75.04392,42.161987],[-75.04424299999999,42.161404],[-75.04450199999999,42.16103],[-75.04483,42.160668],[-75.04522,42.160282],[-75.045468,42.160048],[-75.04569499999999,42.159895],[-75.045534,42.159832],[-75.04533499999999,42.159754],[-75.045119,42.159676],[-75.044585,42.159486],[-75.04448499999999,42.159441],[-75.041343,42.158046],[-75.02227999999999,42.149907],[-75.01312799999999,42.145999],[-75.006951,42.143372],[-75.002821,42.141597],[-74.999877,42.140125],[-75.001914,42.13929],[-75.00263200000001,42.138996],[-75.00418000000001,42.138366],[-75.00935,42.136227],[-75.021117,42.131357],[-75.024095,42.130125],[-75.030479,42.127484],[-75.03305,42.126432],[-75.034982,42.125622],[-75.035248,42.125514],[-75.036411,42.125036],[-75.045436,42.121359],[-75.052978,42.118266],[-75.054366,42.11768],[-75.05464000000001,42.117591],[-75.058931,42.115799],[-75.064786,42.113417],[-75.065065,42.113302],[-75.065991,42.112919],[-75.066901,42.11254],[-75.07533599999999,42.109024],[-75.084082,42.105381],[-75.08519200000001,42.104899],[-75.09090500000001,42.102521],[-75.097807,42.099655],[-75.108026,42.095411],[-75.10724,42.094112],[-75.095941,42.075451],[-75.109077,42.071145],[-75.10927599999999,42.071084],[-75.11587400000001,42.068927],[-75.124612,42.072764],[-75.12607199999999,42.073414],[-75.134046,42.076966],[-75.13996899999999,42.079604],[-75.14176999999999,42.080406],[-75.143019,42.080968],[-75.14366200000001,42.08125],[-75.156948,42.087161],[-75.15715899999999,42.087257],[-75.17313,42.094367],[-75.173529,42.094574],[-75.188844,42.101372],[-75.189474,42.10164],[-75.18983,42.101787],[-75.190163,42.101925],[-75.190112,42.101976]]],"type":"Polygon"}
}