{
  "id": "360650212021",
  "type": "Feature",
  "properties": {
    "area_land":240641,
    "area_water":0,
    "geoid":"360650212021",
    "name":"Block Group 1",
    "state":"ny"
},
  "bbox": [
    -75.237672,
    43.082529,
    -75.229384,
    43.088897
],
  "geometry": {"coordinates":[[[-75.237672,43.085772],[-75.23508099999999,43.088897],[-75.234218,43.088507],[-75.233384,43.088128],[-75.23246899999999,43.08772],[-75.231435,43.087253],[-75.230358,43.086773],[-75.229384,43.086334],[-75.230172,43.085378],[-75.231121,43.084247],[-75.229994,43.083735],[-75.229709,43.083594],[-75.22969399999999,43.083558],[-75.229709,43.083501],[-75.22986299999999,43.083302],[-75.230513,43.082529],[-75.231329,43.082899],[-75.231994,43.083198],[-75.23213800000001,43.083263],[-75.23297700000001,43.083643],[-75.23405,43.084131],[-75.235058,43.084595],[-75.235978,43.085009],[-75.236824,43.085386],[-75.237672,43.085772]]],"type":"Polygon"}
}