{
  "id": "360272202011",
  "type": "Feature",
  "properties": {
    "area_land":221734,
    "area_water":0,
    "geoid":"360272202011",
    "name":"Block Group 1",
    "state":"ny"
},
  "bbox": [
    -73.929667,
    41.7025,
    -73.919495,
    41.707532
],
  "geometry": {"coordinates":[[[-73.92912,41.7072],[-73.92886,41.707143],[-73.928746,41.707129],[-73.92773,41.707007],[-73.92686399999999,41.706901],[-73.925725,41.706755],[-73.924288,41.706557],[-73.924226,41.706549],[-73.923092,41.706394],[-73.92152900000001,41.706188],[-73.92148400000001,41.706361],[-73.92142,41.706685],[-73.921295,41.707312],[-73.921239,41.707532],[-73.92023,41.707395],[-73.919495,41.707299],[-73.91969400000001,41.706455],[-73.91980700000001,41.705987],[-73.91993100000001,41.70546],[-73.92012099999999,41.704631],[-73.920444,41.703163],[-73.92046499999999,41.702999],[-73.920509,41.702603],[-73.920534,41.7025],[-73.92088800000001,41.70257],[-73.921143,41.702633],[-73.92133699999999,41.702693],[-73.921537,41.702765],[-73.921897,41.702919],[-73.922021,41.70299],[-73.92255299999999,41.703384],[-73.92274399999999,41.703505],[-73.92302599999999,41.703661],[-73.923484,41.703846],[-73.923592,41.70389],[-73.924612,41.704277],[-73.925421,41.704581],[-73.926374,41.704948],[-73.92828,41.705669],[-73.92867200000001,41.70583],[-73.92966699999999,41.706163],[-73.92912,41.7072]]],"type":"Polygon"}
}