{
  "id": "360179702001",
  "type": "Feature",
  "properties": {
    "area_land":84570720,
    "area_water":196749,
    "geoid":"360179702001",
    "name":"Block Group 1",
    "state":"ny"
},
  "bbox": [
    -75.781602,
    42.635999,
    -75.60667,
    42.737001
],
  "geometry": {"coordinates":[[[-75.78160200000001,42.729592],[-75.781391,42.729601],[-75.779785,42.729672],[-75.77956500000001,42.729682],[-75.778271,42.729739],[-75.770855,42.730069],[-75.76929,42.73019],[-75.769194,42.730193],[-75.765922,42.730307],[-75.76526800000001,42.73033],[-75.763076,42.730421],[-75.762196,42.730457],[-75.75449500000001,42.730776],[-75.74963200000001,42.73098],[-75.744739,42.731299],[-75.744499,42.73131],[-75.735699,42.731724],[-75.735675,42.731725],[-75.733287,42.731837],[-75.732799,42.73186],[-75.72727,42.73212],[-75.72712,42.732127],[-75.724136,42.732268],[-75.724003,42.732274],[-75.71424399999999,42.732732],[-75.714091,42.732739],[-75.709177,42.73297],[-75.70750200000001,42.733049],[-75.70677999999999,42.733083],[-75.687744,42.733979],[-75.687488,42.733991],[-75.684093,42.73415],[-75.68154,42.73427],[-75.680421,42.734323],[-75.679682,42.734357],[-75.67182,42.734727],[-75.669522,42.734835],[-75.666541,42.734975],[-75.665674,42.735016],[-75.660692,42.735251],[-75.65992199999999,42.735288],[-75.653817,42.735576],[-75.653733,42.735592],[-75.653593,42.735619],[-75.653496,42.735638],[-75.646069,42.735976],[-75.64497799999999,42.736026],[-75.638429,42.736324],[-75.63833200000001,42.736328],[-75.637906,42.736347],[-75.624628,42.736953],[-75.61841200000001,42.737001],[-75.61851799999999,42.73696],[-75.618714,42.736822],[-75.618853,42.736677],[-75.61976900000001,42.735854],[-75.620389,42.735254],[-75.620751,42.734905],[-75.621381,42.734282],[-75.621593,42.733981],[-75.62179,42.733633],[-75.621994,42.733092],[-75.6221,42.73254],[-75.622165,42.731885],[-75.62223899999999,42.730816],[-75.62228,42.729728],[-75.622255,42.729104],[-75.62223,42.728917],[-75.62219,42.728725],[-75.622091,42.728503],[-75.62198600000001,42.728305],[-75.621596,42.727776],[-75.620279,42.725899],[-75.619686,42.725036],[-75.619552,42.724867],[-75.61932400000001,42.724526],[-75.619153,42.724227],[-75.61909900000001,42.724056],[-75.619052,42.723633],[-75.61897999999999,42.722233],[-75.618965,42.721503],[-75.618908,42.720427],[-75.618887,42.719515],[-75.618848,42.71892],[-75.618758,42.718075],[-75.618703,42.717678],[-75.618681,42.717409],[-75.618681,42.717097],[-75.618708,42.716925],[-75.61878,42.716721],[-75.618914,42.716525],[-75.619034,42.716413],[-75.619255,42.716251],[-75.61942000000001,42.716117],[-75.619631,42.715919],[-75.619765,42.715767],[-75.62017899999999,42.71509],[-75.620541,42.714558],[-75.620682,42.714304],[-75.620773,42.714058],[-75.62081999999999,42.713828],[-75.620836,42.71361],[-75.62075,42.712245],[-75.62075299999999,42.712138],[-75.620772,42.711952],[-75.620986,42.711241],[-75.621123,42.710878],[-75.62122599999999,42.710695],[-75.62155300000001,42.710252],[-75.62218799999999,42.709549],[-75.62311200000001,42.708565],[-75.623431,42.708247],[-75.62365,42.708051],[-75.62380400000001,42.707935],[-75.6225,42.706724],[-75.62087200000001,42.705156],[-75.620615,42.704887],[-75.620318,42.704537],[-75.61909799999999,42.702934],[-75.61902600000001,42.70282],[-75.619016,42.702787],[-75.618989,42.702683],[-75.619006,42.702552],[-75.61925100000001,42.702085],[-75.61926800000001,42.701993],[-75.619254,42.701878],[-75.619147,42.701669],[-75.618942,42.701403],[-75.618799,42.701199],[-75.61860900000001,42.700909],[-75.618443,42.700599],[-75.618297,42.700282],[-75.618161,42.700115],[-75.61805699999999,42.700037],[-75.617931,42.699974],[-75.617794,42.699933],[-75.617633,42.699915],[-75.61739,42.699925],[-75.61681799999999,42.700051],[-75.61677899999999,42.700059],[-75.61626200000001,42.700167],[-75.616181,42.699844],[-75.616051,42.699484],[-75.615932,42.699294],[-75.615863,42.699216],[-75.615683,42.699051],[-75.615566,42.698967],[-75.614484,42.698302],[-75.613938,42.697929],[-75.613202,42.697458],[-75.613096,42.697389],[-75.612224,42.696782],[-75.61093200000001,42.695944],[-75.610697,42.695772],[-75.610204,42.695394],[-75.609163,42.694534],[-75.609011,42.694391],[-75.608638,42.693965],[-75.60847800000001,42.69382],[-75.607837,42.693318],[-75.607696,42.693193],[-75.60746,42.692948],[-75.607417,42.692879],[-75.60733399999999,42.69269],[-75.60728400000001,42.692448],[-75.607236,42.692099],[-75.607078,42.690009],[-75.607069,42.689476],[-75.60705799999999,42.688999],[-75.607077,42.688697],[-75.60707600000001,42.688468],[-75.60702000000001,42.688192],[-75.606796,42.687499],[-75.60671600000001,42.687176],[-75.60666999999999,42.686805],[-75.60667100000001,42.686653],[-75.60672099999999,42.686354],[-75.606866,42.685889],[-75.606937,42.685589],[-75.606966,42.685028],[-75.606955,42.684273],[-75.606905,42.683685],[-75.606797,42.682892],[-75.607107,42.682909],[-75.60740699999999,42.682958],[-75.607957,42.683098],[-75.609137,42.683403],[-75.60960900000001,42.683498],[-75.60981099999999,42.683526],[-75.610148,42.683547],[-75.610489,42.683557],[-75.613027,42.683542],[-75.61323,42.683547],[-75.61346399999999,42.68357],[-75.61375,42.683638],[-75.614239,42.683767],[-75.61615,42.684159],[-75.616731,42.684273],[-75.617422,42.684386],[-75.617982,42.684519],[-75.618646,42.684696],[-75.61975099999999,42.684962],[-75.620734,42.685261],[-75.621347,42.685456],[-75.62178,42.685585],[-75.622163,42.685648],[-75.62270700000001,42.685689],[-75.622832,42.685706],[-75.623065,42.685767],[-75.623535,42.685936],[-75.623868,42.686078],[-75.624064,42.686139],[-75.624241,42.686183],[-75.624304,42.686214],[-75.62444499999999,42.686257],[-75.62441200000001,42.685514],[-75.62426600000001,42.685679],[-75.62425500000001,42.685699],[-75.62414,42.685347],[-75.62419,42.684783],[-75.624191,42.68384],[-75.624234,42.682804],[-75.624072,42.680959],[-75.624019,42.680489],[-75.623963,42.679606],[-75.62389899999999,42.678593],[-75.623769,42.676158],[-75.62372499999999,42.675103],[-75.623689,42.67422],[-75.623633,42.673304],[-75.62359499999999,42.672503],[-75.62358500000001,42.672202],[-75.623564,42.67001],[-75.62347800000001,42.668127],[-75.623437,42.666709],[-75.623301,42.664314],[-75.623177,42.662895],[-75.623141,42.662327],[-75.623105,42.661486],[-75.62309,42.660822],[-75.62308299999999,42.660384],[-75.622979,42.659049],[-75.622917,42.657527],[-75.622883,42.656709],[-75.622771,42.654978],[-75.62276300000001,42.654551],[-75.622795,42.65429],[-75.62285199999999,42.654146],[-75.623148,42.653819],[-75.62324,42.65367],[-75.62327500000001,42.653567],[-75.623289,42.65348],[-75.623304,42.652869],[-75.62337100000001,42.65194],[-75.623418,42.651581],[-75.623503,42.651009],[-75.623594,42.650528],[-75.62388300000001,42.649413],[-75.623909,42.649247],[-75.623898,42.649002],[-75.623848,42.648776],[-75.623672,42.648362],[-75.623386,42.647709],[-75.622944,42.646786],[-75.622747,42.646346],[-75.622647,42.646083],[-75.622499,42.645616],[-75.622429,42.645301],[-75.622388,42.64443],[-75.622277,42.642573],[-75.622139,42.640116],[-75.62215,42.639922],[-75.622196,42.639637],[-75.622255,42.639439],[-75.62233000000001,42.639248],[-75.62249799999999,42.638933],[-75.622591,42.638797],[-75.62286,42.638454],[-75.622941,42.638368],[-75.623195,42.638136],[-75.623341,42.637968],[-75.623446,42.637791],[-75.62356699999999,42.637539],[-75.623791,42.63695],[-75.624077,42.636362],[-75.62420299999999,42.636163],[-75.62433,42.635999],[-75.624488,42.636116],[-75.624878,42.63635],[-75.624999,42.636414],[-75.625218,42.636506],[-75.625522,42.636618],[-75.62587600000001,42.636717],[-75.626226,42.636779],[-75.626564,42.636811],[-75.626756,42.636823],[-75.627261,42.636814],[-75.629591,42.636679],[-75.630073,42.63667],[-75.63038,42.636683],[-75.63076599999999,42.636728],[-75.631162,42.6368],[-75.631488,42.636903],[-75.63174100000001,42.636996],[-75.632051,42.637143],[-75.632493,42.637403],[-75.63267399999999,42.637549],[-75.63287,42.637728],[-75.63367100000001,42.638643],[-75.634413,42.639509],[-75.634726,42.639813],[-75.635009,42.640052],[-75.63540999999999,42.640354],[-75.635471,42.640392],[-75.635863,42.640633],[-75.636084,42.640758],[-75.636349,42.640889],[-75.63708099999999,42.641201],[-75.641711,42.642948],[-75.642126,42.643124],[-75.642467,42.643289],[-75.642753,42.643441],[-75.643355,42.643833],[-75.643889,42.644254],[-75.64406700000001,42.644415],[-75.644312,42.644657],[-75.644507,42.64485],[-75.645532,42.645858],[-75.646595,42.64687],[-75.646686,42.646948],[-75.64695500000001,42.647179],[-75.647375,42.647505],[-75.647893,42.647863],[-75.648184,42.648048],[-75.648487,42.648221],[-75.648698,42.648341],[-75.64894200000001,42.648466],[-75.65157000000001,42.649605],[-75.652506,42.650015],[-75.653361,42.650398],[-75.65425,42.650775],[-75.654791,42.650972],[-75.65566800000001,42.651243],[-75.656211,42.651373],[-75.656983,42.651519],[-75.657629,42.651608],[-75.659053,42.651741],[-75.661576,42.651946],[-75.661879,42.651982],[-75.662519,42.652064],[-75.663205,42.652196],[-75.663884,42.65234],[-75.66455999999999,42.652516],[-75.665442,42.65278],[-75.665931,42.652948],[-75.66676,42.653285],[-75.672848,42.655952],[-75.674127,42.656503],[-75.674221,42.656548],[-75.674556,42.656707],[-75.674875,42.65687],[-75.675465,42.657235],[-75.675653,42.657369],[-75.676142,42.657763],[-75.677024,42.658527],[-75.677362,42.658776],[-75.677463,42.658834],[-75.67760699999999,42.658911],[-75.67783799999999,42.65901],[-75.677975,42.659055],[-75.678151,42.659094],[-75.678703,42.659183],[-75.680122,42.659399],[-75.681106,42.659535],[-75.681769,42.659643],[-75.682204,42.659724],[-75.683665,42.660034],[-75.684377,42.660202],[-75.68503200000001,42.660396],[-75.685344,42.660522],[-75.685627,42.660657],[-75.68643,42.661145],[-75.68789700000001,42.662095],[-75.69062,42.663795],[-75.693257,42.665415],[-75.695503,42.666822],[-75.698285,42.668537],[-75.699591,42.669345],[-75.700008,42.669605],[-75.70071299999999,42.670085],[-75.70147799999999,42.670643],[-75.70207600000001,42.671037],[-75.703546,42.671947],[-75.70392099999999,42.672225],[-75.70417,42.672447],[-75.70444999999999,42.672771],[-75.70477700000001,42.673248],[-75.705001,42.673588],[-75.705235,42.673882],[-75.705405,42.674067],[-75.705566,42.674222],[-75.70586900000001,42.674466],[-75.705904,42.674491],[-75.706166,42.674678],[-75.70636500000001,42.674795],[-75.706694,42.674973],[-75.707058,42.675147],[-75.707268,42.67523],[-75.707785,42.675397],[-75.707992,42.675454],[-75.708575,42.675573],[-75.70878399999999,42.675603],[-75.709096,42.675634],[-75.71049600000001,42.675728],[-75.710786,42.675744],[-75.711338,42.675807],[-75.711606,42.675847],[-75.7122,42.675962],[-75.71257199999999,42.676043],[-75.71272399999999,42.676073],[-75.71321,42.676177],[-75.71346699999999,42.676247],[-75.713725,42.676331],[-75.713976,42.676432],[-75.71450299999999,42.676696],[-75.71463,42.676773],[-75.715221,42.677213],[-75.715891,42.67773],[-75.716067,42.677878],[-75.716362,42.678079],[-75.716628,42.678231],[-75.71699,42.67839],[-75.717409,42.678518],[-75.717472,42.678531],[-75.71766,42.67857],[-75.718039,42.678606],[-75.71831400000001,42.67862],[-75.719189,42.678599],[-75.719538,42.6786],[-75.71978900000001,42.67862],[-75.720173,42.678674],[-75.72072900000001,42.6788],[-75.72089699999999,42.678852],[-75.72138099999999,42.679048],[-75.721571,42.679144],[-75.721835,42.679301],[-75.72203500000001,42.679447],[-75.72268800000001,42.680011],[-75.723635,42.680864],[-75.724007,42.681139],[-75.724344,42.681344],[-75.724653,42.681492],[-75.72496700000001,42.681618],[-75.725117,42.681666],[-75.725362,42.681738],[-75.72561899999999,42.6818],[-75.725949,42.681852],[-75.727096,42.681953],[-75.727411,42.68199],[-75.727709,42.682055],[-75.728122,42.68217],[-75.728492,42.682316],[-75.728706,42.68242],[-75.728894,42.682525],[-75.729066,42.682638],[-75.729225,42.68275],[-75.730102,42.683512],[-75.730408,42.683823],[-75.730497,42.683956],[-75.73057799999999,42.684133],[-75.73068499999999,42.684632],[-75.730779,42.685168],[-75.730892,42.685499],[-75.730997,42.685757],[-75.731132,42.686013],[-75.731585,42.686707],[-75.73186,42.687137],[-75.732088,42.687611],[-75.732192,42.687882],[-75.73227799999999,42.688246],[-75.73234600000001,42.688652],[-75.732411,42.689384],[-75.732472,42.689864],[-75.732522,42.690074],[-75.73259299999999,42.690263],[-75.73276300000001,42.690569],[-75.73298,42.690868],[-75.733096,42.690994],[-75.73423200000001,42.692026],[-75.734455,42.692251],[-75.73465400000001,42.692475],[-75.73489600000001,42.69284],[-75.73513699999999,42.693327],[-75.73535699999999,42.693905],[-75.735598,42.6944],[-75.73657300000001,42.696093],[-75.736869,42.696617],[-75.736987,42.696863],[-75.73713100000001,42.697287],[-75.737162,42.697419],[-75.73721,42.697797],[-75.737449,42.701285],[-75.73758100000001,42.702704],[-75.737724,42.703847],[-75.73777800000001,42.704293],[-75.73777,42.704435],[-75.737745,42.704494],[-75.737664,42.704607],[-75.73761399999999,42.704649],[-75.73746199999999,42.704724],[-75.736969,42.704874],[-75.736819,42.704946],[-75.736673,42.705055],[-75.736589,42.705162],[-75.73656099999999,42.705262],[-75.73657799999999,42.705391],[-75.736645,42.705492],[-75.736773,42.705605],[-75.73694999999999,42.705705],[-75.737115,42.705505],[-75.737408,42.705152],[-75.73764199999999,42.704921],[-75.73795800000001,42.704669],[-75.738181,42.704492],[-75.738592,42.704286],[-75.73910100000001,42.704056],[-75.74009100000001,42.703678],[-75.740577,42.703524],[-75.741052,42.703422],[-75.742594,42.70318],[-75.742904,42.70312],[-75.743156,42.703061],[-75.743436,42.702969],[-75.74372700000001,42.702835],[-75.744258,42.702539],[-75.744468,42.702394],[-75.74451500000001,42.702356],[-75.744709,42.702181],[-75.744782,42.702094],[-75.745091,42.701626],[-75.745217,42.701469],[-75.745301,42.701382],[-75.74539900000001,42.701304],[-75.745591,42.701193],[-75.74590999999999,42.701058],[-75.746025,42.701156],[-75.746064,42.701204],[-75.74609700000001,42.701324],[-75.74614699999999,42.701865],[-75.746173,42.702317],[-75.746273,42.70329],[-75.746365,42.7039],[-75.746433,42.704208],[-75.74666999999999,42.704978],[-75.746737,42.705176],[-75.74684999999999,42.70561],[-75.74702600000001,42.706581],[-75.747372,42.70873],[-75.747427,42.709011],[-75.747491,42.709265],[-75.747603,42.709587],[-75.74774499999999,42.709866],[-75.747901,42.71012],[-75.747974,42.710224],[-75.748679,42.711059],[-75.749078,42.711503],[-75.749332,42.711769],[-75.749576,42.711984],[-75.75,42.712294],[-75.75025100000001,42.71245],[-75.75068,42.71267],[-75.75216500000001,42.713308],[-75.752531,42.713501],[-75.752931,42.713739],[-75.753208,42.713944],[-75.75361700000001,42.714292],[-75.75463499999999,42.715222],[-75.75503399999999,42.715557],[-75.75510300000001,42.715608],[-75.75552399999999,42.715867],[-75.75579,42.716013],[-75.759636,42.717625],[-75.759874,42.717751],[-75.76015,42.717914],[-75.76049999999999,42.718154],[-75.76077600000001,42.718386],[-75.76199800000001,42.719645],[-75.762254,42.719885],[-75.762591,42.720113],[-75.76263,42.720139],[-75.76277899999999,42.720232],[-75.763126,42.720411],[-75.76355,42.72055],[-75.763626,42.720573],[-75.76454099999999,42.72085],[-75.76509299999999,42.721043],[-75.76539200000001,42.721145],[-75.76599400000001,42.72135],[-75.767233,42.721794],[-75.767464,42.721883],[-75.76787,42.722072],[-75.768173,42.722242],[-75.76885,42.722657],[-75.76916199999999,42.722865],[-75.770066,42.723436],[-75.770505,42.723651],[-75.770968,42.723838],[-75.77161700000001,42.724035],[-75.772656,42.724335],[-75.772876,42.724405],[-75.773383,42.724548],[-75.77374500000001,42.724662],[-75.77418,42.724826],[-75.774497,42.724968],[-75.774896,42.725197],[-75.77528100000001,42.725451],[-75.777496,42.726967],[-75.77811,42.727365],[-75.779487,42.728223],[-75.78023899999999,42.72867],[-75.780978,42.72913],[-75.78150100000001,42.729515],[-75.78156799999999,42.729566],[-75.78160200000001,42.729592]]],"type":"Polygon"}
}