{
  "id": "360470284003",
  "type": "Feature",
  "properties": {
    "area_land":68592,
    "area_water":0,
    "geoid":"360470284003",
    "name":"Block Group 3",
    "state":"ny"
},
  "bbox": [
    -74.00263,
    40.60262,
    -73.998254,
    40.605934
],
  "geometry": {"coordinates":[[[-74.00263,40.603847],[-74.000457,40.605934],[-73.999718,40.605482],[-73.99899600000001,40.605056],[-73.998254,40.604608],[-74.000022,40.602907],[-74.00032400000001,40.60262],[-74.001098,40.603034],[-74.001846,40.603431],[-74.00263,40.603847]]],"type":"Polygon"}
}