{
  "id": "360630211002",
  "type": "Feature",
  "properties": {
    "area_land":339014,
    "area_water":0,
    "geoid":"360630211002",
    "name":"Block Group 2",
    "state":"ny"
},
  "bbox": [
    -79.05959,
    43.088357,
    -79.052376,
    43.094613
],
  "geometry": {"coordinates":[[[-79.05959,43.094335],[-79.059332,43.094343],[-79.05896,43.094355],[-79.05855699999999,43.09437],[-79.0583,43.094379],[-79.058042,43.09439],[-79.05764499999999,43.094407],[-79.05757800000001,43.094409],[-79.05726799999999,43.094424],[-79.057011,43.094436],[-79.056895,43.094439],[-79.05655,43.09445],[-79.05643499999999,43.094455],[-79.05629,43.09446],[-79.05585499999999,43.094476],[-79.055711,43.094482],[-79.05544999999999,43.094493],[-79.05506800000001,43.094511],[-79.05466699999999,43.094528],[-79.054407,43.09454],[-79.054149,43.094549],[-79.053378,43.094577],[-79.053121,43.094587],[-79.052994,43.094592],[-79.052615,43.094607],[-79.05248899999999,43.094613],[-79.052466,43.094295],[-79.052398,43.093344],[-79.052376,43.093027],[-79.05350900000001,43.09298],[-79.05347999999999,43.092565],[-79.053393,43.09132],[-79.053365,43.090906],[-79.05333299999999,43.090454],[-79.05323799999999,43.089098],[-79.053225,43.088645],[-79.054018,43.08861],[-79.054277,43.088599],[-79.054675,43.088583],[-79.055316,43.088556],[-79.056619,43.088505],[-79.057918,43.088412],[-79.059213,43.088357],[-79.059363,43.090678],[-79.05942,43.091418],[-79.059433,43.091796],[-79.05944700000001,43.092236],[-79.05950900000001,43.093122],[-79.05952499999999,43.093364],[-79.059573,43.094092],[-79.05959,43.094335]]],"type":"Polygon"}
}