{
  "id": "360130356002",
  "type": "Feature",
  "properties": {
    "area_land":1045674,
    "area_water":0,
    "geoid":"360130356002",
    "name":"Block Group 2",
    "state":"ny"
},
  "bbox": [
    -79.353989,
    42.473799,
    -79.333425,
    42.485069
],
  "geometry": {"coordinates":[[[-79.353989,42.476498],[-79.350846,42.479305],[-79.349474,42.480512],[-79.34924700000001,42.480703],[-79.34907,42.480853],[-79.348957,42.480937],[-79.348615,42.481194],[-79.34799700000001,42.481611],[-79.34730399999999,42.482036],[-79.3463,42.482554],[-79.34591899999999,42.482726],[-79.34551999999999,42.482895],[-79.344831,42.483144],[-79.34429299999999,42.483339],[-79.34384900000001,42.483479],[-79.343276,42.48363],[-79.34305999999999,42.48368],[-79.342992,42.483696],[-79.342292,42.483854],[-79.342119,42.483881],[-79.341341,42.484007],[-79.33955400000001,42.484309],[-79.33802799999999,42.484555],[-79.336524,42.484811],[-79.334962,42.485069],[-79.33489,42.484806],[-79.334418,42.48313],[-79.33392000000001,42.481348],[-79.33342500000001,42.479531],[-79.33420099999999,42.479425],[-79.334962,42.479314],[-79.336512,42.479091],[-79.337299,42.478972],[-79.33806300000001,42.478853],[-79.33888399999999,42.478725],[-79.339319,42.478667],[-79.33945900000001,42.478646],[-79.33958699999999,42.478626],[-79.33974000000001,42.478604],[-79.34087599999999,42.478422],[-79.341532,42.478315],[-79.341803,42.478271],[-79.342416,42.478191],[-79.342586,42.478167],[-79.344453,42.477883],[-79.34571699999999,42.477682],[-79.34600500000001,42.477624],[-79.346031,42.475829],[-79.34603199999999,42.47574],[-79.34604400000001,42.474983],[-79.346054,42.4745],[-79.346065,42.473836],[-79.35048999999999,42.47386],[-79.351997,42.473876],[-79.352542,42.473865],[-79.353247,42.473868],[-79.353562,42.473847],[-79.353987,42.473799],[-79.353989,42.476498]]],"type":"Polygon"}
}