{
  "id": "360050185003",
  "type": "Feature",
  "properties": {
    "area_land":76493,
    "area_water":0,
    "geoid":"360050185003",
    "name":"Block Group 3",
    "state":"ny"
},
  "bbox": [
    -73.908461,
    40.824624,
    -73.903852,
    40.829452
],
  "geometry": {"coordinates":[[[-73.90821200000001,40.825314],[-73.907931,40.825996],[-73.907844,40.82622],[-73.90773900000001,40.826492],[-73.907647,40.826695],[-73.907228,40.827783],[-73.907031,40.82828],[-73.906571,40.829452],[-73.905531,40.829104],[-73.90509,40.829014],[-73.903852,40.828194],[-73.904909,40.827277],[-73.90508,40.827114],[-73.90537999999999,40.826875],[-73.907031,40.82581],[-73.907781,40.825214],[-73.908461,40.824624],[-73.90821200000001,40.825314]]],"type":"Polygon"}
}