{
  "id": "360470082003",
  "type": "Feature",
  "properties": {
    "area_land":46698,
    "area_water":0,
    "geoid":"360470082003",
    "name":"Block Group 3",
    "state":"ny"
},
  "bbox": [
    -74.010308,
    40.650389,
    -74.00675,
    40.6532
],
  "geometry": {"coordinates":[[[-74.009705,40.652032],[-74.009107,40.652625],[-74.008545,40.6532],[-74.00675,40.652071],[-74.007335,40.651511],[-74.00791700000001,40.650951],[-74.008498,40.650389],[-74.01030799999999,40.651483],[-74.009705,40.652032]]],"type":"Polygon"}
}