{
  "id": "360470162001",
  "type": "Feature",
  "properties": {
    "area_land":87131,
    "area_water":0,
    "geoid":"360470162001",
    "name":"Block Group 1",
    "state":"ny"
},
  "bbox": [
    -74.031947,
    40.613462,
    -74.026302,
    40.616961
],
  "geometry": {"coordinates":[[[-74.031515,40.61533],[-74.031228,40.615723],[-74.030485,40.616518],[-74.02957600000001,40.616067],[-74.0287,40.61563],[-74.02777500000001,40.616715],[-74.0275,40.616961],[-74.026646,40.616508],[-74.026302,40.616335],[-74.026467,40.616115],[-74.02663200000001,40.615949],[-74.026656,40.615922],[-74.027416,40.615225],[-74.028385,40.614249],[-74.028513,40.61403],[-74.028676,40.613838],[-74.028972,40.613516],[-74.029042,40.613462],[-74.02910300000001,40.613514],[-74.029169,40.613563],[-74.029241,40.613607],[-74.02928799999999,40.613629],[-74.029335,40.613649],[-74.029414,40.613677],[-74.029518,40.6137],[-74.02962100000001,40.61371],[-74.029746,40.613706],[-74.02987,40.613771],[-74.029976,40.613827],[-74.030165,40.613927],[-74.031947,40.614815],[-74.031515,40.61533]]],"type":"Polygon"}
}