{
  "id": "360594145011",
  "type": "Feature",
  "properties": {
    "area_land":481887,
    "area_water":153653,
    "geoid":"360594145011",
    "name":"Block Group 1",
    "state":"ny"
},
  "bbox": [
    -73.594187,
    40.625902,
    -73.582472,
    40.640303
],
  "geometry": {"coordinates":[[[-73.59418700000001,40.636562],[-73.593791,40.636652],[-73.59322899999999,40.636779],[-73.59306100000001,40.636819],[-73.592969,40.636851],[-73.592859,40.636862],[-73.592483,40.636944],[-73.592124,40.637042],[-73.591652,40.636166],[-73.591628,40.636034],[-73.59161,40.635762],[-73.590963,40.635831],[-73.590084,40.635927],[-73.589203,40.636019],[-73.589583,40.638059],[-73.589961,40.640099],[-73.589071,40.640196],[-73.58807299999999,40.640303],[-73.58791100000001,40.639418],[-73.58748300000001,40.637106],[-73.586534,40.63721],[-73.585588,40.637313],[-73.58465700000001,40.637413],[-73.584233,40.635102],[-73.583804,40.632791],[-73.58335,40.630346],[-73.582921,40.628034],[-73.58273699999999,40.627043],[-73.582688,40.626962],[-73.582472,40.626602],[-73.58456,40.626145],[-73.585672,40.625902],[-73.586275,40.627313],[-73.58576600000001,40.628316],[-73.58635599999999,40.631394],[-73.58774200000001,40.631808],[-73.593431,40.633143],[-73.59398899999999,40.63346],[-73.593998,40.633736],[-73.59399999999999,40.633813],[-73.59418700000001,40.636562]]],"type":"Polygon"}
}