{
  "id": "360595200022",
  "type": "Feature",
  "properties": {
    "area_land":470786,
    "area_water":0,
    "geoid":"360595200022",
    "name":"Block Group 2",
    "state":"ny"
},
  "bbox": [
    -73.485179,
    40.742507,
    -73.477955,
    40.756206
],
  "geometry": {"coordinates":[[[-73.485179,40.756206],[-73.484602,40.7561],[-73.48433900000001,40.756033],[-73.483975,40.755953],[-73.48232,40.755655],[-73.48128199999999,40.755456],[-73.481228,40.755453],[-73.481199,40.755439],[-73.47914900000001,40.755035],[-73.478489,40.754902],[-73.478262,40.754869],[-73.478129,40.754821],[-73.47804600000001,40.754774],[-73.47795499999999,40.754669],[-73.477958,40.75454],[-73.478009,40.754436],[-73.478042,40.754387],[-73.47808999999999,40.754316],[-73.478156,40.754151],[-73.478219,40.753943],[-73.47828,40.753493],[-73.478335,40.753422],[-73.478289,40.753425],[-73.478312,40.753147],[-73.47835600000001,40.752821],[-73.478416,40.752351],[-73.47845700000001,40.752012],[-73.478578,40.751174],[-73.47867599999999,40.750459],[-73.478844,40.749156],[-73.47893500000001,40.748465],[-73.479028,40.747804],[-73.47901400000001,40.747749],[-73.479052,40.747498],[-73.479063,40.747422],[-73.479095,40.747085],[-73.479117,40.747058],[-73.47913200000001,40.747014],[-73.479191,40.746495],[-73.479195,40.746405],[-73.479219,40.746274],[-73.47930599999999,40.745594],[-73.47935099999999,40.745233],[-73.47939,40.744895],[-73.479433,40.744547],[-73.479468,40.744202],[-73.479607,40.743091],[-73.479619,40.742905],[-73.479647,40.742507],[-73.479929,40.742521],[-73.480722,40.742541],[-73.48083800000001,40.742561],[-73.48174299999999,40.742595],[-73.481752,40.742667],[-73.481962,40.744466],[-73.482032,40.745148],[-73.482084,40.745676],[-73.482135,40.746205],[-73.48214900000001,40.74635],[-73.482241,40.747253],[-73.482226,40.747305],[-73.482229,40.747366],[-73.482258,40.747412],[-73.48229600000001,40.747786],[-73.482356,40.748307],[-73.48234100000001,40.748327],[-73.482373,40.748345],[-73.48237,40.748384],[-73.48245199999999,40.748918],[-73.482449,40.749034],[-73.482617,40.750448],[-73.482681,40.75097],[-73.48272900000001,40.751378],[-73.482764,40.751548],[-73.482873,40.751867],[-73.482935,40.751988],[-73.482984,40.752116],[-73.483672,40.753158],[-73.483816,40.753376],[-73.484071,40.753816],[-73.48410199999999,40.753884],[-73.484149,40.753975],[-73.485079,40.755945],[-73.485083,40.755978],[-73.485179,40.756206]]],"type":"Polygon"}
}