{
  "id": "360870133002",
  "type": "Feature",
  "properties": {
    "area_land":1120887,
    "area_water":1225348,
    "geoid":"360870133002",
    "name":"Block Group 2",
    "state":"ny"
},
  "bbox": [
    -73.927394,
    41.028992,
    -73.896359,
    41.051896
],
  "geometry": {"coordinates":[[[-73.927252,41.031406],[-73.927223,41.031431],[-73.926157,41.031905],[-73.92207999999999,41.033997],[-73.91988000000001,41.035597],[-73.91818000000001,41.037697],[-73.91758,41.038597],[-73.91768,41.040097],[-73.917951,41.040873],[-73.918144,41.041353],[-73.918182,41.041228],[-73.918762,41.041179],[-73.918995,41.041167],[-73.919845,41.041113],[-73.920619,41.041063],[-73.92062199999999,41.041322],[-73.920647,41.041486],[-73.920697,41.041655],[-73.920697,41.041848],[-73.92082600000001,41.042827],[-73.920866,41.043095],[-73.920967,41.043767],[-73.921133,41.044589],[-73.921532,41.046335],[-73.92176600000001,41.04758],[-73.922044,41.048973],[-73.922172,41.049517],[-73.92233899999999,41.050076],[-73.92247500000001,41.050532],[-73.922595,41.050909],[-73.922601,41.050928],[-73.921581,41.051296],[-73.91977900000001,41.051796],[-73.919741,41.051798],[-73.919023,41.051872],[-73.918953,41.051879],[-73.918846,41.05189],[-73.91878,41.051896],[-73.914281,41.051497],[-73.896952,41.043284],[-73.896912,41.043314],[-73.896834,41.043392],[-73.896469,41.043436],[-73.89642499999999,41.043401],[-73.896399,41.04334],[-73.896359,41.042697],[-73.90098,41.040797],[-73.90635899999999,41.039025],[-73.907464,41.038748],[-73.90761500000001,41.038676],[-73.907742,41.038644],[-73.907813,41.038581],[-73.90786900000001,41.038502],[-73.907893,41.038402],[-73.908311,41.038358],[-73.91100299999999,41.038081],[-73.911012,41.038059],[-73.911168,41.038032],[-73.91157,41.037966],[-73.91168,41.037948],[-73.91383,41.037451],[-73.914147,41.037378],[-73.915373,41.037105],[-73.915541,41.037068],[-73.91575400000001,41.036847],[-73.915162,41.036516],[-73.91504,41.036448],[-73.915476,41.036153],[-73.915424,41.036077],[-73.91653100000001,41.035085],[-73.91656999999999,41.035051],[-73.916589,41.035033],[-73.917186,41.0345],[-73.917691,41.034324],[-73.918042,41.034202],[-73.91811300000001,41.034178],[-73.922442,41.032677],[-73.92284100000001,41.03241],[-73.92294800000001,41.032312],[-73.92349299999999,41.031691],[-73.92478199999999,41.029938],[-73.92497,41.029687],[-73.925454,41.028992],[-73.92553700000001,41.029117],[-73.925754,41.029441],[-73.926151,41.029993],[-73.92644300000001,41.030315],[-73.92652,41.030455],[-73.92723700000001,41.031131],[-73.92739400000001,41.031279],[-73.927252,41.031406]]],"type":"Polygon"}
}