{
  "id": "361090011002",
  "type": "Feature",
  "properties": {
    "area_land":376369,
    "area_water":2321,
    "geoid":"361090011002",
    "name":"Block Group 2",
    "state":"ny"
},
  "bbox": [
    -76.498243,
    42.428117,
    -76.489482,
    42.438761
],
  "geometry": {"coordinates":[[[-76.498243,42.428117],[-76.497849,42.428726],[-76.497596,42.429118],[-76.497452,42.429341],[-76.496596,42.430659],[-76.496522,42.430773],[-76.49645700000001,42.430873],[-76.496369,42.430992],[-76.49612,42.431359],[-76.49476799999999,42.433367],[-76.494669,42.433558],[-76.494626,42.433657],[-76.49459299999999,42.433761],[-76.494573,42.43387],[-76.494568,42.434027],[-76.49457,42.434055],[-76.494574,42.434128],[-76.49460500000001,42.434643],[-76.494619,42.434878],[-76.49471,42.434877],[-76.49521,42.434843],[-76.495772,42.434827],[-76.496703,42.434792],[-76.496703,42.434941],[-76.496735,42.435634],[-76.49674,42.435746],[-76.496779,42.436619],[-76.496792,42.436916],[-76.496673,42.436918],[-76.496556,42.436942],[-76.496084,42.437146],[-76.495655,42.437377],[-76.495473,42.437465],[-76.49526,42.437526],[-76.494986,42.437584],[-76.49477899999999,42.437609],[-76.494782,42.437672],[-76.49484200000001,42.43809],[-76.494885,42.438278],[-76.49495899999999,42.438408],[-76.495015,42.438506],[-76.49511200000001,42.438661],[-76.49513399999999,42.438695],[-76.494641,42.438761],[-76.493058,42.438636],[-76.491496,42.438329],[-76.490245,42.437935],[-76.490222,42.437919],[-76.489842,42.437667],[-76.489482,42.437352],[-76.489512,42.437317],[-76.49000700000001,42.436748],[-76.49073799999999,42.436194],[-76.490989,42.436001],[-76.49107600000001,42.43595],[-76.491163,42.435918],[-76.49119399999999,42.435913],[-76.49121100000001,42.435908],[-76.49151999999999,42.435895],[-76.49231399999999,42.435876],[-76.492328,42.435795],[-76.492322,42.435651],[-76.492306,42.435525],[-76.492144,42.43496],[-76.49170100000001,42.433759],[-76.49164,42.433593],[-76.491589,42.433413],[-76.49157,42.433287],[-76.491569,42.433238],[-76.491578,42.433058],[-76.49161700000001,42.432855],[-76.491668,42.432678],[-76.491741,42.432484],[-76.49213899999999,42.431537],[-76.49236500000001,42.431017],[-76.492391,42.430944],[-76.492431,42.430836],[-76.492454,42.43075],[-76.49245999999999,42.430705],[-76.49246100000001,42.430628],[-76.492439,42.430475],[-76.492418,42.430422],[-76.492383,42.430355],[-76.492341,42.430297],[-76.492293,42.430243],[-76.49204,42.429994],[-76.491832,42.429781],[-76.49176799999999,42.429728],[-76.491578,42.429545],[-76.491381,42.429359],[-76.49125600000001,42.429214],[-76.491192,42.429141],[-76.49150899999999,42.429272],[-76.49189200000001,42.429474],[-76.49194900000001,42.4295],[-76.492088,42.429539],[-76.49217299999999,42.429556],[-76.492465,42.42957],[-76.493512,42.429543],[-76.493756,42.42954],[-76.494095,42.429522],[-76.494276,42.429506],[-76.494449,42.42949],[-76.494512,42.42948],[-76.494685,42.429437],[-76.494916,42.429358],[-76.49504399999999,42.429308],[-76.49525199999999,42.429227],[-76.49575299999999,42.429041],[-76.496408,42.428789],[-76.49645599999999,42.428766],[-76.496624,42.428705],[-76.497004,42.428543],[-76.49757099999999,42.428301],[-76.498048,42.428119],[-76.498243,42.428117]]],"type":"Polygon"}
}