{
  "id": "360594144004",
  "type": "Feature",
  "properties": {
    "area_land":692076,
    "area_water":0,
    "geoid":"360594144004",
    "name":"Block Group 4",
    "state":"ny"
},
  "bbox": [
    -73.583254,
    40.653724,
    -73.565553,
    40.660375
],
  "geometry": {"coordinates":[[[-73.583254,40.657265],[-73.582217,40.657431],[-73.5819,40.657476],[-73.578954,40.658014],[-73.57800400000001,40.658173],[-73.575028,40.658696],[-73.571111,40.659412],[-73.57039,40.659544],[-73.56963500000001,40.659703],[-73.568962,40.659886],[-73.56833899999999,40.660041],[-73.568179,40.660057],[-73.567105,40.660263],[-73.56652099999999,40.660375],[-73.566326,40.659936],[-73.566264,40.659525],[-73.566254,40.659358],[-73.56625099999999,40.659306],[-73.566115,40.657969],[-73.56599199999999,40.657274],[-73.565753,40.655936],[-73.565748,40.655904],[-73.565799,40.655639],[-73.565839,40.655436],[-73.56594200000001,40.654904],[-73.565935,40.654792],[-73.565842,40.654736],[-73.565749,40.654656],[-73.565606,40.654472],[-73.565567,40.654384],[-73.56555299999999,40.654263],[-73.565568,40.654197],[-73.56562599999999,40.654112],[-73.56571700000001,40.654039],[-73.566115,40.65386],[-73.566812,40.653868],[-73.566958,40.653852],[-73.56718499999999,40.653842],[-73.567357,40.653839],[-73.567736,40.653822],[-73.568662,40.653766],[-73.56896500000001,40.653756],[-73.569705,40.653724],[-73.569913,40.65377],[-73.57013000000001,40.653748],[-73.57033199999999,40.653749],[-73.57074900000001,40.653778],[-73.57092,40.653807],[-73.571045,40.65382],[-73.571505,40.653904],[-73.57372700000001,40.654326],[-73.574322,40.654435],[-73.57494800000001,40.654549],[-73.57528000000001,40.654609],[-73.57626399999999,40.654786],[-73.576596,40.654829],[-73.576984,40.654847],[-73.57716499999999,40.654858],[-73.577439,40.654859],[-73.57759,40.654854],[-73.578174,40.654834],[-73.57852,40.654805],[-73.57898400000001,40.654722],[-73.579505,40.654609],[-73.58016000000001,40.654377],[-73.58148799999999,40.65563],[-73.582087,40.656196],[-73.582157,40.656258],[-73.58226999999999,40.656359],[-73.582359,40.656438],[-73.582413,40.656515],[-73.582864,40.656935],[-73.58312100000001,40.657151],[-73.58323900000001,40.657132],[-73.583254,40.657265]]],"type":"Polygon"}
}