{
  "id": "360010131002",
  "type": "Feature",
  "properties": {
    "area_land":161676,
    "area_water":0,
    "geoid":"360010131002",
    "name":"Block Group 2",
    "state":"ny"
},
  "bbox": [
    -73.698809,
    42.744364,
    -73.690064,
    42.747943
],
  "geometry": {"coordinates":[[[-73.698809,42.747036],[-73.69839399999999,42.747033],[-73.698211,42.747031],[-73.697546,42.746983],[-73.697439,42.746972],[-73.697339,42.746962],[-73.69697499999999,42.74689],[-73.696917,42.746879],[-73.69640699999999,42.746781],[-73.695973,42.747943],[-73.695065,42.747778],[-73.694123,42.747583],[-73.693173,42.747396],[-73.69239,42.747242],[-73.692218,42.747219],[-73.691568,42.747088],[-73.69064899999999,42.746906],[-73.69006400000001,42.746793],[-73.690359,42.745572],[-73.690651,42.744364],[-73.690955,42.744426],[-73.691502,42.744515],[-73.69240600000001,42.744702],[-73.69301900000001,42.744824],[-73.69315400000001,42.744856],[-73.69402700000001,42.745023],[-73.694975,42.745206],[-73.695909,42.745379],[-73.69649099999999,42.745519],[-73.69727,42.745629],[-73.69750000000001,42.745665],[-73.69764499999999,42.745685],[-73.69785400000001,42.745722],[-73.697969,42.745739],[-73.69804999999999,42.74575],[-73.698537,42.746523],[-73.69866,42.746749],[-73.69879,42.746986],[-73.698809,42.747036]]],"type":"Polygon"}
}