{
  "id": "360775902022",
  "type": "Feature",
  "properties": {
    "area_land":11052389,
    "area_water":45218,
    "geoid":"360775902022",
    "name":"Block Group 2",
    "state":"ny"
},
  "bbox": [
    -74.976809,
    42.661681,
    -74.920947,
    42.712768
],
  "geometry": {"coordinates":[[[-74.97669999999999,42.708841],[-74.976578,42.708832],[-74.976321,42.708832],[-74.975956,42.708855],[-74.975635,42.708894],[-74.97538299999999,42.708937],[-74.97511299999999,42.709002],[-74.97408799999999,42.709279],[-74.973409,42.709448],[-74.97306500000001,42.709525],[-74.97268699999999,42.709598],[-74.97217000000001,42.709668],[-74.97086400000001,42.709815],[-74.969398,42.710009],[-74.968906,42.710084],[-74.96848199999999,42.710143],[-74.96792000000001,42.710232],[-74.96718,42.710362],[-74.966936,42.710421],[-74.966803,42.71046],[-74.966646,42.710519],[-74.966517,42.710573],[-74.966291,42.710689],[-74.965157,42.711375],[-74.964769,42.711633],[-74.96403100000001,42.712084],[-74.963686,42.712283],[-74.96294,42.71265],[-74.96263500000001,42.712768],[-74.962346,42.71269],[-74.961974,42.712589],[-74.96135,42.712419],[-74.961084,42.712346],[-74.960768,42.71226],[-74.959986,42.712047],[-74.959351,42.711856],[-74.957418,42.711322],[-74.956585,42.711098],[-74.956103,42.710951],[-74.955609,42.71076],[-74.955344,42.710635],[-74.954947,42.710381],[-74.95465,42.710156],[-74.95453500000001,42.710062],[-74.954092,42.709673],[-74.953981,42.709592],[-74.953827,42.709504],[-74.953661,42.709423],[-74.953452,42.709348],[-74.952804,42.70916],[-74.95114100000001,42.708723],[-74.950749,42.708601],[-74.95015600000001,42.708386],[-74.949378,42.708019],[-74.948836,42.707742],[-74.94842300000001,42.70754],[-74.94812899999999,42.707413],[-74.945717,42.706586],[-74.943776,42.705968],[-74.943738,42.705955],[-74.942791,42.705635],[-74.94182499999999,42.705297],[-74.94164499999999,42.705207],[-74.941335,42.705022],[-74.941033,42.704794],[-74.94064400000001,42.70444],[-74.940307,42.704122],[-74.93970400000001,42.703494],[-74.939356,42.703082],[-74.939267,42.702982],[-74.939207,42.702908],[-74.939007,42.702558],[-74.938777,42.701958],[-74.938665,42.70174],[-74.938492,42.701486],[-74.93838,42.701373],[-74.93829599999999,42.701297],[-74.938031,42.701104],[-74.93727699999999,42.700627],[-74.937083,42.700468],[-74.936902,42.700305],[-74.936666,42.70007],[-74.936419,42.699777],[-74.93634299999999,42.699691],[-74.936159,42.69938],[-74.936061,42.699149],[-74.935996,42.699037],[-74.935903,42.698927],[-74.935768,42.698846],[-74.93554,42.698726],[-74.935372,42.698663],[-74.93526300000001,42.698628],[-74.935053,42.698592],[-74.93488499999999,42.698584],[-74.934611,42.698582],[-74.93367600000001,42.698561],[-74.933576,42.698551],[-74.933454,42.698544],[-74.93321,42.698497],[-74.93307799999999,42.698471],[-74.93277500000001,42.698413],[-74.931849,42.698208],[-74.930537,42.697902],[-74.930435,42.697857],[-74.93118800000001,42.697099],[-74.93144100000001,42.696856],[-74.93358499999999,42.694794],[-74.933797,42.694593],[-74.93397899999999,42.694422],[-74.93355200000001,42.694443],[-74.933285,42.694453],[-74.933229,42.694455],[-74.931194,42.694582],[-74.929793,42.694647],[-74.927922,42.694757],[-74.92636299999999,42.694832],[-74.92460199999999,42.694889],[-74.924097,42.696178],[-74.92278399999999,42.695887],[-74.922702,42.695866],[-74.922634,42.695834],[-74.92258200000001,42.69579],[-74.92216500000001,42.695454],[-74.92213599999999,42.695415],[-74.922116,42.695362],[-74.92212600000001,42.694841],[-74.922121,42.694788],[-74.92209699999999,42.694716],[-74.92188400000001,42.694481],[-74.921801,42.694406],[-74.921723,42.694367],[-74.92160199999999,42.694321],[-74.921481,42.694296],[-74.921272,42.694289],[-74.921229,42.694178],[-74.920967,42.693804],[-74.920947,42.693701],[-74.92117500000001,42.693124],[-74.921238,42.69302],[-74.921306,42.692974],[-74.921389,42.692945],[-74.921486,42.692945],[-74.921578,42.692992],[-74.921728,42.693102],[-74.921893,42.693302],[-74.922403,42.693875],[-74.922602,42.694025],[-74.92297499999999,42.694196],[-74.923126,42.694239],[-74.92325700000001,42.694249],[-74.92336299999999,42.694246],[-74.923474,42.694199],[-74.923608,42.694034],[-74.92371,42.693867],[-74.923731,42.693749],[-74.923738,42.693562],[-74.923731,42.693403],[-74.923738,42.693251],[-74.92377999999999,42.693133],[-74.923849,42.693037],[-74.923974,42.69296],[-74.924119,42.692912],[-74.92425799999999,42.692898],[-74.924361,42.692898],[-74.92447900000001,42.692947],[-74.924611,42.693037],[-74.924735,42.693182],[-74.92486,42.693355],[-74.92498500000001,42.693479],[-74.925102,42.693562],[-74.92525500000001,42.693611],[-74.92540700000001,42.693632],[-74.92550900000001,42.693632],[-74.925642,42.693597],[-74.925748,42.693554],[-74.92583,42.693469],[-74.925904,42.693328],[-74.92592399999999,42.693267],[-74.925945,42.693206],[-74.926028,42.693085],[-74.92610999999999,42.693007],[-74.926248,42.69297],[-74.926743,42.692879],[-74.926986,42.692829],[-74.927207,42.692701],[-74.92734,42.692589],[-74.927436,42.692468],[-74.927528,42.692282],[-74.92762399999999,42.692111],[-74.92797299999999,42.691814],[-74.928138,42.691679],[-74.92829399999999,42.691588],[-74.928555,42.691517],[-74.928922,42.691467],[-74.929523,42.691328],[-74.929908,42.69121],[-74.930082,42.691114],[-74.93017,42.691025],[-74.93017500000001,42.691008],[-74.93018600000001,42.690968],[-74.930193,42.69094],[-74.930179,42.690843],[-74.930109,42.690732],[-74.92995000000001,42.690601],[-74.929722,42.690483],[-74.92946499999999,42.6904],[-74.929147,42.690358],[-74.928842,42.690358],[-74.928641,42.690421],[-74.928378,42.690531],[-74.928073,42.690711],[-74.927984,42.690778],[-74.927547,42.691106],[-74.927443,42.691175],[-74.927346,42.69121],[-74.92720799999999,42.691203],[-74.927097,42.691147],[-74.926924,42.69094],[-74.92677,42.690683],[-74.92675699999999,42.690661],[-74.926446,42.690144],[-74.92640400000001,42.690026],[-74.92639800000001,42.689902],[-74.92646000000001,42.689798],[-74.926626,42.689618],[-74.92679200000001,42.689524],[-74.927111,42.689414],[-74.927319,42.689331],[-74.927644,42.689158],[-74.927845,42.689095],[-74.92810799999999,42.689033],[-74.928468,42.688971],[-74.928884,42.688964],[-74.92932,42.688985],[-74.930075,42.688947],[-74.93024800000001,42.688891],[-74.930345,42.688815],[-74.930407,42.688691],[-74.930414,42.688531],[-74.93033800000001,42.688386],[-74.930227,42.688289],[-74.930054,42.688158],[-74.92990899999999,42.688012],[-74.929759,42.687848],[-74.929706,42.687753],[-74.929689,42.687649],[-74.929725,42.687551],[-74.929804,42.687471],[-74.92993300000001,42.687372],[-74.930069,42.687294],[-74.93028,42.687194],[-74.93055699999999,42.687091],[-74.930892,42.686991],[-74.931292,42.686883],[-74.931522,42.686797],[-74.931675,42.686723],[-74.931769,42.686658],[-74.93185699999999,42.686567],[-74.93194800000001,42.686441],[-74.932013,42.686312],[-74.93206600000001,42.686178],[-74.932125,42.685966],[-74.932143,42.685775],[-74.932143,42.685646],[-74.932119,42.685529],[-74.932078,42.685438],[-74.93199,42.685317],[-74.931837,42.68517],[-74.93180099999999,42.685114],[-74.93180700000001,42.68504],[-74.93186,42.684958],[-74.932213,42.684711],[-74.932337,42.684655],[-74.932478,42.684612],[-74.932543,42.684607],[-74.932608,42.684603],[-74.932802,42.684629],[-74.932902,42.684668],[-74.93294299999999,42.684729],[-74.93296599999999,42.684785],[-74.93294899999999,42.684871],[-74.932896,42.685062],[-74.93289,42.685153],[-74.932925,42.685218],[-74.93297800000001,42.685261],[-74.933025,42.685269],[-74.93309000000001,42.685261],[-74.933178,42.685213],[-74.933284,42.685127],[-74.93392,42.684703],[-74.93409,42.684664],[-74.93452600000001,42.68466],[-74.934685,42.684651],[-74.934791,42.684629],[-74.934879,42.684595],[-74.93495,42.684538],[-74.934991,42.684474],[-74.93500299999999,42.684404],[-74.934967,42.684327],[-74.934926,42.684262],[-74.934775,42.684092],[-74.934494,42.683643],[-74.93441199999999,42.68348],[-74.934358,42.683355],[-74.934352,42.683234],[-74.934406,42.683169],[-74.934534,42.683091],[-74.934628,42.683062],[-74.934696,42.683058],[-74.93476200000001,42.683087],[-74.934827,42.683144],[-74.935006,42.683326],[-74.935106,42.683367],[-74.93522,42.68339],[-74.935692,42.683395],[-74.93582000000001,42.683386],[-74.935979,42.683355],[-74.93607299999999,42.683321],[-74.936184,42.683246],[-74.93629,42.683167],[-74.93636100000001,42.683081],[-74.936381,42.683012],[-74.936369,42.682951],[-74.936329,42.682899],[-74.93625299999999,42.682868],[-74.93603299999999,42.68283],[-74.935979,42.682794],[-74.935942,42.682746],[-74.93580300000001,42.682307],[-74.935732,42.682152],[-74.935678,42.682067],[-74.93558400000001,42.681991],[-74.935462,42.681962],[-74.935305,42.681954],[-74.935086,42.681972],[-74.934921,42.682004],[-74.934827,42.682048],[-74.934748,42.682125],[-74.934608,42.68228],[-74.93452600000001,42.68232],[-74.93446,42.682328],[-74.934383,42.68232],[-74.93429500000001,42.682288],[-74.93424400000001,42.682251],[-74.93420399999999,42.682173],[-74.93414199999999,42.682008],[-74.934124,42.681929],[-74.934124,42.681864],[-74.93415299999999,42.681807],[-74.934218,42.681765],[-74.934301,42.68173],[-74.934344,42.681694],[-74.93447999999999,42.681439],[-74.934506,42.68137],[-74.934551,42.681314],[-74.934628,42.68127],[-74.934938,42.681148],[-74.93507200000001,42.681075],[-74.93535900000001,42.680895],[-74.935519,42.68081],[-74.93561200000001,42.680787],[-74.93571799999999,42.680797],[-74.93580300000001,42.680843],[-74.93584300000001,42.680904],[-74.935866,42.681033],[-74.935857,42.681211],[-74.935857,42.681316],[-74.93588,42.681418],[-74.93601099999999,42.681646],[-74.936093,42.681738],[-74.936199,42.681788],[-74.93630899999999,42.68182],[-74.93640600000001,42.681816],[-74.936494,42.68178],[-74.93678199999999,42.681611],[-74.93686700000001,42.68154],[-74.936924,42.681458],[-74.936967,42.681353],[-74.93697,42.681263],[-74.936927,42.681146],[-74.936796,42.680879],[-74.93659100000001,42.680548],[-74.936483,42.680425],[-74.93636100000001,42.680352],[-74.93602199999999,42.680274],[-74.935911,42.680241],[-74.935863,42.680193],[-74.935863,42.680128],[-74.93588,42.680063],[-74.935962,42.679958],[-74.93679899999999,42.679203],[-74.936941,42.679118],[-74.937112,42.679044],[-74.937612,42.678911],[-74.937684,42.678886],[-74.937743,42.678852],[-74.93778,42.678798],[-74.93780599999999,42.67872],[-74.937811,42.678653],[-74.937783,42.678568],[-74.937718,42.678513],[-74.937533,42.678461],[-74.937203,42.678405],[-74.93712600000001,42.678369],[-74.93710299999999,42.678315],[-74.93711500000001,42.678248],[-74.93714300000001,42.678177],[-74.937206,42.678109],[-74.93731099999999,42.678044],[-74.937985,42.677818],[-74.938102,42.677761],[-74.938221,42.677682],[-74.938317,42.677573],[-74.938641,42.677126],[-74.93873499999999,42.677021],[-74.938917,42.676866],[-74.939139,42.676711],[-74.93928699999999,42.67664],[-74.93941,42.676607],[-74.93954600000001,42.676588],[-74.940161,42.676609],[-74.94039100000001,42.676609],[-74.94064400000001,42.676584],[-74.940809,42.67658],[-74.941256,42.676642],[-74.94159500000001,42.676716],[-74.9417,42.676728],[-74.941782,42.676716],[-74.941839,42.676684],[-74.941891,42.67664],[-74.941874,42.676465],[-74.941839,42.676298],[-74.941774,42.676226],[-74.941671,42.676144],[-74.94113900000001,42.675887],[-74.94056500000001,42.675729],[-74.94031699999999,42.675674],[-74.940077,42.675637],[-74.93995700000001,42.675637],[-74.93951800000001,42.675701],[-74.93880799999999,42.675729],[-74.938671,42.675701],[-74.938571,42.675646],[-74.938551,42.675619],[-74.938541,42.675564],[-74.93856100000001,42.675444],[-74.938596,42.675389],[-74.93893,42.67509],[-74.939475,42.674682],[-74.93956799999999,42.674599],[-74.939733,42.674498],[-74.93988,42.674443],[-74.940045,42.674397],[-74.940375,42.67437],[-74.94056,42.674324],[-74.940882,42.674195],[-74.94113900000001,42.674104],[-74.941869,42.673874],[-74.941969,42.673828],[-74.942069,42.673745],[-74.942151,42.673663],[-74.942199,42.673551],[-74.942224,42.673329],[-74.942179,42.673053],[-74.94205100000001,42.672741],[-74.942024,42.67264],[-74.942024,42.672539],[-74.94209600000001,42.67241],[-74.942261,42.672254],[-74.942391,42.672218],[-74.942583,42.672227],[-74.94303600000001,42.672392],[-74.94319,42.672484],[-74.943495,42.672612],[-74.94367800000001,42.672704],[-74.943808,42.672713],[-74.943955,42.672667],[-74.94403699999999,42.672557],[-74.944322,42.671926],[-74.944442,42.671705],[-74.94454500000001,42.671483],[-74.94459000000001,42.671255],[-74.94459999999999,42.67107],[-74.94459000000001,42.670941],[-74.94457199999999,42.670859],[-74.944525,42.670776],[-74.94434200000001,42.670601],[-74.94425,42.670491],[-74.94421199999999,42.670372],[-74.944202,42.670207],[-74.94423999999999,42.670078],[-74.944322,42.66992],[-74.944884,42.668978],[-74.945052,42.668629],[-74.945207,42.66813],[-74.94529900000001,42.667615],[-74.945322,42.667208],[-74.945357,42.66646],[-74.945357,42.666249],[-74.94541700000001,42.665894],[-74.945424,42.665729],[-74.94541700000001,42.665582],[-74.945369,42.665372],[-74.945232,42.665031],[-74.94517399999999,42.664858],[-74.945149,42.664709],[-74.94515699999999,42.664553],[-74.945212,42.664471],[-74.945314,42.664371],[-74.945714,42.664063],[-74.945769,42.66398],[-74.945886,42.663751],[-74.945944,42.663613],[-74.946071,42.663431],[-74.946201,42.663321],[-74.946366,42.663229],[-74.947512,42.662788],[-74.94788699999999,42.662709],[-74.948426,42.662712],[-74.948976,42.662715],[-74.94921600000001,42.662733],[-74.949409,42.662706],[-74.949519,42.66265],[-74.95008,42.662136],[-74.950154,42.662007],[-74.950191,42.661915],[-74.950209,42.661786],[-74.950191,42.661685],[-74.950796,42.661681],[-74.95092200000001,42.661708],[-74.951059,42.661892],[-74.951072,42.662058],[-74.95097800000001,42.66226],[-74.95085899999999,42.662472],[-74.95080900000001,42.66261],[-74.95080900000001,42.662762],[-74.950903,42.662794],[-74.950953,42.66278],[-74.951272,42.66255],[-74.95142199999999,42.662458],[-74.95166,42.662458],[-74.95181700000001,42.662504],[-74.951904,42.662624],[-74.951948,42.662734],[-74.952011,42.663052],[-74.95209199999999,42.66313],[-74.952167,42.66319],[-74.95223,42.663282],[-74.952392,42.663682],[-74.952505,42.663866],[-74.95259299999999,42.663986],[-74.952718,42.664124],[-74.952856,42.664216],[-74.952962,42.664262],[-74.953194,42.664262],[-74.953481,42.664184],[-74.953744,42.664156],[-74.953926,42.664156],[-74.954283,42.664368],[-74.954452,42.664506],[-74.954808,42.664763],[-74.954927,42.664901],[-74.954958,42.664993],[-74.954971,42.665099],[-74.954927,42.665448],[-74.954958,42.665655],[-74.955127,42.665913],[-74.95555299999999,42.666249],[-74.955866,42.666534],[-74.956022,42.666594],[-74.956129,42.666608],[-74.95634200000001,42.666608],[-74.956642,42.666534],[-74.957268,42.666286],[-74.95784999999999,42.666148],[-74.95868900000001,42.666037],[-74.95907,42.66601],[-74.959715,42.665946],[-74.95996599999999,42.665922],[-74.960798,42.665904],[-74.96143600000001,42.666083],[-74.962384,42.666319],[-74.96262900000001,42.666396],[-74.962721,42.666457],[-74.962782,42.666564],[-74.962767,42.666778],[-74.96279699999999,42.666916],[-74.962935,42.667099],[-74.963027,42.667344],[-74.963027,42.667635],[-74.963104,42.667803],[-74.963195,42.66791],[-74.96345599999999,42.66817],[-74.963532,42.668277],[-74.963548,42.668369],[-74.963532,42.668415],[-74.96333300000001,42.668492],[-74.963211,42.668568],[-74.96311900000001,42.66869],[-74.96307299999999,42.66892],[-74.963171,42.669265],[-74.963217,42.669356],[-74.963283,42.66942],[-74.96338900000001,42.669481],[-74.96361899999999,42.669635],[-74.963651,42.669678],[-74.963694,42.6698],[-74.96371000000001,42.669921],[-74.963667,42.670016],[-74.963239,42.670216],[-74.963106,42.670459],[-74.96276899999999,42.670762],[-74.962475,42.670915],[-74.96244299999999,42.671021],[-74.962475,42.671127],[-74.962705,42.671327],[-74.96276899999999,42.671449],[-74.962796,42.671618],[-74.96275300000001,42.671681],[-74.962598,42.671724],[-74.96244299999999,42.671787],[-74.962374,42.671877],[-74.96234200000001,42.672077],[-74.962283,42.672337],[-74.962299,42.67258],[-74.96239,42.672824],[-74.96255499999999,42.673067],[-74.963026,42.673601],[-74.96319699999999,42.673817],[-74.963223,42.673939],[-74.963149,42.674092],[-74.96266799999999,42.67423],[-74.96234200000001,42.674277],[-74.96191399999999,42.674552],[-74.961668,42.674795],[-74.96054599999999,42.676178],[-74.960429,42.676252],[-74.96021500000001,42.676268],[-74.959762,42.676252],[-74.959639,42.676299],[-74.959548,42.676347],[-74.959473,42.676437],[-74.959441,42.676574],[-74.959425,42.676818],[-74.95939300000001,42.67705],[-74.959243,42.677489],[-74.959163,42.677749],[-74.959104,42.678055],[-74.959104,42.678314],[-74.95912,42.678621],[-74.95919499999999,42.678789],[-74.95927,42.678911],[-74.95951599999999,42.67917],[-74.95981,42.679398],[-74.959917,42.679504],[-74.959991,42.679626],[-74.959959,42.67972],[-74.959836,42.679838],[-74.959746,42.679959],[-74.95971299999999,42.680312],[-74.959671,42.680403],[-74.95960700000001,42.680462],[-74.959532,42.680509],[-74.95889099999999,42.680815],[-74.958538,42.681039],[-74.958249,42.681286],[-74.957881,42.681816],[-74.957774,42.68206],[-74.95771499999999,42.682351],[-74.95764,42.682637],[-74.957565,42.682912],[-74.95749600000001,42.683085],[-74.957319,42.68316],[-74.957148,42.68316],[-74.95701,42.68325],[-74.95694,42.683376],[-74.95694,42.683501],[-74.95697199999999,42.683658],[-74.95707899999999,42.683764],[-74.957542,42.683973],[-74.95764800000001,42.684195],[-74.95766,42.68422],[-74.95769300000001,42.684335],[-74.95769300000001,42.684443],[-74.957655,42.68461],[-74.957598,42.684785],[-74.957466,42.685112],[-74.95741099999999,42.68529],[-74.957335,42.685676],[-74.957302,42.685816],[-74.95725,42.685941],[-74.95705,42.686321],[-74.95701699999999,42.686443],[-74.956998,42.686589],[-74.956998,42.686958],[-74.957027,42.687394],[-74.95702900000001,42.687533],[-74.957004,42.687716],[-74.95696100000001,42.687867],[-74.95651700000001,42.687829],[-74.956591,42.688687],[-74.95661800000001,42.688829],[-74.956658,42.688966],[-74.95674200000001,42.689169],[-74.957176,42.690104],[-74.957413,42.69072],[-74.95753999999999,42.690994],[-74.957577,42.691054],[-74.957669,42.691174],[-74.95774299999999,42.691257],[-74.957914,42.69142],[-74.95814300000001,42.691592],[-74.958414,42.691762],[-74.959299,42.692284],[-74.95947700000001,42.692404],[-74.96014099999999,42.692901],[-74.961389,42.693823],[-74.96222400000001,42.694428],[-74.962626,42.694724],[-74.96283099999999,42.694864],[-74.962937,42.694942],[-74.96308500000001,42.695025],[-74.963262,42.695113],[-74.963509,42.695227],[-74.963728,42.695321],[-74.964652,42.695673],[-74.964877,42.69576],[-74.965132,42.69586],[-74.96549899999999,42.696031],[-74.965718,42.696145],[-74.965908,42.696254],[-74.966155,42.696415],[-74.966289,42.696508],[-74.966825,42.696949],[-74.97044200000001,42.69999],[-74.97126400000001,42.700681],[-74.9729,42.702039],[-74.973242,42.702343],[-74.973688,42.702804],[-74.97395299999999,42.703088],[-74.97418999999999,42.703357],[-74.974428,42.703628],[-74.974828,42.704133],[-74.975066,42.704468],[-74.975618,42.705324],[-74.976062,42.706063],[-74.97615999999999,42.706307],[-74.97616600000001,42.706322],[-74.976257,42.706645],[-74.976322,42.707039],[-74.976331,42.707082],[-74.97662800000001,42.70847],[-74.976693,42.708652],[-74.976809,42.708858],[-74.97669999999999,42.708841]]],"type":"Polygon"}
}