{
  "id": "360850125003",
  "type": "Feature",
  "properties": {
    "area_land":152529,
    "area_water":0,
    "geoid":"360850125003",
    "name":"Block Group 3",
    "state":"ny"
},
  "bbox": [
    -74.120129,
    40.623042,
    -74.113309,
    40.628702
],
  "geometry": {"coordinates":[[[-74.12012900000001,40.626536],[-74.118133,40.627872],[-74.117833,40.627624],[-74.11614299999999,40.628702],[-74.11595199999999,40.62823],[-74.11588500000001,40.628089],[-74.11561,40.627549],[-74.115448,40.627221],[-74.11526000000001,40.62686],[-74.115011,40.626377],[-74.114743,40.625864],[-74.114093,40.6246],[-74.113934,40.62433],[-74.113585,40.623698],[-74.113309,40.623042],[-74.11539,40.623887],[-74.117127,40.624533],[-74.11755700000001,40.624693],[-74.11787699999999,40.624834],[-74.1181,40.624963],[-74.11823099999999,40.625077],[-74.118459,40.625269],[-74.119165,40.625824],[-74.119666,40.626185],[-74.12012900000001,40.626536]]],"type":"Polygon"}
}