{
  "id": "360471128001",
  "type": "Feature",
  "properties": {
    "area_land":52241,
    "area_water":0,
    "geoid":"360471128001",
    "name":"Block Group 1",
    "state":"ny"
},
  "bbox": [
    -73.891738,
    40.660636,
    -73.888385,
    40.663778
],
  "geometry": {"coordinates":[[[-73.891738,40.663507],[-73.89082999999999,40.663641],[-73.88990699999999,40.663778],[-73.889785,40.663295],[-73.888385,40.661338],[-73.8892,40.660988],[-73.89001500000001,40.660636],[-73.89144899999999,40.662563],[-73.891738,40.663507]]],"type":"Polygon"}
}