{
  "id": "360110411002",
  "type": "Feature",
  "properties": {
    "area_land":22129046,
    "area_water":6403513,
    "geoid":"360110411002",
    "name":"Block Group 2",
    "state":"ny"
},
  "bbox": [
    -76.576027,
    42.838574,
    -76.515348,
    42.911598
],
  "geometry": {"coordinates":[[[-76.576021,42.886213],[-76.576004,42.886499],[-76.57593900000001,42.887351],[-76.57589400000001,42.888044],[-76.575716,42.890521],[-76.575678,42.890912],[-76.575653,42.891063],[-76.57561099999999,42.891225],[-76.575557,42.891375],[-76.57549,42.891539],[-76.575419,42.891673],[-76.575339,42.891808],[-76.57528499999999,42.891892],[-76.57524600000001,42.891948],[-76.575163,42.892062],[-76.57501999999999,42.89223],[-76.57490199999999,42.89235],[-76.57476699999999,42.892469],[-76.574628,42.892581],[-76.574505,42.89267],[-76.57422699999999,42.892847],[-76.57408599999999,42.892925],[-76.573928,42.893003],[-76.57373800000001,42.893088],[-76.573452,42.893197],[-76.57051800000001,42.894231],[-76.57032,42.894294],[-76.56982499999999,42.894463],[-76.569333,42.894646],[-76.569169,42.894704],[-76.568392,42.894977],[-76.56816499999999,42.895061],[-76.567964,42.895147],[-76.567791,42.895233],[-76.56760300000001,42.895335],[-76.567404,42.895462],[-76.567289,42.895544],[-76.56705100000001,42.895735],[-76.56695000000001,42.895829],[-76.56684199999999,42.895938],[-76.566737,42.896055],[-76.56658,42.896256],[-76.566514,42.896367],[-76.566447,42.896467],[-76.566378,42.896594],[-76.56634,42.896677],[-76.566301,42.896778],[-76.56626,42.896887],[-76.566213,42.897044],[-76.566166,42.897268],[-76.566148,42.897398],[-76.56614,42.897512],[-76.566137,42.897655],[-76.566171,42.89825],[-76.56619999999999,42.898641],[-76.56620599999999,42.898886],[-76.566192,42.899145],[-76.56616099999999,42.899395],[-76.566115,42.899642],[-76.566039,42.89992],[-76.56593700000001,42.900222],[-76.565899,42.90032],[-76.565873,42.900389],[-76.565747,42.900647],[-76.56562,42.900879],[-76.56511,42.901703],[-76.564638,42.902453],[-76.56447900000001,42.902715],[-76.564424,42.902816],[-76.56432700000001,42.903031],[-76.564284,42.903147],[-76.56425,42.903266],[-76.564204,42.903484],[-76.564182,42.903616],[-76.564179,42.903901],[-76.56424699999999,42.904896],[-76.564289,42.905519],[-76.564335,42.906242],[-76.56437200000001,42.906788],[-76.564392,42.907103],[-76.564504,42.908948],[-76.564548,42.909569],[-76.56460199999999,42.910452],[-76.56462500000001,42.91074],[-76.564646,42.911128],[-76.561431,42.91126],[-76.555559,42.911511],[-76.552937,42.911594],[-76.552729,42.911598],[-76.552689,42.911237],[-76.55265300000001,42.911056],[-76.55260800000001,42.910904],[-76.552592,42.91085],[-76.55254499999999,42.910723],[-76.55242800000001,42.910476],[-76.552313,42.910282],[-76.552198,42.910113],[-76.552149,42.91005],[-76.552125,42.91002],[-76.55195500000001,42.909819],[-76.551857,42.909719],[-76.551765,42.909635],[-76.551653,42.909543],[-76.551418,42.909362],[-76.55057100000001,42.90876],[-76.55046299999999,42.908683],[-76.547425,42.906603],[-76.54554,42.908086],[-76.545479,42.908133],[-76.54530699999999,42.908084],[-76.545044,42.908051],[-76.54486300000001,42.908029],[-76.54447399999999,42.90806],[-76.544191,42.908148],[-76.543825,42.908241],[-76.543617,42.908324],[-76.543451,42.908377],[-76.54321899999999,42.90841],[-76.54295500000001,42.908382],[-76.54289900000001,42.90832],[-76.54279699999999,42.908111],[-76.54270099999999,42.907969],[-76.54263899999999,42.907821],[-76.542422,42.90764],[-76.542259,42.907504],[-76.541517,42.907121],[-76.54126599999999,42.906922],[-76.54098399999999,42.906643],[-76.540592,42.906142],[-76.540361,42.905833],[-76.540351,42.905807],[-76.540205,42.905446],[-76.54012899999999,42.905176],[-76.54007300000001,42.904808],[-76.540053,42.904593],[-76.54050700000001,42.9046],[-76.5416,42.90481],[-76.54197600000001,42.904944],[-76.54214899999999,42.904989],[-76.542396,42.904998],[-76.542456,42.904972],[-76.54258799999999,42.904915],[-76.54297699999999,42.904548],[-76.543058,42.904292],[-76.543059,42.904225],[-76.543029,42.90412],[-76.54290899999999,42.903972],[-76.542772,42.903835],[-76.54265100000001,42.903736],[-76.542636,42.903674],[-76.54263400000001,42.903645],[-76.542624,42.903472],[-76.54266200000001,42.903289],[-76.542715,42.903229],[-76.54264499999999,42.902451],[-76.542616,42.902402],[-76.54232,42.901905],[-76.539,42.896346],[-76.535285,42.890124],[-76.533559,42.887235],[-76.527753,42.877515],[-76.526292,42.875068],[-76.52469499999999,42.871659],[-76.52357499999999,42.869006],[-76.522094,42.865926],[-76.520996,42.863],[-76.52008499999999,42.85997],[-76.519908,42.859446],[-76.51884699999999,42.85631],[-76.518338,42.854845],[-76.51804300000001,42.853996],[-76.518013,42.853866],[-76.517512,42.851675],[-76.516993,42.849451],[-76.516791,42.84819],[-76.516508,42.846429],[-76.5162,42.844904],[-76.516093,42.844373],[-76.515513,42.841505],[-76.515348,42.840964],[-76.52614699999999,42.840569],[-76.526411,42.840571],[-76.52676200000001,42.840568],[-76.52905199999999,42.840232],[-76.529917,42.840217],[-76.530199,42.840208],[-76.53107,42.840181],[-76.53205,42.840158],[-76.532348,42.840145],[-76.53267700000001,42.840138],[-76.53516,42.840061],[-76.535645,42.840043],[-76.53691499999999,42.840015],[-76.538241,42.839965],[-76.538708,42.839942],[-76.538797,42.839939],[-76.53912800000001,42.839929],[-76.53953300000001,42.839908],[-76.54014100000001,42.839883],[-76.54021,42.83988],[-76.541359,42.839845],[-76.54159300000001,42.839841],[-76.543465,42.839782],[-76.543657,42.839772],[-76.54410300000001,42.839758],[-76.545472,42.839702],[-76.545935,42.83969],[-76.548033,42.839602],[-76.548215,42.839591],[-76.54916,42.839554],[-76.54939400000001,42.839542],[-76.54982099999999,42.839531],[-76.55045699999999,42.839498],[-76.550878,42.83948],[-76.55106600000001,42.839476],[-76.551535,42.839456],[-76.555065,42.839337],[-76.556411,42.839286],[-76.557863,42.839221],[-76.55802199999999,42.839221],[-76.558403,42.839195],[-76.559371,42.839161],[-76.559871,42.839148],[-76.56030699999999,42.839125],[-76.56065599999999,42.839117],[-76.563937,42.838999],[-76.56433800000001,42.838985],[-76.566968,42.838881],[-76.568375,42.838836],[-76.570187,42.838757],[-76.57110900000001,42.838731],[-76.571945,42.838693],[-76.572067,42.83869],[-76.572318,42.838684],[-76.57314599999999,42.838652],[-76.57399599999999,42.838627],[-76.575349,42.838574],[-76.575378,42.838816],[-76.575397,42.839047],[-76.57543800000001,42.83988],[-76.575481,42.840937],[-76.575484,42.84116],[-76.575463,42.841597],[-76.5753,42.843879],[-76.57498099999999,42.848348],[-76.574912,42.849248],[-76.574896,42.849649],[-76.574716,42.855507],[-76.57470000000001,42.855772],[-76.574625,42.857545],[-76.574564,42.85861],[-76.574556,42.858869],[-76.574506,42.859933],[-76.574493,42.86006],[-76.574449,42.860302],[-76.574067,42.861716],[-76.573722,42.863054],[-76.57356,42.863731],[-76.573543,42.863861],[-76.573527,42.8641],[-76.573525,42.864358],[-76.573567,42.864873],[-76.57372700000001,42.867161],[-76.57372700000001,42.867286],[-76.573739,42.867466],[-76.57379899999999,42.868306],[-76.57385600000001,42.869338],[-76.57388,42.86986],[-76.573936,42.870738],[-76.573994,42.871387],[-76.574125,42.872596],[-76.57413200000001,42.872734],[-76.574155,42.872961],[-76.574183,42.873231],[-76.574225,42.873553],[-76.574297,42.874312],[-76.57445199999999,42.87583],[-76.574476,42.876173],[-76.574512,42.876433],[-76.57452499999999,42.876633],[-76.57452499999999,42.876911],[-76.574445,42.879169],[-76.57441300000001,42.880361],[-76.57441,42.880565],[-76.574417,42.8807],[-76.57443000000001,42.880825],[-76.57445300000001,42.880962],[-76.57453700000001,42.881254],[-76.574656,42.881573],[-76.575575,42.883916],[-76.57577000000001,42.88443],[-76.575897,42.884876],[-76.57595499999999,42.885166],[-76.57599500000001,42.885427],[-76.576021,42.885749],[-76.576027,42.885922],[-76.576021,42.886213]]],"type":"Polygon"}
}