{
  "id": "361190034001",
  "type": "Feature",
  "properties": {
    "area_land":156732,
    "area_water":0,
    "geoid":"361190034001",
    "name":"Block Group 1",
    "state":"ny"
},
  "bbox": [
    -73.819213,
    40.906868,
    -73.813663,
    40.91191
],
  "geometry": {"coordinates":[[[-73.819213,40.909463],[-73.81862599999999,40.909994],[-73.81850900000001,40.910099],[-73.818061,40.91055],[-73.817514,40.911099],[-73.81777599999999,40.911261],[-73.817995,40.911379],[-73.81804200000001,40.911393],[-73.81765799999999,40.911815],[-73.817571,40.91191],[-73.817455,40.911891],[-73.8167,40.911766],[-73.815933,40.911605],[-73.813931,40.911139],[-73.813795,40.911108],[-73.81367,40.91108],[-73.81366300000001,40.910866],[-73.813677,40.910767],[-73.813733,40.910563],[-73.81379800000001,40.910459],[-73.81384300000001,40.910424],[-73.81397200000001,40.910397],[-73.81398900000001,40.910393],[-73.814077,40.910423],[-73.81411900000001,40.910437],[-73.814266,40.910487],[-73.814408,40.910473],[-73.814453,40.910445],[-73.814491,40.910397],[-73.814533,40.910272],[-73.814539,40.910177],[-73.81446,40.909938],[-73.814339,40.909705],[-73.814302,40.909585],[-73.814187,40.909216],[-73.81383700000001,40.908428],[-73.81376400000001,40.908196],[-73.81373600000001,40.908098],[-73.81371900000001,40.907901],[-73.813754,40.907666],[-73.813802,40.907434],[-73.8138,40.907339],[-73.813799,40.90725],[-73.81378599999999,40.907196],[-73.81383099999999,40.907158],[-73.813974,40.907079],[-73.81416400000001,40.907011],[-73.814836,40.906868],[-73.815434,40.907203],[-73.81630800000001,40.907723],[-73.81829,40.908909],[-73.81888499999999,40.909278],[-73.819213,40.909463]]],"type":"Polygon"}
}