{
  "id": "360290168001",
  "type": "Feature",
  "properties": {
    "area_land":465466,
    "area_water":0,
    "geoid":"360290168001",
    "name":"Block Group 1",
    "state":"ny"
},
  "bbox": [
    -78.862566,
    42.903838,
    -78.853965,
    42.91015
],
  "geometry": {"coordinates":[[[-78.862551,42.904856],[-78.86253499999999,42.905755],[-78.862517,42.906689],[-78.862498,42.907584],[-78.862477,42.908477],[-78.86246199999999,42.909006],[-78.862447,42.909497],[-78.861862,42.909483],[-78.859627,42.909443],[-78.859618,42.91015],[-78.856825,42.910119],[-78.855577,42.910107],[-78.853979,42.910104],[-78.853978,42.909852],[-78.853966,42.909373],[-78.853965,42.909027],[-78.853965,42.908368],[-78.853965,42.908236],[-78.853966,42.907454],[-78.853978,42.906579],[-78.85398600000001,42.906037],[-78.85398600000001,42.905648],[-78.85398600000001,42.90485],[-78.85397399999999,42.903838],[-78.85522899999999,42.903854],[-78.856208,42.903866],[-78.857148,42.903878],[-78.857327,42.90388],[-78.859741,42.903909],[-78.86148799999999,42.903933],[-78.862566,42.903948],[-78.862551,42.904856]]],"type":"Polygon"}
}