{
  "id": "361090013001",
  "type": "Feature",
  "properties": {
    "area_land":15229125,
    "area_water":26502,
    "geoid":"361090013001",
    "name":"Block Group 1",
    "state":"ny"
},
  "bbox": [
    -76.472117,
    42.395174,
    -76.382207,
    42.443343
],
  "geometry": {"coordinates":[[[-76.471889,42.429386],[-76.470798,42.429436],[-76.470303,42.429457],[-76.46954700000001,42.429488],[-76.46835900000001,42.429535],[-76.467524,42.429567],[-76.466993,42.429588],[-76.46499799999999,42.429641],[-76.462479,42.429691],[-76.462772,42.431547],[-76.462801,42.431754],[-76.46283699999999,42.432023],[-76.463116,42.433645],[-76.463273,42.434638],[-76.463351,42.434926],[-76.46347900000001,42.435212],[-76.46356,42.435391],[-76.463864,42.435959],[-76.463902,42.436134],[-76.464061,42.436173],[-76.464169,42.436207],[-76.464786,42.436384],[-76.464789,42.436555],[-76.46481199999999,42.43674],[-76.464861,42.436924],[-76.464905,42.437031],[-76.46511599999999,42.437491],[-76.46544900000001,42.438181],[-76.46568000000001,42.438683],[-76.466126,42.43965],[-76.46630500000001,42.439953],[-76.46651799999999,42.440302],[-76.466584,42.440418],[-76.466666,42.44053],[-76.466762,42.440632],[-76.46687300000001,42.440725],[-76.46699599999999,42.440809],[-76.46713200000001,42.440884],[-76.467276,42.44095],[-76.46802,42.441242],[-76.468335,42.441391],[-76.468627,42.441558],[-76.468869,42.441731],[-76.469078,42.441895],[-76.46890399999999,42.442021],[-76.468802,42.442039],[-76.468791,42.442009],[-76.46873100000001,42.441944],[-76.468716,42.441911],[-76.46867899999999,42.441872],[-76.468642,42.441817],[-76.468583,42.441757],[-76.468568,42.441719],[-76.468457,42.441609],[-76.46839,42.441565],[-76.46825699999999,42.44151],[-76.46822,42.441499],[-76.468192,42.441482],[-76.468086,42.441455],[-76.46802700000001,42.441433],[-76.46786400000001,42.4414],[-76.467575,42.441351],[-76.467516,42.441335],[-76.467338,42.441313],[-76.4667,42.441214],[-76.466159,42.441105],[-76.46568499999999,42.441055],[-76.46547700000001,42.441039],[-76.465062,42.441017],[-76.464707,42.441011],[-76.464277,42.441028],[-76.463714,42.441105],[-76.463514,42.441149],[-76.46322499999999,42.44116],[-76.462884,42.441122],[-76.462632,42.441105],[-76.462565,42.441116],[-76.46245399999999,42.441144],[-76.462232,42.44127],[-76.462157,42.441292],[-76.46194300000001,42.441325],[-76.461713,42.441353],[-76.46135700000001,42.441375],[-76.461209,42.441375],[-76.460883,42.441342],[-76.460601,42.441292],[-76.460379,42.441271],[-76.45994899999999,42.441243],[-76.459712,42.441243],[-76.459163,42.441276],[-76.45875599999999,42.441309],[-76.45860999999999,42.441316],[-76.45820000000001,42.441337],[-76.457607,42.441337],[-76.457415,42.441326],[-76.457185,42.441299],[-76.45705100000001,42.441271],[-76.456985,42.441244],[-76.456829,42.441161],[-76.45660700000001,42.441057],[-76.456532,42.44103],[-76.456355,42.440975],[-76.456221,42.440953],[-76.45611,42.440964],[-76.455977,42.44103],[-76.455791,42.441162],[-76.45571700000001,42.4412],[-76.45557599999999,42.441228],[-76.455495,42.441217],[-76.455384,42.441173],[-76.455236,42.441074],[-76.45501299999999,42.440854],[-76.454976,42.440811],[-76.45494600000001,42.440761],[-76.454902,42.440706],[-76.454798,42.440618],[-76.454628,42.440459],[-76.45447900000001,42.44035],[-76.45442,42.440333],[-76.45426500000001,42.440311],[-76.45381999999999,42.440284],[-76.453546,42.440262],[-76.45349400000001,42.440262],[-76.453249,42.440295],[-76.45309399999999,42.440322],[-76.452664,42.440344],[-76.45250799999999,42.440344],[-76.45222699999999,42.440377],[-76.452108,42.440405],[-76.45208599999999,42.440416],[-76.452034,42.440427],[-76.452004,42.440443],[-76.45196,42.440454],[-76.451626,42.440608],[-76.451137,42.440921],[-76.45092200000001,42.441031],[-76.450841,42.441064],[-76.450796,42.441091],[-76.450641,42.441168],[-76.45053,42.441228],[-76.450441,42.441267],[-76.450307,42.441283],[-76.450233,42.441283],[-76.45002599999999,42.441245],[-76.449996,42.441228],[-76.44986299999999,42.441201],[-76.449529,42.441036],[-76.44939599999999,42.441003],[-76.449241,42.440982],[-76.449218,42.440976],[-76.448734,42.440982],[-76.448714,42.440982],[-76.448573,42.440971],[-76.44838,42.440927],[-76.448329,42.440899],[-76.44813600000001,42.440855],[-76.448099,42.440855],[-76.448032,42.440883],[-76.447988,42.440938],[-76.447973,42.440982],[-76.447951,42.441004],[-76.447936,42.441058],[-76.447914,42.441075],[-76.44789900000001,42.441119],[-76.44787599999999,42.441141],[-76.447862,42.441168],[-76.447802,42.44124],[-76.447788,42.441273],[-76.447765,42.441295],[-76.447751,42.441322],[-76.447743,42.44136],[-76.447773,42.441602],[-76.44780299999999,42.441706],[-76.44782499999999,42.441734],[-76.44784,42.441767],[-76.447862,42.441794],[-76.44787700000001,42.441832],[-76.447958,42.441931],[-76.447973,42.44197],[-76.44801,42.442008],[-76.448106,42.442123],[-76.448173,42.442173],[-76.44824699999999,42.442255],[-76.448255,42.442283],[-76.448284,42.442299],[-76.448292,42.442392],[-76.448284,42.442475],[-76.44821,42.442557],[-76.44806199999999,42.442639],[-76.447988,42.442656],[-76.447684,42.442694],[-76.446995,42.442716],[-76.44679499999999,42.442716],[-76.446713,42.442711],[-76.44656500000001,42.442694],[-76.44640200000001,42.442645],[-76.446217,42.442563],[-76.445994,42.44242],[-76.44569799999999,42.442184],[-76.44559099999999,42.442108],[-76.445075,42.441739],[-76.44502300000001,42.441712],[-76.444912,42.441685],[-76.44478599999999,42.441668],[-76.444675,42.441668],[-76.44460100000001,42.441685],[-76.444519,42.441712],[-76.444356,42.441816],[-76.44423,42.44191],[-76.444119,42.442041],[-76.44408199999999,42.442118],[-76.44405999999999,42.442151],[-76.44403,42.442179],[-76.444023,42.442255],[-76.44399300000001,42.442272],[-76.443979,42.442404],[-76.443949,42.442574],[-76.44391899999999,42.44259],[-76.443912,42.442667],[-76.443882,42.442684],[-76.44386,42.442738],[-76.443808,42.442782],[-76.443727,42.442837],[-76.44361600000001,42.442859],[-76.443504,42.442859],[-76.44324,42.442806],[-76.443178,42.442793],[-76.44300800000001,42.442711],[-76.442948,42.442695],[-76.442778,42.442612],[-76.4426,42.442503],[-76.442556,42.442464],[-76.442415,42.442382],[-76.44211799999999,42.442151],[-76.441785,42.441915],[-76.441703,42.441888],[-76.441577,42.44186],[-76.44146600000001,42.441844],[-76.441118,42.441822],[-76.441058,42.441822],[-76.44085800000001,42.44186],[-76.440814,42.441888],[-76.44077,42.441904],[-76.44068799999999,42.44197],[-76.44066599999999,42.442031],[-76.44066599999999,42.442069],[-76.44068799999999,42.442124],[-76.440836,42.442256],[-76.440873,42.4423],[-76.440888,42.442354],[-76.44090300000001,42.442376],[-76.44091,42.442409],[-76.44085800000001,42.442558],[-76.440821,42.442601],[-76.440777,42.44264],[-76.44047399999999,42.442678],[-76.440451,42.442684],[-76.440406,42.442711],[-76.440377,42.44275],[-76.440355,42.442805],[-76.440332,42.442892],[-76.44031,42.442936],[-76.440303,42.442975],[-76.44028,42.442997],[-76.44026599999999,42.44303],[-76.44015400000001,42.443128],[-76.44003600000001,42.443183],[-76.439977,42.443189],[-76.439888,42.443178],[-76.439784,42.443123],[-76.439702,42.443052],[-76.439688,42.443002],[-76.43966500000001,42.442986],[-76.43961299999999,42.442931],[-76.439599,42.442892],[-76.439576,42.442865],[-76.439539,42.442794],[-76.43952400000001,42.442755],[-76.43951,42.442733],[-76.43942800000001,42.442645],[-76.439384,42.44264],[-76.43928,42.442755],[-76.43928,42.442783],[-76.439243,42.442838],[-76.439206,42.442914],[-76.43919099999999,42.442969],[-76.439176,42.442991],[-76.43914700000001,42.443096],[-76.439117,42.44315],[-76.439058,42.443222],[-76.439043,42.443266],[-76.43898299999999,42.443332],[-76.438924,42.443343],[-76.438858,42.443343],[-76.43874599999999,42.443271],[-76.43872399999999,42.443249],[-76.43870200000001,42.44315],[-76.438717,42.442997],[-76.438761,42.442903],[-76.438776,42.442887],[-76.43882000000001,42.442755],[-76.438828,42.442706],[-76.438857,42.442618],[-76.43885,42.442547],[-76.438761,42.442464],[-76.43870200000001,42.442464],[-76.43862799999999,42.442481],[-76.438554,42.442547],[-76.43848699999999,42.442618],[-76.438479,42.442656],[-76.43845,42.442673],[-76.43844199999999,42.442711],[-76.438413,42.442733],[-76.438405,42.442755],[-76.438153,42.443052],[-76.438057,42.443123],[-76.438005,42.443134],[-76.43785699999999,42.443118],[-76.43776099999999,42.443096],[-76.437738,42.443079],[-76.43767200000001,42.443068],[-76.43759799999999,42.443024],[-76.43759799999999,42.442958],[-76.437635,42.442914],[-76.437731,42.442832],[-76.437961,42.442678],[-76.43801999999999,42.442613],[-76.438042,42.442519],[-76.438035,42.442475],[-76.43795299999999,42.442409],[-76.437827,42.442426],[-76.437738,42.442448],[-76.43764899999999,42.442475],[-76.437449,42.442519],[-76.43736800000001,42.442519],[-76.43730100000001,42.442508],[-76.43719,42.442426],[-76.437183,42.442393],[-76.437153,42.442366],[-76.437145,42.442316],[-76.437116,42.4423],[-76.43710799999999,42.442256],[-76.437079,42.442234],[-76.437071,42.442179],[-76.437049,42.442162],[-76.437027,42.442086],[-76.437049,42.441822],[-76.437071,42.441806],[-76.437071,42.441778],[-76.43708599999999,42.441734],[-76.437071,42.441652],[-76.437034,42.441625],[-76.43699700000001,42.441614],[-76.436916,42.441619],[-76.43680500000001,42.441636],[-76.436775,42.44163],[-76.436716,42.441652],[-76.436612,42.441652],[-76.436538,42.44163],[-76.43645600000001,42.441597],[-76.43633,42.441581],[-76.436278,42.441586],[-76.436093,42.441707],[-76.43601200000001,42.441734],[-76.4359,42.441734],[-76.435789,42.441712],[-76.43566300000001,42.441657],[-76.43558899999999,42.44163],[-76.435515,42.441614],[-76.435478,42.441597],[-76.435463,42.441597],[-76.435456,42.441625],[-76.435456,42.441652],[-76.43566300000001,42.441861],[-76.435678,42.441976],[-76.43566300000001,42.442151],[-76.435641,42.442173],[-76.435626,42.442228],[-76.435604,42.442256],[-76.43558899999999,42.442289],[-76.435515,42.442371],[-76.435367,42.442514],[-76.435271,42.442574],[-76.43514500000001,42.442591],[-76.43507,42.442591],[-76.435011,42.442585],[-76.434907,42.442519],[-76.434907,42.442409],[-76.434922,42.442366],[-76.43498099999999,42.442289],[-76.434996,42.442256],[-76.435018,42.442234],[-76.435056,42.442152],[-76.435056,42.44208],[-76.435011,42.442025],[-76.434848,42.441954],[-76.434759,42.441926],[-76.434611,42.441888],[-76.434455,42.441877],[-76.43441799999999,42.441899],[-76.434381,42.441904],[-76.43427699999999,42.441959],[-76.43423300000001,42.442009],[-76.434218,42.442042],[-76.434196,42.442064],[-76.434166,42.442124],[-76.434144,42.442228],[-76.434144,42.442355],[-76.434181,42.442388],[-76.434455,42.442563],[-76.434566,42.442667],[-76.434589,42.442728],[-76.434566,42.44286],[-76.434529,42.442887],[-76.43441900000001,42.442947],[-76.43439600000001,42.442953],[-76.434366,42.442969],[-76.43424,42.442986],[-76.434122,42.44298],[-76.433981,42.442942],[-76.433922,42.442914],[-76.433796,42.442876],[-76.43375899999999,42.442876],[-76.433684,42.442931],[-76.433684,42.442958],[-76.433662,42.442975],[-76.43364699999999,42.44303],[-76.433573,42.443096],[-76.433536,42.443123],[-76.433477,42.443139],[-76.43334400000001,42.443134],[-76.433269,42.443112],[-76.432973,42.442887],[-76.432929,42.44286],[-76.432832,42.44281],[-76.43273600000001,42.442805],[-76.43266199999999,42.442821],[-76.43264000000001,42.442838],[-76.432573,42.442914],[-76.432491,42.442969],[-76.43238700000001,42.442986],[-76.43226900000001,42.442986],[-76.432069,42.442958],[-76.432017,42.442958],[-76.43174999999999,42.443002],[-76.43163199999999,42.442997],[-76.431528,42.442975],[-76.431365,42.442892],[-76.431343,42.442865],[-76.43134999999999,42.442838],[-76.431498,42.442706],[-76.431602,42.442601],[-76.431676,42.442519],[-76.431698,42.442448],[-76.431691,42.442415],[-76.43166100000001,42.442366],[-76.431639,42.442344],[-76.431535,42.442327],[-76.431461,42.442366],[-76.43140200000001,42.442437],[-76.431313,42.442503],[-76.431254,42.442519],[-76.431172,42.442525],[-76.430913,42.442508],[-76.430757,42.442519],[-76.430646,42.442558],[-76.430476,42.442695],[-76.430438,42.4427],[-76.43034900000001,42.4427],[-76.430312,42.442684],[-76.43029,42.442667],[-76.43023100000001,42.442558],[-76.430223,42.442525],[-76.430194,42.442492],[-76.43018600000001,42.442453],[-76.430164,42.442426],[-76.43015699999999,42.442371],[-76.430046,42.442261],[-76.42997200000001,42.442206],[-76.429912,42.442173],[-76.42980900000001,42.442151],[-76.42976400000001,42.442151],[-76.429727,42.442173],[-76.42966,42.442201],[-76.42952699999999,42.442283],[-76.429349,42.442278],[-76.429238,42.442261],[-76.429179,42.442245],[-76.428971,42.442217],[-76.428861,42.442199],[-76.42883999999999,42.44189],[-76.428817,42.441647],[-76.42856,42.437503],[-76.428405,42.435061],[-76.428236,42.43241],[-76.428157,42.431352],[-76.42811500000001,42.430791],[-76.42811399999999,42.430773],[-76.42807999999999,42.43053],[-76.427954,42.428613],[-76.42787300000001,42.427517],[-76.427606,42.423888],[-76.427601,42.423837],[-76.427599,42.423792],[-76.427538,42.422985],[-76.427415,42.421668],[-76.42743,42.421492],[-76.427291,42.421458],[-76.42717500000001,42.421414],[-76.42706099999999,42.421361],[-76.426588,42.421124],[-76.426416,42.421054],[-76.42623500000001,42.420998],[-76.426047,42.42096],[-76.425883,42.420935],[-76.425005,42.420828],[-76.424367,42.420751],[-76.424284,42.420743],[-76.424015,42.420715],[-76.42366800000001,42.420652],[-76.423259,42.42054],[-76.420857,42.419759],[-76.42067400000001,42.419698],[-76.419586,42.419275],[-76.419228,42.419122],[-76.41899100000001,42.418994],[-76.41721699999999,42.418075],[-76.416881,42.417849],[-76.416673,42.417681],[-76.41601799999999,42.417013],[-76.415909,42.41692],[-76.41574300000001,42.416792],[-76.414691,42.416084],[-76.414407,42.41589],[-76.413569,42.415346],[-76.413066,42.414997],[-76.412288,42.414443],[-76.41090699999999,42.413483],[-76.410793,42.413417],[-76.410737,42.413391],[-76.410644,42.413356],[-76.410453,42.4133],[-76.41013700000001,42.413214],[-76.409779,42.413137],[-76.409493,42.413095],[-76.409328,42.413079],[-76.409128,42.41305],[-76.40847100000001,42.412932],[-76.40779000000001,42.412828],[-76.407518,42.412759],[-76.407161,42.412674],[-76.406296,42.412495],[-76.40558,42.412347],[-76.404825,42.412176],[-76.404297,42.412047],[-76.40412499999999,42.412],[-76.403114,42.411697],[-76.402671,42.411554],[-76.40116999999999,42.411117],[-76.40086100000001,42.411016],[-76.40065199999999,42.410948],[-76.400543,42.410909],[-76.40033099999999,42.410785],[-76.400211,42.410692],[-76.400104,42.41059],[-76.400035,42.410505],[-76.399984,42.410452],[-76.39983100000001,42.410228],[-76.39963899999999,42.40992],[-76.399361,42.409455],[-76.399117,42.409008],[-76.39902499999999,42.408815],[-76.398662,42.407996],[-76.398262,42.407114],[-76.398235,42.407064],[-76.398201,42.407015],[-76.39811400000001,42.406926],[-76.398005,42.406856],[-76.397943,42.406825],[-76.397808,42.406781],[-76.397738,42.406769],[-76.397099,42.406705],[-76.396923,42.40668],[-76.396846,42.406658],[-76.396702,42.406597],[-76.395196,42.405787],[-76.394598,42.405447],[-76.39408299999999,42.405147],[-76.39339699999999,42.404719],[-76.39300299999999,42.40448],[-76.392831,42.404388],[-76.39263200000001,42.404291],[-76.392224,42.404112],[-76.391735,42.403938],[-76.391249,42.403777],[-76.39093200000001,42.403645],[-76.390715,42.403545],[-76.39050899999999,42.403444],[-76.390034,42.403193],[-76.38924900000001,42.40277],[-76.388795,42.402519],[-76.388642,42.40243],[-76.388389,42.402272],[-76.388257,42.402197],[-76.38814600000001,42.402141],[-76.38798300000001,42.402069],[-76.38745,42.401869],[-76.385868,42.401275],[-76.385209,42.401063],[-76.384891,42.400967],[-76.384604,42.400885],[-76.382879,42.400438],[-76.38282,42.400412],[-76.38271400000001,42.40035],[-76.382667,42.40031],[-76.382592,42.40023],[-76.382543,42.400136],[-76.382524,42.400059],[-76.382462,42.39934],[-76.38245999999999,42.399305],[-76.382403,42.398395],[-76.382344,42.397319],[-76.382301,42.39664],[-76.382279,42.396068],[-76.38226299999999,42.395785],[-76.38220699999999,42.395412],[-76.382532,42.39543],[-76.382606,42.395438],[-76.386202,42.395521],[-76.387023,42.39552],[-76.387911,42.395492],[-76.388597,42.395443],[-76.388897,42.395425],[-76.38938899999999,42.395384],[-76.390278,42.39531],[-76.390415,42.395299],[-76.39214800000001,42.395174],[-76.393598,42.395224],[-76.39390299999999,42.395239],[-76.39525,42.395326],[-76.396355,42.395393],[-76.39796200000001,42.3955],[-76.39953,42.395621],[-76.400581,42.395702],[-76.40369699999999,42.395948],[-76.404315,42.395981],[-76.408106,42.396092],[-76.408396,42.396105],[-76.4089,42.396127],[-76.409049,42.396134],[-76.409611,42.396181],[-76.410144,42.396265],[-76.410589,42.396358],[-76.41092399999999,42.396453],[-76.41123,42.396558],[-76.41173000000001,42.396772],[-76.412457,42.397141],[-76.413133,42.397511],[-76.41435799999999,42.398167],[-76.415429,42.398721],[-76.419656,42.4007],[-76.422978,42.402235],[-76.423705,42.402586],[-76.42441599999999,42.402928],[-76.424725,42.403077],[-76.42750100000001,42.404421],[-76.429433,42.405365],[-76.431943,42.40663],[-76.43455299999999,42.407885],[-76.43831,42.409725],[-76.43905599999999,42.410085],[-76.439522,42.410291],[-76.440147,42.410504],[-76.440732,42.410685],[-76.441558,42.411013],[-76.44295099999999,42.411655],[-76.44411700000001,42.412192],[-76.445153,42.412722],[-76.445654,42.412978],[-76.44605900000001,42.413185],[-76.446842,42.413612],[-76.44726,42.413848],[-76.44768000000001,42.414088],[-76.448549,42.414585],[-76.448571,42.414598],[-76.44877099999999,42.414713],[-76.44976,42.415263],[-76.453929,42.417593],[-76.454134,42.417711],[-76.455319,42.418399],[-76.457015,42.419422],[-76.45873400000001,42.420454],[-76.459102,42.42067],[-76.460448,42.421558],[-76.461563,42.422372],[-76.461788,42.422531],[-76.463088,42.423478],[-76.464088,42.424177],[-76.464231,42.42427],[-76.464371,42.424362],[-76.46560599999999,42.425171],[-76.46722200000001,42.426195],[-76.468407,42.426953],[-76.46879199999999,42.427199],[-76.46973699999999,42.427803],[-76.46990700000001,42.427912],[-76.470859,42.428494],[-76.471369,42.428821],[-76.472117,42.429347],[-76.471889,42.429386]]],"type":"Polygon"}
}