{
  "id": "360210011002",
  "type": "Feature",
  "properties": {
    "area_land":30505882,
    "area_water":3498084,
    "geoid":"360210011002",
    "name":"Block Group 2",
    "state":"ny"
},
  "bbox": [
    -73.851286,
    42.184666,
    -73.763685,
    42.251646
],
  "geometry": {"coordinates":[[[-73.850717,42.222655],[-73.850493,42.223464],[-73.85048399999999,42.223494],[-73.849388,42.227436],[-73.849203,42.227777],[-73.847813,42.230347],[-73.84193500000001,42.235631],[-73.83855,42.238441],[-73.835206,42.24208],[-73.83260300000001,42.244058],[-73.829449,42.245681],[-73.828468,42.245797],[-73.82526,42.245541],[-73.823412,42.245912],[-73.82299,42.246156],[-73.82128,42.247144],[-73.81962,42.248089],[-73.819,42.248468],[-73.817964,42.249103],[-73.81658400000001,42.250087],[-73.81523799999999,42.250804],[-73.813366,42.251025],[-73.812136,42.251035],[-73.809212,42.251567],[-73.80897400000001,42.251646],[-73.80756,42.250087],[-73.80727,42.249812],[-73.807074,42.249648],[-73.80703699999999,42.249615],[-73.803342,42.246331],[-73.801873,42.245022],[-73.800364,42.243717],[-73.79974,42.243633],[-73.79942800000001,42.243583],[-73.79291499999999,42.242512],[-73.788837,42.241841],[-73.78142699999999,42.240621],[-73.778166,42.240059],[-73.777676,42.240046],[-73.777579,42.240098],[-73.77688000000001,42.240413],[-73.77681,42.240449],[-73.77664300000001,42.240537],[-73.776552,42.240594],[-73.77622700000001,42.240895],[-73.77503900000001,42.241993],[-73.77478600000001,42.242217],[-73.77457099999999,42.242385],[-73.774501,42.242426],[-73.77177399999999,42.241967],[-73.77248299999999,42.240549],[-73.772729,42.24],[-73.77305800000001,42.239458],[-73.772229,42.239237],[-73.771451,42.239187],[-73.769739,42.239472],[-73.769569,42.23946],[-73.76968599999999,42.238938],[-73.77001,42.237345],[-73.76999600000001,42.237253],[-73.769857,42.236843],[-73.76981600000001,42.236616],[-73.769814,42.236411],[-73.76987200000001,42.236151],[-73.769935,42.235989],[-73.770098,42.235679],[-73.77030000000001,42.235373],[-73.770365,42.235256],[-73.770404,42.235142],[-73.770381,42.235015],[-73.770275,42.234819],[-73.770213,42.234677],[-73.770143,42.234192],[-73.770056,42.233837],[-73.770044,42.233653],[-73.770082,42.233433],[-73.770526,42.231858],[-73.77079000000001,42.230804],[-73.77087,42.230526],[-73.771012,42.229929],[-73.771069,42.229437],[-73.771064,42.229352],[-73.77101500000001,42.229069],[-73.770866,42.228546],[-73.77082799999999,42.228343],[-73.770842,42.227979],[-73.770883,42.227417],[-73.770871,42.227196],[-73.770871,42.22689],[-73.770898,42.226555],[-73.770965,42.22607],[-73.77106499999999,42.225538],[-73.771204,42.224883],[-73.771271,42.223996],[-73.771278,42.223661],[-73.77123400000001,42.223191],[-73.77115000000001,42.222814],[-73.77111499999999,42.222595],[-73.77112099999999,42.222498],[-73.771168,42.222187],[-73.77122300000001,42.222005],[-73.77148099999999,42.221274],[-73.77164,42.220932],[-73.771764,42.220717],[-73.772234,42.220019],[-73.77229800000001,42.219909],[-73.77232100000001,42.219841],[-73.77233699999999,42.219738],[-73.772318,42.219515],[-73.772211,42.219167],[-73.772172,42.21889],[-73.772161,42.218682],[-73.77218000000001,42.218304],[-73.772248,42.217882],[-73.772389,42.217477],[-73.77273700000001,42.216641],[-73.772879,42.216277],[-73.772994,42.21594],[-73.77341699999999,42.214265],[-73.773449,42.214091],[-73.77349700000001,42.213594],[-73.773528,42.212944],[-73.773544,42.212796],[-73.773599,42.212577],[-73.773625,42.212518],[-73.77380100000001,42.212226],[-73.77397499999999,42.211968],[-73.77419500000001,42.211717],[-73.77439200000001,42.211517],[-73.774787,42.211076],[-73.77497,42.210807],[-73.775237,42.210278],[-73.775277,42.210152],[-73.775279,42.210093],[-73.77525199999999,42.209986],[-73.775184,42.209867],[-73.774985,42.209678],[-73.77455399999999,42.209335],[-73.77422300000001,42.209034],[-73.77426699999999,42.208983],[-73.774306,42.208954],[-73.774367,42.208938],[-73.774445,42.208932],[-73.774625,42.208941],[-73.774867,42.209003],[-73.775779,42.209185],[-73.77598,42.209214],[-73.776186,42.209223],[-73.776335,42.209211],[-73.776499,42.209185],[-73.776751,42.209123],[-73.776785,42.209115],[-73.777429,42.20893],[-73.77801700000001,42.208772],[-73.77905800000001,42.208448],[-73.77991299999999,42.208151],[-73.780227,42.208064],[-73.780642,42.207972],[-73.78123600000001,42.207898],[-73.78140999999999,42.207869],[-73.78161,42.207817],[-73.78188400000001,42.207723],[-73.782341,42.207544],[-73.782747,42.207345],[-73.783074,42.207189],[-73.783255,42.207125],[-73.783502,42.207052],[-73.783851,42.206962],[-73.784018,42.206933],[-73.78424099999999,42.20691],[-73.784514,42.206944],[-73.784735,42.206994],[-73.78469699999999,42.206569],[-73.784507,42.205016],[-73.784497,42.204933],[-73.78357800000001,42.204244],[-73.77940700000001,42.201056],[-73.77902,42.200718],[-73.778497,42.200241],[-73.778143,42.199842],[-73.77797099999999,42.19961],[-73.777816,42.199428],[-73.777411,42.198872],[-73.776636,42.197873],[-73.77614199999999,42.197316],[-73.77581000000001,42.196983],[-73.775305,42.196453],[-73.774951,42.196093],[-73.774224,42.195351],[-73.772695,42.193776],[-73.7718,42.19283],[-73.770916,42.19195],[-73.77034,42.191333],[-73.769358,42.190343],[-73.76906,42.19004],[-73.76810999999999,42.189088],[-73.76377100000001,42.184752],[-73.763685,42.184666],[-73.775944,42.187235],[-73.783687,42.188915],[-73.784482,42.189097],[-73.785293,42.18927],[-73.803479,42.193091],[-73.80749299999999,42.193914],[-73.814684,42.195388],[-73.823184,42.19713],[-73.82469500000001,42.19744],[-73.83743699999999,42.20017],[-73.83850099999999,42.200409],[-73.844303,42.201645],[-73.84791199999999,42.202418],[-73.848805,42.202602],[-73.848854,42.202612],[-73.84896500000001,42.202644],[-73.851084,42.203091],[-73.85096,42.203482],[-73.850385,42.206719],[-73.850195,42.207788],[-73.849473,42.20964],[-73.849554,42.210944],[-73.849609,42.211812],[-73.84982100000001,42.2127],[-73.850562,42.215807],[-73.851286,42.220612],[-73.850717,42.222655]]],"type":"Polygon"}
}