{
  "id": "360610171000",
  "type": "Feature",
  "properties": {
    "area_land":0,
    "area_water":194050,
    "geoid":"360610171000",
    "name":"Block Group 0",
    "state":"ny"
},
  "bbox": [
    -73.989957,
    40.787889,
    -73.981932,
    40.792981
],
  "geometry": {"coordinates":[[[-73.989957,40.790424],[-73.988123,40.792981],[-73.981932,40.790548],[-73.983751,40.787889],[-73.98987700000001,40.790391],[-73.989957,40.790424]]],"type":"Polygon"}
}