{
  "id": "360470351003",
  "type": "Feature",
  "properties": {
    "area_land":67679,
    "area_water":0,
    "geoid":"360470351003",
    "name":"Block Group 3",
    "state":"ny"
},
  "bbox": [
    -73.934224,
    40.665234,
    -73.931214,
    40.667976
],
  "geometry": {"coordinates":[[[-73.934138,40.666276],[-73.93405799999999,40.667168],[-73.933982,40.667976],[-73.931214,40.667825],[-73.931291,40.667015],[-73.931381,40.666126],[-73.931455,40.665234],[-73.934224,40.665378],[-73.934138,40.666276]]],"type":"Polygon"}
}