{
  "id": "360550052002",
  "type": "Feature",
  "properties": {
    "area_land":281060,
    "area_water":0,
    "geoid":"360550052002",
    "name":"Block Group 2",
    "state":"ny"
},
  "bbox": [
    -77.613531,
    43.174924,
    -77.604536,
    43.179212
],
  "geometry": {"coordinates":[[[-77.61353099999999,43.179122],[-77.61070100000001,43.179212],[-77.61067799999999,43.178838],[-77.610662,43.178586],[-77.61064,43.178254],[-77.607817,43.178346],[-77.606092,43.178388],[-77.60471099999999,43.178426],[-77.604681,43.177831],[-77.604635,43.17711],[-77.604603,43.176647],[-77.604574,43.176164],[-77.604546,43.175692],[-77.604536,43.175195],[-77.60520699999999,43.175176],[-77.605879,43.175157],[-77.606525,43.175142],[-77.607606,43.175109],[-77.61041899999999,43.175014],[-77.613264,43.174924],[-77.61331,43.175622],[-77.613325,43.175783],[-77.613356,43.176309],[-77.613364,43.17648],[-77.613394,43.1769],[-77.613417,43.177213],[-77.613461,43.177889],[-77.613501,43.178498],[-77.61353099999999,43.179122]]],"type":"Polygon"}
}