{
  "id": "360470554002",
  "type": "Feature",
  "properties": {
    "area_land":42765,
    "area_water":0,
    "geoid":"360470554002",
    "name":"Block Group 2",
    "state":"ny"
},
  "bbox": [
    -73.961886,
    40.605358,
    -73.959576,
    40.60803
],
  "geometry": {"coordinates":[[[-73.96188600000001,40.607336],[-73.960909,40.607693],[-73.960037,40.60803],[-73.959576,40.605596],[-73.96073199999999,40.60547],[-73.96095099999999,40.605445],[-73.961732,40.605358],[-73.96188600000001,40.607336]]],"type":"Polygon"}
}