{
  "id": "360290101021",
  "type": "Feature",
  "properties": {
    "area_land":749637,
    "area_water":0,
    "geoid":"360290101021",
    "name":"Block Group 1",
    "state":"ny"
},
  "bbox": [
    -78.766194,
    42.924926,
    -78.754133,
    42.933201
],
  "geometry": {"coordinates":[[[-78.766194,42.932565],[-78.765753,42.932579],[-78.76562699999999,42.932574],[-78.764996,42.932615],[-78.76449100000001,42.932634],[-78.764258,42.932667],[-78.764072,42.932727],[-78.76386599999999,42.932853],[-78.763767,42.932986],[-78.763649,42.933201],[-78.763587,42.933131],[-78.763254,42.932757],[-78.76228500000001,42.932786],[-78.76225100000001,42.932785],[-78.762249,42.932804],[-78.762216,42.932802],[-78.759669,42.932815],[-78.758225,42.932822],[-78.757886,42.932824],[-78.756665,42.932837],[-78.755752,42.932838],[-78.755138,42.93286],[-78.75473,42.932917],[-78.754143,42.933032],[-78.754142,42.93284],[-78.75415,42.930958],[-78.754144,42.930475],[-78.754143,42.93036],[-78.754141,42.930253],[-78.754141,42.93024],[-78.75414000000001,42.930164],[-78.754139,42.930098],[-78.754137,42.929952],[-78.754137,42.929909],[-78.754136,42.92974],[-78.754133,42.929323],[-78.754139,42.92707],[-78.755411,42.926826],[-78.75745999999999,42.92642],[-78.75846900000001,42.926233],[-78.759598,42.925998],[-78.76054000000001,42.925801],[-78.76079900000001,42.925751],[-78.76113700000001,42.925685],[-78.76187,42.925548],[-78.76298300000001,42.92533],[-78.763097,42.925307],[-78.76452500000001,42.92509],[-78.765388,42.925003],[-78.765742,42.924966],[-78.76614600000001,42.924926],[-78.76614499999999,42.924979],[-78.766144,42.926158],[-78.76610700000001,42.927602],[-78.76611200000001,42.927926],[-78.76611699999999,42.928208],[-78.76613,42.928967],[-78.766165,42.931003],[-78.766176,42.931587],[-78.766181,42.931868],[-78.76619100000001,42.93242],[-78.766192,42.932455],[-78.766194,42.932565]]],"type":"Polygon"}
}