{
  "id": "360290023001",
  "type": "Feature",
  "properties": {
    "area_land":196159,
    "area_water":0,
    "geoid":"360290023001",
    "name":"Block Group 1",
    "state":"ny"
},
  "bbox": [
    -78.80384,
    42.884582,
    -78.799355,
    42.889779
],
  "geometry": {"coordinates":[[[-78.803833,42.884798],[-78.803781,42.887253],[-78.80377300000001,42.88731],[-78.803765,42.887358],[-78.803742,42.888749],[-78.80371599999999,42.889768],[-78.80241599999999,42.889772],[-78.80117,42.889774],[-78.799987,42.889777],[-78.79939899999999,42.889779],[-78.79935500000001,42.889778],[-78.79947300000001,42.887271],[-78.799555,42.885758],[-78.79954600000001,42.885694],[-78.79946200000001,42.885105],[-78.799454,42.885059],[-78.799519,42.884734],[-78.799549,42.884582],[-78.799746,42.884659],[-78.800254,42.884857],[-78.800709,42.885035],[-78.801249,42.884895],[-78.802109,42.884655],[-78.802525,42.884661],[-78.80383999999999,42.884679],[-78.803833,42.884798]]],"type":"Polygon"}
}