{
  "id": "360810061002",
  "type": "Feature",
  "properties": {
    "area_land":48636,
    "area_water":0,
    "geoid":"360810061002",
    "name":"Block Group 2",
    "state":"ny"
},
  "bbox": [
    -73.924588,
    40.760849,
    -73.921081,
    40.763966
],
  "geometry": {"coordinates":[[[-73.924588,40.7616],[-73.922663,40.763966],[-73.92188,40.763574],[-73.921081,40.763199],[-73.922996,40.760849],[-73.923788,40.761226],[-73.924588,40.7616]]],"type":"Polygon"}
}