{
  "id": "361219710002",
  "type": "Feature",
  "properties": {
    "area_land":13072506,
    "area_water":0,
    "geoid":"361219710002",
    "name":"Block Group 2",
    "state":"ny"
},
  "bbox": [
    -78.432746,
    42.51922,
    -78.337932,
    42.536429
],
  "geometry": {"coordinates":[[[-78.43270699999999,42.519274],[-78.432592,42.519509],[-78.43251100000001,42.519753],[-78.432485,42.519897],[-78.43244,42.520482],[-78.43241399999999,42.521309],[-78.432408,42.521509],[-78.432376,42.523071],[-78.432363,42.523264],[-78.432337,42.527747],[-78.432326,42.529894],[-78.43231299999999,42.530522],[-78.432276,42.532408],[-78.432264,42.533037],[-78.430971,42.532527],[-78.430224,42.532232],[-78.427722,42.531253],[-78.427089,42.531013],[-78.42579000000001,42.530522],[-78.425439,42.530389],[-78.42511,42.530265],[-78.42439299999999,42.529972],[-78.424046,42.529831],[-78.424064,42.530076],[-78.424121,42.530812],[-78.42413999999999,42.531058],[-78.423987,42.531158],[-78.423529,42.531457],[-78.423377,42.531558],[-78.423333,42.531589],[-78.42320100000001,42.531683],[-78.423158,42.531715],[-78.423106,42.531751],[-78.422952,42.531861],[-78.422901,42.531898],[-78.42288000000001,42.531912],[-78.42281800000001,42.531957],[-78.422798,42.531972],[-78.422543,42.532151],[-78.421778,42.532689],[-78.42152400000001,42.532869],[-78.421843,42.53312],[-78.42237,42.533535],[-78.422813,42.533862],[-78.423141,42.534105],[-78.42298,42.534156],[-78.42249700000001,42.534311],[-78.422337,42.534363],[-78.422286,42.534378],[-78.422133,42.534426],[-78.422083,42.534442],[-78.421815,42.534525],[-78.421238,42.534705],[-78.42101,42.534768],[-78.42074100000001,42.534843],[-78.420694,42.534856],[-78.420554,42.534895],[-78.420508,42.534909],[-78.420356,42.53493],[-78.42005,42.534934],[-78.41867499999999,42.534957],[-78.418217,42.534965],[-78.417984,42.534967],[-78.417286,42.534977],[-78.41705399999999,42.534981],[-78.41674999999999,42.534984],[-78.415837,42.534996],[-78.41553399999999,42.535],[-78.41527499999999,42.535003],[-78.4145,42.535014],[-78.414242,42.535018],[-78.414024,42.535021],[-78.41337300000001,42.535032],[-78.413156,42.535036],[-78.411671,42.535051],[-78.411327,42.535055],[-78.411222,42.535056],[-78.410906,42.53506],[-78.410802,42.535062],[-78.410298,42.535069],[-78.408451,42.535089],[-78.407625,42.535114],[-78.403497,42.535169],[-78.401363,42.535198],[-78.398797,42.53524],[-78.395588,42.535282],[-78.39045299999999,42.535378],[-78.38971600000001,42.53538],[-78.38652399999999,42.535465],[-78.38297,42.535536],[-78.38158300000001,42.535569],[-78.379948,42.53561],[-78.37768199999999,42.535658],[-78.37476100000001,42.535728],[-78.37428,42.535736],[-78.371814,42.535788],[-78.368709,42.535846],[-78.367949,42.535857],[-78.367054,42.535882],[-78.366433,42.535901],[-78.364895,42.535928],[-78.364127,42.53595],[-78.36087000000001,42.536005],[-78.354288,42.536147],[-78.353379,42.536155],[-78.347476,42.536265],[-78.345378,42.536306],[-78.342614,42.536361],[-78.33815300000001,42.536429],[-78.33812500000001,42.534979],[-78.338077,42.532411],[-78.338077,42.531307],[-78.33805700000001,42.530631],[-78.338016,42.529183],[-78.337999,42.527213],[-78.337997,42.526848],[-78.337964,42.525252],[-78.337943,42.52483],[-78.337932,42.524152],[-78.337975,42.523879],[-78.33805599999999,42.523693],[-78.338154,42.523562],[-78.339091,42.522749],[-78.339832,42.522131],[-78.33986400000001,42.522105],[-78.34047200000001,42.521581],[-78.340743,42.521361],[-78.34098,42.52115],[-78.34116899999999,42.520961],[-78.341235,42.52087],[-78.34127100000001,42.520799],[-78.34128,42.520772],[-78.34128,42.520746],[-78.343469,42.520692],[-78.34396099999999,42.520682],[-78.35036700000001,42.520618],[-78.354218,42.520538],[-78.354985,42.520527],[-78.356712,42.520501],[-78.35805999999999,42.520481],[-78.360455,42.520458],[-78.361687,42.520426],[-78.36171,42.520426],[-78.361779,42.520424],[-78.362416,42.5204],[-78.363513,42.520392],[-78.36704400000001,42.52035],[-78.369286,42.520296],[-78.37201899999999,42.520237],[-78.37240300000001,42.520229],[-78.37401199999999,42.520197],[-78.376661,42.520159],[-78.381322,42.52008],[-78.384501,42.52003],[-78.386156,42.519987],[-78.388383,42.519923],[-78.39027299999999,42.519881],[-78.394395,42.519807],[-78.39987000000001,42.519698],[-78.402266,42.519641],[-78.403752,42.519625],[-78.403891,42.519596],[-78.404025,42.519542],[-78.40419799999999,42.51943],[-78.404313,42.519321],[-78.406828,42.519297],[-78.40801999999999,42.519291],[-78.411597,42.519276],[-78.41279,42.519271],[-78.413229,42.519269],[-78.414546,42.519263],[-78.414985,42.519261],[-78.415543,42.519257],[-78.41722,42.519249],[-78.417779,42.519247],[-78.418488,42.519243],[-78.420616,42.519234],[-78.42132599999999,42.519231],[-78.421967,42.519229],[-78.423891,42.519227],[-78.424533,42.519226],[-78.424718,42.519226],[-78.425273,42.519226],[-78.425459,42.519226],[-78.42691600000001,42.519224],[-78.431288,42.519221],[-78.43274599999999,42.51922],[-78.43270699999999,42.519274]]],"type":"Polygon"}
}