{
  "id": "361031349042",
  "type": "Feature",
  "properties": {
    "area_land":2519490,
    "area_water":0,
    "geoid":"361031349042",
    "name":"Block Group 2",
    "state":"ny"
},
  "bbox": [
    -73.191169,
    40.856603,
    -73.170837,
    40.88693
],
  "geometry": {"coordinates":[[[-73.191108,40.87234],[-73.19049800000001,40.872962],[-73.189936,40.87382],[-73.189626,40.874194],[-73.189424,40.874423],[-73.189256,40.874741],[-73.189064,40.875396],[-73.18913999999999,40.87564],[-73.189215,40.875861],[-73.189323,40.876033],[-73.189093,40.876471],[-73.18886000000001,40.876868],[-73.18871799999999,40.877217],[-73.18866199999999,40.877413],[-73.188613,40.877619],[-73.188864,40.877625],[-73.188577,40.877809],[-73.188456,40.877879],[-73.18786900000001,40.87836],[-73.187667,40.878543],[-73.18667499999999,40.879554],[-73.18652299999999,40.879748],[-73.186041,40.880141],[-73.18514999999999,40.880786],[-73.18500400000001,40.880954],[-73.184889,40.881133],[-73.18481300000001,40.881266],[-73.184805,40.881495],[-73.18210999999999,40.885153],[-73.181076,40.88693],[-73.18046699999999,40.885005],[-73.178833,40.878634],[-73.17877,40.878413],[-73.178732,40.878211],[-73.178755,40.878039],[-73.17805199999999,40.876006],[-73.175392,40.87627],[-73.17542899999999,40.875072],[-73.17505199999999,40.873978],[-73.174712,40.872996],[-73.174216,40.871344],[-73.17165799999999,40.873232],[-73.17083700000001,40.873839],[-73.1709,40.873189],[-73.171069,40.872703],[-73.17124699999999,40.872328],[-73.17147900000001,40.871955],[-73.17168599999999,40.871683],[-73.172991,40.870338],[-73.17327,40.870054],[-73.1737,40.869587],[-73.17422500000001,40.86904],[-73.176182,40.866659],[-73.17642600000001,40.866404],[-73.176625,40.866143],[-73.17711300000001,40.865515],[-73.177452,40.865132],[-73.177615,40.864936],[-73.178127,40.864361],[-73.17867699999999,40.863791],[-73.17921200000001,40.863213],[-73.179964,40.862448],[-73.180357,40.862159],[-73.181021,40.861697],[-73.181274,40.861558],[-73.18152600000001,40.861418],[-73.1818,40.861304],[-73.182182,40.86108],[-73.18302,40.860515],[-73.183077,40.860478],[-73.18334900000001,40.86029],[-73.184809,40.859171],[-73.185608,40.85866],[-73.18539699999999,40.858487],[-73.185079,40.858236],[-73.185166,40.858188],[-73.185647,40.857402],[-73.186785,40.85743],[-73.187144,40.856885],[-73.18733,40.856603],[-73.187421,40.856706],[-73.187438,40.856982],[-73.187461,40.857342],[-73.187454,40.858016],[-73.187417,40.858406],[-73.187304,40.858782],[-73.18727,40.858973],[-73.187186,40.859561],[-73.187096,40.860562],[-73.187089,40.86062],[-73.187079,40.860694],[-73.187065,40.861041],[-73.18710299999999,40.861159],[-73.187179,40.861285],[-73.18730100000001,40.861438],[-73.187416,40.861571],[-73.187484,40.861663],[-73.187727,40.862036],[-73.18785,40.862245],[-73.18768300000001,40.862667],[-73.187552,40.862958],[-73.18755299999999,40.863091],[-73.187612,40.863408],[-73.187647,40.863682],[-73.187662,40.863983],[-73.187926,40.86451],[-73.18803,40.86474],[-73.188194,40.865069],[-73.18849899999999,40.865701],[-73.18852,40.865824],[-73.188543,40.865953],[-73.188716,40.866721],[-73.188461,40.867724],[-73.188677,40.868216],[-73.18959099999999,40.869154],[-73.18979,40.869364],[-73.18989999999999,40.869481],[-73.19086799999999,40.870068],[-73.191169,40.870608],[-73.191108,40.87234]]],"type":"Polygon"}
}