{
  "id": "361031237023",
  "type": "Feature",
  "properties": {
    "area_land":576768,
    "area_water":6709,
    "geoid":"361031237023",
    "name":"Block Group 3",
    "state":"ny"
},
  "bbox": [
    -73.396213,
    40.669024,
    -73.382341,
    40.676844
],
  "geometry": {"coordinates":[[[-73.396213,40.673517],[-73.39394,40.674173],[-73.392211,40.674672],[-73.391518,40.674882],[-73.391323,40.674945],[-73.391149,40.675001],[-73.39104500000001,40.675034],[-73.39081899999999,40.675107],[-73.390641,40.675163],[-73.38969899999999,40.675461],[-73.389566,40.675518],[-73.387393,40.676189],[-73.385278,40.676844],[-73.384941,40.676193],[-73.384888,40.676086],[-73.384604,40.675544],[-73.38426200000001,40.674904],[-73.38391799999999,40.674273],[-73.38358599999999,40.673632],[-73.383522,40.673506],[-73.383261,40.672999],[-73.382918,40.67236],[-73.382428,40.671445],[-73.382341,40.671305],[-73.38323800000001,40.671104],[-73.383314,40.671088],[-73.38454900000001,40.670832],[-73.386826,40.670342],[-73.38836000000001,40.670004],[-73.388671,40.669935],[-73.38958100000001,40.669734],[-73.391294,40.669356],[-73.391818,40.669227],[-73.39277,40.669024],[-73.39319999999999,40.669595],[-73.393306,40.669741],[-73.393646,40.67021],[-73.393827,40.670471],[-73.394097,40.670829],[-73.394279,40.671058],[-73.394651,40.671464],[-73.395357,40.67228],[-73.395841,40.67285],[-73.395961,40.673066],[-73.396213,40.673517]]],"type":"Polygon"}
}