{
  "id": "360550114001",
  "type": "Feature",
  "properties": {
    "area_land":1894862,
    "area_water":88370,
    "geoid":"360550114001",
    "name":"Block Group 1",
    "state":"ny"
},
  "bbox": [
    -77.446648,
    43.210354,
    -77.419073,
    43.222069
],
  "geometry": {"coordinates":[[[-77.44663799999999,43.21097],[-77.446639,43.214858],[-77.446636,43.215415],[-77.446636,43.215438],[-77.44663199999999,43.215662],[-77.446631,43.215706],[-77.446628,43.215963],[-77.44662599999999,43.216653],[-77.446618,43.22054],[-77.446646,43.221685],[-77.44664400000001,43.221812],[-77.44664,43.222069],[-77.443513,43.220939],[-77.440729,43.219913],[-77.439745,43.219555],[-77.439621,43.219519],[-77.43949000000001,43.219501],[-77.439317,43.219497],[-77.439007,43.219503],[-77.438202,43.219519],[-77.43778500000001,43.219528],[-77.437157,43.219541],[-77.436561,43.219545],[-77.434838,43.219562],[-77.434558,43.219565],[-77.42995999999999,43.219639],[-77.42649900000001,43.219712],[-77.425168,43.219744],[-77.423108,43.219761],[-77.419161,43.219799],[-77.419163,43.219249],[-77.419162,43.219076],[-77.419162,43.218977],[-77.419158,43.218684],[-77.419155,43.218355],[-77.419155,43.218122],[-77.419155,43.218079],[-77.419155,43.217776],[-77.41915299999999,43.217564],[-77.419147,43.216904],[-77.419141,43.216725],[-77.41913599999999,43.216569],[-77.419128,43.216264],[-77.419099,43.215066],[-77.41909800000001,43.214936],[-77.419096,43.214744],[-77.419094,43.214569],[-77.419073,43.214006],[-77.42060499999999,43.213718],[-77.421404,43.21356],[-77.42357800000001,43.213218],[-77.423934,43.213161],[-77.42595,43.212853],[-77.42791699999999,43.212549],[-77.429339,43.212345],[-77.430319,43.212219],[-77.430781,43.212164],[-77.4318,43.212042],[-77.432518,43.211962],[-77.43406299999999,43.211786],[-77.435171,43.211667],[-77.435937,43.21157],[-77.43617500000001,43.211541],[-77.436414,43.211513],[-77.437771,43.211352],[-77.437999,43.211318],[-77.438468,43.211247],[-77.438727,43.211196],[-77.439823,43.210979],[-77.44120100000001,43.210709],[-77.441686,43.210626],[-77.441985,43.210591],[-77.442369,43.210566],[-77.443083,43.210535],[-77.443617,43.210509],[-77.44425,43.210485],[-77.446648,43.210354],[-77.44663799999999,43.21097]]],"type":"Polygon"}
}