{
  "id": "360099618006",
  "type": "Feature",
  "properties": {
    "area_land":1890702,
    "area_water":79835,
    "geoid":"360099618006",
    "name":"Block Group 6",
    "state":"ny"
},
  "bbox": [
    -78.440173,
    42.061236,
    -78.415895,
    42.074605
],
  "geometry": {"coordinates":[[[-78.440173,42.065036],[-78.44015899999999,42.065154],[-78.440139,42.065189],[-78.440146,42.0653],[-78.440151,42.065468],[-78.440108,42.06702],[-78.43996799999999,42.071521],[-78.439971,42.071736],[-78.438733,42.071722],[-78.435371,42.071226],[-78.42994,42.070425],[-78.428062,42.070549],[-78.42711300000001,42.070828],[-78.42569899999999,42.072393],[-78.42438900000001,42.074093],[-78.423694,42.074522],[-78.42292399999999,42.074605],[-78.42189999999999,42.07442],[-78.42079699999999,42.07352],[-78.41858499999999,42.071271],[-78.41734,42.070119],[-78.41663699999999,42.06953],[-78.41640599999999,42.069392],[-78.416117,42.06925],[-78.415959,42.069192],[-78.415961,42.069144],[-78.41589500000001,42.064895],[-78.421666,42.064859],[-78.42314399999999,42.064877],[-78.425618,42.064904],[-78.425629,42.062395],[-78.425653,42.061236],[-78.432967,42.061389],[-78.43762099999999,42.061647],[-78.439091,42.061665],[-78.43938300000001,42.061569],[-78.439969,42.061349],[-78.439995,42.06147],[-78.439993,42.061975],[-78.439978,42.06232],[-78.439954,42.062503],[-78.439955,42.062663],[-78.43996,42.063077],[-78.439983,42.063194],[-78.44002999999999,42.063276],[-78.44012499999999,42.063399],[-78.44016000000001,42.063524],[-78.440169,42.063957],[-78.440157,42.064801],[-78.440169,42.064935],[-78.440173,42.065036]]],"type":"Polygon"}
}