{
  "id": "360810053001",
  "type": "Feature",
  "properties": {
    "area_land":51900,
    "area_water":0,
    "geoid":"360810053001",
    "name":"Block Group 1",
    "state":"ny"
},
  "bbox": [
    -73.930867,
    40.760048,
    -73.926188,
    40.764491
],
  "geometry": {"coordinates":[[[-73.93036499999999,40.764491],[-73.928425,40.763416],[-73.92698799999999,40.762725],[-73.926188,40.762351],[-73.928051,40.760048],[-73.92885,40.760421],[-73.927492,40.762098],[-73.928291,40.762475],[-73.92899300000001,40.762826],[-73.93086700000001,40.763874],[-73.93036499999999,40.764491]]],"type":"Polygon"}
}