{
  "id": "360470856002",
  "type": "Feature",
  "properties": {
    "area_land":42656,
    "area_water":0,
    "geoid":"360470856002",
    "name":"Block Group 2",
    "state":"ny"
},
  "bbox": [
    -73.945508,
    40.647035,
    -73.942921,
    40.649314
],
  "geometry": {"coordinates":[[[-73.945508,40.64916],[-73.944577,40.64922],[-73.94360399999999,40.649279],[-73.94305199999999,40.649314],[-73.942921,40.648575],[-73.94352499999999,40.648541],[-73.94337400000001,40.647115],[-73.944344,40.647078],[-73.945284,40.647035],[-73.945508,40.64916]]],"type":"Polygon"}
}