{
  "id": "360810075002",
  "type": "Feature",
  "properties": {
    "area_land":40848,
    "area_water":0,
    "geoid":"360810075002",
    "name":"Block Group 2",
    "state":"ny"
},
  "bbox": [
    -73.928425,
    40.762725,
    -73.925061,
    40.765733
],
  "geometry": {"coordinates":[[[-73.927621,40.764247],[-73.927421,40.764453],[-73.927064,40.764822],[-73.92691600000001,40.764952],[-73.926784,40.765094],[-73.92666800000001,40.765245],[-73.92657199999999,40.765403],[-73.926495,40.765566],[-73.926438,40.765733],[-73.92570000000001,40.765391],[-73.925237,40.765178],[-73.925061,40.765097],[-73.925522,40.764529],[-73.92617199999999,40.763727],[-73.92698799999999,40.762725],[-73.928425,40.763416],[-73.927621,40.764247]]],"type":"Polygon"}
}