{
  "id": "360550149011",
  "type": "Feature",
  "properties": {
    "area_land":991743,
    "area_water":62895,
    "geoid":"360550149011",
    "name":"Block Group 1",
    "state":"ny"
},
  "bbox": [
    -77.803399,
    43.189762,
    -77.773339,
    43.195437
],
  "geometry": {"coordinates":[[[-77.80330600000001,43.195173],[-77.803231,43.195162],[-77.800338,43.193471],[-77.800214,43.193718],[-77.799953,43.194468],[-77.799913,43.194583],[-77.799638,43.195437],[-77.79843,43.195401],[-77.79537500000001,43.195299],[-77.793131,43.195224],[-77.792828,43.195215],[-77.788861,43.19509],[-77.787481,43.195048],[-77.78694900000001,43.195034],[-77.7847,43.194965],[-77.784113,43.194947],[-77.781244,43.19487],[-77.77333900000001,43.1947],[-77.77337900000001,43.193604],[-77.77345099999999,43.191322],[-77.77345800000001,43.191163],[-77.773517,43.190936],[-77.773889,43.190973],[-77.77605200000001,43.191188],[-77.77795399999999,43.191464],[-77.780055,43.191122],[-77.782849,43.190708],[-77.78698300000001,43.190067],[-77.78853100000001,43.189762],[-77.793218,43.189764],[-77.793531,43.189862],[-77.795098,43.190046],[-77.796239,43.190684],[-77.79681100000001,43.191004],[-77.79839699999999,43.191896],[-77.79856599999999,43.191986],[-77.80036200000001,43.193336],[-77.800397,43.193354],[-77.80138599999999,43.193832],[-77.80251,43.194567],[-77.803399,43.195033],[-77.80330600000001,43.195173]]],"type":"Polygon"}
}