{
  "id": "360550142035",
  "type": "Feature",
  "properties": {
    "area_land":1643043,
    "area_water":0,
    "geoid":"360550142035",
    "name":"Block Group 5",
    "state":"ny"
},
  "bbox": [
    -77.732427,
    43.164482,
    -77.713249,
    43.175235
],
  "geometry": {"coordinates":[[[-77.732427,43.16723],[-77.732398,43.17023],[-77.73239599999999,43.170361],[-77.73239599999999,43.171369],[-77.732364,43.173682],[-77.73235,43.174781],[-77.728792,43.175178],[-77.72826000000001,43.175221],[-77.72785399999999,43.175235],[-77.727653,43.175228],[-77.72721199999999,43.175186],[-77.727053,43.175166],[-77.726911,43.175149],[-77.726748,43.175121],[-77.726658,43.175106],[-77.72618300000001,43.175008],[-77.72601400000001,43.174972],[-77.725194,43.174803],[-77.724204,43.174599],[-77.724147,43.174587],[-77.722877,43.174321],[-77.721985,43.174113],[-77.719115,43.173446],[-77.717327,43.173046],[-77.713413,43.172159],[-77.71339500000001,43.170881],[-77.713379,43.169925],[-77.713309,43.166584],[-77.71328699999999,43.165572],[-77.713249,43.164572],[-77.715306,43.164568],[-77.715396,43.164568],[-77.715485,43.164569],[-77.716793,43.164564],[-77.71742999999999,43.164562],[-77.71865099999999,43.164558],[-77.719765,43.164553],[-77.720067,43.164552],[-77.720798,43.164544],[-77.72183200000001,43.164541],[-77.721913,43.16454],[-77.723175,43.164532],[-77.723573,43.164529],[-77.72416,43.164525],[-77.72548399999999,43.164513],[-77.727934,43.164486],[-77.728241,43.164485],[-77.729574,43.164486],[-77.73240300000001,43.164482],[-77.732427,43.16723]]],"type":"Polygon"}
}