{
  "id": "360930321014",
  "type": "Feature",
  "properties": {
    "area_land":1489624,
    "area_water":0,
    "geoid":"360930321014",
    "name":"Block Group 4",
    "state":"ny"
},
  "bbox": [
    -73.892815,
    42.809682,
    -73.879229,
    42.828407
],
  "geometry": {"coordinates":[[[-73.892763,42.810775],[-73.89276599999999,42.811526],[-73.892695,42.812492],[-73.892506,42.815556],[-73.892456,42.816761],[-73.892433,42.817852],[-73.892342,42.820173],[-73.892242,42.822095],[-73.892124,42.824071],[-73.89205699999999,42.826199],[-73.891929,42.828394],[-73.89158,42.828407],[-73.889758,42.828244],[-73.887626,42.827979],[-73.883703,42.827619],[-73.882791,42.827496],[-73.881878,42.827374],[-73.881384,42.827272],[-73.881289,42.827253],[-73.880945,42.827146],[-73.88072200000001,42.827011],[-73.88013599999999,42.82656],[-73.87969099999999,42.826303],[-73.87944899999999,42.825958],[-73.879229,42.825464],[-73.879232,42.825075],[-73.879651,42.824161],[-73.879863,42.823523],[-73.879981,42.822902],[-73.880307,42.820442],[-73.88036700000001,42.820067],[-73.880585,42.81896],[-73.880923,42.817706],[-73.880999,42.817641],[-73.881118,42.817608],[-73.882778,42.81756],[-73.882943,42.817516],[-73.88306300000001,42.81744],[-73.88361999999999,42.816765],[-73.88382300000001,42.816517],[-73.88429499999999,42.815929],[-73.8848,42.815318],[-73.885124,42.815063],[-73.88557,42.814735],[-73.885989,42.81468],[-73.886443,42.814541],[-73.88672200000001,42.81442],[-73.886993,42.814254],[-73.88721200000001,42.814056],[-73.887282,42.81396],[-73.887548,42.81334],[-73.887759,42.813078],[-73.888023,42.812827],[-73.889368,42.812076],[-73.89115099999999,42.811434],[-73.89181600000001,42.810829],[-73.892444,42.810197],[-73.892815,42.809682],[-73.892763,42.810775]]],"type":"Polygon"}
}