{
  "id": "360290049003",
  "type": "Feature",
  "properties": {
    "area_land":135552,
    "area_water":0,
    "geoid":"360290049003",
    "name":"Block Group 3",
    "state":"ny"
},
  "bbox": [
    -78.860654,
    42.944521,
    -78.855879,
    42.947739
],
  "geometry": {"coordinates":[[[-78.860646,42.946747],[-78.860637,42.946849],[-78.860604,42.946967],[-78.860542,42.947079],[-78.860524,42.947125],[-78.86051,42.94718],[-78.86048700000001,42.947367],[-78.860483,42.947399],[-78.860477,42.947739],[-78.860451,42.947739],[-78.85903,42.947728],[-78.85744,42.947713],[-78.857401,42.947713],[-78.85588,42.947698],[-78.855879,42.947664],[-78.855903,42.945977],[-78.855937,42.944521],[-78.857271,42.944538],[-78.858501,42.944548],[-78.859447,42.944555],[-78.860654,42.944568],[-78.860646,42.946747]]],"type":"Polygon"}
}