{
  "id": "360594048003",
  "type": "Feature",
  "properties": {
    "area_land":251922,
    "area_water":0,
    "geoid":"360594048003",
    "name":"Block Group 3",
    "state":"ny"
},
  "bbox": [
    -73.704957,
    40.710926,
    -73.695939,
    40.7162
],
  "geometry": {"coordinates":[[[-73.70495699999999,40.712616],[-73.704685,40.712852],[-73.70413499999999,40.713574],[-73.703468,40.714437],[-73.70316,40.714757],[-73.70247500000001,40.715002],[-73.702124,40.715129],[-73.699156,40.7162],[-73.699,40.716099],[-73.698978,40.716077],[-73.698598,40.715788],[-73.698522,40.715739],[-73.69843400000001,40.715663],[-73.69785400000001,40.715222],[-73.69729599999999,40.714801],[-73.69672300000001,40.714371],[-73.69615899999999,40.713951],[-73.695939,40.713766],[-73.696275,40.713402],[-73.69674000000001,40.713194],[-73.696979,40.712799],[-73.697312,40.712876],[-73.697273,40.712573],[-73.698427,40.712054],[-73.69972,40.711557],[-73.700418,40.711208],[-73.70130399999999,40.710926],[-73.701808,40.711169],[-73.702096,40.711312],[-73.70244099999999,40.711466],[-73.703058,40.711758],[-73.70333100000001,40.711887],[-73.703701,40.712056],[-73.704089,40.712242],[-73.704322,40.712351],[-73.704849,40.712597],[-73.70495699999999,40.712616]]],"type":"Polygon"}
}