{
  "id": "360470108002",
  "type": "Feature",
  "properties": {
    "area_land":37773,
    "area_water":0,
    "geoid":"360470108002",
    "name":"Block Group 2",
    "state":"ny"
},
  "bbox": [
    -74.004295,
    40.639225,
    -74.000925,
    40.641675
],
  "geometry": {"coordinates":[[[-74.003713,40.641116],[-74.003125,40.641675],[-74.000925,40.640346],[-74.001508,40.639785],[-74.00209099999999,40.639225],[-74.004295,40.640557],[-74.003713,40.641116]]],"type":"Polygon"}
}