{
  "id": "360470257001",
  "type": "Feature",
  "properties": {
    "area_land":80393,
    "area_water":0,
    "geoid":"360470257001",
    "name":"Block Group 1",
    "state":"ny"
},
  "bbox": [
    -73.949788,
    40.695378,
    -73.946366,
    40.698641
],
  "geometry": {"coordinates":[[[-73.949788,40.69831],[-73.94695900000001,40.698641],[-73.946797,40.697903],[-73.94663799999999,40.69718],[-73.94649,40.696453],[-73.946366,40.695704],[-73.949207,40.695378],[-73.94935599999999,40.696121],[-73.9495,40.696847],[-73.949647,40.697583],[-73.949788,40.69831]]],"type":"Polygon"}
}