{
  "id": "360594099001",
  "type": "Feature",
  "properties": {
    "area_land":214196,
    "area_water":0,
    "geoid":"360594099001",
    "name":"Block Group 1",
    "state":"ny"
},
  "bbox": [
    -73.721489,
    40.679494,
    -73.714618,
    40.686289
],
  "geometry": {"coordinates":[[[-73.72148900000001,40.681067],[-73.72016000000001,40.682472],[-73.718992,40.683708],[-73.7187,40.68355],[-73.718067,40.684223],[-73.716735,40.686289],[-73.716666,40.68627],[-73.715897,40.685997],[-73.715306,40.685786],[-73.71511099999999,40.685717],[-73.714928,40.685658],[-73.714961,40.685461],[-73.71501499999999,40.68534],[-73.715081,40.685154],[-73.715154,40.68488],[-73.71518399999999,40.684704],[-73.715188,40.684605],[-73.71516699999999,40.684408],[-73.715075,40.684111],[-73.714992,40.683952],[-73.714917,40.683839],[-73.714618,40.683495],[-73.71480099999999,40.683314],[-73.71514500000001,40.682843],[-73.716235,40.681404],[-73.716548,40.68099],[-73.71668200000001,40.680813],[-73.716767,40.680674],[-73.717033,40.680208],[-73.717536,40.680066],[-73.717724,40.68],[-73.717927,40.679907],[-73.718086,40.679804],[-73.718172,40.679732],[-73.71825200000001,40.679656],[-73.718374,40.679494],[-73.719066,40.679765],[-73.719291,40.679864],[-73.719441,40.679922],[-73.720034,40.680255],[-73.72076199999999,40.680661],[-73.72148900000001,40.681067]]],"type":"Polygon"}
}