{
  "id": "360810837004",
  "type": "Feature",
  "properties": {
    "area_land":96389,
    "area_water":0,
    "geoid":"360810837004",
    "name":"Block Group 4",
    "state":"ny"
},
  "bbox": [
    -73.81951,
    40.738987,
    -73.814811,
    40.742635
],
  "geometry": {"coordinates":[[[-73.819428,40.740569],[-73.819191,40.741104],[-73.819118,40.741252],[-73.818848,40.741945],[-73.818578,40.742635],[-73.816453,40.741921],[-73.81481100000001,40.741367],[-73.814995,40.740787],[-73.81502,40.740662],[-73.815128,40.739922],[-73.815116,40.739672],[-73.815096,40.739234],[-73.815057,40.738987],[-73.815922,40.739184],[-73.81662300000001,40.739398],[-73.817134,40.739551],[-73.817745,40.739763],[-73.81860399999999,40.740051],[-73.81905500000001,40.740205],[-73.81950999999999,40.74036],[-73.819428,40.740569]]],"type":"Polygon"}
}