{
  "id": "361190103002",
  "type": "Feature",
  "properties": {
    "area_land":809784,
    "area_water":0,
    "geoid":"361190103002",
    "name":"Block Group 2",
    "state":"ny"
},
  "bbox": [
    -73.888049,
    40.976565,
    -73.877951,
    40.994551
],
  "geometry": {"coordinates":[[[-73.888049,40.976565],[-73.886746,40.980788],[-73.88573700000001,40.983713],[-73.885105,40.985616],[-73.885034,40.985867],[-73.884871,40.985841],[-73.88482,40.985843],[-73.884733,40.985846],[-73.884687,40.985872],[-73.88464,40.986305],[-73.884579,40.987251],[-73.884548,40.988208],[-73.884553,40.988521],[-73.88453800000001,40.988823],[-73.884455,40.989458],[-73.88347899999999,40.989406],[-73.883431,40.989776],[-73.882998,40.98974],[-73.882926,40.98974],[-73.88285,40.989755],[-73.882763,40.989791],[-73.88271899999999,40.989835],[-73.882701,40.989853],[-73.882576,40.990667],[-73.882164,40.990697],[-73.882094,40.991088],[-73.882059,40.991201],[-73.882012,40.991349],[-73.881935,40.991478],[-73.88184800000001,40.991596],[-73.88173,40.991719],[-73.881598,40.991832],[-73.881304,40.992085],[-73.88079399999999,40.992446],[-73.880719,40.992435],[-73.880235,40.992831],[-73.879121,40.993793],[-73.87830700000001,40.994551],[-73.878151,40.993417],[-73.878095,40.993089],[-73.878033,40.992692],[-73.877961,40.992333],[-73.877951,40.992156],[-73.87796,40.991984],[-73.877977,40.991643],[-73.878002,40.991423],[-73.878079,40.991056],[-73.878125,40.990907],[-73.878187,40.990789],[-73.87920800000001,40.989336],[-73.879409,40.989041],[-73.87957,40.988773],[-73.88002,40.987997],[-73.880156,40.987716],[-73.880205,40.987597],[-73.880241,40.987433],[-73.88028199999999,40.987148],[-73.880286,40.986879],[-73.88027200000001,40.986725],[-73.880154,40.986048],[-73.880087,40.985746],[-73.879964,40.985317],[-73.879758,40.984817],[-73.879644,40.984594],[-73.879537,40.984387],[-73.87950499999999,40.984297],[-73.879374,40.983928],[-73.879322,40.983692],[-73.879317,40.983512],[-73.87933099999999,40.983265],[-73.87933700000001,40.983194],[-73.879363,40.983102],[-73.879445,40.9829],[-73.879543,40.982571],[-73.87965,40.982264],[-73.879722,40.982012],[-73.879788,40.981464],[-73.87979900000001,40.981374],[-73.879868,40.981131],[-73.880042,40.980542],[-73.880105,40.980002],[-73.88014699999999,40.979496],[-73.88014699999999,40.979483],[-73.880177,40.979036],[-73.880213,40.978666],[-73.88026600000001,40.978402],[-73.88028799999999,40.978271],[-73.880349,40.978017],[-73.881501,40.977849],[-73.882458,40.977713],[-73.883606,40.97759],[-73.88441400000001,40.977387],[-73.88587200000001,40.977022],[-73.886032,40.976982],[-73.886533,40.976856],[-73.887079,40.976756],[-73.888049,40.976565]]],"type":"Polygon"}
}