{
  "id": "360550024001",
  "type": "Feature",
  "properties": {
    "area_land":208294,
    "area_water":0,
    "geoid":"360550024001",
    "name":"Block Group 1",
    "state":"ny"
},
  "bbox": [
    -77.649048,
    43.173852,
    -77.643028,
    43.179263
],
  "geometry": {"coordinates":[[[-77.649045,43.176851],[-77.649045,43.176962],[-77.64904199999999,43.179254],[-77.648976,43.179255],[-77.64819199999999,43.179259],[-77.647842,43.179263],[-77.64690299999999,43.178372],[-77.64636400000001,43.177873],[-77.64561399999999,43.177177],[-77.64547399999999,43.177278],[-77.64505200000001,43.177585],[-77.644727,43.176758],[-77.64433099999999,43.175748],[-77.64397099999999,43.176289],[-77.643725,43.176662],[-77.643362,43.175976],[-77.64304199999999,43.175372],[-77.643028,43.173875],[-77.64432499999999,43.173875],[-77.64563699999999,43.173871],[-77.64694900000001,43.17386],[-77.648246,43.173863],[-77.648984,43.173853],[-77.64904799999999,43.173852],[-77.649045,43.176851]]],"type":"Polygon"}
}