{
  "id": "360810158013",
  "type": "Feature",
  "properties": {
    "area_land":92641,
    "area_water":0,
    "geoid":"360810158013",
    "name":"Block Group 3",
    "state":"ny"
},
  "bbox": [
    -73.816926,
    40.686695,
    -73.812907,
    40.690972
],
  "geometry": {"coordinates":[[[-73.816926,40.69025],[-73.816075,40.690492],[-73.815228,40.690733],[-73.814384,40.690972],[-73.814204,40.690609],[-73.81409600000001,40.690559],[-73.813958,40.690474],[-73.812907,40.689827],[-73.81335900000001,40.689278],[-73.813458,40.687535],[-73.813452,40.687155],[-73.814131,40.68694],[-73.81497400000001,40.686695],[-73.816283,40.6893],[-73.81641999999999,40.689245],[-73.81667299999999,40.689747],[-73.816926,40.69025]]],"type":"Polygon"}
}