{
  "id": "360010002004",
  "type": "Feature",
  "properties": {
    "area_land":192305,
    "area_water":0,
    "geoid":"360010002004",
    "name":"Block Group 4",
    "state":"ny"
},
  "bbox": [
    -73.761745,
    42.652557,
    -73.750031,
    42.659968
],
  "geometry": {"coordinates":[[[-73.7616,42.658335],[-73.76110199999999,42.658816],[-73.76049399999999,42.659411],[-73.75993200000001,42.659968],[-73.75943700000001,42.659676],[-73.757779,42.658731],[-73.757214,42.658397],[-73.75567100000001,42.657514],[-73.75525500000001,42.657276],[-73.754341,42.656744],[-73.75354900000001,42.656269],[-73.751921,42.65534],[-73.751324,42.655008],[-73.75116199999999,42.654912],[-73.750563,42.65456],[-73.75003100000001,42.654244],[-73.750045,42.654009],[-73.7501,42.653852],[-73.75012700000001,42.65373],[-73.75022300000001,42.653544],[-73.75046,42.653192],[-73.75087499999999,42.652557],[-73.751518,42.652928],[-73.751621,42.652998],[-73.752135,42.653377],[-73.75276599999999,42.653863],[-73.75319399999999,42.654202],[-73.753339,42.654307],[-73.75357099999999,42.654455],[-73.754656,42.655127],[-73.754706,42.655158],[-73.754756,42.655187],[-73.755878,42.65584],[-73.756806,42.656376],[-73.757608,42.656822],[-73.75893600000001,42.657615],[-73.75928,42.657314],[-73.759413,42.657194],[-73.759491,42.657123],[-73.759531,42.657105],[-73.759567,42.657102],[-73.759607,42.65711],[-73.760862,42.657704],[-73.76108499999999,42.657817],[-73.761745,42.658177],[-73.7616,42.658335]]],"type":"Polygon"}
}