{
  "id": "360594070005",
  "type": "Feature",
  "properties": {
    "area_land":182019,
    "area_water":0,
    "geoid":"360594070005",
    "name":"Block Group 5",
    "state":"ny"
},
  "bbox": [
    -73.627482,
    40.689919,
    -73.621737,
    40.696066
],
  "geometry": {"coordinates":[[[-73.627416,40.691068],[-73.627369,40.691123],[-73.627303,40.691178],[-73.627092,40.691301],[-73.626633,40.691554],[-73.62648900000001,40.691642],[-73.626279,40.691758],[-73.626008,40.69192],[-73.62585,40.692053],[-73.62577899999999,40.69217],[-73.625741,40.692242],[-73.625711,40.692328],[-73.62569499999999,40.692528],[-73.62575099999999,40.69277],[-73.62532,40.692924],[-73.625255,40.692966],[-73.62522,40.692988],[-73.62519399999999,40.693024],[-73.625046,40.693147],[-73.62497,40.693229],[-73.62487900000001,40.69336],[-73.624793,40.693561],[-73.624762,40.693618],[-73.624751,40.693673],[-73.6245,40.694325],[-73.624381,40.694638],[-73.624212,40.695197],[-73.62413100000001,40.695427],[-73.624044,40.69557],[-73.624004,40.695614],[-73.623921,40.69569],[-73.62379799999999,40.695783],[-73.623581,40.695884],[-73.62344,40.695927],[-73.623306,40.695954],[-73.62198600000001,40.696066],[-73.621887,40.695365],[-73.621765,40.694479],[-73.621746,40.69436],[-73.621737,40.694151],[-73.621742,40.693954],[-73.621756,40.693832],[-73.62179399999999,40.693602],[-73.62182900000001,40.693419],[-73.621833,40.693367],[-73.621888,40.693039],[-73.621949,40.692672],[-73.622022,40.692246],[-73.622067,40.691979],[-73.622164,40.691451],[-73.622198,40.691276],[-73.622227,40.691124],[-73.622334,40.690771],[-73.62237500000001,40.690668],[-73.62241299999999,40.690572],[-73.62244800000001,40.690486],[-73.62266099999999,40.690088],[-73.62276799999999,40.689919],[-73.623271,40.690017],[-73.62465400000001,40.690262],[-73.626732,40.690638],[-73.626924,40.690671],[-73.62701,40.690699],[-73.627269,40.690865],[-73.627482,40.690941],[-73.627416,40.691068]]],"type":"Polygon"}
}