{
  "id": "360319605985",
  "type": "Feature",
  "properties": {
    "area_land":6048951,
    "area_water":0,
    "geoid":"360319605985",
    "name":"Block Group 5",
    "state":"ny"
},
  "bbox": [
    -74.111119,
    44.276035,
    -73.9999,
    44.305057
],
  "geometry": {"coordinates":[[[-74.11107,44.305057],[-74.11088599999999,44.304879],[-74.110299,44.304371],[-74.10975000000001,44.303945],[-74.108958,44.303409],[-74.103982,44.300225],[-74.10327700000001,44.299788],[-74.103099,44.299698],[-74.10297199999999,44.299633],[-74.102836,44.299564],[-74.10261800000001,44.299472],[-74.102468,44.299409],[-74.102273,44.299332],[-74.101986,44.299236],[-74.101614,44.299128],[-74.101018,44.299001],[-74.10091799999999,44.298984],[-74.100722,44.29895],[-74.100285,44.298892],[-74.09998,44.29887],[-74.09962299999999,44.298856],[-74.099132,44.298862],[-74.098122,44.298921],[-74.097888,44.298947],[-74.096979,44.29911],[-74.09586,44.299266],[-74.09280699999999,44.299692],[-74.09251399999999,44.299733],[-74.092478,44.299737],[-74.092202,44.299772],[-74.09167100000001,44.299841],[-74.090806,44.299936],[-74.089609,44.300018],[-74.088615,44.300052],[-74.08797199999999,44.300057],[-74.08668,44.300028],[-74.08628,44.300015],[-74.085937,44.300005],[-74.08541,44.299992],[-74.08517500000001,44.299988],[-74.08395400000001,44.299937],[-74.083656,44.299925],[-74.08304699999999,44.29992],[-74.081839,44.299889],[-74.08085199999999,44.299855],[-74.080716,44.299847],[-74.07999,44.299788],[-74.079778,44.299758],[-74.079256,44.299674],[-74.078878,44.299595],[-74.078405,44.299483],[-74.078047,44.29938],[-74.077258,44.29912],[-74.077048,44.299043],[-74.076148,44.298719],[-74.07558,44.298514],[-74.07443499999999,44.298115],[-74.073938,44.297973],[-74.073823,44.297939],[-74.073104,44.297725],[-74.072699,44.297598],[-74.072418,44.297496],[-74.071961,44.297298],[-74.071533,44.297065],[-74.071409,44.296982],[-74.071031,44.296701],[-74.070874,44.296563],[-74.070542,44.296225],[-74.070453,44.296117],[-74.070134,44.295788],[-74.06989,44.295599],[-74.06978100000001,44.295519],[-74.069568,44.295389],[-74.069323,44.295262],[-74.069057,44.295148],[-74.06890199999999,44.295093],[-74.068558,44.29499],[-74.06815400000001,44.294901],[-74.06761400000001,44.294839],[-74.067363,44.29483],[-74.066897,44.294846],[-74.06547399999999,44.294966],[-74.065048,44.294981],[-74.064402,44.294971],[-74.063782,44.29493],[-74.06369599999999,44.294924],[-74.063553,44.294904],[-74.063384,44.294881],[-74.062809,44.294803],[-74.061988,44.294659],[-74.060457,44.294352],[-74.057002,44.293639],[-74.053543,44.292932],[-74.051452,44.292482],[-74.050753,44.292303],[-74.050054,44.292106],[-74.048671,44.291682],[-74.047893,44.291463],[-74.04735700000001,44.29133],[-74.04642200000001,44.291116],[-74.042553,44.290212],[-74.04126599999999,44.289898],[-74.04079400000001,44.289734],[-74.04057899999999,44.289647],[-74.040054,44.289402],[-74.038687,44.288672],[-74.038189,44.288446],[-74.037958,44.288356],[-74.037471,44.288193],[-74.037166,44.288107],[-74.036674,44.287994],[-74.036205,44.287921],[-74.035764,44.287876],[-74.03531599999999,44.28785],[-74.034879,44.287848],[-74.03442699999999,44.287871],[-74.03397,44.287918],[-74.030866,44.288458],[-74.030362,44.288533],[-74.02986900000001,44.288595],[-74.028919,44.288677],[-74.027936,44.288715],[-74.027429,44.28871],[-74.02665399999999,44.288687],[-74.02485799999999,44.288601],[-74.024777,44.288524],[-74.02454899999999,44.288368],[-74.023236,44.287749],[-74.023056,44.287684],[-74.022755,44.287605],[-74.02216300000001,44.287495],[-74.02190400000001,44.287423],[-74.021664,44.287312],[-74.021485,44.287146],[-74.02136400000001,44.286965],[-74.021186,44.286597],[-74.021047,44.286415],[-74.02090699999999,44.286288],[-74.020628,44.286106],[-74.02051299999999,44.286035],[-74.02023,44.285903],[-74.019941,44.285793],[-74.019473,44.28565],[-74.01838499999999,44.285335],[-74.017966,44.285232],[-74.017623,44.285169],[-74.01699000000001,44.285081],[-74.016176,44.284991],[-74.01489599999999,44.284851],[-74.01372499999999,44.284756],[-74.013446,44.284735],[-74.01261,44.284661],[-74.01199699999999,44.284577],[-74.011612,44.284488],[-74.01117499999999,44.284353],[-74.01067500000001,44.284165],[-74.010222,44.283972],[-74.01013500000001,44.283927],[-74.009918,44.283815],[-74.008962,44.283256],[-74.008544,44.283031],[-74.00799600000001,44.282787],[-74.006927,44.28237],[-74.006376,44.282147],[-74.004626,44.281438],[-74.00420099999999,44.28124],[-74.00392600000001,44.281098],[-74.003198,44.280676],[-74.002591,44.280308],[-74.002011,44.279995],[-74.001755,44.279886],[-74.00117299999999,44.279682],[-74.000956,44.27958],[-74.00079599999999,44.27947],[-74.0005,44.279148],[-74.00031,44.278915],[-74.000164,44.278702],[-74.00006,44.278476],[-74.0,44.278304],[-73.9999,44.27779],[-74.000687,44.277714],[-74.001169,44.277661],[-74.005219,44.277267],[-74.00721799999999,44.277085],[-74.007755,44.277011],[-74.008377,44.276912],[-74.009237,44.276696],[-74.01019700000001,44.27644],[-74.01140100000001,44.276139],[-74.011765,44.276067],[-74.011999,44.276041],[-74.012069,44.27604],[-74.01233000000001,44.276035],[-74.012918,44.276059],[-74.01356199999999,44.276096],[-74.014968,44.276199],[-74.01635400000001,44.276282],[-74.016907,44.276326],[-74.017591,44.276371],[-74.01821200000001,44.276419],[-74.01964599999999,44.276576],[-74.02029400000001,44.276654],[-74.020724,44.276713],[-74.02112,44.276801],[-74.021468,44.276884],[-74.021728,44.276976],[-74.023589,44.277761],[-74.023954,44.277885],[-74.024393,44.277987],[-74.02813,44.27856],[-74.02847,44.278615],[-74.02899600000001,44.278725],[-74.03000400000001,44.278992],[-74.035034,44.280272],[-74.04349499999999,44.28243],[-74.044427,44.282703],[-74.045,44.282834],[-74.04527,44.282903],[-74.046868,44.28331],[-74.047669,44.283493],[-74.048626,44.283685],[-74.05015400000001,44.283929],[-74.05107700000001,44.284151],[-74.051351,44.284233],[-74.051638,44.284351],[-74.05202199999999,44.284532],[-74.052381,44.284735],[-74.052841,44.285036],[-74.053481,44.285508],[-74.053625,44.285615],[-74.05511300000001,44.286723],[-74.056991,44.288087],[-74.058137,44.288923],[-74.059252,44.28972],[-74.05964400000001,44.290023],[-74.060365,44.29054],[-74.061466,44.291358],[-74.062118,44.291822],[-74.063103,44.292487],[-74.06349400000001,44.292722],[-74.06373600000001,44.292862],[-74.063974,44.29298],[-74.06456900000001,44.29321],[-74.064937,44.293322],[-74.06548600000001,44.29344],[-74.066191,44.293557],[-74.06656700000001,44.293608],[-74.06706,44.293668],[-74.069253,44.293972],[-74.069613,44.294034],[-74.07001200000001,44.294157],[-74.070796,44.294444],[-74.07113699999999,44.294592],[-74.07326399999999,44.295577],[-74.073938,44.295863],[-74.07453700000001,44.296084],[-74.07516699999999,44.296258],[-74.07564499999999,44.296365],[-74.076419,44.296505],[-74.076688,44.296537],[-74.07724399999999,44.296585],[-74.077895,44.2966],[-74.078594,44.296582],[-74.079347,44.296528],[-74.07966,44.296492],[-74.080218,44.296405],[-74.080956,44.296246],[-74.081819,44.296047],[-74.082486,44.295914],[-74.083117,44.295778],[-74.083676,44.29567],[-74.084247,44.295551],[-74.085266,44.295319],[-74.08564,44.29522],[-74.085819,44.295163],[-74.086023,44.295083],[-74.086484,44.294861],[-74.08749299999999,44.294334],[-74.08775300000001,44.294215],[-74.088003,44.294121],[-74.088189,44.294067],[-74.088621,44.29399],[-74.090525,44.293757],[-74.09059000000001,44.293751],[-74.091837,44.293626],[-74.09217599999999,44.293578],[-74.092215,44.293566],[-74.09224399999999,44.293568],[-74.092871,44.293484],[-74.093891,44.293379],[-74.094362,44.293341],[-74.095043,44.293297],[-74.095601,44.293305],[-74.095781,44.293317],[-74.09625699999999,44.293359],[-74.09650499999999,44.293388],[-74.097492,44.293561],[-74.10012500000001,44.294037],[-74.100538,44.294087],[-74.10077,44.294103],[-74.101096,44.294116],[-74.10154900000001,44.294091],[-74.1019,44.294043],[-74.102121,44.294001],[-74.102452,44.293922],[-74.104508,44.293321],[-74.105366,44.293105],[-74.105621,44.293057],[-74.105859,44.293034],[-74.106334,44.293005],[-74.106583,44.293005],[-74.10690200000001,44.293027],[-74.10708,44.29305],[-74.10722699999999,44.293079],[-74.107345,44.293104],[-74.107724,44.293204],[-74.10792600000001,44.293273],[-74.108255,44.293417],[-74.10849399999999,44.293548],[-74.108773,44.293734],[-74.10903999999999,44.293953],[-74.109228,44.294148],[-74.10942300000001,44.294388],[-74.10959800000001,44.294668],[-74.10970399999999,44.294865],[-74.10980600000001,44.295113],[-74.10987,44.295329],[-74.109908,44.295519],[-74.110148,44.297567],[-74.11042399999999,44.299634],[-74.110929,44.303829],[-74.111119,44.305022],[-74.11107,44.305057]]],"type":"Polygon"}
}