{
  "id": "360550139013",
  "type": "Feature",
  "properties": {
    "area_land":393042,
    "area_water":0,
    "geoid":"360550139013",
    "name":"Block Group 3",
    "state":"ny"
},
  "bbox": [
    -77.651579,
    43.211208,
    -77.644653,
    43.221378
],
  "geometry": {"coordinates":[[[-77.651579,43.218366],[-77.651222,43.218496],[-77.649365,43.219168],[-77.64769099999999,43.219783],[-77.647338,43.219919],[-77.647204,43.219971],[-77.64708299999999,43.220027],[-77.646117,43.220566],[-77.64581800000001,43.220737],[-77.644828,43.221285],[-77.644656,43.221378],[-77.64465300000001,43.220445],[-77.64466299999999,43.219651],[-77.644672,43.218851],[-77.64468100000001,43.218056],[-77.644685,43.217766],[-77.644687,43.217616],[-77.645246,43.21764],[-77.64523199999999,43.217232],[-77.645252,43.21558],[-77.64525999999999,43.214755],[-77.645267,43.213932],[-77.64528300000001,43.213059],[-77.64531700000001,43.211741],[-77.645489,43.211208],[-77.645912,43.211381],[-77.646567,43.211753],[-77.647713,43.212387],[-77.648409,43.212773],[-77.64860899999999,43.212884],[-77.64884499999999,43.213016],[-77.651566,43.215241],[-77.651461,43.215894],[-77.651444,43.21601],[-77.65140599999999,43.217882],[-77.65141300000001,43.217998],[-77.65142899999999,43.218098],[-77.65146799999999,43.21819],[-77.651579,43.218366]]],"type":"Polygon"}
}