{
  "id": "360339504004",
  "type": "Feature",
  "properties": {
    "area_land":3588304,
    "area_water":150728,
    "geoid":"360339504004",
    "name":"Block Group 4",
    "state":"ny"
},
  "bbox": [
    -74.293503,
    44.809806,
    -74.259609,
    44.850355
],
  "geometry": {"coordinates":[[[-74.293503,44.846146],[-74.29312899999999,44.846021],[-74.292869,44.845915],[-74.292539,44.845739],[-74.29177300000001,44.845251],[-74.291455,44.845067],[-74.291084,44.844893],[-74.290993,44.844852],[-74.290656,44.844735],[-74.29033,44.844645],[-74.290058,44.844586],[-74.289843,44.844556],[-74.288236,44.844374],[-74.288043,44.844354],[-74.287843,44.844334],[-74.28753500000001,44.844325],[-74.28688,44.844334],[-74.286423,44.844375],[-74.284972,44.844545],[-74.28452799999999,44.844583],[-74.283636,44.844687],[-74.282962,44.844758],[-74.28247500000001,44.844821],[-74.28273900000001,44.8464],[-74.28278,44.846692],[-74.28284499999999,44.847039],[-74.282934,44.84757],[-74.28301,44.847948],[-74.28325100000001,44.84953],[-74.283271,44.849714],[-74.28203600000001,44.84983],[-74.281755,44.849857],[-74.28063,44.849969],[-74.27960899999999,44.850071],[-74.278459,44.850185],[-74.27714400000001,44.850315],[-74.276754,44.850355],[-74.276684,44.850196],[-74.275127,44.846847],[-74.274911,44.846411],[-74.27456599999999,44.845683],[-74.274501,44.84555],[-74.274263,44.844986],[-74.27413900000001,44.844608],[-74.274052,44.844241],[-74.273926,44.84375],[-74.273782,44.843311],[-74.273647,44.842998],[-74.273341,44.84243],[-74.273482,44.842316],[-74.27353100000001,44.842302],[-74.273691,44.842305],[-74.273729,44.842253],[-74.27374399999999,44.842212],[-74.273774,44.842175],[-74.27381099999999,44.842163],[-74.273893,44.842163],[-74.274024,44.842178],[-74.274136,44.842171],[-74.274304,44.842127],[-74.274225,44.842018],[-74.27409,44.841923],[-74.273589,44.84169],[-74.27337900000001,44.841592],[-74.27322599999999,44.841508],[-74.273113,44.841431],[-74.27303999999999,44.841355],[-74.272999,44.841278],[-74.272865,44.840943],[-74.272746,44.840761],[-74.272684,44.840721],[-74.272604,44.840692],[-74.27236000000001,44.840652],[-74.272243,44.840612],[-74.272144,44.840557],[-74.272057,44.840473],[-74.27198,44.840342],[-74.271789,44.839959],[-74.271745,44.839796],[-74.271625,44.839577],[-74.27157699999999,44.839522],[-74.27145,44.839439],[-74.27126800000001,44.83938],[-74.27107100000001,44.8393],[-74.270888,44.83918],[-74.270779,44.839071],[-74.27069299999999,44.838954],[-74.270533,44.838663],[-74.27050699999999,44.838535],[-74.270504,44.838276],[-74.270551,44.838032],[-74.27065899999999,44.837847],[-74.270841,44.837668],[-74.271049,44.837497],[-74.271348,44.837202],[-74.27116700000001,44.837049],[-74.271,44.836925],[-74.27068199999999,44.836761],[-74.270398,44.836575],[-74.270239,44.836444],[-74.270104,44.836306],[-74.269758,44.835832],[-74.26955,44.835468],[-74.269537,44.835445],[-74.26915099999999,44.83475],[-74.26906,44.834564],[-74.26885799999999,44.833694],[-74.268781,44.833213],[-74.268669,44.832781],[-74.268528,44.832466],[-74.26796400000001,44.831293],[-74.267596,44.830265],[-74.267386,44.829737],[-74.26736099999999,44.829621],[-74.26736099999999,44.829307],[-74.267273,44.827887],[-74.26723,44.827617],[-74.267149,44.827366],[-74.266732,44.826371],[-74.266644,44.826207],[-74.266327,44.825697],[-74.266262,44.82554],[-74.26585900000001,44.824728],[-74.265576,44.824335],[-74.265379,44.824145],[-74.265117,44.823941],[-74.264985,44.823861],[-74.264892,44.823788],[-74.26481200000001,44.823697],[-74.26478299999999,44.82361],[-74.264765,44.823362],[-74.26478299999999,44.823176],[-74.26489100000001,44.822925],[-74.265142,44.822557],[-74.265193,44.822448],[-74.265219,44.82236],[-74.26522199999999,44.822273],[-74.265197,44.822051],[-74.265157,44.821938],[-74.265033,44.821695],[-74.264961,44.821441],[-74.264943,44.821339],[-74.26491900000001,44.821144],[-74.26491900000001,44.820704],[-74.26490699999999,44.820549],[-74.264877,44.820425],[-74.26480599999999,44.820234],[-74.264753,44.820163],[-74.26469299999999,44.820104],[-74.264574,44.820026],[-74.26449100000001,44.820003],[-74.263706,44.819943],[-74.263485,44.819912],[-74.263285,44.819843],[-74.263102,44.819759],[-74.26296000000001,44.819675],[-74.26285799999999,44.81957],[-74.262574,44.819224],[-74.262468,44.819045],[-74.262413,44.818914],[-74.262316,44.818524],[-74.26230200000001,44.818397],[-74.262275,44.817497],[-74.26225100000001,44.817052],[-74.262207,44.816808],[-74.262163,44.816663],[-74.26211600000001,44.816557],[-74.26178400000001,44.816109],[-74.261403,44.815646],[-74.26121000000001,44.815428],[-74.260893,44.815103],[-74.260592,44.814899],[-74.260413,44.81475],[-74.26003,44.814364],[-74.25989199999999,44.814178],[-74.259686,44.813843],[-74.259649,44.813744],[-74.25961700000001,44.813566],[-74.259609,44.813424],[-74.259615,44.813081],[-74.259637,44.812892],[-74.259716,44.812501],[-74.259946,44.811912],[-74.260125,44.811141],[-74.26021900000001,44.810523],[-74.26025300000001,44.809992],[-74.260441,44.80996],[-74.261579,44.809842],[-74.26169,44.809806],[-74.26202000000001,44.810085],[-74.262649,44.810566],[-74.263972,44.811525],[-74.265136,44.812393],[-74.265479,44.812671],[-74.265817,44.813013],[-74.266137,44.813371],[-74.26651099999999,44.813858],[-74.26705,44.814638],[-74.267383,44.815147],[-74.267763,44.815811],[-74.268371,44.816839],[-74.268508,44.817132],[-74.26862300000001,44.817468],[-74.268917,44.818555],[-74.269034,44.819137],[-74.269121,44.819498],[-74.269192,44.819864],[-74.26930900000001,44.820379],[-74.269341,44.820438],[-74.269441,44.82062],[-74.26957,44.820807],[-74.270073,44.821342],[-74.270855,44.82211],[-74.271523,44.822727],[-74.272026,44.823242],[-74.273101,44.824406],[-74.274378,44.825789],[-74.274621,44.826066],[-74.274928,44.826349],[-74.275096,44.826467],[-74.275733,44.826855],[-74.275863,44.826951],[-74.27615400000001,44.827216],[-74.276349,44.827407],[-74.276507,44.827578],[-74.277513,44.828551],[-74.278397,44.829363],[-74.279713,44.830531],[-74.28010500000001,44.830862],[-74.280158,44.830906],[-74.280452,44.831156],[-74.280765,44.831406],[-74.28095399999999,44.831555],[-74.28122399999999,44.831752],[-74.282314,44.832499],[-74.282921,44.832912],[-74.283023,44.832982],[-74.283642,44.833395],[-74.28416900000001,44.833716],[-74.284704,44.834008],[-74.28597499999999,44.83468],[-74.286379,44.834913],[-74.28657,44.835051],[-74.286863,44.835322],[-74.287638,44.836175],[-74.28783199999999,44.836396],[-74.289145,44.837849],[-74.290209,44.839044],[-74.290553,44.839422],[-74.29088400000001,44.83983],[-74.29101799999999,44.840002],[-74.291245,44.840378],[-74.29191299999999,44.84155],[-74.292136,44.84196],[-74.29259399999999,44.842749],[-74.292895,44.843309],[-74.293009,44.843665],[-74.29311,44.844102],[-74.29329799999999,44.844957],[-74.293503,44.846146]]],"type":"Polygon"}
}