{
  "id": "360999501001",
  "type": "Feature",
  "properties": {
    "area_land":77845418,
    "area_water":7919211,
    "geoid":"360999501001",
    "name":"Block Group 1",
    "state":"ny"
},
  "bbox": [
    -76.858773,
    42.946112,
    -76.711202,
    43.024058
],
  "geometry": {"coordinates":[[[-76.858773,43.018434],[-76.857614,43.018483],[-76.857381,43.018494],[-76.85438499999999,43.018618],[-76.85399,43.018636],[-76.84983699999999,43.018809],[-76.849796,43.018811],[-76.846553,43.018948],[-76.84536799999999,43.01899],[-76.841852,43.019158],[-76.84174,43.019163],[-76.83991,43.019245],[-76.839747,43.019252],[-76.833769,43.019446],[-76.829284,43.019588],[-76.829232,43.019591],[-76.825594,43.019718],[-76.814269,43.020343],[-76.813919,43.020355],[-76.812951,43.020401],[-76.81229999999999,43.020445],[-76.80800600000001,43.020588],[-76.807254,43.020621],[-76.807046,43.020636],[-76.806822,43.020645],[-76.806107,43.020697],[-76.80608599999999,43.020698],[-76.804579,43.020788],[-76.80226,43.020857],[-76.802015,43.02087],[-76.799374,43.021008],[-76.799234,43.021014],[-76.798405,43.021049],[-76.798379,43.021051],[-76.79819999999999,43.021059],[-76.796772,43.021043],[-76.792436,43.021223],[-76.787871,43.021405],[-76.78498399999999,43.021524],[-76.783468,43.021607],[-76.783152,43.021611],[-76.782931,43.021613],[-76.78271599999999,43.021622],[-76.775181,43.021953],[-76.770798,43.022062],[-76.769915,43.022104],[-76.766998,43.022191],[-76.766715,43.022203],[-76.76642200000001,43.022215],[-76.76638800000001,43.022216],[-76.76635400000001,43.022217],[-76.76098,43.022404],[-76.75997,43.022435],[-76.75798399999999,43.022521],[-76.75691,43.022562],[-76.752821,43.02267],[-76.749483,43.022739],[-76.744713,43.022959],[-76.744173,43.022979],[-76.744108,43.022981],[-76.72885599999999,43.023527],[-76.72866999999999,43.023534],[-76.725381,43.02364],[-76.71767800000001,43.023937],[-76.717615,43.02394],[-76.714505,43.024051],[-76.714288,43.024058],[-76.71380600000001,43.024035],[-76.71367600000001,43.023844],[-76.713545,43.023655],[-76.713223,43.023162],[-76.713064,43.022803],[-76.712863,43.022438],[-76.712692,43.022151],[-76.712481,43.021715],[-76.71201000000001,43.021038],[-76.711732,43.020451],[-76.71148100000001,43.019751],[-76.711353,43.019326],[-76.71133500000001,43.019265],[-76.711226,43.018575],[-76.71121100000001,43.018247],[-76.711202,43.018042],[-76.711412,43.017475],[-76.711457,43.01737],[-76.71162099999999,43.017015],[-76.712005,43.016352],[-76.71211,43.016202],[-76.71240899999999,43.015766],[-76.712968,43.015266],[-76.713703,43.014638],[-76.71450299999999,43.014152],[-76.715442,43.013491],[-76.717286,43.012274],[-76.71814999999999,43.011703],[-76.718699,43.011337],[-76.718943,43.011129],[-76.719246,43.010819],[-76.71939399999999,43.010667],[-76.71979,43.010267],[-76.72009300000001,43.009839],[-76.720311,43.009563],[-76.720439,43.009402],[-76.72054,43.009303],[-76.720772,43.009075],[-76.721129,43.008659],[-76.72139799999999,43.008275],[-76.72165699999999,43.007859],[-76.72169,43.007762],[-76.721771,43.007526],[-76.721852,43.007289],[-76.721863,43.007201],[-76.721914,43.006791],[-76.721887,43.006531],[-76.721857,43.006235],[-76.721834,43.006161],[-76.721805,43.006063],[-76.72177499999999,43.005962],[-76.72170199999999,43.005654],[-76.72161,43.005194],[-76.721519,43.004695],[-76.72143800000001,43.004267],[-76.721356,43.003929],[-76.721283,43.003703],[-76.721125,43.003323],[-76.72089099999999,43.002676],[-76.720854,43.002379],[-76.720826,43.002105],[-76.720766,43.001742],[-76.72078399999999,43.001284],[-76.720872,43.000385],[-76.720879,43.0003],[-76.720889,43.000166],[-76.72091,43.000076],[-76.720912,43.000062],[-76.720832,42.998633],[-76.720654,42.995426],[-76.72117799999999,42.994243],[-76.72129,42.993985],[-76.72143699999999,42.993668],[-76.72147699999999,42.993578],[-76.721515,42.993492],[-76.72215799999999,42.9929],[-76.723326,42.991822],[-76.72400500000001,42.991486],[-76.726283,42.990345],[-76.726653,42.989257],[-76.728814,42.987764],[-76.728156,42.98571],[-76.72840600000001,42.984452],[-76.72827100000001,42.981004],[-76.72762299999999,42.978144],[-76.728658,42.976072],[-76.731047,42.974482],[-76.73354500000001,42.972811],[-76.73513199999999,42.97153],[-76.735169,42.9715],[-76.736082,42.970765],[-76.73612199999999,42.970733],[-76.73621799999999,42.970661],[-76.736605,42.970383],[-76.73674,42.970286],[-76.737031,42.968661],[-76.737098,42.968287],[-76.73671,42.967661],[-76.736565,42.967435],[-76.73654500000001,42.967403],[-76.736245,42.966934],[-76.735894,42.965493],[-76.736558,42.96442],[-76.73666799999999,42.963036],[-76.73670799999999,42.962543],[-76.73698,42.962271],[-76.737706,42.961554],[-76.73797500000001,42.961286],[-76.73804199999999,42.961219],[-76.738136,42.961126],[-76.738231,42.961034],[-76.73825600000001,42.961009],[-76.738249,42.960912],[-76.738056,42.958125],[-76.738066,42.95784],[-76.73810899999999,42.956586],[-76.738637,42.955695],[-76.738924,42.95521],[-76.739211,42.954726],[-76.739361,42.954473],[-76.73916,42.954152],[-76.738669,42.953367],[-76.73817699999999,42.952582],[-76.738136,42.952516],[-76.737829,42.951698],[-76.737641,42.951455],[-76.73741,42.950582],[-76.737207,42.950041],[-76.73737300000001,42.950035],[-76.73973599999999,42.949967],[-76.73988199999999,42.949963],[-76.74947,42.949716],[-76.751548,42.949655],[-76.766059,42.949233],[-76.76746900000001,42.949192],[-76.767854,42.949183],[-76.769801,42.949022],[-76.770126,42.949022],[-76.770884,42.948993],[-76.776726,42.948838],[-76.777838,42.948796],[-76.78266000000001,42.948594],[-76.78904900000001,42.94838],[-76.794419,42.948219],[-76.79508,42.948202],[-76.795152,42.9482],[-76.795745,42.948225],[-76.807892,42.947843],[-76.81801900000001,42.947492],[-76.82658499999999,42.947168],[-76.828783,42.947082],[-76.833753,42.946888],[-76.84407299999999,42.946485],[-76.846305,42.94641],[-76.854254,42.946112],[-76.85434600000001,42.947654],[-76.855149,42.960578],[-76.85552800000001,42.966778],[-76.85553299999999,42.966867],[-76.85554999999999,42.967146],[-76.85691799999999,42.989424],[-76.857598,43.000301],[-76.857613,43.000501],[-76.85782,43.004344],[-76.85781299999999,43.004548],[-76.857936,43.006468],[-76.857952,43.006721],[-76.85808299999999,43.008037],[-76.858538,43.014649],[-76.858773,43.018434]]],"type":"Polygon"}
}