{
  "id": "360470186001",
  "type": "Feature",
  "properties": {
    "area_land":56501,
    "area_water":0,
    "geoid":"360470186001",
    "name":"Block Group 1",
    "state":"ny"
},
  "bbox": [
    -74.005979,
    40.613475,
    -74.002031,
    40.616482
],
  "geometry": {"coordinates":[[[-74.005397,40.615363],[-74.004813,40.615923],[-74.004234,40.616482],[-74.002031,40.615153],[-74.00261399999999,40.614594],[-74.003196,40.614035],[-74.003778,40.613475],[-74.005979,40.614804],[-74.005397,40.615363]]],"type":"Polygon"}
}