{
  "id": "360150101001",
  "type": "Feature",
  "properties": {
    "area_land":52289452,
    "area_water":461913,
    "geoid":"360150101001",
    "name":"Block Group 1",
    "state":"ny"
},
  "bbox": [
    -76.730568,
    42.171605,
    -76.610638,
    42.248333
],
  "geometry": {"coordinates":[[[-76.73056800000001,42.248064],[-76.729349,42.248069],[-76.72921599999999,42.248066],[-76.728369,42.247963],[-76.728217,42.247963],[-76.712513,42.2481],[-76.712144,42.248094],[-76.70965,42.248049],[-76.706838,42.248025],[-76.695441,42.248179],[-76.693084,42.2482],[-76.686688,42.248318],[-76.685779,42.248333],[-76.68577000000001,42.247355],[-76.685714,42.242513],[-76.68571900000001,42.242265],[-76.68582499999999,42.239224],[-76.685785,42.23883],[-76.68566800000001,42.237678],[-76.68565599999999,42.237604],[-76.685126,42.237628],[-76.685029,42.237628],[-76.681349,42.237675],[-76.681313,42.237676],[-76.665358,42.237877],[-76.66478499999999,42.237884],[-76.66306899999999,42.237905],[-76.662498,42.237913],[-76.660155,42.237942],[-76.65312900000001,42.23803],[-76.65078699999999,42.23806],[-76.650654,42.238061],[-76.650255,42.238066],[-76.65012299999999,42.238068],[-76.648347,42.23809],[-76.64811400000001,42.238094],[-76.644032,42.235047],[-76.64261,42.233985],[-76.642256,42.233721],[-76.63273100000001,42.226638],[-76.624663,42.22063],[-76.62244,42.219085],[-76.622347,42.21901],[-76.62199099999999,42.218746],[-76.61972299999999,42.216855],[-76.61063799999999,42.216685],[-76.61069999999999,42.21385],[-76.6108,42.210458],[-76.61106599999999,42.201407],[-76.611127,42.201452],[-76.61130199999999,42.201654],[-76.611386,42.201822],[-76.611508,42.201971],[-76.61171400000001,42.202189],[-76.611951,42.202421],[-76.612157,42.202585],[-76.61253000000001,42.202917],[-76.612737,42.203005],[-76.612996,42.20318],[-76.613294,42.20339],[-76.613477,42.203577],[-76.61377400000001,42.203959],[-76.61390400000001,42.2041],[-76.61433100000001,42.20439],[-76.61459000000001,42.204546],[-76.615354,42.204945],[-76.61597500000001,42.205431],[-76.616135,42.205502],[-76.61627799999999,42.205526],[-76.616517,42.205525],[-76.617833,42.205549],[-76.618032,42.205599],[-76.61823099999999,42.205697],[-76.61844600000001,42.205921],[-76.619148,42.206761],[-76.61949199999999,42.207527],[-76.619606,42.207665],[-76.61975,42.207761],[-76.619878,42.207814],[-76.62015,42.207825],[-76.626546,42.207903],[-76.626851,42.207895],[-76.627538,42.207819],[-76.63091799999999,42.206999],[-76.631236,42.206857],[-76.63353499999999,42.205828],[-76.633703,42.205744],[-76.633802,42.205652],[-76.633787,42.205267],[-76.633802,42.205],[-76.63387899999999,42.204676],[-76.633985,42.204417],[-76.634191,42.204069],[-76.634413,42.203745],[-76.634626,42.203398],[-76.63484699999999,42.203108],[-76.63506099999999,42.202852],[-76.635389,42.202528],[-76.63561,42.20236],[-76.63622100000001,42.201918],[-76.636679,42.201674],[-76.637022,42.201498],[-76.63735,42.201368],[-76.637625,42.201273],[-76.637968,42.201098],[-76.63823499999999,42.201006],[-76.638548,42.200949],[-76.63886100000001,42.200976],[-76.63915799999999,42.201006],[-76.64416300000001,42.201925],[-76.64491099999999,42.202036],[-76.645354,42.202089],[-76.64577300000001,42.20207],[-76.646101,42.202036],[-76.646361,42.201971],[-76.64819199999999,42.201544],[-76.648489,42.201437],[-76.648764,42.201315],[-76.649046,42.201174],[-76.649344,42.201018],[-76.649603,42.200854],[-76.649901,42.200632],[-76.650328,42.200281],[-76.650527,42.20014],[-76.65074799999999,42.20001],[-76.651167,42.19982],[-76.651595,42.199686],[-76.651763,42.199671],[-76.65275099999999,42.199529],[-76.653037,42.199488],[-76.654387,42.199274],[-76.65476099999999,42.199152],[-76.65505899999999,42.199026],[-76.655379,42.19887],[-76.65570700000001,42.198626],[-76.65607300000001,42.198313],[-76.65634,42.197985],[-76.656508,42.197706],[-76.65689,42.196535],[-76.65701199999999,42.196283],[-76.657157,42.19602],[-76.658019,42.195086],[-76.658126,42.194948],[-76.65830099999999,42.194708],[-76.6585,42.19446],[-76.65901100000001,42.193766],[-76.659476,42.193148],[-76.65991099999999,42.192652],[-76.660239,42.192312],[-76.66049099999999,42.19208],[-76.661231,42.191424],[-76.663568,42.189693],[-76.665879,42.189706],[-76.665955,42.188921],[-76.66623800000001,42.186057],[-76.666268,42.185753],[-76.666335,42.185072],[-76.666335,42.18345],[-76.666358,42.18102],[-76.666335,42.180752],[-76.666231,42.180489],[-76.665992,42.180086],[-76.664649,42.177847],[-76.66448200000001,42.177507],[-76.666183,42.177416],[-76.66654200000001,42.177382],[-76.667137,42.177347],[-76.667823,42.177382],[-76.668243,42.177477],[-76.668685,42.177618],[-76.670158,42.178175],[-76.673225,42.179331],[-76.67354,42.179494],[-76.674031,42.179671],[-76.67428200000001,42.179746],[-76.674509,42.179802],[-76.674927,42.179817],[-76.67517700000001,42.179806],[-76.675444,42.179786],[-76.678314,42.179568],[-76.67868799999999,42.179545],[-76.67892399999999,42.179541],[-76.67923,42.179568],[-76.67952699999999,42.179606],[-76.679924,42.179752],[-76.68016799999999,42.179842],[-76.680357,42.179915],[-76.680424,42.179941],[-76.68047199999999,42.17996],[-76.680542,42.179987],[-76.681023,42.180178],[-76.681297,42.180285],[-76.682121,42.180628],[-76.682373,42.180689],[-76.682472,42.180723],[-76.682717,42.180777],[-76.68302199999999,42.1808],[-76.683312,42.1808],[-76.683863,42.180786],[-76.686036,42.180732],[-76.68658600000001,42.180718],[-76.68684399999999,42.180712],[-76.687687,42.18033],[-76.688675,42.180014],[-76.68965799999999,42.179749],[-76.691536,42.179274],[-76.693018,42.178937],[-76.69363,42.178781],[-76.6969,42.177996],[-76.697491,42.177867],[-76.698785,42.177584],[-76.699248,42.177465],[-76.70018,42.177224],[-76.701505,42.176861],[-76.70301499999999,42.176519],[-76.704722,42.176187],[-76.708016,42.175598],[-76.71166100000001,42.174939],[-76.713126,42.174672],[-76.715583,42.174203],[-76.717179,42.173938],[-76.717896,42.173776],[-76.718633,42.173608],[-76.719038,42.173483],[-76.71942300000001,42.173365],[-76.72045199999999,42.173031],[-76.721659,42.172594],[-76.72206799999999,42.17239],[-76.72229799999999,42.172211],[-76.72257999999999,42.172006],[-76.723024,42.171827],[-76.72360399999999,42.171682],[-76.724065,42.17163],[-76.72450000000001,42.171605],[-76.725148,42.171673],[-76.72629499999999,42.171946],[-76.72629499999999,42.172067],[-76.72644,42.174684],[-76.726607,42.177707],[-76.72721900000001,42.188729],[-76.727238,42.191593],[-76.727211,42.192622],[-76.72744899999999,42.195058],[-76.727925,42.200742],[-76.728077,42.203201],[-76.729052,42.22065],[-76.72917700000001,42.222858],[-76.729664,42.231528],[-76.729688,42.232012],[-76.729924,42.236217],[-76.730232,42.241791],[-76.73039300000001,42.244944],[-76.73056800000001,42.248064]]],"type":"Polygon"}
}