{
  "id": "360870131002",
  "type": "Feature",
  "properties": {
    "area_land":314991,
    "area_water":0,
    "geoid":"360870131002",
    "name":"Block Group 2",
    "state":"ny"
},
  "bbox": [
    -73.925228,
    41.09372,
    -73.91723,
    41.099925
],
  "geometry": {"coordinates":[[[-73.924693,41.096741],[-73.92452900000001,41.097144],[-73.92402,41.098489],[-73.92500800000001,41.098703],[-73.924819,41.099209],[-73.92458600000001,41.099835],[-73.924578,41.099855],[-73.924554,41.099925],[-73.924435,41.0999],[-73.92408399999999,41.099831],[-73.923669,41.09975],[-73.923644,41.099745],[-73.923541,41.099724],[-73.923399,41.099697],[-73.922961,41.099601],[-73.922483,41.099486],[-73.92235700000001,41.099458],[-73.92143900000001,41.099257],[-73.92126,41.099233],[-73.920682,41.099108],[-73.920334,41.099032],[-73.920253,41.099014],[-73.920159,41.098994],[-73.919788,41.098916],[-73.919758,41.09891],[-73.919481,41.098851],[-73.91930600000001,41.098813],[-73.919072,41.098763],[-73.91892300000001,41.09873],[-73.91889500000001,41.098724],[-73.918165,41.098562],[-73.917286,41.098364],[-73.91723,41.098351],[-73.917231,41.098336],[-73.917233,41.09831],[-73.91725700000001,41.098028],[-73.917298,41.09771],[-73.917413,41.097033],[-73.917452,41.096797],[-73.917542,41.096254],[-73.91761200000001,41.095674],[-73.917664,41.095215],[-73.917705,41.094783],[-73.917725,41.094432],[-73.91776400000001,41.093793],[-73.917771,41.09372],[-73.918655,41.093912],[-73.919691,41.094124],[-73.920715,41.094372],[-73.921521,41.094563],[-73.92231700000001,41.09475],[-73.923964,41.095088],[-73.925228,41.09537],[-73.924693,41.096741]]],"type":"Polygon"}
}