{
  "id": "360470934001",
  "type": "Feature",
  "properties": {
    "area_land":81276,
    "area_water":0,
    "geoid":"360470934001",
    "name":"Block Group 1",
    "state":"ny"
},
  "bbox": [
    -73.920773,
    40.648568,
    -73.91632,
    40.652789
],
  "geometry": {"coordinates":[[[-73.920773,40.652554],[-73.919962,40.652789],[-73.918137,40.651158],[-73.91632,40.649527],[-73.917087,40.649027],[-73.917801,40.648568],[-73.91962100000001,40.650201],[-73.920467,40.649654],[-73.920581,40.650707],[-73.92062199999999,40.651098],[-73.92074599999999,40.652271],[-73.920773,40.652554]]],"type":"Polygon"}
}