{
  "id": "360050383021",
  "type": "Feature",
  "properties": {
    "area_land":69387,
    "area_water":0,
    "geoid":"360050383021",
    "name":"Block Group 1",
    "state":"ny"
},
  "bbox": [
    -73.89644,
    40.854571,
    -73.890887,
    40.861634
],
  "geometry": {"coordinates":[[[-73.896007,40.855596],[-73.895763,40.855967],[-73.89558100000001,40.856246],[-73.895263,40.856743],[-73.893885,40.85882],[-73.89380800000001,40.858942],[-73.893215,40.859874],[-73.892563,40.860523],[-73.892428,40.860657],[-73.891447,40.861634],[-73.89088700000001,40.861345],[-73.891048,40.861146],[-73.891744,40.860177],[-73.892257,40.85941],[-73.892993,40.858386],[-73.894414,40.856434],[-73.89477599999999,40.85593],[-73.89560899999999,40.854571],[-73.89644,40.854908],[-73.896007,40.855596]]],"type":"Polygon"}
}