{
  "id": "360530301031",
  "type": "Feature",
  "properties": {
    "area_land":16749559,
    "area_water":44247,
    "geoid":"360530301031",
    "name":"Block Group 1",
    "state":"ny"
},
  "bbox": [
    -75.709363,
    43.075566,
    -75.652836,
    43.151445
],
  "geometry": {"coordinates":[[[-75.709363,43.151405],[-75.708715,43.151311],[-75.708339,43.151284],[-75.70799,43.151278],[-75.707825,43.151291],[-75.70764200000001,43.151331],[-75.707404,43.151411],[-75.707257,43.151445],[-75.707166,43.151445],[-75.707019,43.151398],[-75.706661,43.151197],[-75.706579,43.151103],[-75.706542,43.150996],[-75.706551,43.150843],[-75.706579,43.150729],[-75.707065,43.149873],[-75.707138,43.149732],[-75.707202,43.149505],[-75.707202,43.149324],[-75.70714700000001,43.149023],[-75.707166,43.148936],[-75.707303,43.148682],[-75.707404,43.148622],[-75.707624,43.148622],[-75.707762,43.148629],[-75.707881,43.148615],[-75.707982,43.148575],[-75.708046,43.148515],[-75.708358,43.14812],[-75.70838500000001,43.14804],[-75.70838500000001,43.14796],[-75.708358,43.147886],[-75.70823799999999,43.147679],[-75.70823799999999,43.147585],[-75.708293,43.147492],[-75.708443,43.147363],[-75.708697,43.147131],[-75.70877900000001,43.147011],[-75.708825,43.146877],[-75.708843,43.146756],[-75.708825,43.146562],[-75.708752,43.146087],[-75.70865999999999,43.145773],[-75.70860500000001,43.145659],[-75.708513,43.145539],[-75.70842,43.145453],[-75.708325,43.145381],[-75.708212,43.145315],[-75.708083,43.14526],[-75.70791800000001,43.145222],[-75.70773699999999,43.145189],[-75.707262,43.145134],[-75.707059,43.145095],[-75.706915,43.145051],[-75.70674200000001,43.144974],[-75.706576,43.144864],[-75.706501,43.144787],[-75.70641999999999,43.144675],[-75.706399,43.144565],[-75.70641500000001,43.144461],[-75.70649299999999,43.144358],[-75.706682,43.144188],[-75.706757,43.144078],[-75.706863,43.143907],[-75.70703,43.14355],[-75.70719099999999,43.143222],[-75.70725400000001,43.143055],[-75.707285,43.142911],[-75.7073,43.142747],[-75.707285,43.14256],[-75.707223,43.142347],[-75.707089,43.142103],[-75.706805,43.141634],[-75.70656099999999,43.141225],[-75.706497,43.141051],[-75.706469,43.140931],[-75.706497,43.140784],[-75.706588,43.140717],[-75.70668000000001,43.140697],[-75.70707400000001,43.140663],[-75.707184,43.14063],[-75.707294,43.140583],[-75.707514,43.140462],[-75.707606,43.140396],[-75.70768099999999,43.140323],[-75.70771000000001,43.140272],[-75.707752,43.140163],[-75.707759,43.139999],[-75.707759,43.139701],[-75.707694,43.139295],[-75.70746699999999,43.138377],[-75.70742199999999,43.138143],[-75.707357,43.137962],[-75.707266,43.137815],[-75.70702799999999,43.137387],[-75.706872,43.13716],[-75.706771,43.137026],[-75.706579,43.136912],[-75.70631299999999,43.136805],[-75.706084,43.136752],[-75.705855,43.136739],[-75.705727,43.136765],[-75.705607,43.136805],[-75.705507,43.136886],[-75.705443,43.136979],[-75.705415,43.137113],[-75.70535099999999,43.137554],[-75.705314,43.137681],[-75.705268,43.137735],[-75.705195,43.137775],[-75.70510400000001,43.137815],[-75.704994,43.137835],[-75.704874,43.137815],[-75.704774,43.137761],[-75.70446200000001,43.137421],[-75.70437099999999,43.137347],[-75.704206,43.137253],[-75.703931,43.13712],[-75.703518,43.136946],[-75.702996,43.136772],[-75.702575,43.136665],[-75.70234600000001,43.136612],[-75.702117,43.136585],[-75.70190599999999,43.136585],[-75.70170400000001,43.136605],[-75.701521,43.136652],[-75.701374,43.136719],[-75.70121,43.136846],[-75.700284,43.137695],[-75.69951399999999,43.138437],[-75.69922099999999,43.138657],[-75.698672,43.139052],[-75.69846099999999,43.139179],[-75.698195,43.139299],[-75.697453,43.139547],[-75.697141,43.13964],[-75.696775,43.139707],[-75.696381,43.139734],[-75.69523599999999,43.139734],[-75.694768,43.13968],[-75.694603,43.139627],[-75.694503,43.139567],[-75.694383,43.13946],[-75.694338,43.139337],[-75.694318,43.139179],[-75.694355,43.139025],[-75.69441,43.138932],[-75.694557,43.138798],[-75.696123,43.137655],[-75.69627,43.137461],[-75.69638,43.137274],[-75.696426,43.1371],[-75.69645300000001,43.136919],[-75.69637899999999,43.136604],[-75.696297,43.136457],[-75.69611399999999,43.13629],[-75.695958,43.136197],[-75.695234,43.135815],[-75.695078,43.135722],[-75.694913,43.135655],[-75.69416200000001,43.135488],[-75.693933,43.135401],[-75.69374999999999,43.135287],[-75.69364899999999,43.13518],[-75.693585,43.13506],[-75.69357599999999,43.13492],[-75.69357599999999,43.134793],[-75.693612,43.134699],[-75.693896,43.134137],[-75.693915,43.133984],[-75.693896,43.13381],[-75.693805,43.133643],[-75.69362099999999,43.133475],[-75.69344700000001,43.133362],[-75.692925,43.133108],[-75.69243,43.132954],[-75.691981,43.132867],[-75.69167899999999,43.13284],[-75.690753,43.132867],[-75.69022200000001,43.132941],[-75.689874,43.133008],[-75.689581,43.133101],[-75.688609,43.133596],[-75.68845399999999,43.133669],[-75.68827,43.133716],[-75.68803200000001,43.133756],[-75.687821,43.133776],[-75.687601,43.133776],[-75.687382,43.13373],[-75.687235,43.133656],[-75.687101,43.13352],[-75.687014,43.133161],[-75.686761,43.132528],[-75.686493,43.132238],[-75.686429,43.132071],[-75.686401,43.131897],[-75.686429,43.131777],[-75.686502,43.131657],[-75.686685,43.131469],[-75.686768,43.131316],[-75.686814,43.131155],[-75.686905,43.130567],[-75.686914,43.130306],[-75.686887,43.130032],[-75.68685000000001,43.129838],[-75.686736,43.129655],[-75.686548,43.129444],[-75.685962,43.129069],[-75.68543,43.128748],[-75.68493599999999,43.128494],[-75.684432,43.128287],[-75.684175,43.128207],[-75.68391,43.128166],[-75.68365300000001,43.128153],[-75.683058,43.128247],[-75.682362,43.128454],[-75.682124,43.128521],[-75.681831,43.128567],[-75.68154699999999,43.128581],[-75.681291,43.128547],[-75.68097,43.128487],[-75.679937,43.128133],[-75.679743,43.128061],[-75.67946000000001,43.127999],[-75.67899300000001,43.12792],[-75.678746,43.127833],[-75.678572,43.127726],[-75.678398,43.127592],[-75.678279,43.127472],[-75.678206,43.127278],[-75.67818800000001,43.127098],[-75.678197,43.126897],[-75.67824299999999,43.12673],[-75.67836200000001,43.126583],[-75.678764,43.126269],[-75.678892,43.126182],[-75.679084,43.126115],[-75.67950500000001,43.126015],[-75.68026500000001,43.125901],[-75.68043900000001,43.125921],[-75.680622,43.125968],[-75.680815,43.126055],[-75.681117,43.126222],[-75.68196500000001,43.126538],[-75.682091,43.126561],[-75.68221699999999,43.126554],[-75.682343,43.126531],[-75.68249,43.126476],[-75.682573,43.126402],[-75.682637,43.126335],[-75.682985,43.12566],[-75.68306699999999,43.12554],[-75.683159,43.125446],[-75.683333,43.125333],[-75.683516,43.125239],[-75.68369,43.125199],[-75.685137,43.124972],[-75.685265,43.124898],[-75.685329,43.124825],[-75.685384,43.124698],[-75.685393,43.124538],[-75.685384,43.124391],[-75.685265,43.124083],[-75.685146,43.123916],[-75.685008,43.123736],[-75.684853,43.123609],[-75.68467,43.123482],[-75.684505,43.123442],[-75.684303,43.123442],[-75.684138,43.123462],[-75.683498,43.123635],[-75.68309499999999,43.123756],[-75.682829,43.123816],[-75.682573,43.123849],[-75.68223399999999,43.123843],[-75.68185800000001,43.123809],[-75.68076000000001,43.123615],[-75.680604,43.123562],[-75.680476,43.123482],[-75.680396,43.123389],[-75.680329,43.123281],[-75.680302,43.123181],[-75.680302,43.123081],[-75.680348,43.123001],[-75.68043900000001,43.122927],[-75.68102500000001,43.12278],[-75.68112600000001,43.122747],[-75.681427,43.122626],[-75.68156500000001,43.122546],[-75.681665,43.122499],[-75.68172,43.122439],[-75.681757,43.122326],[-75.681757,43.122205],[-75.68172,43.122098],[-75.681601,43.121838],[-75.681583,43.121684],[-75.681566,43.121456],[-75.681538,43.121319],[-75.681487,43.121233],[-75.681394,43.121133],[-75.681327,43.121073],[-75.68124899999999,43.121022],[-75.681175,43.120999],[-75.681116,43.120999],[-75.68104200000001,43.121019],[-75.680983,43.121076],[-75.680969,43.121156],[-75.680971,43.121205],[-75.680986,43.121298],[-75.680999,43.121436],[-75.680987,43.121501],[-75.680948,43.121575],[-75.68088899999999,43.12165],[-75.680787,43.12172],[-75.68061400000001,43.121795],[-75.680408,43.121856],[-75.680273,43.121878],[-75.680166,43.121878],[-75.680076,43.121855],[-75.68000600000001,43.121812],[-75.679935,43.121738],[-75.67990399999999,43.121667],[-75.67990399999999,43.121595],[-75.67993,43.121528],[-75.679973,43.121472],[-75.68006800000001,43.121364],[-75.68010700000001,43.12129],[-75.680131,43.121193],[-75.680139,43.121105],[-75.680119,43.12102],[-75.680066,43.120928],[-75.67999500000001,43.12084],[-75.6799,43.120782],[-75.679795,43.120742],[-75.679661,43.120711],[-75.679506,43.120691],[-75.679376,43.120691],[-75.679272,43.120708],[-75.679165,43.120762],[-75.67911100000001,43.120815],[-75.67908,43.120892],[-75.679067,43.120952],[-75.67905399999999,43.121059],[-75.679056,43.121363],[-75.67903699999999,43.121477],[-75.678973,43.121584],[-75.678873,43.121644],[-75.67872,43.121668],[-75.678515,43.121664],[-75.678271,43.121621],[-75.67796300000001,43.121556],[-75.677713,43.121509],[-75.677514,43.121481],[-75.67731499999999,43.121462],[-75.67712899999999,43.121457],[-75.676968,43.121497],[-75.676739,43.12157],[-75.676419,43.121711],[-75.676256,43.121757],[-75.676134,43.121762],[-75.675961,43.121757],[-75.67579600000001,43.121777],[-75.675659,43.121824],[-75.675549,43.121898],[-75.675466,43.121965],[-75.675375,43.122085],[-75.67530600000001,43.122198],[-75.67524899999999,43.122268],[-75.675152,43.122328],[-75.675023,43.122362],[-75.67488899999999,43.122372],[-75.674725,43.122366],[-75.67455099999999,43.122339],[-75.67427600000001,43.122239],[-75.674029,43.122138],[-75.67385899999999,43.122038],[-75.67353799999999,43.121928],[-75.673292,43.121866],[-75.673046,43.121819],[-75.67269899999999,43.121742],[-75.67254800000001,43.121643],[-75.672431,43.121523],[-75.67236200000001,43.121386],[-75.672326,43.12125],[-75.672326,43.121104],[-75.67233299999999,43.120957],[-75.672369,43.120805],[-75.672433,43.120638],[-75.67251899999999,43.120486],[-75.672675,43.120296],[-75.672935,43.120047],[-75.67327400000001,43.119713],[-75.673429,43.119538],[-75.673585,43.119319],[-75.673767,43.119014],[-75.67384699999999,43.118854],[-75.673884,43.118706],[-75.673884,43.118608],[-75.673874,43.118487],[-75.67383100000001,43.118366],[-75.673783,43.118253],[-75.67371799999999,43.118147],[-75.67360100000001,43.118038],[-75.673424,43.117929],[-75.673023,43.117718],[-75.672771,43.117612],[-75.672557,43.11753],[-75.67213599999999,43.117437],[-75.671943,43.117417],[-75.671724,43.117417],[-75.671611,43.117413],[-75.671499,43.117394],[-75.671402,43.117347],[-75.67135399999999,43.117292],[-75.671295,43.117136],[-75.671279,43.117069],[-75.671199,43.116933],[-75.671097,43.116843],[-75.67092100000001,43.116761],[-75.670776,43.116703],[-75.670616,43.11664],[-75.67045,43.116593],[-75.670311,43.116546],[-75.67026300000001,43.116495],[-75.670231,43.116402],[-75.670231,43.11632],[-75.67023,43.116154],[-75.67027299999999,43.116003],[-75.67027899999999,43.11591],[-75.67026300000001,43.115757],[-75.670199,43.115586],[-75.670108,43.115433],[-75.669915,43.115289],[-75.669701,43.115183],[-75.669546,43.115156],[-75.669192,43.115142],[-75.668836,43.115156],[-75.66779,43.115195],[-75.666742,43.1152],[-75.66644700000001,43.115184],[-75.66624899999999,43.115158],[-75.666023,43.115087],[-75.665719,43.114886],[-75.665485,43.114788],[-75.665251,43.11475],[-75.665057,43.114711],[-75.6648,43.114694],[-75.664519,43.11472],[-75.66425599999999,43.114767],[-75.662676,43.115279],[-75.66206099999999,43.1156],[-75.66178600000001,43.115724],[-75.661552,43.115813],[-75.6614,43.115856],[-75.661224,43.115852],[-75.66101399999999,43.115818],[-75.66074500000001,43.115681],[-75.660557,43.115527],[-75.660394,43.115382],[-75.66031700000001,43.115266],[-75.660265,43.115113],[-75.660241,43.114967],[-75.660276,43.114775],[-75.660394,43.114463],[-75.660394,43.114331],[-75.660253,43.113917],[-75.660183,43.113844],[-75.66001300000001,43.113712],[-75.659873,43.113643],[-75.65973200000001,43.113639],[-75.659125,43.113733],[-75.65865700000001,43.113814],[-75.65833499999999,43.113857],[-75.65805400000001,43.113878],[-75.657515,43.113891],[-75.657006,43.113934],[-75.65671399999999,43.113972],[-75.656093,43.114092],[-75.655573,43.114134],[-75.655338,43.114134],[-75.655128,43.114092],[-75.654824,43.114228],[-75.654448,43.114342],[-75.653103,43.114111],[-75.65297,43.113953],[-75.65283599999999,43.113794],[-75.65302,43.113736],[-75.653198,43.113687],[-75.65442299999999,43.113331],[-75.655692,43.112961],[-75.657906,43.112321],[-75.659015,43.111999],[-75.65979,43.111775],[-75.662024,43.111125],[-75.66374500000001,43.110625],[-75.664738,43.110337],[-75.66550100000001,43.110116],[-75.66678,43.109745],[-75.667081,43.109657],[-75.671756,43.108302],[-75.672517,43.1081],[-75.673243,43.107932],[-75.673982,43.107774],[-75.67470899999999,43.10764],[-75.676158,43.107433],[-75.678816,43.107091],[-75.67899199999999,43.107069],[-75.679793,43.106966],[-75.67999,43.10694],[-75.680176,43.106916],[-75.680459,43.106637],[-75.680745,43.106355],[-75.682393,43.104693],[-75.68341700000001,43.103672],[-75.68681100000001,43.100243],[-75.68712600000001,43.099976],[-75.68747500000001,43.099702],[-75.68793700000001,43.099385],[-75.688379,43.099128],[-75.688991,43.098825],[-75.69125,43.097771],[-75.691137,43.097669],[-75.691075,43.097606],[-75.690983,43.097507],[-75.690893,43.097391],[-75.69085699999999,43.097294],[-75.690657,43.097477],[-75.69047999999999,43.097595],[-75.690336,43.097671],[-75.69015,43.097688],[-75.689847,43.097679],[-75.68966899999999,43.097637],[-75.689365,43.097544],[-75.689311,43.097515],[-75.688783,43.097232],[-75.688183,43.096928],[-75.68791299999999,43.096776],[-75.68777,43.096658],[-75.687721,43.096601],[-75.687371,43.096333],[-75.68711500000001,43.096211],[-75.685717,43.095768],[-75.684995,43.0955],[-75.68368,43.095069],[-75.682052,43.094505],[-75.678061,43.093203],[-75.67658900000001,43.092697],[-75.676399,43.092598],[-75.676002,43.092267],[-75.675579,43.091844],[-75.67617300000001,43.091538],[-75.678223,43.090501],[-75.678478,43.090361],[-75.678859,43.090188],[-75.67914500000001,43.090087],[-75.679587,43.089955],[-75.679841,43.089891],[-75.680024,43.089854],[-75.680412,43.08979],[-75.679542,43.089796],[-75.679433,43.089806],[-75.679175,43.089808],[-75.673648,43.090042],[-75.672292,43.090096],[-75.67205199999999,43.090122],[-75.67139299999999,43.090233],[-75.668791,43.09065],[-75.66862500000001,43.090679],[-75.666881,43.090809],[-75.666809,43.090813],[-75.66502800000001,43.090891],[-75.66491000000001,43.09092],[-75.664554,43.09106],[-75.664137,43.09127],[-75.661361,43.092613],[-75.661258,43.092655],[-75.661177,43.091934],[-75.66109299999999,43.091081],[-75.661095,43.090885],[-75.661095,43.090813],[-75.660991,43.089838],[-75.66090800000001,43.088901],[-75.66209000000001,43.088501],[-75.66337900000001,43.088062],[-75.66331700000001,43.087993],[-75.663275,43.087894],[-75.663224,43.087452],[-75.66319300000001,43.087027],[-75.663132,43.086288],[-75.662992,43.084564],[-75.66297,43.084083],[-75.66293899999999,43.083651],[-75.66287699999999,43.082882],[-75.662786,43.081878],[-75.66268100000001,43.080605],[-75.662565,43.079192],[-75.662453,43.078054],[-75.662817,43.077992],[-75.663095,43.077952],[-75.663357,43.077914],[-75.66377799999999,43.077869],[-75.664852,43.077787],[-75.667919,43.077591],[-75.668908,43.07753],[-75.671043,43.077401],[-75.671865,43.07735],[-75.678907,43.076872],[-75.68405199999999,43.076586],[-75.686847,43.07642],[-75.689976,43.07624],[-75.690769,43.076196],[-75.691728,43.076141],[-75.69235500000001,43.076099],[-75.692784,43.07609],[-75.69341,43.076095],[-75.69469100000001,43.076096],[-75.695182,43.07608],[-75.69539,43.076064],[-75.69594499999999,43.076002],[-75.696299,43.075938],[-75.69708900000001,43.075801],[-75.697518,43.075759],[-75.699549,43.075691],[-75.70125,43.07564],[-75.70321,43.07557],[-75.703344,43.075566],[-75.703509,43.077715],[-75.703592,43.078704],[-75.703649,43.079466],[-75.703699,43.080097],[-75.703795,43.081313],[-75.703799,43.081361],[-75.703812,43.081528],[-75.703892,43.082544],[-75.703866,43.082615],[-75.70381500000001,43.082727],[-75.704033,43.084779],[-75.704238,43.0868],[-75.70451300000001,43.08965],[-75.704522,43.08994],[-75.704526,43.0901],[-75.704638,43.090983],[-75.70465,43.091052],[-75.704686,43.091255],[-75.704707,43.091443],[-75.704886,43.093136],[-75.704902,43.093305],[-75.705123,43.095639],[-75.70518199999999,43.098258],[-75.705226,43.099384],[-75.70523,43.09979],[-75.705262,43.10026],[-75.705471,43.102076],[-75.705589,43.103107],[-75.70564,43.10378],[-75.70564899999999,43.103929],[-75.705654,43.103998],[-75.70592499999999,43.107465],[-75.706007,43.108983],[-75.706309,43.113099],[-75.706388,43.114376],[-75.706518,43.116598],[-75.706586,43.117541],[-75.70691100000001,43.121838],[-75.70708999999999,43.123729],[-75.70710800000001,43.124963],[-75.70725,43.128022],[-75.70731000000001,43.129186],[-75.708169,43.13795],[-75.70836199999999,43.139662],[-75.708609,43.141539],[-75.70880200000001,43.144622],[-75.70904,43.147278],[-75.709108,43.147818],[-75.709164,43.1486],[-75.70919499999999,43.149054],[-75.70929599999999,43.150519],[-75.70929700000001,43.150538],[-75.709363,43.151405]]],"type":"Polygon"}
}