{
  "id": "360610032004",
  "type": "Feature",
  "properties": {
    "area_land":16816,
    "area_water":0,
    "geoid":"360610032004",
    "name":"Block Group 4",
    "state":"ny"
},
  "bbox": [
    -73.987502,
    40.723649,
    -73.984837,
    40.725203
],
  "geometry": {"coordinates":[[[-73.987053,40.725203],[-73.984837,40.724269],[-73.985286,40.723649],[-73.98750200000001,40.724584],[-73.987053,40.725203]]],"type":"Polygon"}
}