{
  "id": "360810809002",
  "type": "Feature",
  "properties": {
    "area_land":56862,
    "area_water":0,
    "geoid":"360810809002",
    "name":"Block Group 2",
    "state":"ny"
},
  "bbox": [
    -73.829264,
    40.728864,
    -73.825506,
    40.73193
],
  "geometry": {"coordinates":[[[-73.82926399999999,40.731564],[-73.82742500000001,40.73193],[-73.826938,40.731692],[-73.826706,40.731382],[-73.826527,40.731435],[-73.826184,40.730772],[-73.82584199999999,40.730105],[-73.825506,40.729445],[-73.827546,40.728864],[-73.828554,40.730831],[-73.82892,40.731556],[-73.82926399999999,40.731564]]],"type":"Polygon"}
}