{
  "id": "360593040011",
  "type": "Feature",
  "properties": {
    "area_land":271797,
    "area_water":0,
    "geoid":"360593040011",
    "name":"Block Group 1",
    "state":"ny"
},
  "bbox": [
    -73.601309,
    40.745723,
    -73.592819,
    40.751211
],
  "geometry": {"coordinates":[[[-73.601309,40.749657],[-73.600967,40.749859],[-73.600392,40.749995],[-73.599588,40.750197],[-73.59872300000001,40.75042],[-73.59787,40.750658],[-73.596942,40.75086],[-73.595951,40.751071],[-73.595248,40.751211],[-73.594855,40.750562],[-73.594499,40.749996],[-73.594042,40.749252],[-73.593251,40.747896],[-73.59299,40.74747],[-73.59281900000001,40.747192],[-73.592985,40.747165],[-73.593036,40.747157],[-73.593333,40.747084],[-73.593717,40.747004],[-73.594593,40.746824],[-73.595024,40.746738],[-73.595179,40.746703],[-73.595493,40.74664],[-73.596355,40.746464],[-73.597263,40.746277],[-73.59740600000001,40.746249],[-73.598133,40.746097],[-73.598742,40.745972],[-73.59915100000001,40.745893],[-73.59994500000001,40.745754],[-73.600127,40.745723],[-73.60014,40.746905],[-73.600084,40.747256],[-73.600109,40.747388],[-73.60016,40.747558],[-73.60024900000001,40.747762],[-73.600281,40.747835],[-73.600455,40.748053],[-73.60068,40.748367],[-73.600702,40.74838],[-73.600719,40.748445],[-73.600784,40.74854],[-73.601035,40.74909],[-73.601309,40.749657]]],"type":"Polygon"}
}