{
  "id": "360470453001",
  "type": "Feature",
  "properties": {
    "area_land":205080,
    "area_water":0,
    "geoid":"360470453001",
    "name":"Block Group 1",
    "state":"ny"
},
  "bbox": [
    -73.932072,
    40.704717,
    -73.921892,
    40.709396
],
  "geometry": {"coordinates":[[[-73.93207200000001,40.707786],[-73.92902599999999,40.708277],[-73.927407,40.708542],[-73.925765,40.708804],[-73.924187,40.709065],[-73.922483,40.709333],[-73.921892,40.709396],[-73.922337,40.709006],[-73.92286199999999,40.708546],[-73.923062,40.708369],[-73.923852,40.707677],[-73.92416900000001,40.707394],[-73.924907,40.706745],[-73.92513700000001,40.706539],[-73.92589599999999,40.705877],[-73.926089,40.70568],[-73.92657800000001,40.705557],[-73.92810900000001,40.704964],[-73.928738,40.704717],[-73.92969600000001,40.705248],[-73.93031000000001,40.70588],[-73.930893,40.706514],[-73.931479,40.707153],[-73.93207200000001,40.707786]]],"type":"Polygon"}
}