{
  "id": "360050407013",
  "type": "Feature",
  "properties": {
    "area_land":21894,
    "area_water":0,
    "geoid":"360050407013",
    "name":"Block Group 3",
    "state":"ny"
},
  "bbox": [
    -73.891102,
    40.870491,
    -73.888673,
    40.872401
],
  "geometry": {"coordinates":[[[-73.890987,40.871764],[-73.89081400000001,40.871765],[-73.890677,40.87178],[-73.890541,40.871808],[-73.890429,40.871842],[-73.89030099999999,40.871894],[-73.89018299999999,40.871958],[-73.890055,40.872052],[-73.889979,40.872124],[-73.889899,40.87222],[-73.889838,40.872321],[-73.889804,40.872401],[-73.888823,40.871616],[-73.888673,40.871497],[-73.890422,40.870491],[-73.89054400000001,40.870614],[-73.891102,40.871174],[-73.890987,40.871764]]],"type":"Polygon"}
}