{
  "id": "361190044003",
  "type": "Feature",
  "properties": {
    "area_land":269144,
    "area_water":0,
    "geoid":"361190044003",
    "name":"Block Group 3",
    "state":"ny"
},
  "bbox": [
    -73.835467,
    40.925561,
    -73.827511,
    40.932071
],
  "geometry": {"coordinates":[[[-73.835441,40.926663],[-73.835391,40.926794],[-73.83521500000001,40.92721],[-73.835005,40.927636],[-73.834739,40.928176],[-73.834596,40.928503],[-73.83421300000001,40.929373],[-73.833837,40.930258],[-73.833617,40.930742],[-73.83342399999999,40.931169],[-73.833015,40.932071],[-73.832723,40.931843],[-73.83257999999999,40.931689],[-73.83251199999999,40.93166],[-73.832308,40.931653],[-73.832064,40.931682],[-73.83189900000001,40.931721],[-73.831811,40.931768],[-73.83156700000001,40.931756],[-73.831097,40.931752],[-73.831007,40.931727],[-73.830583,40.931537],[-73.830601,40.931507],[-73.83064400000001,40.931209],[-73.830658,40.931012],[-73.830662,40.930618],[-73.830664,40.930476],[-73.829759,40.930451],[-73.829781,40.930304],[-73.829781,40.930135],[-73.829781,40.929147],[-73.829819,40.928188],[-73.829167,40.927939],[-73.828275,40.92755],[-73.828035,40.927428],[-73.827511,40.927119],[-73.828181,40.925919],[-73.8283,40.925718],[-73.828385,40.925561],[-73.828576,40.925625],[-73.82889400000001,40.925713],[-73.82943899999999,40.925846],[-73.83017100000001,40.925932],[-73.83040800000001,40.925955],[-73.83083499999999,40.925969],[-73.831176,40.925975],[-73.83207400000001,40.925993],[-73.83273199999999,40.92601],[-73.833001,40.926046],[-73.83313,40.926077],[-73.83466799999999,40.926435],[-73.83546699999999,40.926612],[-73.835441,40.926663]]],"type":"Polygon"}
}