{
  "id": "361150820014",
  "type": "Feature",
  "properties": {
    "area_land":684948,
    "area_water":0,
    "geoid":"361150820014",
    "name":"Block Group 4",
    "state":"ny"
},
  "bbox": [
    -73.416138,
    43.540655,
    -73.403824,
    43.553331
],
  "geometry": {"coordinates":[[[-73.416138,43.549723],[-73.41589500000001,43.550121],[-73.415718,43.550331],[-73.41542699999999,43.550528],[-73.41058099999999,43.552572],[-73.410465,43.552676],[-73.410357,43.552877],[-73.41030499999999,43.55314],[-73.409932,43.553203],[-73.40982,43.553169],[-73.409886,43.552908],[-73.40982,43.552704],[-73.409868,43.55246],[-73.40978800000001,43.552485],[-73.40928099999999,43.553157],[-73.409189,43.553302],[-73.409172,43.553331],[-73.40897200000001,43.553258],[-73.408766,43.553206],[-73.408153,43.55309],[-73.407293,43.552948],[-73.40713599999999,43.552933],[-73.406457,43.552899],[-73.405259,43.552828],[-73.404878,43.55281],[-73.403824,43.552735],[-73.404202,43.551341],[-73.404259,43.551163],[-73.40437,43.550816],[-73.404623,43.550101],[-73.40473799999999,43.549829],[-73.404963,43.549388],[-73.405175,43.549005],[-73.405401,43.548577],[-73.405562,43.548273],[-73.40560600000001,43.548189],[-73.405894,43.547588],[-73.406064,43.547158],[-73.406384,43.546356],[-73.406717,43.545554],[-73.407027,43.544842],[-73.407402,43.544017],[-73.407501,43.543801],[-73.407633,43.543512],[-73.40780100000001,43.543092],[-73.408092,43.542278],[-73.40865599999999,43.540655],[-73.410065,43.540906],[-73.41097600000001,43.541078],[-73.41121099999999,43.541132],[-73.410797,43.54233],[-73.410657,43.542747],[-73.410371,43.543566],[-73.410217,43.543976],[-73.410027,43.544401],[-73.409791,43.544955],[-73.40854400000001,43.544897],[-73.408449,43.545121],[-73.408895,43.545255],[-73.410629,43.545504],[-73.411416,43.545816],[-73.41185,43.546006],[-73.412812,43.546704],[-73.414248,43.547495],[-73.414473,43.547824],[-73.414801,43.548304],[-73.41601300000001,43.549286],[-73.416138,43.549723]]],"type":"Polygon"}
}