{
  "id": "360450613002",
  "type": "Feature",
  "properties": {
    "area_land":342303,
    "area_water":0,
    "geoid":"360450613002",
    "name":"Block Group 2",
    "state":"ny"
},
  "bbox": [
    -75.906558,
    43.979281,
    -75.894369,
    43.985572
],
  "geometry": {"coordinates":[[[-75.906474,43.979653],[-75.906198,43.981],[-75.905843,43.982791],[-75.905694,43.983483],[-75.905091,43.983412],[-75.902697,43.983168],[-75.901365,43.983015],[-75.900873,43.982965],[-75.900734,43.982956],[-75.900684,43.98296],[-75.900499,43.98303],[-75.90034799999999,43.983127],[-75.89992599999999,43.983529],[-75.89941,43.984052],[-75.899365,43.98409],[-75.89927,43.984171],[-75.898929,43.984431],[-75.898802,43.984586],[-75.898753,43.984681],[-75.898717,43.98482],[-75.89866600000001,43.985023],[-75.898624,43.985094],[-75.898567,43.985144],[-75.89845,43.985163],[-75.89738199999999,43.985073],[-75.89729,43.985065],[-75.897144,43.985037],[-75.896925,43.984945],[-75.89613900000001,43.984382],[-75.896214,43.98544],[-75.896188,43.985492],[-75.896169,43.985515],[-75.896119,43.985532],[-75.89604799999999,43.98554],[-75.895482,43.985545],[-75.895033,43.985572],[-75.894864,43.983494],[-75.89481000000001,43.982823],[-75.894711,43.982484],[-75.894391,43.981664],[-75.894369,43.981553],[-75.894389,43.981394],[-75.89569400000001,43.981537],[-75.89594700000001,43.981544],[-75.896191,43.981543],[-75.897452,43.98149],[-75.897899,43.981472],[-75.898149,43.981444],[-75.89914899999999,43.981201],[-75.900229,43.980906],[-75.900355,43.980866],[-75.901355,43.980486],[-75.902018,43.98023],[-75.902567,43.980018],[-75.903339,43.979729],[-75.90358000000001,43.979625],[-75.903927,43.979488],[-75.904105,43.979443],[-75.90430499999999,43.979415],[-75.905023,43.979341],[-75.905214,43.979318],[-75.905693,43.979281],[-75.905896,43.979281],[-75.906558,43.979345],[-75.906474,43.979653]]],"type":"Polygon"}
}