{
  "id": "361190050011",
  "type": "Feature",
  "properties": {
    "area_land":621254,
    "area_water":0,
    "geoid":"361190050011",
    "name":"Block Group 1",
    "state":"ny"
},
  "bbox": [
    -73.803856,
    40.966715,
    -73.792388,
    40.979651
],
  "geometry": {"coordinates":[[[-73.803347,40.974037],[-73.803235,40.974254],[-73.80316500000001,40.974432],[-73.803113,40.974604],[-73.80305,40.974902],[-73.80289,40.975511],[-73.802798,40.975865],[-73.80271399999999,40.976134],[-73.80251699999999,40.976737],[-73.802475,40.976859],[-73.802245,40.977565],[-73.802104,40.977998],[-73.80199500000001,40.978305],[-73.801841,40.978661],[-73.80176400000001,40.978793],[-73.80162,40.978988],[-73.801269,40.97944],[-73.801109,40.979651],[-73.80047500000001,40.979201],[-73.800406,40.97912],[-73.800264,40.97899],[-73.799977,40.978573],[-73.79965199999999,40.978322],[-73.79897200000001,40.977821],[-73.798294,40.977304],[-73.79759900000001,40.976806],[-73.79698399999999,40.976169],[-73.796774,40.975798],[-73.796299,40.97566],[-73.795671,40.975501],[-73.795412,40.975474],[-73.794459,40.97539],[-73.79352299999999,40.975306],[-73.7931,40.975152],[-73.79314599999999,40.975111],[-73.79330899999999,40.974889],[-73.793396,40.974732],[-73.79342800000001,40.974563],[-73.79344500000001,40.974472],[-73.79347199999999,40.974365],[-73.793558,40.974265],[-73.79380399999999,40.97409],[-73.79390100000001,40.97399],[-73.79396,40.973903],[-73.793999,40.973774],[-73.794026,40.973536],[-73.79400800000001,40.973432],[-73.79397299999999,40.973016],[-73.793936,40.972927],[-73.793783,40.972733],[-73.793527,40.972346],[-73.793488,40.972236],[-73.79343,40.972128],[-73.79338199999999,40.972079],[-73.79332599999999,40.972048],[-73.793254,40.972031],[-73.793143,40.972021],[-73.79302199999999,40.971983],[-73.792883,40.971889],[-73.79279699999999,40.971817],[-73.79276900000001,40.971758],[-73.792703,40.971516],[-73.792686,40.971451],[-73.792675,40.971411],[-73.792571,40.971033],[-73.792562,40.970962],[-73.79251600000001,40.970531],[-73.79239099999999,40.969986],[-73.792388,40.969913],[-73.792416,40.96981],[-73.79245400000001,40.969768],[-73.792945,40.968881],[-73.793004,40.968808],[-73.793098,40.968749],[-73.79375899999999,40.968405],[-73.793818,40.968353],[-73.793863,40.968277],[-73.79415400000001,40.967668],[-73.794237,40.967526],[-73.794299,40.96747],[-73.794376,40.967432],[-73.794659,40.967351],[-73.794718,40.967327],[-73.794781,40.967285],[-73.794861,40.967186],[-73.794985,40.967017],[-73.79508199999999,40.966917],[-73.79536400000001,40.966715],[-73.79540799999999,40.966938],[-73.795456,40.967111],[-73.795607,40.967449],[-73.79573499999999,40.967684],[-73.79582600000001,40.967807],[-73.796001,40.968011],[-73.79623100000001,40.968257],[-73.797568,40.969698],[-73.797849,40.970014],[-73.798452,40.970692],[-73.798676,40.970943],[-73.79907300000001,40.971455],[-73.79925900000001,40.971704],[-73.799347,40.971807],[-73.799414,40.971867],[-73.79959100000001,40.972015],[-73.79982,40.972172],[-73.800106,40.972321],[-73.800274,40.972392],[-73.800439,40.972462],[-73.801053,40.972758],[-73.801463,40.972947],[-73.801588,40.972979],[-73.80184199999999,40.973027],[-73.80192700000001,40.973036],[-73.803296,40.973184],[-73.803856,40.973217],[-73.803347,40.974037]]],"type":"Polygon"}
}