{
  "id": "360630227024",
  "type": "Feature",
  "properties": {
    "area_land":23032871,
    "area_water":146129,
    "geoid":"360630227024",
    "name":"Block Group 4",
    "state":"ny"
},
  "bbox": [
    -78.825049,
    43.083346,
    -78.725638,
    43.133418
],
  "geometry": {"coordinates":[[[-78.82504900000001,43.133096],[-78.824218,43.133119],[-78.823989,43.133121],[-78.820548,43.133166],[-78.81950999999999,43.133181],[-78.81393,43.133262],[-78.811256,43.133281],[-78.80571,43.133344],[-78.80289399999999,43.133363],[-78.802044,43.133369],[-78.79735599999999,43.133385],[-78.79702399999999,43.133385],[-78.796031,43.133385],[-78.7957,43.133386],[-78.795337,43.133387],[-78.794247,43.133393],[-78.793885,43.133395],[-78.791905,43.1334],[-78.788826,43.133408],[-78.78796,43.133417],[-78.785965,43.133414],[-78.784525,43.133412],[-78.78432100000001,43.133412],[-78.783986,43.133411],[-78.78224400000001,43.133418],[-78.780833,43.133408],[-78.77879900000001,43.133408],[-78.778497,43.133407],[-78.770565,43.133398],[-78.769859,43.133394],[-78.762213,43.133335],[-78.762033,43.133333],[-78.758321,43.133293],[-78.756545,43.133283],[-78.756198,43.133283],[-78.756174,43.133284],[-78.75515900000001,43.133274],[-78.754813,43.133271],[-78.751503,43.133241],[-78.748402,43.133213],[-78.745279,43.133194],[-78.74157200000001,43.133165],[-78.740596,43.133158],[-78.738376,43.133129],[-78.738263,43.133128],[-78.735889,43.133103],[-78.728767,43.133029],[-78.728154,43.133023],[-78.726393,43.133012],[-78.726297,43.13301],[-78.726011,43.133004],[-78.725916,43.133003],[-78.72586,43.133001],[-78.725798,43.133],[-78.72569300000001,43.132998],[-78.725638,43.132997],[-78.726766,43.131218],[-78.727126,43.130653],[-78.72954900000001,43.126887],[-78.730193,43.125908],[-78.730842,43.124925],[-78.73133900000001,43.124141],[-78.73171000000001,43.123567],[-78.73262699999999,43.12215],[-78.73282,43.121844],[-78.73310499999999,43.121394],[-78.733186,43.121267],[-78.73371899999999,43.120424],[-78.733817,43.120261],[-78.735669,43.117215],[-78.736214,43.116319],[-78.736276,43.116195],[-78.736328,43.11609],[-78.736486,43.115778],[-78.73653899999999,43.115674],[-78.73658500000001,43.115582],[-78.736845,43.11512],[-78.73712,43.114633],[-78.73781099999999,43.113487],[-78.738139,43.112946],[-78.738281,43.112942],[-78.73849800000001,43.112936],[-78.738709,43.112931],[-78.738798,43.112929],[-78.73885199999999,43.112928],[-78.738877,43.112927],[-78.73894300000001,43.112924],[-78.738966,43.112923],[-78.7423,43.112846],[-78.74246599999999,43.112843],[-78.748706,43.112731],[-78.752937,43.112672],[-78.752968,43.112671],[-78.753818,43.112646],[-78.756367,43.112609],[-78.756469,43.112607],[-78.757137,43.112591],[-78.765727,43.112515],[-78.77037300000001,43.112474],[-78.77161099999999,43.112457],[-78.772987,43.112448],[-78.773155,43.11245],[-78.77619199999999,43.112415],[-78.777762,43.11239],[-78.778755,43.112389],[-78.779579,43.112377],[-78.77995300000001,43.11235],[-78.780334,43.112297],[-78.780503,43.11226],[-78.780914,43.112144],[-78.781082,43.11208],[-78.78138,43.111946],[-78.781738,43.111748],[-78.787415,43.108353],[-78.788208,43.107849],[-78.788673,43.107517],[-78.788994,43.107258],[-78.789894,43.106457],[-78.791504,43.105053],[-78.79239699999999,43.104252],[-78.794151,43.102692],[-78.794647,43.102238],[-78.796189,43.100873],[-78.796279,43.1008],[-78.796919,43.100332],[-78.79786300000001,43.099706],[-78.79831299999999,43.099409],[-78.79982099999999,43.098448],[-78.802913,43.096537],[-78.80305199999999,43.096453],[-78.804805,43.095405],[-78.806847,43.094152],[-78.808578,43.093115],[-78.809842,43.09236],[-78.810581,43.091894],[-78.812156,43.090851],[-78.81285200000001,43.090406],[-78.815742,43.0885],[-78.81617900000001,43.088228],[-78.819131,43.086212],[-78.819648,43.085853],[-78.820536,43.085238],[-78.82111,43.084864],[-78.82249899999999,43.083906],[-78.82328,43.083346],[-78.823285,43.08346],[-78.8233,43.083802],[-78.823305,43.083917],[-78.82331000000001,43.084035],[-78.823311,43.084122],[-78.823313,43.084196],[-78.823314,43.08428],[-78.82332,43.084506],[-78.823329,43.084738],[-78.823337,43.084944],[-78.823376,43.086129],[-78.82338,43.086254],[-78.82350599999999,43.090185],[-78.82354100000001,43.091496],[-78.82375500000001,43.098894],[-78.823809,43.100455],[-78.82383299999999,43.101515],[-78.823995,43.106417],[-78.824001,43.106663],[-78.824063,43.108269],[-78.824279,43.113825],[-78.824352,43.115677],[-78.824353,43.115708],[-78.82435599999999,43.115802],[-78.824358,43.115834],[-78.824361,43.115913],[-78.82437,43.116151],[-78.82437299999999,43.116231],[-78.82437400000001,43.116262],[-78.82438,43.11655],[-78.824412,43.117455],[-78.82446899999999,43.119058],[-78.824555,43.121127],[-78.824606,43.122351],[-78.824696,43.124321],[-78.824703,43.124499],[-78.82496500000001,43.130946],[-78.825012,43.132076],[-78.825029,43.132567],[-78.82504900000001,43.133096]]],"type":"Polygon"}
}