{
  "id": "360811193001",
  "type": "Feature",
  "properties": {
    "area_land":148634,
    "area_water":0,
    "geoid":"360811193001",
    "name":"Block Group 1",
    "state":"ny"
},
  "bbox": [
    -73.801724,
    40.755628,
    -73.794747,
    40.758527
],
  "geometry": {"coordinates":[[[-73.801402,40.758527],[-73.800472,40.758453],[-73.799539,40.758382],[-73.798609,40.758308],[-73.797674,40.758234],[-73.796741,40.758155],[-73.795804,40.758091],[-73.794932,40.757798],[-73.794747,40.755628],[-73.795193,40.755667],[-73.796126,40.755736],[-73.797061,40.755809],[-73.79799300000001,40.755884],[-73.79892700000001,40.755957],[-73.799859,40.756031],[-73.80079499999999,40.756106],[-73.80172399999999,40.756179],[-73.801402,40.758527]]],"type":"Polygon"}
}