{
  "id": "360470066001",
  "type": "Feature",
  "properties": {
    "area_land":57553,
    "area_water":0,
    "geoid":"360470066001",
    "name":"Block Group 1",
    "state":"ny"
},
  "bbox": [
    -74.027791,
    40.630814,
    -74.024238,
    40.633516
],
  "geometry": {"coordinates":[[[-74.027508,40.632154],[-74.02723,40.632836],[-74.026951,40.633516],[-74.026039,40.633303],[-74.025177,40.633096],[-74.024238,40.632859],[-74.02452,40.632167],[-74.02479200000001,40.631506],[-74.025071,40.630814],[-74.02779099999999,40.631463],[-74.027508,40.632154]]],"type":"Polygon"}
}