{
  "id": "360191008001",
  "type": "Feature",
  "properties": {
    "area_land":8750916,
    "area_water":52116,
    "geoid":"360191008001",
    "name":"Block Group 1",
    "state":"ny"
},
  "bbox": [
    -73.530516,
    44.695128,
    -73.453833,
    44.718935
],
  "geometry": {"coordinates":[[[-73.53025100000001,44.709743],[-73.530188,44.709866],[-73.529776,44.71076],[-73.52920399999999,44.712001],[-73.528249,44.714101],[-73.52754400000001,44.713929],[-73.52692399999999,44.713808],[-73.526349,44.713724],[-73.525735,44.713657],[-73.525436,44.713633],[-73.524563,44.713596],[-73.523602,44.713609],[-73.52003000000001,44.713721],[-73.506146,44.714163],[-73.505549,44.714189],[-73.504386,44.714274],[-73.501328,44.714589],[-73.495835,44.715167],[-73.49527500000001,44.715215],[-73.49414899999999,44.715292],[-73.489768,44.715508],[-73.488806,44.715574],[-73.48793999999999,44.715658],[-73.486896,44.715799],[-73.48441,44.71619],[-73.48344,44.716342],[-73.48330199999999,44.716323],[-73.48240800000001,44.716429],[-73.480289,44.716652],[-73.479586,44.716737],[-73.478183,44.716874],[-73.47735900000001,44.716967],[-73.476752,44.717036],[-73.476206,44.71709],[-73.474628,44.717258],[-73.473617,44.717352],[-73.473232,44.717373],[-73.472585,44.717373],[-73.472222,44.717359],[-73.472054,44.717344],[-73.47171400000001,44.717315],[-73.47100500000001,44.717206],[-73.470707,44.717144],[-73.470296,44.717048],[-73.47008,44.716988],[-73.469809,44.716903],[-73.469241,44.716692],[-73.46900599999999,44.716598],[-73.468643,44.716434],[-73.468441,44.716333],[-73.464986,44.714602],[-73.46428400000001,44.714253],[-73.464147,44.714326],[-73.463978,44.714416],[-73.463751,44.714536],[-73.458799,44.717181],[-73.45869399999999,44.717239],[-73.45819,44.71751],[-73.45695499999999,44.718171],[-73.45553700000001,44.718935],[-73.455287,44.718782],[-73.454964,44.718564],[-73.453833,44.712441],[-73.456339,44.712189],[-73.457894,44.71202],[-73.45834600000001,44.711976],[-73.458352,44.712009],[-73.45839599999999,44.712325],[-73.45846400000001,44.712426],[-73.458161,44.71244],[-73.458505,44.713023],[-73.45921300000001,44.712942],[-73.459648,44.712892],[-73.460177,44.712829],[-73.460159,44.712786],[-73.45994899999999,44.712438],[-73.459791,44.71223],[-73.459701,44.712117],[-73.45947,44.711868],[-73.45961699999999,44.711854],[-73.460683,44.711752],[-73.46150900000001,44.711673],[-73.46954700000001,44.710902],[-73.469542,44.710882],[-73.469494,44.71065],[-73.46945599999999,44.710475],[-73.469365,44.710055],[-73.46932700000001,44.709879],[-73.469239,44.7093],[-73.469216,44.709151],[-73.46898899999999,44.707797],[-73.46896700000001,44.70765],[-73.46909100000001,44.707639],[-73.470592,44.707511],[-73.471361,44.707446],[-73.471529,44.707434],[-73.47301299999999,44.707332],[-73.47308,44.707323],[-73.47318300000001,44.707329],[-73.473584,44.707312],[-73.47371800000001,44.707315],[-73.47395299999999,44.707304],[-73.474091,44.707298],[-73.47463399999999,44.70728],[-73.47494,44.707283],[-73.476534,44.707098],[-73.476884,44.707064],[-73.47722899999999,44.707023],[-73.47744899999999,44.707037],[-73.478027,44.706966],[-73.479032,44.706874],[-73.47921100000001,44.706871],[-73.47990900000001,44.706859],[-73.48157,44.706768],[-73.482572,44.706728],[-73.482297,44.704281],[-73.48225499999999,44.704019],[-73.48123099999999,44.697183],[-73.481236,44.697055],[-73.481455,44.697044],[-73.483144,44.69693],[-73.483924,44.696875],[-73.483953,44.697014],[-73.48469,44.696968],[-73.487663,44.696789],[-73.487792,44.69678],[-73.489025,44.696703],[-73.490016,44.696643],[-73.490363,44.696627],[-73.491568,44.696553],[-73.49312399999999,44.69646],[-73.493279,44.696451],[-73.49462699999999,44.696379],[-73.494696,44.696375],[-73.494753,44.696372],[-73.495024,44.696358],[-73.496824,44.696264],[-73.497231,44.696242],[-73.497377,44.696234],[-73.497795,44.696211],[-73.498018,44.696197],[-73.49928800000001,44.696126],[-73.499743,44.696103],[-73.500276,44.696075],[-73.50062200000001,44.696056],[-73.500833,44.696045],[-73.50321700000001,44.695929],[-73.50973999999999,44.69557],[-73.514191,44.695321],[-73.514219,44.695319],[-73.51508699999999,44.695264],[-73.515869,44.695202],[-73.516125,44.695182],[-73.516476,44.695155],[-73.516865,44.695135],[-73.51720299999999,44.695128],[-73.517403,44.695356],[-73.517591,44.695602],[-73.51852,44.69679],[-73.518681,44.696995],[-73.5187,44.697019],[-73.519036,44.697446],[-73.519364,44.697848],[-73.519623,44.698142],[-73.521869,44.700501],[-73.523921,44.702637],[-73.525285,44.704045],[-73.525874,44.704632],[-73.526946,44.705695],[-73.52715499999999,44.705901],[-73.528896,44.707623],[-73.53051600000001,44.709221],[-73.53025100000001,44.709743]]],"type":"Polygon"}
}