{
  "id": "360290081025",
  "type": "Feature",
  "properties": {
    "area_land":305679,
    "area_water":0,
    "geoid":"360290081025",
    "name":"Block Group 5",
    "state":"ny"
},
  "bbox": [
    -78.869029,
    42.977294,
    -78.858501,
    42.980971
],
  "geometry": {"coordinates":[[[-78.869029,42.980953],[-78.86464599999999,42.980971],[-78.859578,42.980966],[-78.858587,42.980965],[-78.858587,42.980883],[-78.85858399999999,42.980771],[-78.85856099999999,42.979819],[-78.85856,42.979779],[-78.858542,42.979019],[-78.858538,42.978827],[-78.858524,42.978219],[-78.858514,42.97787],[-78.858501,42.977401],[-78.861589,42.977401],[-78.864628,42.977395],[-78.86615,42.977396],[-78.866891,42.977294],[-78.867425,42.97821],[-78.86789,42.979009],[-78.86835499999999,42.979809],[-78.868596,42.980223],[-78.86892,42.980767],[-78.86897999999999,42.980868],[-78.869029,42.980953]]],"type":"Polygon"}
}