{
  "id": "360710112001",
  "type": "Feature",
  "properties": {
    "area_land":5997904,
    "area_water":54887,
    "geoid":"360710112001",
    "name":"Block Group 1",
    "state":"ny"
},
  "bbox": [
    -74.402703,
    41.429706,
    -74.356605,
    41.459972
],
  "geometry": {"coordinates":[[[-74.402703,41.453788],[-74.40257800000001,41.453818],[-74.401698,41.454007],[-74.401614,41.454087],[-74.400886,41.454255],[-74.39932399999999,41.454584],[-74.398707,41.45472],[-74.397836,41.454912],[-74.39715700000001,41.455071],[-74.39517600000001,41.4556],[-74.39569899999999,41.456309],[-74.39537900000001,41.456412],[-74.394051,41.456871],[-74.39370099999999,41.457001],[-74.393119,41.456401],[-74.39302499999999,41.456287],[-74.39283399999999,41.456068],[-74.39248000000001,41.456087],[-74.392021,41.456097],[-74.39161,41.456089],[-74.389184,41.455954],[-74.389031,41.455948],[-74.387366,41.45582],[-74.384917,41.455691],[-74.384108,41.455656],[-74.383488,41.455638],[-74.383163,41.455644],[-74.382947,41.455664],[-74.38256699999999,41.455707],[-74.382203,41.455791],[-74.382031,41.455841],[-74.38176900000001,41.455928],[-74.381372,41.456097],[-74.381028,41.45626],[-74.380729,41.456441],[-74.380487,41.456621],[-74.380124,41.456943],[-74.379615,41.457459],[-74.37910599999999,41.457998],[-74.3788,41.458323],[-74.37838000000001,41.458769],[-74.378276,41.458883],[-74.378176,41.458992],[-74.377436,41.459799],[-74.37727700000001,41.459972],[-74.377188,41.459832],[-74.377084,41.459675],[-74.37704100000001,41.459612],[-74.37606100000001,41.458122],[-74.375664,41.457518],[-74.37536900000001,41.457078],[-74.375241,41.456885],[-74.374679,41.456038],[-74.373413,41.454124],[-74.37277899999999,41.453166],[-74.372641,41.452958],[-74.372501,41.452745],[-74.372317,41.452466],[-74.371909,41.45173],[-74.371793,41.451497],[-74.37174400000001,41.451408],[-74.370784,41.449349],[-74.37073599999999,41.449243],[-74.37058399999999,41.448917],[-74.370572,41.448894],[-74.37045000000001,41.448657],[-74.37017400000001,41.448185],[-74.369989,41.447913],[-74.369765,41.44761],[-74.36957200000001,41.447364],[-74.36946399999999,41.447237],[-74.369429,41.447194],[-74.369045,41.446785],[-74.36882,41.446591],[-74.368589,41.44639],[-74.36833300000001,41.446168],[-74.36817000000001,41.446039],[-74.367699,41.445701],[-74.36717899999999,41.445358],[-74.367142,41.445334],[-74.36662699999999,41.44505],[-74.36628399999999,41.444868],[-74.365797,41.444629],[-74.365376,41.444395],[-74.364125,41.443782],[-74.363789,41.443605],[-74.363429,41.443432],[-74.36325100000001,41.44333],[-74.363068,41.44323],[-74.362599,41.442936],[-74.362323,41.442731],[-74.36199999999999,41.442469],[-74.361807,41.442296],[-74.36150000000001,41.441976],[-74.36124,41.441642],[-74.361108,41.441474],[-74.36085199999999,41.441053],[-74.36068899999999,41.44073],[-74.360591,41.440521],[-74.360322,41.439925],[-74.360268,41.439814],[-74.36022800000001,41.439729],[-74.360086,41.439425],[-74.359385,41.437947],[-74.358414,41.435835],[-74.356787,41.432346],[-74.356605,41.431963],[-74.356858,41.431942],[-74.358085,41.431841],[-74.363891,41.431489],[-74.366603,41.431309],[-74.36705600000001,41.431283],[-74.368582,41.43119],[-74.373654,41.430873],[-74.37367999999999,41.430868],[-74.374318,41.430742],[-74.377775,41.430448],[-74.38270300000001,41.430148],[-74.386826,41.429909],[-74.389031,41.42977],[-74.390112,41.429731],[-74.39078600000001,41.429706],[-74.390586,41.429858],[-74.390303,41.430071],[-74.382738,41.43576],[-74.380613,41.437366],[-74.379794,41.438034],[-74.379141,41.438598],[-74.37841,41.439283],[-74.378173,41.439518],[-74.377475,41.440235],[-74.37686100000001,41.440917],[-74.376717,41.441092],[-74.376116,41.441838],[-74.37648900000001,41.442002],[-74.37692699999999,41.442219],[-74.377268,41.442402],[-74.377454,41.442516],[-74.378334,41.443143],[-74.378664,41.443388],[-74.379279,41.443788],[-74.37968499999999,41.444029],[-74.380037,41.444222],[-74.380323,41.444355],[-74.380484,41.444408],[-74.380616,41.444439],[-74.38082799999999,41.44447],[-74.381179,41.444506],[-74.381552,41.444555],[-74.38221900000001,41.44463],[-74.383501,41.444775],[-74.383923,41.444812],[-74.38415999999999,41.444817],[-74.385177,41.444795],[-74.385925,41.444757],[-74.38637,41.444724],[-74.387249,41.444641],[-74.387531,41.444608],[-74.387745,41.444576],[-74.38800000000001,41.444524],[-74.38930999999999,41.444239],[-74.389657,41.444172],[-74.38999,41.444112],[-74.390221,41.444087],[-74.39031300000001,41.444079],[-74.390603,41.444063],[-74.391013,41.444058],[-74.391351,41.444065],[-74.39152199999999,41.444081],[-74.392286,41.44418],[-74.393897,41.44443],[-74.39439400000001,41.444504],[-74.39472000000001,41.444563],[-74.39559,41.444692],[-74.397075,41.444917],[-74.397515,41.444985],[-74.398574,41.44515],[-74.398985,41.445217],[-74.399681,41.445327],[-74.40012299999999,41.445396],[-74.400716,41.445487],[-74.40078800000001,41.445498],[-74.401212,41.445572],[-74.40067000000001,41.446861],[-74.40097299999999,41.448143],[-74.401285,41.44941],[-74.401315,41.44947],[-74.400807,41.450146],[-74.40100700000001,41.450273],[-74.401144,41.450359],[-74.401635,41.450664],[-74.401914,41.450836],[-74.40210399999999,41.452206],[-74.402193,41.452262],[-74.402653,41.453621],[-74.402703,41.453788]]],"type":"Polygon"}
}