{
  "id": "360690516002",
  "type": "Feature",
  "properties": {
    "area_land":448037,
    "area_water":0,
    "geoid":"360690516002",
    "name":"Block Group 2",
    "state":"ny"
},
  "bbox": [
    -76.995201,
    42.869013,
    -76.986402,
    42.876398
],
  "geometry": {"coordinates":[[[-76.99520099999999,42.876325],[-76.99503300000001,42.876336],[-76.994867,42.876344],[-76.993802,42.876392],[-76.99359800000001,42.876398],[-76.993493,42.876386],[-76.993179,42.876318],[-76.992368,42.87611],[-76.99230900000001,42.8761],[-76.992255,42.87608],[-76.990891,42.875723],[-76.99063099999999,42.875699],[-76.99039399999999,42.8757],[-76.98968600000001,42.875705],[-76.98945000000001,42.875707],[-76.98926,42.875706],[-76.988693,42.875703],[-76.988608,42.875703],[-76.988505,42.875702],[-76.988507,42.875659],[-76.988497,42.875624],[-76.988517,42.875553],[-76.988432,42.875311],[-76.988315,42.874979],[-76.98809199999999,42.874406],[-76.98799699999999,42.874164],[-76.987848,42.873784],[-76.987753,42.873523],[-76.98760799999999,42.873122],[-76.98746199999999,42.872746],[-76.987362,42.872488],[-76.98724199999999,42.872173],[-76.987061,42.871697],[-76.98688199999999,42.87123],[-76.986763,42.870916],[-76.986718,42.870798],[-76.98658399999999,42.870446],[-76.98654000000001,42.870329],[-76.986512,42.870256],[-76.986429,42.870037],[-76.986402,42.869964],[-76.98657799999999,42.869945],[-76.986591,42.86994],[-76.98664100000001,42.869933],[-76.987347,42.869839],[-76.989068,42.869612],[-76.98946599999999,42.869671],[-76.989839,42.869727],[-76.99010800000001,42.869597],[-76.990145,42.86959],[-76.99051,42.869517],[-76.991145,42.869566],[-76.991248,42.869574],[-76.99150899999999,42.869554],[-76.99203900000001,42.869612],[-76.99246100000001,42.869611],[-76.992746,42.869605],[-76.993082,42.869548],[-76.993353,42.869441],[-76.993675,42.869291],[-76.993989,42.869163],[-76.99408099999999,42.869133],[-76.994281,42.86907],[-76.994631,42.869013],[-76.994817,42.869013],[-76.995071,42.869065],[-76.99508,42.869309],[-76.995107,42.870041],[-76.99511699999999,42.870286],[-76.99512900000001,42.870655],[-76.995161,42.871601],[-76.995161,42.871765],[-76.995161,42.872136],[-76.99515,42.872173],[-76.99511699999999,42.872284],[-76.99510600000001,42.872321],[-76.99509500000001,42.872358],[-76.99506100000001,42.872472],[-76.995051,42.87251],[-76.99510600000001,42.873715],[-76.99520099999999,42.876325]]],"type":"Polygon"}
}