{
  "id": "361019603002",
  "type": "Feature",
  "properties": {
    "area_land":43187936,
    "area_water":18357,
    "geoid":"361019603002",
    "name":"Block Group 2",
    "state":"ny"
},
  "bbox": [
    -77.541779,
    42.507089,
    -77.445871,
    42.578399
],
  "geometry": {"coordinates":[[[-77.54174,42.517128],[-77.541698,42.518271],[-77.541586,42.518624],[-77.541578,42.518649],[-77.541237,42.519735],[-77.541082,42.519883],[-77.541062,42.519947],[-77.541071,42.51998],[-77.541117,42.520016],[-77.54145,42.520214],[-77.54153599999999,42.520304],[-77.541557,42.520342],[-77.541546,42.520605],[-77.54146299999999,42.522851],[-77.540944,42.538711],[-77.540913,42.539519],[-77.54079299999999,42.5428],[-77.54071500000001,42.5449],[-77.540706,42.54512],[-77.540666,42.546213],[-77.54062500000001,42.547258],[-77.540584,42.548319],[-77.540587,42.548381],[-77.540515,42.550312],[-77.540446,42.552188],[-77.540335,42.555206],[-77.54031999999999,42.555733],[-77.540318,42.555788],[-77.540316,42.55585],[-77.54029800000001,42.556502],[-77.54028099999999,42.557092],[-77.540282,42.557104],[-77.54028,42.557132],[-77.540165,42.56116],[-77.539992,42.568094],[-77.539675,42.578399],[-77.538673,42.578377],[-77.535667,42.578311],[-77.534666,42.578289],[-77.534381,42.578284],[-77.533529,42.578269],[-77.53324499999999,42.578274],[-77.52714400000001,42.578128],[-77.508841,42.57772],[-77.50274,42.577585],[-77.50270999999999,42.577584],[-77.502623,42.577582],[-77.502594,42.577582],[-77.501552,42.577558],[-77.499711,42.577517],[-77.498428,42.577483],[-77.497387,42.577457],[-77.496573,42.577436],[-77.494134,42.577373],[-77.49332099999999,42.577353],[-77.492966,42.577343],[-77.491901,42.577316],[-77.491547,42.577307],[-77.491356,42.577301],[-77.490889,42.577288],[-77.490785,42.577286],[-77.490595,42.577282],[-77.490477,42.577279],[-77.490126,42.57727],[-77.490009,42.577267],[-77.489041,42.577256],[-77.486138,42.577224],[-77.48517099999999,42.577214],[-77.48483299999999,42.57721],[-77.483823,42.577201],[-77.483486,42.577198],[-77.483468,42.577197],[-77.48341600000001,42.577195],[-77.48339900000001,42.577195],[-77.483379,42.577194],[-77.48331899999999,42.577194],[-77.4833,42.577194],[-77.48317400000001,42.577192],[-77.483097,42.577191],[-77.482799,42.577188],[-77.482674,42.577187],[-77.480288,42.577161],[-77.47962800000001,42.577153],[-77.474236,42.577096],[-77.47390300000001,42.577092],[-77.471037,42.577061],[-77.47034499999999,42.577054],[-77.465121,42.576997],[-77.46244,42.576968],[-77.462217,42.576966],[-77.459575,42.576937],[-77.458786,42.576928],[-77.45641999999999,42.576903],[-77.45563199999999,42.576895],[-77.454892,42.576887],[-77.45267200000001,42.576863],[-77.452438,42.576861],[-77.451932,42.576859],[-77.45071900000001,42.576844],[-77.449417,42.576829],[-77.44708300000001,42.576802],[-77.445871,42.576789],[-77.44639100000001,42.576405],[-77.446774,42.576155],[-77.44730300000001,42.575872],[-77.448303,42.575356],[-77.449274,42.574878],[-77.44964,42.574711],[-77.450379,42.57444],[-77.451117,42.574162],[-77.451363,42.57405],[-77.451579,42.573937],[-77.45192,42.573737],[-77.453275,42.572861],[-77.454548,42.57204],[-77.45686600000001,42.570527],[-77.457336,42.570152],[-77.45842,42.569211],[-77.458501,42.56914],[-77.458657,42.569001],[-77.460258,42.5676],[-77.461033,42.566933],[-77.462715,42.565451],[-77.46316299999999,42.565042],[-77.463263,42.564932],[-77.463515,42.564595],[-77.463639,42.564388],[-77.463762,42.564105],[-77.464045,42.563231],[-77.46407499999999,42.563139],[-77.46438999999999,42.562206],[-77.464614,42.56151],[-77.464653,42.561309],[-77.464663,42.56119],[-77.464634,42.561008],[-77.464562,42.560706],[-77.464296,42.559691],[-77.464151,42.559135],[-77.464018,42.558625],[-77.46393399999999,42.558268],[-77.46378799999999,42.557672],[-77.463703,42.557375],[-77.463554,42.557086],[-77.462333,42.555027],[-77.461656,42.553958],[-77.460172,42.551609],[-77.45994,42.551185],[-77.459766,42.550784],[-77.459633,42.550409],[-77.459513,42.54987],[-77.45945399999999,42.54939],[-77.459446,42.548871],[-77.45948300000001,42.548453],[-77.45956700000001,42.547993],[-77.459745,42.547353],[-77.46087799999999,42.543597],[-77.46136799999999,42.541962],[-77.46163900000001,42.54101],[-77.461828,42.540403],[-77.46203,42.539794],[-77.46229700000001,42.539111],[-77.46254999999999,42.538542],[-77.463241,42.537234],[-77.463311,42.537104],[-77.465385,42.533212],[-77.46603,42.532012],[-77.467783,42.528728],[-77.468525,42.527302],[-77.468687,42.52696],[-77.468765,42.526796],[-77.469902,42.524522],[-77.470248,42.523822],[-77.470754,42.522799],[-77.472612,42.519102],[-77.473378,42.517553],[-77.47445399999999,42.515587],[-77.474751,42.515102],[-77.475092,42.514624],[-77.475537,42.514066],[-77.475568,42.514027],[-77.475606,42.513984],[-77.475863,42.513689],[-77.476438,42.513112],[-77.476837,42.512738],[-77.477019,42.512583],[-77.477767,42.511982],[-77.478042,42.511789],[-77.47874899999999,42.511322],[-77.480197,42.510439],[-77.480915,42.510025],[-77.481632,42.509626],[-77.482433,42.509223],[-77.48321,42.508872],[-77.483985,42.508498],[-77.48477099999999,42.508114],[-77.485136,42.507954],[-77.485542,42.507794],[-77.48600500000001,42.50763],[-77.48807100000001,42.507089],[-77.488101,42.507216],[-77.488108,42.507518],[-77.488074,42.508761],[-77.48806399999999,42.50908],[-77.48805299999999,42.509293],[-77.48803100000001,42.50972],[-77.487953,42.510737],[-77.48778,42.512821],[-77.487724,42.513331],[-77.487664,42.513544],[-77.4876,42.513701],[-77.48748500000001,42.513917],[-77.48700700000001,42.514697],[-77.486842,42.514954],[-77.486428,42.515658],[-77.48538600000001,42.517477],[-77.48490200000001,42.518311],[-77.484702,42.518671],[-77.48457500000001,42.518971],[-77.48415799999999,42.520009],[-77.485591,42.520938],[-77.485834,42.521117],[-77.48610100000001,42.521283],[-77.486176,42.521292],[-77.48626,42.52127],[-77.48634,42.521212],[-77.48667,42.520819],[-77.486819,42.520614],[-77.48705200000001,42.520325],[-77.48718100000001,42.520214],[-77.487353,42.520088],[-77.487593,42.519946],[-77.488084,42.519707],[-77.488508,42.519536],[-77.48997900000001,42.519049],[-77.490335,42.518923],[-77.490425,42.518909],[-77.490533,42.518928],[-77.490611,42.518948],[-77.490891,42.518978],[-77.491074,42.519022],[-77.491321,42.519119],[-77.491395,42.519168],[-77.49152100000001,42.5193],[-77.491606,42.519409],[-77.49188700000001,42.519819],[-77.49195,42.51989],[-77.49198699999999,42.519909],[-77.492058,42.519927],[-77.492137,42.519935],[-77.49340100000001,42.519743],[-77.493532,42.519728],[-77.493618,42.519728],[-77.493763,42.519754],[-77.493842,42.519802],[-77.493942,42.519896],[-77.49409199999999,42.520078],[-77.49428899999999,42.520401],[-77.494345,42.520536],[-77.494364,42.520629],[-77.494364,42.52079],[-77.494367,42.520983],[-77.49445,42.521494],[-77.494483,42.52161],[-77.494563,42.521746],[-77.494649,42.521922],[-77.494817,42.522358],[-77.495092,42.523196],[-77.49514000000001,42.523244],[-77.49528599999999,42.523267],[-77.495643,42.52328],[-77.496892,42.523289],[-77.498054,42.523271],[-77.49924300000001,42.523269],[-77.499667,42.523234],[-77.49990699999999,42.523209],[-77.500344,42.523146],[-77.500946,42.523082],[-77.50119599999999,42.523037],[-77.501848,42.522845],[-77.502172,42.522726],[-77.502441,42.522655],[-77.502712,42.522609],[-77.502861,42.522586],[-77.503007,42.522545],[-77.50308200000001,42.522511],[-77.50315999999999,42.522455],[-77.503452,42.522202],[-77.503545,42.522146],[-77.50394799999999,42.521978],[-77.50422500000001,42.521851],[-77.504813,42.521487],[-77.505059,42.521368],[-77.505549,42.521159],[-77.506258,42.520938],[-77.50641299999999,42.520903],[-77.50701100000001,42.520825],[-77.507231,42.520817],[-77.507496,42.520828],[-77.508038,42.520888],[-77.508934,42.521049],[-77.509072,42.521082],[-77.509349,42.521166],[-77.509861,42.520388],[-77.510245,42.519789],[-77.510803,42.518765],[-77.510851,42.518638],[-77.51091700000001,42.518398],[-77.510954,42.518036],[-77.510963,42.517062],[-77.510954,42.516177],[-77.51098399999999,42.515935],[-77.511055,42.515789],[-77.511126,42.515711],[-77.511199,42.515658],[-77.511257,42.515624],[-77.511324,42.515584],[-77.511414,42.515552],[-77.511459,42.515549],[-77.511684,42.515531],[-77.512693,42.515541],[-77.513143,42.515529],[-77.513256,42.515513],[-77.513321,42.515489],[-77.513475,42.515386],[-77.513552,42.515317],[-77.51367,42.515151],[-77.513913,42.51479],[-77.514034,42.514645],[-77.51414,42.514547],[-77.514346,42.514396],[-77.514865,42.514075],[-77.515072,42.513958],[-77.515261,42.51383],[-77.515517,42.514071],[-77.515692,42.514212],[-77.515807,42.514306],[-77.516119,42.514513],[-77.51651,42.514731],[-77.516577,42.514768],[-77.517055,42.51498],[-77.51770399999999,42.515225],[-77.517867,42.515279],[-77.518565,42.515462],[-77.518885,42.515533],[-77.519274,42.515609],[-77.51942,42.515633],[-77.519757,42.515686],[-77.52008499999999,42.515705],[-77.52069,42.5157],[-77.52225300000001,42.515622],[-77.523633,42.515623],[-77.52437999999999,42.515628],[-77.52513399999999,42.515621],[-77.529644,42.515655],[-77.530171,42.51567],[-77.530637,42.515707],[-77.530872,42.515739],[-77.531099,42.51578],[-77.531452,42.515865],[-77.531565,42.515776],[-77.53166299999999,42.515737],[-77.53184899999999,42.51571],[-77.53222,42.515697],[-77.53276,42.515691],[-77.53476000000001,42.515732],[-77.535025,42.515737],[-77.535155,42.515732],[-77.535505,42.515735],[-77.535732,42.515727],[-77.53606000000001,42.515689],[-77.536238,42.515652],[-77.536405,42.5156],[-77.536771,42.515437],[-77.53680799999999,42.515421],[-77.537059,42.515252],[-77.53715,42.515178],[-77.537173,42.51516],[-77.53731000000001,42.51503],[-77.537491,42.514787],[-77.537656,42.514507],[-77.537825,42.514202],[-77.538009,42.514255],[-77.538375,42.514393],[-77.538749,42.514566],[-77.53912,42.514753],[-77.540458,42.515578],[-77.54060800000001,42.515647],[-77.54076999999999,42.515705],[-77.540943,42.515747],[-77.54124899999999,42.515798],[-77.541455,42.515824],[-77.54177900000001,42.515824],[-77.54174,42.517128]]],"type":"Polygon"}
}