{
  "id": "360470029011",
  "type": "Feature",
  "properties": {
    "area_land":53740,
    "area_water":0,
    "geoid":"360470029011",
    "name":"Block Group 1",
    "state":"ny"
},
  "bbox": [
    -73.980388,
    40.693438,
    -73.977827,
    40.696529
],
  "geometry": {"coordinates":[[[-73.980388,40.696507],[-73.979529,40.696529],[-73.978381,40.696492],[-73.978365,40.696375],[-73.97835000000001,40.696285],[-73.97833,40.696161],[-73.978173,40.695384],[-73.978094,40.694623],[-73.977986,40.694256],[-73.97787099999999,40.693663],[-73.977827,40.693438],[-73.979168,40.693489],[-73.979195,40.693695],[-73.979218,40.693765],[-73.979259,40.69382],[-73.97933,40.693891],[-73.97948100000001,40.694013],[-73.979805,40.694241],[-73.979883,40.694308],[-73.979944,40.694385],[-73.98013899999999,40.694683],[-73.980243,40.695457],[-73.98026299999999,40.695634],[-73.980356,40.696178],[-73.98037100000001,40.696263],[-73.98038099999999,40.696404],[-73.980388,40.696507]]],"type":"Polygon"}
}