{
  "id": "360470394003",
  "type": "Feature",
  "properties": {
    "area_land":96485,
    "area_water":0,
    "geoid":"360470394003",
    "name":"Block Group 3",
    "state":"ny"
},
  "bbox": [
    -73.968201,
    40.595461,
    -73.965076,
    40.60009
],
  "geometry": {"coordinates":[[[-73.96820099999999,40.599835],[-73.96727300000001,40.599939],[-73.966178,40.60006],[-73.96590399999999,40.60009],[-73.96547700000001,40.597834],[-73.965076,40.595716],[-73.96535,40.595686],[-73.966449,40.595567],[-73.967376,40.595461],[-73.967777,40.59758],[-73.96820099999999,40.599835]]],"type":"Polygon"}
}