{
  "id": "360130374002",
  "type": "Feature",
  "properties": {
    "area_land":89185715,
    "area_water":36060,
    "geoid":"360130374002",
    "name":"Block Group 2",
    "state":"ny"
},
  "bbox": [
    -79.178904,
    42.165251,
    -79.059682,
    42.260722
],
  "geometry": {"coordinates":[[[-79.178904,42.240631],[-79.178804,42.250108],[-79.178719,42.25261],[-79.178798,42.256272],[-79.17878399999999,42.260067],[-79.178781,42.260722],[-79.178597,42.26072],[-79.15528500000001,42.260537],[-79.15448000000001,42.260536],[-79.131828,42.260464],[-79.131371,42.260462],[-79.12822799999999,42.260466],[-79.12692300000001,42.260469],[-79.12449700000001,42.260469],[-79.120273,42.260456],[-79.120051,42.260449],[-79.119613,42.260456],[-79.11752799999999,42.260435],[-79.11661599999999,42.260438],[-79.115061,42.260427],[-79.112649,42.260431],[-79.11045799999999,42.260405],[-79.107316,42.260402],[-79.105771,42.260413],[-79.10421599999999,42.260383],[-79.102745,42.26038],[-79.10165000000001,42.260404],[-79.10111499999999,42.260416],[-79.096752,42.260406],[-79.09360100000001,42.260391],[-79.09044,42.260383],[-79.087395,42.260354],[-79.084242,42.260354],[-79.080671,42.26031],[-79.080477,42.260318],[-79.080386,42.260332],[-79.08028899999999,42.26036],[-79.078191,42.260419],[-79.073635,42.260399],[-79.060399,42.260256],[-79.060405,42.259819],[-79.06041999999999,42.259611],[-79.06035199999999,42.25767],[-79.060367,42.253888],[-79.060309,42.250909],[-79.06030199999999,42.250051],[-79.060303,42.249935],[-79.06031900000001,42.248358],[-79.06031299999999,42.247517],[-79.06031299999999,42.247498],[-79.06030800000001,42.247404],[-79.060305,42.24735],[-79.060187,42.242668],[-79.060166,42.242062],[-79.060126,42.240802],[-79.060119,42.240568],[-79.060101,42.24047],[-79.060035,42.240098],[-79.060022,42.239962],[-79.060017,42.239819],[-79.060017,42.239798],[-79.060018,42.239735],[-79.06002599999999,42.239297],[-79.06001000000001,42.238918],[-79.06,42.237105],[-79.06,42.237093],[-79.059984,42.236128],[-79.059997,42.231171],[-79.060001,42.229476],[-79.05987,42.223647],[-79.059876,42.223422],[-79.059882,42.223229],[-79.059884,42.22315],[-79.05988499999999,42.223091],[-79.05990300000001,42.221683],[-79.059898,42.22155],[-79.059898,42.22119],[-79.05990199999999,42.221162],[-79.059906,42.221013],[-79.059905,42.220976],[-79.05990300000001,42.220854],[-79.05990799999999,42.220709],[-79.059909,42.220662],[-79.059909,42.220623],[-79.059898,42.217906],[-79.05985699999999,42.215962],[-79.059861,42.215793],[-79.05989,42.215681],[-79.059933,42.2156],[-79.059882,42.215484],[-79.059861,42.215416],[-79.059853,42.21516],[-79.05986,42.213755],[-79.059861,42.213629],[-79.059877,42.211818],[-79.059878,42.211666],[-79.059871,42.209951],[-79.059856,42.209658],[-79.059871,42.209411],[-79.059871,42.208749],[-79.05985099999999,42.206701],[-79.059831,42.206286],[-79.059816,42.206152],[-79.059791,42.206039],[-79.059769,42.205966],[-79.059781,42.194433],[-79.059786,42.184531],[-79.059682,42.177422],[-79.059709,42.173923],[-79.05971099999999,42.173403],[-79.05971,42.173279],[-79.059712,42.172683],[-79.059737,42.166789],[-79.059737,42.166524],[-79.06045399999999,42.166756],[-79.060782,42.166895],[-79.061093,42.167067],[-79.06156,42.167401],[-79.06268799999999,42.168296],[-79.06430899999999,42.169548],[-79.065133,42.170198],[-79.06576200000001,42.170679],[-79.066137,42.170933],[-79.06626799999999,42.171007],[-79.066441,42.171103],[-79.06690999999999,42.171333],[-79.067365,42.171512],[-79.067669,42.171615],[-79.067837,42.171666],[-79.06786,42.171672],[-79.068107,42.17174],[-79.068308,42.171793],[-79.068482,42.171826],[-79.068754,42.171882],[-79.06938100000001,42.17197],[-79.06990999999999,42.172025],[-79.070286,42.172054],[-79.070753,42.172055],[-79.071247,42.172033],[-79.071691,42.171993],[-79.072275,42.171923],[-79.07436,42.171643],[-79.07551100000001,42.171479],[-79.07623599999999,42.17137],[-79.076706,42.171315],[-79.079319,42.170976],[-79.07989499999999,42.170871],[-79.080161,42.170787],[-79.08063799999999,42.170635],[-79.082431,42.170055],[-79.083297,42.169738],[-79.083495,42.169632],[-79.083805,42.16941],[-79.08432999999999,42.168984],[-79.08444299999999,42.168878],[-79.084575,42.168721],[-79.084717,42.168473],[-79.08517000000001,42.167538],[-79.085559,42.166743],[-79.085661,42.166503],[-79.08590100000001,42.165702],[-79.08602999999999,42.165251],[-79.086461,42.1654],[-79.08687399999999,42.165557],[-79.088342,42.16618],[-79.088801,42.166384],[-79.09012300000001,42.166945],[-79.091368,42.167462],[-79.092535,42.167979],[-79.092945,42.168191],[-79.093109,42.168289],[-79.093244,42.168387],[-79.094347,42.169352],[-79.09521599999999,42.170129],[-79.09569,42.17058],[-79.096402,42.171295],[-79.097145,42.172045],[-79.09824399999999,42.173232],[-79.098361,42.173375],[-79.098467,42.173528],[-79.098489,42.173567],[-79.098569,42.173709],[-79.098705,42.173972],[-79.098964,42.174551],[-79.099322,42.175412],[-79.099371,42.175533],[-79.099976,42.175509],[-79.10021999999999,42.175534],[-79.10070899999999,42.175625],[-79.10092,42.175687],[-79.10112100000001,42.175757],[-79.101495,42.175928],[-79.10171,42.176085],[-79.10224599999999,42.176529],[-79.10470100000001,42.178452],[-79.105441,42.179021],[-79.105722,42.179196],[-79.10730100000001,42.180081],[-79.108637,42.180795],[-79.11001,42.181516],[-79.111422,42.182234],[-79.112945,42.183036],[-79.11469099999999,42.183946],[-79.11481499999999,42.184001],[-79.115039,42.184059],[-79.115163,42.184077],[-79.115393,42.184092],[-79.115903,42.184103],[-79.11722899999999,42.184096],[-79.11820899999999,42.184106],[-79.120206,42.184082],[-79.124726,42.184036],[-79.125822,42.184043],[-79.126756,42.184025],[-79.132605,42.18396],[-79.13293899999999,42.183956],[-79.13501100000001,42.183941],[-79.136489,42.183919],[-79.138043,42.183891],[-79.140344,42.18385],[-79.141198,42.183835],[-79.142309,42.183813],[-79.148107,42.183769],[-79.151337,42.183726],[-79.15245899999999,42.183693],[-79.153819,42.18367],[-79.15860600000001,42.183613],[-79.16010300000001,42.183605],[-79.16226899999999,42.183574],[-79.163093,42.183562],[-79.164576,42.183562],[-79.166062,42.18354],[-79.167621,42.183503],[-79.170738,42.183471],[-79.17231200000001,42.183441],[-79.172957,42.183438],[-79.17609299999999,42.183398],[-79.17626799999999,42.18339],[-79.176501,42.183409],[-79.176709,42.183441],[-79.17689900000001,42.183482],[-79.177143,42.183554],[-79.178224,42.183926],[-79.178827,42.184177],[-79.17878,42.187534],[-79.178758,42.198843],[-79.178765,42.1997],[-79.178766,42.199848],[-79.17876800000001,42.199995],[-79.17883500000001,42.208098],[-79.17884599999999,42.209066],[-79.17880100000001,42.218031],[-79.178837,42.226718],[-79.178821,42.228875],[-79.178816,42.232553],[-79.178904,42.240631]]],"type":"Polygon"}
}