{
  "id": "361190088002",
  "type": "Feature",
  "properties": {
    "area_land":58028,
    "area_water":0,
    "geoid":"361190088002",
    "name":"Block Group 2",
    "state":"ny"
},
  "bbox": [
    -73.764428,
    41.034155,
    -73.760411,
    41.03717
],
  "geometry": {"coordinates":[[[-73.764428,41.036281],[-73.76361900000001,41.036479],[-73.763188,41.036603],[-73.762579,41.036815],[-73.761591,41.03717],[-73.761162,41.036614],[-73.76085,41.036209],[-73.760411,41.035712],[-73.76069,41.035552],[-73.761244,41.035186],[-73.76216100000001,41.03459],[-73.762821,41.034155],[-73.763876,41.035585],[-73.764223,41.036052],[-73.764428,41.036281]]],"type":"Polygon"}
}