{
  "id": "361219701002",
  "type": "Feature",
  "properties": {
    "area_land":61088987,
    "area_water":0,
    "geoid":"361219701002",
    "name":"Block Group 2",
    "state":"ny"
},
  "bbox": [
    -78.074265,
    42.800477,
    -77.95464,
    42.865048
],
  "geometry": {"coordinates":[[[-78.074251,42.802417],[-78.074213,42.807185],[-78.0742,42.808775],[-78.074208,42.809377],[-78.074234,42.811183],[-78.074243,42.811786],[-78.074218,42.813044],[-78.074147,42.816821],[-78.074123,42.81808],[-78.07398999999999,42.818038],[-78.073707,42.817919],[-78.07348,42.817806],[-78.073177,42.817631],[-78.072783,42.817351],[-78.07258,42.817191],[-78.07221,42.816868],[-78.07171200000001,42.816433],[-78.071442,42.816178],[-78.070566,42.815386],[-78.069838,42.814801],[-78.06893700000001,42.814031],[-78.06840800000001,42.813608],[-78.06814199999999,42.813423],[-78.067769,42.81323],[-78.06741599999999,42.813079],[-78.066759,42.812817],[-78.06571,42.812399],[-78.06464699999999,42.811956],[-78.064274,42.812009],[-78.063275,42.812107],[-78.06278500000001,42.812163],[-78.06250300000001,42.812196],[-78.06110700000001,42.812391],[-78.05934499999999,42.812595],[-78.057318,42.812879],[-78.057214,42.812891],[-78.055914,42.813052],[-78.05535500000001,42.813113],[-78.05434,42.813222],[-78.054119,42.813247],[-78.05325499999999,42.813318],[-78.052932,42.813333],[-78.05176400000001,42.813356],[-78.05128499999999,42.813357],[-78.050265,42.813361],[-78.05030600000001,42.817117],[-78.050284,42.81786],[-78.05019,42.81935],[-78.050162,42.819616],[-78.049983,42.820892],[-78.049694,42.823429],[-78.04966400000001,42.823793],[-78.04957400000001,42.824547],[-78.049536,42.825162],[-78.049521,42.825864],[-78.049536,42.828566],[-78.049548,42.829059],[-78.05197099999999,42.829021],[-78.052791,42.828993],[-78.05361000000001,42.828976],[-78.05522499999999,42.828914],[-78.059258,42.828826],[-78.06157,42.82879],[-78.062977,42.828747],[-78.064643,42.828712],[-78.064769,42.828729],[-78.06486,42.828763],[-78.06421,42.829376],[-78.06235599999999,42.831186],[-78.062033,42.831483],[-78.059905,42.833561],[-78.059648,42.833824],[-78.05912600000001,42.834395],[-78.05884500000001,42.834687],[-78.056212,42.83758],[-78.055803,42.838053],[-78.055645,42.838252],[-78.05504000000001,42.839074],[-78.054372,42.840076],[-78.054096,42.840513],[-78.053523,42.841453],[-78.052322,42.843599],[-78.052171,42.843832],[-78.05189799999999,42.844189],[-78.051678,42.844447],[-78.051373,42.844741],[-78.051249,42.844844],[-78.050698,42.845212],[-78.048248,42.84678],[-78.047854,42.847027],[-78.047433,42.84729],[-78.04714199999999,42.847471],[-78.04686100000001,42.847648],[-78.046689,42.847779],[-78.04658000000001,42.847924],[-78.046558,42.847984],[-78.04650700000001,42.848211],[-78.046491,42.848288],[-78.046452,42.848334],[-78.046289,42.848456],[-78.04651200000001,42.848452],[-78.047185,42.848442],[-78.047409,42.848439],[-78.04756500000001,42.848435],[-78.048033,42.848426],[-78.04819000000001,42.848423],[-78.049521,42.848408],[-78.050358,42.848399],[-78.05351400000001,42.848349],[-78.054846,42.848328],[-78.055561,42.848318],[-78.057706,42.848288],[-78.058421,42.848278],[-78.058578,42.848276],[-78.058758,42.848275],[-78.059769,42.84827],[-78.060107,42.848269],[-78.06223799999999,42.848265],[-78.06250300000001,42.848265],[-78.06440600000001,42.848247],[-78.068634,42.848226],[-78.069948,42.84822],[-78.070268,42.848202],[-78.070497,42.848175],[-78.07076000000001,42.848127],[-78.071079,42.848191],[-78.071162,42.848208],[-78.07134600000001,42.848262],[-78.072003,42.848502],[-78.072309,42.848615],[-78.072676,42.848749],[-78.073644,42.849104],[-78.073778,42.849148],[-78.07415,42.849272],[-78.07416499999999,42.849433],[-78.07420999999999,42.849916],[-78.074225,42.850077],[-78.074225,42.850437],[-78.074225,42.850465],[-78.074156,42.851518],[-78.074146,42.851673],[-78.074139,42.851879],[-78.07413,42.852517],[-78.074125,42.85298],[-78.074127,42.854432],[-78.074129,42.855071],[-78.074173,42.856805],[-78.074179,42.857032],[-78.074212,42.859526],[-78.07415399999999,42.861738],[-78.07415399999999,42.862008],[-78.074161,42.863743],[-78.05606400000001,42.864043],[-78.05448199999999,42.864043],[-78.053955,42.864034],[-78.053844,42.864034],[-78.05370600000001,42.864037],[-78.053445,42.864043],[-78.05228,42.864051],[-78.05098099999999,42.86407],[-78.04929,42.864082],[-78.049002,42.86407],[-78.048776,42.864213],[-78.048599,42.864328],[-78.045447,42.864376],[-78.030289,42.864603],[-78.02910199999999,42.864621],[-78.02881499999999,42.864625],[-78.02682799999999,42.864655],[-78.02024,42.864753],[-78.009528,42.864914],[-78.007628,42.864935],[-78.007464,42.864937],[-78.001189,42.865041],[-78.00058799999999,42.865048],[-77.999731,42.865001],[-77.995362,42.864993],[-77.995262,42.863181],[-77.99337199999999,42.863247],[-77.984449,42.863058],[-77.981089,42.863023],[-77.98084299999999,42.863021],[-77.979902,42.863011],[-77.978497,42.862997],[-77.975495,42.862962],[-77.966233,42.862946],[-77.96619,42.862951],[-77.964878,42.862952],[-77.964105,42.86294],[-77.96375,42.86293],[-77.961271,42.862876],[-77.960014,42.862851],[-77.958843,42.862835],[-77.956681,42.862809],[-77.955287,42.862793],[-77.95522800000001,42.862788],[-77.95508700000001,42.862775],[-77.954964,42.862754],[-77.95484500000001,42.862679],[-77.95481599999999,42.862661],[-77.95479,42.862644],[-77.954748,42.862618],[-77.954735,42.862601],[-77.954712,42.862571],[-77.95470400000001,42.86255],[-77.954696,42.862531],[-77.95468,42.862482],[-77.954677,42.862457],[-77.954657,42.862226],[-77.95465,42.862149],[-77.95464800000001,42.86212],[-77.954641,42.862031],[-77.95464,42.862011],[-77.954689,42.861869],[-77.954841,42.861445],[-77.954893,42.861307],[-77.954887,42.861275],[-77.95488400000001,42.861253],[-77.954886,42.861183],[-77.954888,42.861154],[-77.954897,42.860229],[-77.95492900000001,42.85746],[-77.95494100000001,42.856538],[-77.954954,42.855437],[-77.954993,42.852137],[-77.955,42.851572],[-77.955004,42.851037],[-77.955004,42.85101],[-77.955004,42.85093],[-77.955005,42.850904],[-77.955011,42.850278],[-77.955028,42.848402],[-77.955035,42.847777],[-77.95504099999999,42.847124],[-77.95505799999999,42.845166],[-77.955065,42.844514],[-77.955085,42.842515],[-77.95509199999999,42.842186],[-77.955247,42.835205],[-77.955299,42.832878],[-77.955305,42.831385],[-77.955325,42.826907],[-77.955332,42.825415],[-77.95533399999999,42.824924],[-77.95534000000001,42.823454],[-77.955342,42.823142],[-77.95534000000001,42.822965],[-77.955337,42.822745],[-77.955331,42.822086],[-77.95532900000001,42.821867],[-77.95526099999999,42.821033],[-77.955062,42.818549],[-77.955061,42.818532],[-77.955033,42.817697],[-77.955033,42.817337],[-77.955033,42.817228],[-77.955037,42.816258],[-77.955038,42.816032],[-77.95501299999999,42.815901],[-77.95508100000001,42.814825],[-77.955286,42.811599],[-77.955355,42.810524],[-77.95535599999999,42.810433],[-77.955361,42.810165],[-77.955365,42.810078],[-77.955376,42.809357],[-77.955416,42.8072],[-77.955431,42.806481],[-77.95544200000001,42.805923],[-77.95544599999999,42.805743],[-77.95549200000001,42.804251],[-77.95551,42.803694],[-77.95553,42.80305],[-77.95556500000001,42.801943],[-77.955566,42.80112],[-77.955567,42.800477],[-77.95560500000001,42.800477],[-77.955719,42.80048],[-77.955758,42.800481],[-77.966998,42.800729],[-77.967277,42.800737],[-77.968462,42.800773],[-77.971951,42.80088],[-77.97205200000001,42.800883],[-77.972356,42.800892],[-77.972458,42.800896],[-77.97425800000001,42.800951],[-77.976266,42.801001],[-77.97730799999999,42.801034],[-77.980778,42.80114],[-77.980993,42.801146],[-77.987139,42.801339],[-77.99205000000001,42.80139],[-77.99573700000001,42.80143],[-77.995991,42.801475],[-77.996309,42.8015],[-77.997739,42.801559],[-78.000658,42.801681],[-78.00376199999999,42.801706],[-78.00570999999999,42.801722],[-78.005771,42.801722],[-78.00726899999999,42.801731],[-78.007779,42.801735],[-78.00932400000001,42.801758],[-78.011764,42.80177],[-78.01326299999999,42.801778],[-78.01361,42.801779],[-78.014652,42.801785],[-78.015,42.801787],[-78.017353,42.801788],[-78.02328799999999,42.801794],[-78.02381,42.801786],[-78.024415,42.801791],[-78.024638,42.801794],[-78.026769,42.801786],[-78.02704900000001,42.801783],[-78.02789,42.801776],[-78.028171,42.801774],[-78.028327,42.80177],[-78.02879799999999,42.801759],[-78.028955,42.801756],[-78.030012,42.801735],[-78.03218699999999,42.801722],[-78.032894,42.80171],[-78.034577,42.801682],[-78.037537,42.801642],[-78.04198700000001,42.801558],[-78.043437,42.801551],[-78.044712,42.801518],[-78.04865100000001,42.801417],[-78.04889799999999,42.80141],[-78.04964099999999,42.80139],[-78.04988899999999,42.801384],[-78.05225299999999,42.801329],[-78.05476400000001,42.801264],[-78.056353,42.801223],[-78.05974399999999,42.801148],[-78.060885,42.801103],[-78.06250300000001,42.801057],[-78.06325099999999,42.801046],[-78.066321,42.800969],[-78.069389,42.800902],[-78.069599,42.800898],[-78.070317,42.800892],[-78.072108,42.800849],[-78.073547,42.800824],[-78.074265,42.800828],[-78.074251,42.802417]]],"type":"Polygon"}
}