{
  "id": "360670053001",
  "type": "Feature",
  "properties": {
    "area_land":223349,
    "area_water":0,
    "geoid":"360670053001",
    "name":"Block Group 1",
    "state":"ny"
},
  "bbox": [
    -76.152837,
    43.027397,
    -76.142133,
    43.03145
],
  "geometry": {"coordinates":[[[-76.15283700000001,43.029346],[-76.151578,43.029664],[-76.149771,43.030133],[-76.147711,43.03066],[-76.14764599999999,43.030525],[-76.146567,43.030816],[-76.14578899999999,43.031012],[-76.144677,43.031301],[-76.144104,43.03145],[-76.143987,43.031197],[-76.143906,43.031122],[-76.143857,43.031098],[-76.143304,43.030946],[-76.142678,43.030791],[-76.142641,43.030771],[-76.14258100000001,43.030694],[-76.14254800000001,43.030561],[-76.14242400000001,43.029856],[-76.142387,43.029675],[-76.14215900000001,43.028478],[-76.142133,43.02834],[-76.14329600000001,43.028276],[-76.144294,43.028234],[-76.144352,43.028223],[-76.14443900000001,43.028187],[-76.14456,43.028139],[-76.144764,43.028113],[-76.146446,43.027993],[-76.146801,43.028744],[-76.14885700000001,43.028211],[-76.15205899999999,43.027397],[-76.152404,43.028303],[-76.15283700000001,43.029346]]],"type":"Polygon"}
}