{
  "id": "360550130026",
  "type": "Feature",
  "properties": {
    "area_land":986646,
    "area_water":0,
    "geoid":"360550130026",
    "name":"Block Group 6",
    "state":"ny"
},
  "bbox": [
    -77.576927,
    43.09903,
    -77.561591,
    43.108608
],
  "geometry": {"coordinates":[[[-77.576927,43.099396],[-77.576891,43.099642],[-77.57679,43.100183],[-77.576728,43.100524],[-77.576651,43.100947],[-77.576628,43.101074],[-77.57649000000001,43.101825],[-77.57642,43.10223],[-77.576398,43.10236],[-77.576369,43.102508],[-77.576312,43.102796],[-77.576294,43.102892],[-77.576143,43.103696],[-77.57604600000001,43.104255],[-77.57590999999999,43.105011],[-77.57590500000001,43.105104],[-77.575919,43.105244],[-77.575954,43.105386],[-77.575976,43.105447],[-77.57601200000001,43.105512],[-77.576043,43.105544],[-77.57606199999999,43.105563],[-77.576172,43.105635],[-77.576369,43.105742],[-77.57658499999999,43.105835],[-77.57678199999999,43.105902],[-77.576256,43.106943],[-77.576156,43.107142],[-77.57599399999999,43.107456],[-77.57578599999999,43.107875],[-77.575765,43.10792],[-77.574724,43.107918],[-77.57412100000001,43.107938],[-77.571696,43.108017],[-77.570972,43.108054],[-77.569242,43.108122],[-77.56674,43.108254],[-77.561622,43.108606],[-77.56159100000001,43.108608],[-77.56163100000001,43.108536],[-77.561717,43.108384],[-77.561768,43.108296],[-77.562273,43.107388],[-77.562309,43.107323],[-77.56328000000001,43.105539],[-77.563682,43.104798],[-77.56407400000001,43.104079],[-77.56453399999999,43.103207],[-77.56467499999999,43.102943],[-77.565417,43.101599],[-77.566675,43.099261],[-77.567644,43.099237],[-77.568448,43.099217],[-77.56873,43.09921],[-77.569138,43.0992],[-77.571602,43.099137],[-77.572316,43.099129],[-77.57378,43.099088],[-77.575081,43.099048],[-77.57608999999999,43.099033],[-77.576306,43.09903],[-77.57650099999999,43.099032],[-77.576577,43.099041],[-77.57670400000001,43.099072],[-77.57676600000001,43.099097],[-77.57681599999999,43.099128],[-77.57686699999999,43.099169],[-77.576896,43.099219],[-77.57692299999999,43.099302],[-77.576927,43.099396]]],"type":"Polygon"}
}