{
  "id": "360870107022",
  "type": "Feature",
  "properties": {
    "area_land":241928,
    "area_water":0,
    "geoid":"360870107022",
    "name":"Block Group 2",
    "state":"ny"
},
  "bbox": [
    -73.975214,
    41.194691,
    -73.964103,
    41.200251
],
  "geometry": {"coordinates":[[[-73.97500100000001,41.19745],[-73.97454500000001,41.197947],[-73.974459,41.198061],[-73.974299,41.198308],[-73.974183,41.198481],[-73.974097,41.198609],[-73.97387999999999,41.198995],[-73.973597,41.19955],[-73.973525,41.199698],[-73.973218,41.200251],[-73.973161,41.200236],[-73.97251300000001,41.199926],[-73.97237,41.19986],[-73.970466,41.198995],[-73.970242,41.198888],[-73.970159,41.198836],[-73.969977,41.198683],[-73.969801,41.198507],[-73.96885399999999,41.19747],[-73.968778,41.197373],[-73.96869100000001,41.197223],[-73.968559,41.19689],[-73.968065,41.196939],[-73.967688,41.196989],[-73.96652,41.19716],[-73.96575799999999,41.197248],[-73.964502,41.197347],[-73.964313,41.196575],[-73.96410299999999,41.196104],[-73.964215,41.196032],[-73.964811,41.195584],[-73.965152,41.195332],[-73.965823,41.194869],[-73.966303,41.195206],[-73.967426,41.196141],[-73.967467,41.196196],[-73.967624,41.196111],[-73.968011,41.195809],[-73.968453,41.195452],[-73.968952,41.195017],[-73.969104,41.194884],[-73.969329,41.194691],[-73.970309,41.195317],[-73.970979,41.195722],[-73.97109399999999,41.195784],[-73.97124700000001,41.195843],[-73.97185899999999,41.196051],[-73.97233799999999,41.196194],[-73.973491,41.196605],[-73.974737,41.197095],[-73.97521399999999,41.197254],[-73.97500100000001,41.19745]]],"type":"Polygon"}
}