{
  "id": "360470876001",
  "type": "Feature",
  "properties": {
    "area_land":79847,
    "area_water":0,
    "geoid":"360470876001",
    "name":"Block Group 1",
    "state":"ny"
},
  "bbox": [
    -73.937397,
    40.660236,
    -73.934231,
    40.663362
],
  "geometry": {"coordinates":[[[-73.937397,40.66292],[-73.937264,40.663192],[-73.93455299999999,40.663362],[-73.934467,40.662575],[-73.934392,40.661864],[-73.934316,40.661148],[-73.934231,40.660415],[-73.935203,40.660357],[-73.936136,40.660295],[-73.937111,40.660236],[-73.93718800000001,40.660947],[-73.937262,40.661671],[-73.937341,40.662397],[-73.937397,40.66292]]],"type":"Polygon"}
}