{
  "id": "360050396003",
  "type": "Feature",
  "properties": {
    "area_land":66775,
    "area_water":0,
    "geoid":"360050396003",
    "name":"Block Group 3",
    "state":"ny"
},
  "bbox": [
    -73.862803,
    40.882665,
    -73.85876,
    40.885693
],
  "geometry": {"coordinates":[[[-73.862416,40.884281],[-73.86202900000001,40.884987],[-73.86163999999999,40.885693],[-73.85876,40.884777],[-73.859161,40.884072],[-73.859555,40.88337],[-73.85994100000001,40.882665],[-73.862803,40.883574],[-73.862416,40.884281]]],"type":"Polygon"}
}