{
  "id": "360690506013",
  "type": "Feature",
  "properties": {
    "area_land":6307691,
    "area_water":4878485,
    "geoid":"360690506013",
    "name":"Block Group 3",
    "state":"ny"
},
  "bbox": [
    -77.303162,
    42.839827,
    -77.245255,
    42.872401
],
  "geometry": {"coordinates":[[[-77.30306400000001,42.842778],[-77.30296300000001,42.84401],[-77.302958,42.844072],[-77.302924,42.844546],[-77.302836,42.84528],[-77.302756,42.845665],[-77.30251199999999,42.846358],[-77.30230400000001,42.84689],[-77.302104,42.847321],[-77.30199399999999,42.847557],[-77.301984,42.847581],[-77.301776,42.84798],[-77.301523,42.848368],[-77.301349,42.84861],[-77.301171,42.848845],[-77.300809,42.849328],[-77.30063699999999,42.84955],[-77.30045800000001,42.849784],[-77.299859,42.850583],[-77.299454,42.851124],[-77.29906699999999,42.85168],[-77.29876299999999,42.852073],[-77.298429,42.852403],[-77.298108,42.852667],[-77.29790199999999,42.852829],[-77.29743999999999,42.853195],[-77.297145,42.853479],[-77.296972,42.853677],[-77.296961,42.85369],[-77.29659599999999,42.854215],[-77.29653,42.854331],[-77.296488,42.854406],[-77.29641599999999,42.854568],[-77.29627000000001,42.854983],[-77.296093,42.855661],[-77.296012,42.855934],[-77.295525,42.857256],[-77.295252,42.857972],[-77.29501399999999,42.858597],[-77.29431,42.860496],[-77.29355,42.8624],[-77.29314599999999,42.863335],[-77.29306699999999,42.863545],[-77.292563,42.864694],[-77.292249,42.865509],[-77.29218899999999,42.865683],[-77.292126,42.86587],[-77.291972,42.86636],[-77.291528,42.868099],[-77.29112600000001,42.869675],[-77.291004,42.870155],[-77.290852,42.87081],[-77.290817,42.871084],[-77.290798,42.871387],[-77.290797,42.871615],[-77.29065,42.871652],[-77.290209,42.871762],[-77.290063,42.8718],[-77.289132,42.870488],[-77.288516,42.869621],[-77.287699,42.868481],[-77.285493,42.869314],[-77.285122,42.869455],[-77.28404,42.869998],[-77.283371,42.870215],[-77.28304900000001,42.87032],[-77.281747,42.87075],[-77.28137700000001,42.870904],[-77.28072899999999,42.871177],[-77.27905699999999,42.871228],[-77.274621,42.871366],[-77.274045,42.871391],[-77.272375,42.871465],[-77.269644,42.871558],[-77.26863400000001,42.871593],[-77.262705,42.871787],[-77.26145099999999,42.871814],[-77.25906999999999,42.871868],[-77.25872099999999,42.871847],[-77.25852999999999,42.871753],[-77.258033,42.871509],[-77.25795599999999,42.871479],[-77.257896,42.871456],[-77.257762,42.871394],[-77.25761,42.871458],[-77.257493,42.871508],[-77.256686,42.871854],[-77.256418,42.871969],[-77.256428,42.871985],[-77.25645900000001,42.872033],[-77.25646999999999,42.872049],[-77.255701,42.872091],[-77.255613,42.872094],[-77.25304,42.872192],[-77.252183,42.872226],[-77.251279,42.872197],[-77.251014,42.872212],[-77.25076900000001,42.872203],[-77.250039,42.872179],[-77.249932,42.872401],[-77.249747,42.872389],[-77.24919199999999,42.872355],[-77.24900700000001,42.872344],[-77.248335,42.872306],[-77.24632200000001,42.872194],[-77.245651,42.872157],[-77.24564599999999,42.872011],[-77.245634,42.871576],[-77.24563000000001,42.871431],[-77.245465,42.865327],[-77.245463,42.863996],[-77.24541000000001,42.861693],[-77.245368,42.85986],[-77.245255,42.85491],[-77.24684600000001,42.854914],[-77.248323,42.854918],[-77.253266,42.854881],[-77.254777,42.854862],[-77.25599,42.854846],[-77.25617,42.854843],[-77.256713,42.854836],[-77.256894,42.854835],[-77.257459,42.854824],[-77.26166600000001,42.854764],[-77.261973,42.85476],[-77.265958,42.854728],[-77.268242,42.85472],[-77.268238,42.853158],[-77.268227,42.851604],[-77.26822300000001,42.850987],[-77.268278,42.848623],[-77.268384,42.846982],[-77.26843100000001,42.846276],[-77.268669,42.84401],[-77.268804,42.842229],[-77.271036,42.842284],[-77.27423400000001,42.842363],[-77.277732,42.842216],[-77.27996400000001,42.842123],[-77.28010500000001,42.842069],[-77.280216,42.842027],[-77.28037399999999,42.841983],[-77.280545,42.841978],[-77.280697,42.841974],[-77.280714,42.841713],[-77.280738,42.841355],[-77.280781,42.840935],[-77.280809,42.840676],[-77.281958,42.840726],[-77.28234,42.840761],[-77.28315600000001,42.840912],[-77.28321,42.840923],[-77.28348200000001,42.840958],[-77.283896,42.840981],[-77.28426899999999,42.840978],[-77.28494499999999,42.840924],[-77.287909,42.840621],[-77.28864400000001,42.840538],[-77.28918400000001,42.840445],[-77.289754,42.840291],[-77.290426,42.840079],[-77.290569,42.840035],[-77.291027,42.839925],[-77.291585,42.839852],[-77.292023,42.839827],[-77.292513,42.839846],[-77.29283,42.839878],[-77.29320300000001,42.83995],[-77.293564,42.840047],[-77.29390600000001,42.840169],[-77.294043,42.840226],[-77.29477300000001,42.840579],[-77.294811,42.840595],[-77.295496,42.840897],[-77.295845,42.841021],[-77.29633,42.841147],[-77.29668599999999,42.841217],[-77.29704,42.841256],[-77.301047,42.841487],[-77.301503,42.841514],[-77.302358,42.841557],[-77.303162,42.841608],[-77.30306400000001,42.842778]]],"type":"Polygon"}
}