{
  "id": "360870112004",
  "type": "Feature",
  "properties": {
    "area_land":2520763,
    "area_water":0,
    "geoid":"360870112004",
    "name":"Block Group 4",
    "state":"ny"
},
  "bbox": [
    -73.991265,
    41.078529,
    -73.971538,
    41.096596
],
  "geometry": {"coordinates":[[[-73.991265,41.096318],[-73.991056,41.096293],[-73.98990000000001,41.096109],[-73.989313,41.096019],[-73.988877,41.095958],[-73.988617,41.095932],[-73.98839599999999,41.095922],[-73.98796,41.095928],[-73.98755199999999,41.095961],[-73.984264,41.096322],[-73.984081,41.096342],[-73.98361800000001,41.096392],[-73.981979,41.096572],[-73.981909,41.09658],[-73.981604,41.096596],[-73.981054,41.096595],[-73.98065200000001,41.096579],[-73.98025800000001,41.096542],[-73.980029,41.096511],[-73.979877,41.096475],[-73.97962800000001,41.096402],[-73.97951,41.096355],[-73.979164,41.096146],[-73.97874299999999,41.095883],[-73.978452,41.095688],[-73.977863,41.095262],[-73.97751599999999,41.094994],[-73.977225,41.094792],[-73.977051,41.094685],[-73.976816,41.094585],[-73.976578,41.094523],[-73.976237,41.094452],[-73.975841,41.094347],[-73.975194,41.094222],[-73.974011,41.093864],[-73.97371099999999,41.093802],[-73.97351399999999,41.093783],[-73.973344,41.093779],[-73.972965,41.093818],[-73.97279399999999,41.093857],[-73.972463,41.09395],[-73.972391,41.093958],[-73.972266,41.093587],[-73.972193,41.093174],[-73.972105,41.092362],[-73.97205200000001,41.09215],[-73.972036,41.092091],[-73.97202299999999,41.092038],[-73.971929,41.091694],[-73.971718,41.090916],[-73.971554,41.09035],[-73.971538,41.090189],[-73.971557,41.090081],[-73.971937,41.088998],[-73.972291,41.088046],[-73.972341,41.08785],[-73.97237699999999,41.087614],[-73.97241699999999,41.087225],[-73.972432,41.086862],[-73.972397,41.086237],[-73.972354,41.085853],[-73.972274,41.085236],[-73.97224199999999,41.08475],[-73.97241699999999,41.083788],[-73.972438,41.083578],[-73.972515,41.083152],[-73.972572,41.083034],[-73.972605,41.08299],[-73.972656,41.082952],[-73.97273199999999,41.082923],[-73.972967,41.082905],[-73.97364399999999,41.082862],[-73.974616,41.082768],[-73.97531499999999,41.082714],[-73.976342,41.082633],[-73.976558,41.082608],[-73.97708,41.08255],[-73.97715100000001,41.082428],[-73.977221,41.082215],[-73.977338,41.081466],[-73.97736,41.081323],[-73.977448,41.080711],[-73.977502,41.080434],[-73.977541,41.080311],[-73.97775300000001,41.079816],[-73.977771,41.079739],[-73.977774,41.079617],[-73.977673,41.078882],[-73.97767399999999,41.078541],[-73.978718,41.078529],[-73.980332,41.07856],[-73.982319,41.078614],[-73.98265499999999,41.078623],[-73.983808,41.078655],[-73.983858,41.078656],[-73.98474400000001,41.078681],[-73.98496799999999,41.078687],[-73.98519899999999,41.078693],[-73.98531199999999,41.078844],[-73.985929,41.079682],[-73.986963,41.08111],[-73.987593,41.082044],[-73.98790200000001,41.082516],[-73.988191,41.082998],[-73.98871699999999,41.083975],[-73.989181,41.084947],[-73.989391,41.085424],[-73.989583,41.085894],[-73.989913,41.086843],[-73.990071,41.087324],[-73.990235,41.087878],[-73.990281,41.088091],[-73.990557,41.089368],[-73.990644,41.089903],[-73.990695,41.090303],[-73.990726,41.090652],[-73.990741,41.090783],[-73.99081700000001,41.091362],[-73.990993,41.093256],[-73.991011,41.093462],[-73.991073,41.09421],[-73.99109300000001,41.09467],[-73.991175,41.095586],[-73.99123,41.096034],[-73.991265,41.096318]]],"type":"Polygon"}
}