{
  "id": "360810683002",
  "type": "Feature",
  "properties": {
    "area_land":103013,
    "area_water":0,
    "geoid":"360810683002",
    "name":"Block Group 2",
    "state":"ny"
},
  "bbox": [
    -73.873788,
    40.733294,
    -73.865159,
    40.736643
],
  "geometry": {"coordinates":[[[-73.873059,40.734485],[-73.872257,40.734737],[-73.869702,40.735498],[-73.867546,40.736154],[-73.86583,40.736643],[-73.86550099999999,40.735989],[-73.86515900000001,40.735325],[-73.866851,40.734821],[-73.869175,40.734136],[-73.869995,40.733894],[-73.870225,40.73367],[-73.870335,40.733554],[-73.87039,40.73344],[-73.87048,40.733294],[-73.87194,40.733717],[-73.873788,40.734255],[-73.873059,40.734485]]],"type":"Polygon"}
}