{
  "id": "360470872002",
  "type": "Feature",
  "properties": {
    "area_land":41616,
    "area_water":0,
    "geoid":"360470872002",
    "name":"Block Group 2",
    "state":"ny"
},
  "bbox": [
    -73.938454,
    40.653327,
    -73.935416,
    40.655039
],
  "geometry": {"coordinates":[[[-73.93845399999999,40.654858],[-73.937518,40.654916],[-73.936548,40.654976],[-73.93557800000001,40.655039],[-73.935416,40.653505],[-73.936386,40.653445],[-73.93735599999999,40.653386],[-73.93828999999999,40.653327],[-73.93845399999999,40.654858]]],"type":"Polygon"}
}