{
  "id": "360790102005",
  "type": "Feature",
  "properties": {
    "area_land":12965893,
    "area_water":123973,
    "geoid":"360790102005",
    "name":"Block Group 5",
    "state":"ny"
},
  "bbox": [
    -73.606057,
    41.444309,
    -73.550619,
    41.48456
],
  "geometry": {"coordinates":[[[-73.606009,41.444468],[-73.605907,41.444694],[-73.605783,41.444867],[-73.60566799999999,41.444996],[-73.605137,41.445519],[-73.60479100000001,41.445898],[-73.604623,41.446117],[-73.60457700000001,41.4462],[-73.60447600000001,41.44643],[-73.604399,41.446718],[-73.60437899999999,41.446993],[-73.604404,41.447652],[-73.604463,41.44855],[-73.604457,41.448685],[-73.604454,41.448769],[-73.604403,41.44903],[-73.604297,41.44933],[-73.60411499999999,41.449817],[-73.60408700000001,41.449893],[-73.60389600000001,41.450385],[-73.603809,41.450558],[-73.60365899999999,41.450782],[-73.603077,41.451447],[-73.602948,41.451624],[-73.602763,41.451957],[-73.60234800000001,41.452793],[-73.602281,41.452977],[-73.60222,41.453254],[-73.602007,41.455493],[-73.60200399999999,41.455577],[-73.602009,41.456442],[-73.601986,41.456688],[-73.60195899999999,41.456982],[-73.601899,41.457514],[-73.601916,41.457761],[-73.601989,41.458108],[-73.602401,41.459015],[-73.602712,41.459962],[-73.60275900000001,41.460079],[-73.602853,41.460312],[-73.60338900000001,41.461379],[-73.603677,41.46198],[-73.604009,41.462771],[-73.60432299999999,41.463592],[-73.60455399999999,41.464194],[-73.604775,41.4648],[-73.604916,41.465201],[-73.60502,41.465622],[-73.60507200000001,41.465948],[-73.605071,41.466227],[-73.605008,41.466866],[-73.604885,41.467679],[-73.60485300000001,41.468087],[-73.60486,41.468422],[-73.604904,41.469138],[-73.604884,41.469346],[-73.604829,41.46957],[-73.604732,41.4698],[-73.60457599999999,41.470071],[-73.60441299999999,41.47031],[-73.604229,41.470546],[-73.603904,41.470922],[-73.603677,41.471168],[-73.603111,41.471705],[-73.60293799999999,41.471893],[-73.602805,41.472077],[-73.602738,41.472224],[-73.602709,41.472322],[-73.602675,41.472575],[-73.602672,41.4726],[-73.60265,41.4735],[-73.60270300000001,41.474525],[-73.60277600000001,41.474871],[-73.602862,41.475241],[-73.602887,41.475504],[-73.60278700000001,41.476597],[-73.602701,41.477256],[-73.602683,41.477329],[-73.602181,41.477111],[-73.601579,41.476927],[-73.60009599999999,41.476569],[-73.59965800000001,41.476492],[-73.59951,41.476479],[-73.599244,41.476479],[-73.599058,41.476503],[-73.598878,41.476538],[-73.598663,41.476598],[-73.598418,41.476702],[-73.59826200000001,41.476787],[-73.598125,41.476878],[-73.597881,41.477068],[-73.597347,41.477516],[-73.596597,41.478148],[-73.596295,41.478365],[-73.59607200000001,41.478498],[-73.595812,41.478627],[-73.595367,41.478802],[-73.595152,41.478874],[-73.59447900000001,41.479097],[-73.59415799999999,41.479181],[-73.59381,41.479244],[-73.59356200000001,41.479266],[-73.593125,41.479268],[-73.592934,41.479257],[-73.592721,41.479229],[-73.592507,41.479201],[-73.591965,41.47909],[-73.591566,41.478997],[-73.590915,41.478844],[-73.590441,41.478753],[-73.59013899999999,41.478714],[-73.59004899999999,41.478702],[-73.589792,41.47868],[-73.589315,41.47864],[-73.588086,41.478547],[-73.587096,41.47845],[-73.586808,41.478401],[-73.58639100000001,41.4783],[-73.586172,41.478232],[-73.585691,41.478037],[-73.585381,41.477872],[-73.584948,41.477601],[-73.584665,41.477402],[-73.584025,41.476953],[-73.58358,41.47664],[-73.58352499999999,41.476602],[-73.58335,41.476467],[-73.583142,41.476272],[-73.583099,41.476222],[-73.58299599999999,41.476099],[-73.58281700000001,41.475825],[-73.58269900000001,41.475589],[-73.582601,41.475314],[-73.582553,41.475053],[-73.582548,41.474665],[-73.582533,41.474414],[-73.582489,41.474275],[-73.582396,41.474144],[-73.582289,41.47404],[-73.582145,41.473948],[-73.581824,41.473818],[-73.58139,41.473689],[-73.581193,41.473652],[-73.580958,41.473632],[-73.58082899999999,41.473636],[-73.58059,41.473658],[-73.58068299999999,41.474149],[-73.58072199999999,41.474567],[-73.580714,41.474976],[-73.580651,41.475419],[-73.580552,41.475785],[-73.580412,41.476151],[-73.58030599999999,41.47637],[-73.58007499999999,41.476754],[-73.579897,41.476994],[-73.579656,41.477277],[-73.57881500000001,41.478216],[-73.578034,41.479084],[-73.577614,41.479603],[-73.577371,41.479944],[-73.577288,41.480061],[-73.576609,41.481117],[-73.576033,41.482036],[-73.57589900000001,41.482301],[-73.57579699999999,41.48258],[-73.57572399999999,41.482925],[-73.57570200000001,41.48313],[-73.57571799999999,41.483432],[-73.575771,41.483755],[-73.57582499999999,41.483959],[-73.575901,41.484241],[-73.575311,41.48435],[-73.575219,41.484365],[-73.57513899999999,41.484377],[-73.57481300000001,41.484421],[-73.574714,41.484431],[-73.574639,41.484434],[-73.574578,41.484432],[-73.57446,41.484428],[-73.57443600000001,41.484427],[-73.574251,41.484397],[-73.573848,41.484298],[-73.573409,41.484171],[-73.573145,41.484123],[-73.57294400000001,41.484108],[-73.572755,41.484114],[-73.572461,41.484156],[-73.572244,41.484213],[-73.57168299999999,41.484408],[-73.571343,41.484494],[-73.57089000000001,41.48456],[-73.57066500000001,41.484227],[-73.570171,41.483487],[-73.569652,41.482697],[-73.56910999999999,41.481696],[-73.56887500000001,41.481218],[-73.568782,41.480986],[-73.56868799999999,41.480667],[-73.568513,41.479742],[-73.5684,41.478933],[-73.568405,41.47888],[-73.568416,41.478746],[-73.568511,41.478351],[-73.568544,41.478119],[-73.56853099999999,41.477972],[-73.56849099999999,41.477822],[-73.567548,41.475363],[-73.567408,41.47505],[-73.567125,41.474562],[-73.566824,41.474086],[-73.56619999999999,41.473075],[-73.56595900000001,41.472666],[-73.565726,41.472221],[-73.56535599999999,41.4714],[-73.56523900000001,41.47114],[-73.56517100000001,41.470989],[-73.56479,41.470146],[-73.564622,41.469775],[-73.564425,41.4693],[-73.564336,41.46895],[-73.564227,41.468052],[-73.564145,41.467742],[-73.563895,41.46717],[-73.563737,41.466867],[-73.563564,41.466623],[-73.563399,41.466449],[-73.563142,41.466243],[-73.56295900000001,41.466132],[-73.562905,41.4661],[-73.562602,41.465957],[-73.56143299999999,41.465519],[-73.56092099999999,41.465291],[-73.56051100000001,41.465069],[-73.55987399999999,41.464685],[-73.55945,41.464345],[-73.558837,41.463754],[-73.558308,41.463319],[-73.5582,41.463203],[-73.558138,41.463126],[-73.558036,41.462969],[-73.557936,41.462731],[-73.55788200000001,41.462508],[-73.557796,41.461901],[-73.557782,41.461815],[-73.557714,41.461392],[-73.557649,41.460984],[-73.557565,41.460731],[-73.557551,41.460689],[-73.557495,41.460587],[-73.557469,41.460549],[-73.557374,41.460413],[-73.55723500000001,41.460257],[-73.557203,41.460228],[-73.55704299999999,41.460084],[-73.55686900000001,41.459951],[-73.556803,41.459902],[-73.556665,41.459797],[-73.55654800000001,41.459708],[-73.556129,41.459384],[-73.555424,41.458762],[-73.55516799999999,41.458564],[-73.554991,41.458469],[-73.554835,41.458411],[-73.554585,41.458365],[-73.554377,41.458362],[-73.554019,41.458406],[-73.55353599999999,41.458489],[-73.553313,41.458528],[-73.55314799999999,41.45858],[-73.55297299999999,41.458444],[-73.55268,41.45826],[-73.552559,41.458158],[-73.552457,41.458027],[-73.55237099999999,41.457831],[-73.55234400000001,41.457707],[-73.552352,41.457571],[-73.55251,41.456685],[-73.55259100000001,41.45624],[-73.552831,41.45493],[-73.55284899999999,41.454834],[-73.55305300000001,41.45376],[-73.55328900000001,41.452694],[-73.553033,41.452631],[-73.552888,41.45257],[-73.552829,41.452528],[-73.552792,41.452493],[-73.552717,41.452374],[-73.552618,41.452083],[-73.552526,41.451788],[-73.552447,41.451621],[-73.55230400000001,41.451414],[-73.55209000000001,41.451189],[-73.55164499999999,41.450778],[-73.550922,41.450125],[-73.550758,41.449958],[-73.550619,41.449785],[-73.554984,41.449365],[-73.557497,41.449179],[-73.574555,41.447491],[-73.57497100000001,41.447465],[-73.575408,41.447409],[-73.576273,41.447334],[-73.581253,41.446766],[-73.59105,41.445792],[-73.59166999999999,41.44573],[-73.592291,41.445669],[-73.59678599999999,41.445223],[-73.60605700000001,41.444309],[-73.606009,41.444468]]],"type":"Polygon"}
}