{
  "id": "360550111001",
  "type": "Feature",
  "properties": {
    "area_land":332763,
    "area_water":0,
    "geoid":"360550111001",
    "name":"Block Group 1",
    "state":"ny"
},
  "bbox": [
    -77.552128,
    43.170084,
    -77.540464,
    43.176859
],
  "geometry": {"coordinates":[[[-77.551849,43.170862],[-77.55156599999999,43.17168],[-77.551264,43.172514],[-77.54822,43.172607],[-77.544661,43.172731],[-77.54471700000001,43.173539],[-77.544774,43.174315],[-77.544822,43.175112],[-77.543705,43.175149],[-77.54375899999999,43.175944],[-77.54486900000001,43.175907],[-77.544921,43.176792],[-77.543589,43.176824],[-77.543566,43.176825],[-77.543116,43.176838],[-77.54282000000001,43.176847],[-77.542779,43.176849],[-77.54275800000001,43.17685],[-77.542545,43.176859],[-77.54251499999999,43.17662],[-77.542446,43.176314],[-77.542357,43.176078],[-77.542207,43.175697],[-77.542153,43.17557],[-77.542137,43.175532],[-77.5419,43.174955],[-77.541737,43.174639],[-77.541511,43.174266],[-77.541355,43.174048],[-77.54127699999999,43.173939],[-77.540464,43.172956],[-77.54055099999999,43.172806],[-77.540961,43.172033],[-77.541403,43.171208],[-77.54182900000001,43.170425],[-77.544515,43.170344],[-77.548069,43.17022],[-77.552128,43.170084],[-77.551849,43.170862]]],"type":"Polygon"}
}