{
  "id": "360811377004",
  "type": "Feature",
  "properties": {
    "area_land":136503,
    "area_water":0,
    "geoid":"360811377004",
    "name":"Block Group 4",
    "state":"ny"
},
  "bbox": [
    -73.753978,
    40.742405,
    -73.744776,
    40.745716
],
  "geometry": {"coordinates":[[[-73.753978,40.743518],[-73.75308,40.743762],[-73.75219300000001,40.744002],[-73.751316,40.744243],[-73.750434,40.744487],[-73.749543,40.744732],[-73.748631,40.744979],[-73.747713,40.745232],[-73.74682900000001,40.745471],[-73.745931,40.745716],[-73.744776,40.743281],[-73.745695,40.743029],[-73.74672,40.743124],[-73.747849,40.743296],[-73.74887699999999,40.743288],[-73.749798,40.743142],[-73.750728,40.742998],[-73.751633,40.742807],[-73.752533,40.742611],[-73.753473,40.742405],[-73.753978,40.743518]]],"type":"Polygon"}
}