{
  "id": "360239705001",
  "type": "Feature",
  "properties": {
    "area_land":1253887,
    "area_water":51890,
    "geoid":"360239705001",
    "name":"Block Group 1",
    "state":"ny"
},
  "bbox": [
    -76.16721,
    42.59823,
    -76.154685,
    42.614509
],
  "geometry": {"coordinates":[[[-76.16721,42.606133],[-76.16716099999999,42.606605],[-76.16714,42.606722],[-76.16711599999999,42.60685],[-76.16691299999999,42.60759],[-76.166889,42.60768],[-76.166877,42.607724],[-76.166861,42.607784],[-76.166825,42.607915],[-76.166596,42.608703],[-76.16656500000001,42.608816],[-76.16646,42.609133],[-76.166355,42.609381],[-76.16627699999999,42.609545],[-76.16622700000001,42.609644],[-76.16606899999999,42.609916],[-76.165774,42.61037],[-76.165717,42.610458],[-76.16588900000001,42.610542],[-76.165904,42.610549],[-76.166031,42.610631],[-76.166101,42.610693],[-76.166175,42.610777],[-76.16621499999999,42.610852],[-76.166218,42.610864],[-76.16625999999999,42.611049],[-76.166275,42.611193],[-76.166483,42.613676],[-76.166507,42.61396],[-76.166509,42.613991],[-76.163223,42.614137],[-76.154685,42.614509],[-76.154734,42.614434],[-76.154843,42.614266],[-76.154995,42.614128],[-76.15511600000001,42.614037],[-76.155444,42.613803],[-76.155771,42.613372],[-76.155901,42.61322],[-76.156075,42.613075],[-76.156143,42.612986],[-76.156198,42.612902],[-76.15621899999999,42.612757],[-76.156183,42.612605],[-76.156002,42.612244],[-76.15593699999999,42.611954],[-76.15593699999999,42.611716],[-76.155959,42.611576],[-76.15620699999999,42.610929],[-76.156351,42.610488],[-76.156469,42.610178],[-76.156684,42.609613],[-76.15697400000001,42.609071],[-76.15712600000001,42.608825],[-76.157394,42.608485],[-76.15764,42.608153],[-76.157813,42.607813],[-76.157858,42.607664],[-76.157887,42.607569],[-76.157927,42.607372],[-76.157931,42.607348],[-76.157956,42.607225],[-76.15799800000001,42.607016],[-76.15801399999999,42.606936],[-76.15810399999999,42.606629],[-76.15828500000001,42.606029],[-76.15835800000001,42.605723],[-76.158444,42.605359],[-76.158638,42.604888],[-76.15876299999999,42.604612],[-76.15886,42.604225],[-76.158901,42.603879],[-76.158901,42.603436],[-76.158929,42.602897],[-76.158929,42.602641],[-76.158929,42.601887],[-76.15891499999999,42.601376],[-76.158863,42.601037],[-76.158855,42.600984],[-76.15885,42.600954],[-76.158818,42.600739],[-76.158597,42.599595],[-76.158404,42.598793],[-76.158242,42.598402],[-76.15886,42.598497],[-76.15914100000001,42.598529],[-76.161141,42.598461],[-76.162171,42.598418],[-76.163331,42.59837],[-76.164199,42.598334],[-76.164575,42.598318],[-76.16463899999999,42.598316],[-76.165189,42.598292],[-76.166128,42.598251],[-76.16666600000001,42.59823],[-76.16671599999999,42.59904],[-76.166725,42.599175],[-76.166764,42.599778],[-76.16682400000001,42.60064],[-76.166948,42.602307],[-76.16706600000001,42.603872],[-76.167177,42.605401],[-76.167209,42.605919],[-76.16721,42.606133]]],"type":"Polygon"}
}