{
  "id": "361031698002",
  "type": "Feature",
  "properties": {
    "area_land":697723,
    "area_water":66571,
    "geoid":"361031698002",
    "name":"Block Group 2",
    "state":"ny"
},
  "bbox": [
    -72.674296,
    40.920132,
    -72.657755,
    40.934392
],
  "geometry": {"coordinates":[[[-72.674296,40.933015],[-72.67353300000001,40.933373],[-72.67264299999999,40.933724],[-72.672141,40.933911],[-72.67172100000001,40.934024],[-72.671396,40.9341],[-72.670682,40.934236],[-72.67016700000001,40.934311],[-72.66928,40.934392],[-72.666496,40.931149],[-72.665327,40.929763],[-72.664734,40.928617],[-72.66431,40.928169],[-72.662165,40.925895],[-72.661646,40.925309],[-72.661215,40.924794],[-72.660692,40.924167],[-72.65833499999999,40.921299],[-72.65775499999999,40.92056],[-72.659153,40.920448],[-72.660115,40.920361],[-72.66121,40.920281],[-72.663715,40.920132],[-72.663853,40.92032],[-72.664846,40.921608],[-72.665471,40.9224],[-72.665959,40.923007],[-72.66634999999999,40.923475],[-72.666417,40.92356],[-72.66690800000001,40.92419],[-72.66719999999999,40.924565],[-72.66800600000001,40.925604],[-72.669242,40.927146],[-72.669523,40.927497],[-72.669663,40.927674],[-72.670191,40.928348],[-72.670896,40.929222],[-72.671538,40.930037],[-72.672196,40.930854],[-72.672526,40.931265],[-72.672843,40.931691],[-72.673692,40.932778],[-72.67392100000001,40.932913],[-72.67407799999999,40.932962],[-72.674296,40.933015]]],"type":"Polygon"}
}