{
  "id": "361190013023",
  "type": "Feature",
  "properties": {
    "area_land":144410,
    "area_water":0,
    "geoid":"361190013023",
    "name":"Block Group 3",
    "state":"ny"
},
  "bbox": [
    -73.891202,
    40.909746,
    -73.885314,
    40.914499
],
  "geometry": {"coordinates":[[[-73.89120200000001,40.912393],[-73.88969,40.912736],[-73.88967,40.913458],[-73.889658,40.913638],[-73.889067,40.913439],[-73.888841,40.913722],[-73.88869200000001,40.913883],[-73.88844899999999,40.914055],[-73.888049,40.914388],[-73.887946,40.914459],[-73.887809,40.914499],[-73.88709299999999,40.914376],[-73.886201,40.914197],[-73.88605800000001,40.914156],[-73.88599499999999,40.914114],[-73.885949,40.91405],[-73.885693,40.913272],[-73.88561,40.912626],[-73.885615,40.912521],[-73.885597,40.912458],[-73.885526,40.91238],[-73.88541600000001,40.912302],[-73.885345,40.912221],[-73.88533,40.912175],[-73.88531399999999,40.912129],[-73.885324,40.912058],[-73.885441,40.911869],[-73.885501,40.911772],[-73.885548,40.911662],[-73.88575400000001,40.911354],[-73.88585399999999,40.911183],[-73.88588900000001,40.91113],[-73.886742,40.911433],[-73.886762,40.911367],[-73.886769,40.911243],[-73.886804,40.911105],[-73.886843,40.911031],[-73.88691,40.910978],[-73.88721099999999,40.910886],[-73.88733499999999,40.910781],[-73.88741,40.910709],[-73.887867,40.910192],[-73.887925,40.910158],[-73.88798,40.910153],[-73.888143,40.910203],[-73.888271,40.910263],[-73.888322,40.910314],[-73.888519,40.909969],[-73.888621,40.909885],[-73.889009,40.909746],[-73.889286,40.910184],[-73.88991300000001,40.911066],[-73.890124,40.911409],[-73.89016599999999,40.911519],[-73.890171,40.911594],[-73.89120200000001,40.912393]]],"type":"Polygon"}
}