{
  "id": "360810243003",
  "type": "Feature",
  "properties": {
    "area_land":118859,
    "area_water":0,
    "geoid":"360810243003",
    "name":"Block Group 3",
    "state":"ny"
},
  "bbox": [
    -73.901943,
    40.733908,
    -73.895956,
    40.737057
],
  "geometry": {"coordinates":[[[-73.901894,40.735661],[-73.901839,40.737057],[-73.900901,40.737037],[-73.899925,40.737012],[-73.89895199999999,40.736992],[-73.897761,40.736966],[-73.89684,40.736945],[-73.895956,40.736925],[-73.89597500000001,40.736441],[-73.896016,40.735239],[-73.896029,40.735018],[-73.896511,40.735097],[-73.896912,40.735087],[-73.89783199999999,40.73516],[-73.899022,40.735149],[-73.90000999999999,40.73485],[-73.900115,40.734813],[-73.90027000000001,40.734741],[-73.900372,40.734681],[-73.900497,40.73459],[-73.90061799999999,40.734476],[-73.900711,40.734359],[-73.90107999999999,40.733908],[-73.901943,40.73434],[-73.901894,40.735661]]],"type":"Polygon"}
}