{
  "id": "360810934023",
  "type": "Feature",
  "properties": {
    "area_land":195025,
    "area_water":0,
    "geoid":"360810934023",
    "name":"Block Group 3",
    "state":"ny"
},
  "bbox": [
    -73.846179,
    40.577856,
    -73.8372,
    40.582629
],
  "geometry": {"coordinates":[[[-73.84614999999999,40.581753],[-73.845181,40.581581],[-73.844922,40.581592],[-73.844176,40.581625],[-73.843154,40.58167],[-73.84230599999999,40.581707],[-73.84225000000001,40.58171],[-73.8413,40.581758],[-73.840333,40.581808],[-73.839354,40.581857],[-73.839296,40.581864],[-73.83926599999999,40.581993],[-73.83921599999999,40.582072],[-73.83916600000001,40.582173],[-73.839097,40.582291],[-73.839045,40.58237],[-73.839023,40.58242],[-73.838972,40.582485],[-73.83891800000001,40.582535],[-73.838888,40.582574],[-73.838829,40.582594],[-73.838752,40.582629],[-73.83829799999999,40.581766],[-73.838182,40.581506],[-73.837515,40.580355],[-73.8372,40.579812],[-73.838105,40.579511],[-73.83893,40.579235],[-73.839753,40.578959],[-73.840575,40.578677],[-73.84138400000001,40.578422],[-73.842224,40.578132],[-73.84304899999999,40.577856],[-73.844005,40.579514],[-73.84508599999999,40.581402],[-73.84504699999999,40.58146],[-73.84617900000001,40.581663],[-73.84614999999999,40.581753]]],"type":"Polygon"}
}