{
  "id": "361019613003",
  "type": "Feature",
  "properties": {
    "area_land":43970037,
    "area_water":388214,
    "geoid":"361019613003",
    "name":"Block Group 3",
    "state":"ny"
},
  "bbox": [
    -77.343386,
    42.272468,
    -77.219968,
    42.332391
],
  "geometry": {"coordinates":[[[-77.343386,42.31935],[-77.343363,42.319534],[-77.343323,42.319679],[-77.34324700000001,42.319877],[-77.34316099999999,42.320025],[-77.342972,42.32029],[-77.34287399999999,42.32041],[-77.341711,42.321827],[-77.341536,42.32201],[-77.34087,42.322571],[-77.340627,42.322763],[-77.339725,42.323546],[-77.339467,42.323758],[-77.33927799999999,42.323927],[-77.33901400000001,42.324163],[-77.33861,42.324587],[-77.338483,42.324748],[-77.338133,42.325131],[-77.337588,42.325761],[-77.337142,42.326228],[-77.336984,42.326388],[-77.33631099999999,42.326949],[-77.336007,42.32718],[-77.335883,42.327258],[-77.335543,42.327426],[-77.335098,42.327612],[-77.33495600000001,42.327663],[-77.334883,42.32769],[-77.33456099999999,42.327767],[-77.33448300000001,42.327785],[-77.333476,42.327948],[-77.333195,42.327994],[-77.332643,42.328106],[-77.33232700000001,42.328211],[-77.33144799999999,42.32863],[-77.33109899999999,42.328794],[-77.33056500000001,42.329016],[-77.33040699999999,42.329073],[-77.330152,42.329157],[-77.329978,42.329219],[-77.32928800000001,42.329432],[-77.327806,42.329908],[-77.32775100000001,42.329932],[-77.32753,42.33003],[-77.32725499999999,42.330184],[-77.326835,42.330476],[-77.326745,42.330547],[-77.326646,42.330626],[-77.325892,42.331215],[-77.325458,42.331568],[-77.32531,42.331688],[-77.32502100000001,42.331899],[-77.32484700000001,42.332026],[-77.32475599999999,42.332079],[-77.324482,42.332221],[-77.32423,42.332313],[-77.32398000000001,42.332391],[-77.320345,42.33087],[-77.319497,42.33053],[-77.31925,42.330434],[-77.318839,42.330275],[-77.316951,42.329502],[-77.316872,42.32947],[-77.316177,42.329183],[-77.315459,42.328891],[-77.314807,42.328614],[-77.313557,42.328108],[-77.312467,42.327658],[-77.311063,42.327064],[-77.310818,42.326951],[-77.310214,42.326728],[-77.310034,42.326672],[-77.30978899999999,42.326611],[-77.309612,42.32658],[-77.309417,42.326558],[-77.309219,42.326548],[-77.309028,42.326551],[-77.308634,42.326583],[-77.308443,42.326615],[-77.30813499999999,42.326696],[-77.30756100000001,42.326912],[-77.30741500000001,42.326992],[-77.30721,42.327125],[-77.307008,42.327298],[-77.306838,42.327489],[-77.306662,42.327737],[-77.304716,42.330944],[-77.30457,42.33089],[-77.303889,42.330636],[-77.302164,42.329998],[-77.301419,42.329724],[-77.297541,42.328293],[-77.29744700000001,42.328257],[-77.296717,42.327938],[-77.29577399999999,42.327458],[-77.29471599999999,42.326922],[-77.294284,42.326724],[-77.29340500000001,42.326395],[-77.29275,42.326175],[-77.29242000000001,42.32609],[-77.291974,42.326019],[-77.291624,42.325971],[-77.291251,42.32592],[-77.29039400000001,42.325828],[-77.289137,42.325677],[-77.28751,42.325482],[-77.28713500000001,42.3254],[-77.28674100000001,42.325284],[-77.286593,42.325227],[-77.286214,42.325068],[-77.28585099999999,42.324882],[-77.28549,42.325063],[-77.28534999999999,42.325124],[-77.28510900000001,42.325185],[-77.28500099999999,42.325186],[-77.284915,42.325186],[-77.284656,42.325163],[-77.284132,42.325075],[-77.283388,42.324923],[-77.282963,42.324816],[-77.28250199999999,42.324685],[-77.282003,42.324521],[-77.279901,42.323752],[-77.279325,42.323537],[-77.278161,42.323106],[-77.277846,42.32299],[-77.276304,42.322418],[-77.27620400000001,42.322381],[-77.272504,42.321015],[-77.271129,42.32051],[-77.27058,42.320336],[-77.269758,42.320128],[-77.268635,42.319873],[-77.265686,42.319225],[-77.26291399999999,42.318616],[-77.26173799999999,42.318336],[-77.261235,42.318191],[-77.26062899999999,42.317982],[-77.260296,42.317851],[-77.25967900000001,42.317579],[-77.259407,42.317444],[-77.259227,42.317344],[-77.258606,42.316998],[-77.256456,42.315736],[-77.256058,42.315502],[-77.255326,42.315066],[-77.254655,42.314629],[-77.254103,42.31422],[-77.253604,42.313784],[-77.253456,42.313636],[-77.253034,42.3132],[-77.251064,42.310879],[-77.25054900000001,42.310235],[-77.248954,42.308346],[-77.248065,42.307327],[-77.247783,42.306968],[-77.247922,42.306544],[-77.247637,42.306782],[-77.247544,42.306646],[-77.24744699999999,42.306496],[-77.246994,42.305675],[-77.246943,42.305561],[-77.24662499999999,42.304857],[-77.24654,42.304709],[-77.246207,42.304163],[-77.245942,42.303799],[-77.245665,42.303452],[-77.245453,42.303211],[-77.245013,42.302776],[-77.244422,42.302277],[-77.243983,42.301962],[-77.243421,42.301586],[-77.242028,42.300654],[-77.241302,42.300167],[-77.24114400000001,42.300061],[-77.239836,42.299185],[-77.236341,42.296843],[-77.23526099999999,42.296132],[-77.234953,42.295947],[-77.234315,42.295583],[-77.23373100000001,42.295289],[-77.233295,42.295091],[-77.23268899999999,42.29484],[-77.230316,42.29394],[-77.22946899999999,42.293643],[-77.228803,42.29342],[-77.227859,42.293138],[-77.227411,42.293009],[-77.22629499999999,42.292726],[-77.224727,42.29237],[-77.223648,42.292116],[-77.22332,42.292037],[-77.22280499999999,42.291884],[-77.22244000000001,42.291774],[-77.22182100000001,42.291551],[-77.221541,42.291434],[-77.221119,42.291232],[-77.220664,42.290973],[-77.220355,42.290751],[-77.220085,42.290517],[-77.21996799999999,42.2904],[-77.22010299999999,42.290162],[-77.220225,42.29004],[-77.22053099999999,42.289809],[-77.220975,42.289525],[-77.221124,42.289399],[-77.22135,42.28914],[-77.221673,42.289164],[-77.22206,42.289167],[-77.22284399999999,42.289114],[-77.222989,42.289102],[-77.223457,42.289067],[-77.22372300000001,42.289051],[-77.224147,42.289014],[-77.22497,42.288949],[-77.225818,42.288884],[-77.22635200000001,42.288845],[-77.22731,42.288776],[-77.23027399999999,42.288663],[-77.23054999999999,42.288659],[-77.230912,42.288655],[-77.231459,42.288624],[-77.231864,42.288601],[-77.232327,42.288604],[-77.234751,42.288517],[-77.234999,42.288498],[-77.235303,42.288455],[-77.235721,42.288367],[-77.237302,42.287995],[-77.23766500000001,42.287907],[-77.237838,42.287864],[-77.237982,42.287827],[-77.23805900000001,42.287809],[-77.23864,42.287674],[-77.238737,42.287651],[-77.23917400000001,42.287555],[-77.239589,42.287489],[-77.240453,42.287369],[-77.240898,42.287329],[-77.241204,42.287318],[-77.24269200000001,42.2873],[-77.242853,42.287284],[-77.242947,42.287274],[-77.243089,42.287242],[-77.243188,42.287209],[-77.243312,42.28715],[-77.243425,42.287067],[-77.243567,42.286939],[-77.24365400000001,42.286834],[-77.243786,42.28664],[-77.243848,42.286498],[-77.243877,42.286316],[-77.243848,42.286025],[-77.24368,42.285358],[-77.243636,42.285027],[-77.243622,42.284615],[-77.24363200000001,42.28436],[-77.243672,42.284134],[-77.243807,42.28373],[-77.244176,42.282786],[-77.24428899999999,42.282534],[-77.24439099999999,42.282334],[-77.244482,42.282199],[-77.244664,42.281981],[-77.244792,42.281864],[-77.244894,42.281788],[-77.245007,42.281719],[-77.245127,42.281664],[-77.245262,42.281617],[-77.245696,42.281504],[-77.247122,42.281269],[-77.24796499999999,42.281161],[-77.24854499999999,42.281133],[-77.248705,42.281138],[-77.248963,42.281176],[-77.249184,42.281223],[-77.25000300000001,42.281431],[-77.251212,42.281712],[-77.251409,42.281744],[-77.251718,42.28177],[-77.252976,42.281788],[-77.25373500000001,42.281777],[-77.254887,42.281704],[-77.25547,42.281682],[-77.256871,42.28167],[-77.258088,42.281661],[-77.258627,42.281668],[-77.25964399999999,42.281657],[-77.260257,42.281675],[-77.261128,42.281646],[-77.26163099999999,42.281642],[-77.262331,42.281661],[-77.262568,42.281697],[-77.263119,42.281828],[-77.26451900000001,42.282105],[-77.266221,42.282396],[-77.266367,42.282411],[-77.267475,42.282447],[-77.26813199999999,42.282429],[-77.268456,42.282389],[-77.26993299999999,42.282163],[-77.271145,42.28196],[-77.271518,42.281897],[-77.273287,42.281591],[-77.27353100000001,42.281522],[-77.27367700000001,42.281456],[-77.273819,42.281362],[-77.27395,42.281253],[-77.274152,42.281045],[-77.27433600000001,42.280816],[-77.274455,42.280632],[-77.274727,42.280169],[-77.27551,42.278772],[-77.276071,42.277783],[-77.27720600000001,42.275647],[-77.277897,42.274243],[-77.278727,42.272476],[-77.27988999999999,42.272468],[-77.28112,42.272476],[-77.281837,42.272473],[-77.28302499999999,42.272486],[-77.28514800000001,42.272468],[-77.293609,42.272555],[-77.293859,42.272555],[-77.295845,42.272528],[-77.29862300000001,42.272559],[-77.300923,42.272549],[-77.301501,42.272556],[-77.30440400000001,42.27257],[-77.30716,42.27257],[-77.325293,42.272666],[-77.34157399999999,42.272753],[-77.341555,42.276091],[-77.341492,42.280321],[-77.34148399999999,42.280857],[-77.341447,42.28451],[-77.34144000000001,42.285161],[-77.341444,42.288993],[-77.34139999999999,42.291529],[-77.34138799999999,42.292283],[-77.341336,42.295777],[-77.341362,42.29797],[-77.34132700000001,42.300174],[-77.341275,42.301299],[-77.341256,42.301446],[-77.34119800000001,42.301646],[-77.341109,42.301834],[-77.341052,42.301934],[-77.34066300000001,42.302476],[-77.340524,42.302715],[-77.340473,42.30282],[-77.34043800000001,42.303062],[-77.340442,42.303313],[-77.340456,42.303474],[-77.340493,42.303645],[-77.34054,42.30378],[-77.34061699999999,42.303922],[-77.340985,42.304388],[-77.341116,42.304596],[-77.341145,42.304683],[-77.34117500000001,42.30484],[-77.341204,42.305131],[-77.34121500000001,42.305707],[-77.34119800000001,42.307175],[-77.341195,42.307361],[-77.34113000000001,42.310354],[-77.341123,42.310643],[-77.341105,42.311109],[-77.34104499999999,42.312429],[-77.341036,42.312789],[-77.34103399999999,42.313209],[-77.341069,42.313475],[-77.341104,42.313644],[-77.341157,42.313817],[-77.3413,42.314129],[-77.34143299999999,42.314346],[-77.34157500000001,42.314542],[-77.34209300000001,42.315106],[-77.342482,42.315644],[-77.342699,42.316054],[-77.34283000000001,42.316461],[-77.34294199999999,42.317015],[-77.342996,42.317165],[-77.34303199999999,42.317222],[-77.343082,42.317258],[-77.343143,42.31773],[-77.343346,42.318786],[-77.34336999999999,42.318964],[-77.343386,42.319154],[-77.343386,42.31935]]],"type":"Polygon"}
}