{
  "id": "360810775003",
  "type": "Feature",
  "properties": {
    "area_land":67908,
    "area_water":0,
    "geoid":"360810775003",
    "name":"Block Group 3",
    "state":"ny"
},
  "bbox": [
    -73.832041,
    40.709023,
    -73.827722,
    40.712423
],
  "geometry": {"coordinates":[[[-73.831372,40.711109],[-73.829314,40.712423],[-73.82913000000001,40.712154],[-73.82889900000001,40.711757],[-73.828728,40.711506],[-73.82836,40.711129],[-73.82809899999999,40.710946],[-73.82778500000001,40.71066],[-73.82772199999999,40.710603],[-73.828963,40.709812],[-73.82968700000001,40.709348],[-73.83019400000001,40.709023],[-73.831019,40.709687],[-73.832041,40.710678],[-73.831372,40.711109]]],"type":"Polygon"}
}