{
  "id": "360670048002",
  "type": "Feature",
  "properties": {
    "area_land":890486,
    "area_water":0,
    "geoid":"360670048002",
    "name":"Block Group 2",
    "state":"ny"
},
  "bbox": [
    -76.203578,
    43.02246,
    -76.185305,
    43.036452
],
  "geometry": {"coordinates":[[[-76.203316,43.026739],[-76.202882,43.02675],[-76.20186699999999,43.026772],[-76.201363,43.02682],[-76.200996,43.027268],[-76.199629,43.027367],[-76.199556,43.028164],[-76.19918199999999,43.028165],[-76.198654,43.028192],[-76.19776400000001,43.028258],[-76.196939,43.028359],[-76.19674000000001,43.028393],[-76.19654800000001,43.027066],[-76.19544999999999,43.026948],[-76.195553,43.028609],[-76.195626,43.02971],[-76.195694,43.030599],[-76.195674,43.030656],[-76.19559700000001,43.03068],[-76.195359,43.03164],[-76.195251,43.032085],[-76.194176,43.032117],[-76.193641,43.032326],[-76.192898,43.032606],[-76.192688,43.032676],[-76.18793700000001,43.032561],[-76.18825,43.033457],[-76.18941599999999,43.035685],[-76.18953399999999,43.035913],[-76.189223,43.036386],[-76.188901,43.036435],[-76.188633,43.036452],[-76.188311,43.036445],[-76.18812,43.036426],[-76.188193,43.03622],[-76.188247,43.035951],[-76.18824499999999,43.035748],[-76.18823,43.035672],[-76.18809,43.035291],[-76.18739100000001,43.033464],[-76.18687199999999,43.032102],[-76.186846,43.032049],[-76.186971,43.031998],[-76.18841399999999,43.031274],[-76.188372,43.03089],[-76.188171,43.028157],[-76.188113,43.027262],[-76.188121,43.026844],[-76.187674,43.026715],[-76.186809,43.026405],[-76.186082,43.02614],[-76.185305,43.025877],[-76.193915,43.025385],[-76.194568,43.02246],[-76.198008,43.022461],[-76.19822000000001,43.022836],[-76.19974000000001,43.022858],[-76.199933,43.022642],[-76.20116,43.023635],[-76.202235,43.02265],[-76.203147,43.022471],[-76.20312,43.023083],[-76.20357799999999,43.024135],[-76.203316,43.026739]]],"type":"Polygon"}
}