{
  "id": "360710119001",
  "type": "Feature",
  "properties": {
    "area_land":30477728,
    "area_water":128995,
    "geoid":"360710119001",
    "name":"Block Group 1",
    "state":"ny"
},
  "bbox": [
    -74.400025,
    41.38613,
    -74.251223,
    41.434706
],
  "geometry": {"coordinates":[[[-74.399907,41.405598],[-74.399659,41.40573],[-74.399327,41.405881],[-74.39894099999999,41.405998],[-74.398584,41.406077],[-74.39793299999999,41.406181],[-74.397592,41.406241],[-74.39729800000001,41.406313],[-74.39700000000001,41.406467],[-74.39684099999999,41.406565],[-74.396135,41.40711],[-74.395635,41.407636],[-74.395433,41.407829],[-74.39503000000001,41.408241],[-74.394959,41.408355],[-74.39490000000001,41.408515],[-74.39487099999999,41.408774],[-74.394812,41.409713],[-74.394774,41.40988],[-74.394744,41.409949],[-74.394408,41.410377],[-74.39430299999999,41.410481],[-74.39425300000001,41.41051],[-74.39410599999999,41.410551],[-74.39369000000001,41.410626],[-74.39358900000001,41.410658],[-74.393451,41.410734],[-74.393224,41.410957],[-74.39311499999999,41.411055],[-74.393039,41.411099],[-74.39284600000001,41.411143],[-74.392702,41.4112],[-74.392554,41.411298],[-74.392465,41.411394],[-74.39227700000001,41.411719],[-74.39217499999999,41.411854],[-74.391702,41.412304],[-74.391617,41.412353],[-74.39153899999999,41.412371],[-74.391233,41.412403],[-74.391042,41.412424],[-74.39098799999999,41.412418],[-74.390913,41.412383],[-74.39081299999999,41.412325],[-74.390576,41.412263],[-74.390445,41.412234],[-74.39036400000001,41.41223],[-74.38996299999999,41.412372],[-74.389825,41.412407],[-74.389719,41.412415],[-74.389528,41.412411],[-74.389134,41.412386],[-74.388929,41.412362],[-74.388679,41.412298],[-74.388403,41.412202],[-74.38829,41.412177],[-74.388233,41.412174],[-74.38818999999999,41.412188],[-74.388063,41.412291],[-74.387967,41.41233],[-74.38783599999999,41.41233],[-74.38771199999999,41.412312],[-74.38761700000001,41.412319],[-74.38639999999999,41.412832],[-74.385875,41.413119],[-74.385583,41.41326],[-74.38484699999999,41.414089],[-74.38428999999999,41.414278],[-74.383156,41.414473],[-74.382407,41.41451],[-74.382046,41.414528],[-74.381883,41.414523],[-74.381732,41.414518],[-74.381511,41.414501],[-74.38120000000001,41.41447],[-74.380651,41.414257],[-74.380606,41.414251],[-74.38026600000001,41.414175],[-74.380185,41.414186],[-74.38007500000001,41.414218],[-74.379554,41.41443],[-74.37942,41.414444],[-74.37929200000001,41.414444],[-74.378895,41.414352],[-74.37881400000001,41.414349],[-74.37875,41.414359],[-74.37867199999999,41.414398],[-74.37863299999999,41.414462],[-74.378612,41.414572],[-74.378559,41.414944],[-74.378483,41.415009],[-74.37834599999999,41.41505],[-74.378229,41.415128],[-74.378159,41.415188],[-74.378095,41.415223],[-74.37800300000001,41.415251],[-74.377852,41.415276],[-74.37767100000001,41.415266],[-74.377257,41.415201],[-74.376925,41.415738],[-74.37673100000001,41.416142],[-74.37669200000001,41.416248],[-74.376677,41.416414],[-74.376734,41.416874],[-74.376723,41.417044],[-74.376677,41.417189],[-74.37652,41.417561],[-74.376346,41.41783],[-74.376187,41.418025],[-74.375731,41.41851],[-74.375523,41.418754],[-74.375317,41.419016],[-74.37497999999999,41.419491],[-74.374953,41.419563],[-74.374914,41.419741],[-74.37484600000001,41.420175],[-74.37481699999999,41.420319],[-74.374757,41.42044],[-74.374751,41.420485],[-74.37475999999999,41.420636],[-74.374617,41.420673],[-74.37446799999999,41.420783],[-74.37413599999999,41.42114],[-74.374081,41.421148],[-74.374043,41.421176],[-74.374038,41.421234],[-74.374043,41.421288],[-74.373977,41.421348],[-74.373946,41.421352],[-74.37391599999999,41.421336],[-74.37386600000001,41.421354],[-74.373833,41.421399],[-74.373749,41.421602],[-74.373694,41.42179],[-74.373656,41.422104],[-74.37366400000001,41.422481],[-74.373681,41.422666],[-74.373698,41.422859],[-74.373698,41.422986],[-74.373711,41.423085],[-74.373761,41.423132],[-74.37375,41.423225],[-74.373777,41.423691],[-74.373828,41.423834],[-74.373886,41.424337],[-74.373878,41.42446],[-74.373881,41.424513],[-74.373912,41.424544],[-74.37394399999999,41.4246],[-74.373987,41.424619],[-74.374,41.424655],[-74.37396,41.424737],[-74.37401300000001,41.424871],[-74.374019,41.424989],[-74.37401,41.42503],[-74.374026,41.425097],[-74.37410300000001,41.425154],[-74.374139,41.425309],[-74.374109,41.425448],[-74.374098,41.425537],[-74.37413100000001,41.425582],[-74.374162,41.425742],[-74.374207,41.425819],[-74.374235,41.425893],[-74.374242,41.425987],[-74.37426499999999,41.426055],[-74.374342,41.426135],[-74.37438899999999,41.426149],[-74.374499,41.426139],[-74.37453600000001,41.426152],[-74.374684,41.426322],[-74.37479399999999,41.426411],[-74.374807,41.426441],[-74.374889,41.426505],[-74.375012,41.426662],[-74.37517200000001,41.426766],[-74.375225,41.426787],[-74.375266,41.426794],[-74.375289,41.426787],[-74.375326,41.426718],[-74.375349,41.426705],[-74.37541,41.426712],[-74.375445,41.426734],[-74.375484,41.42678],[-74.375495,41.426815],[-74.37548,41.426882],[-74.375495,41.426921],[-74.37552700000001,41.426935],[-74.37558300000001,41.426939],[-74.375714,41.426974],[-74.375739,41.426992],[-74.375792,41.427102],[-74.375888,41.427116],[-74.375923,41.427134],[-74.37595899999999,41.427187],[-74.375969,41.427233],[-74.375952,41.427268],[-74.375927,41.427289],[-74.375923,41.427311],[-74.375934,41.427328],[-74.37598699999999,41.427357],[-74.376076,41.427381],[-74.37608299999999,41.427403],[-74.376037,41.427452],[-74.376031,41.427502],[-74.376074,41.427612],[-74.376109,41.427654],[-74.376152,41.427668],[-74.376226,41.427658],[-74.37625800000001,41.427668],[-74.376272,41.427732],[-74.376265,41.427764],[-74.37623000000001,41.427799],[-74.376194,41.427817],[-74.376138,41.427874],[-74.376114,41.428011],[-74.37612,41.428082],[-74.37616199999999,41.428132],[-74.376148,41.428196],[-74.375049,41.429208],[-74.375,41.429298],[-74.37496299999999,41.42933],[-74.374889,41.429335],[-74.374787,41.429412],[-74.37475499999999,41.429453],[-74.374703,41.42956],[-74.374696,41.429612],[-74.37467100000001,41.429631],[-74.374627,41.429634],[-74.374599,41.429676],[-74.374469,41.42976],[-74.374393,41.429772],[-74.374375,41.429802],[-74.374382,41.429862],[-74.374368,41.429879],[-74.37425500000001,41.429885],[-74.374168,41.429929],[-74.374055,41.430026],[-74.37388199999999,41.430198],[-74.373884,41.430223],[-74.373909,41.430249],[-74.373904,41.430278],[-74.373858,41.430295],[-74.373828,41.430325],[-74.37375900000001,41.430328],[-74.37373700000001,41.43035],[-74.373755,41.430484],[-74.373701,41.430563],[-74.37369700000001,41.430626],[-74.373723,41.430682],[-74.373717,41.430731],[-74.373673,41.430743],[-74.37363499999999,41.43073],[-74.37362899999999,41.430755],[-74.373645,41.43082],[-74.373654,41.430873],[-74.368582,41.43119],[-74.36705600000001,41.431283],[-74.366603,41.431309],[-74.363891,41.431489],[-74.358085,41.431841],[-74.356858,41.431942],[-74.356605,41.431963],[-74.35450899999999,41.43208],[-74.33807299999999,41.433187],[-74.337954,41.433191],[-74.330828,41.433558],[-74.327575,41.433758],[-74.325942,41.43385],[-74.321809,41.434119],[-74.313137,41.434654],[-74.31258699999999,41.434706],[-74.31109600000001,41.433904],[-74.30847900000001,41.432515],[-74.305943,41.431169],[-74.301815,41.428948],[-74.30169100000001,41.428879],[-74.29976000000001,41.427828],[-74.299299,41.427597],[-74.29908399999999,41.42749],[-74.29522,41.425514],[-74.294898,41.425343],[-74.294194,41.424969],[-74.292147,41.42377],[-74.288977,41.42191],[-74.28017800000001,41.416519],[-74.268308,41.409245],[-74.261966,41.405356],[-74.261647,41.405161],[-74.25860299999999,41.403314],[-74.255865,41.401653],[-74.255679,41.401555],[-74.2556,41.401601],[-74.255081,41.40187],[-74.25290200000001,41.403021],[-74.25130900000001,41.403777],[-74.25125300000001,41.400655],[-74.251233,41.394734],[-74.25123499999999,41.394417],[-74.251223,41.390485],[-74.251265,41.387184],[-74.25132000000001,41.387166],[-74.251535,41.387092],[-74.25203500000001,41.386923],[-74.252413,41.386795],[-74.252859,41.386658],[-74.253348,41.386508],[-74.254032,41.386331],[-74.25423499999999,41.386284],[-74.254319,41.386264],[-74.254937,41.386175],[-74.255334,41.386142],[-74.255636,41.38613],[-74.256578,41.386202],[-74.25663299999999,41.38621],[-74.256865,41.386244],[-74.257414,41.386343],[-74.25843,41.38651],[-74.259508,41.386723],[-74.260278,41.386855],[-74.260474,41.38688],[-74.261055,41.386983],[-74.26128199999999,41.387032],[-74.261427,41.387071],[-74.261814,41.387177],[-74.262266,41.387318],[-74.262548,41.387438],[-74.263223,41.387777],[-74.26387200000001,41.388127],[-74.264321,41.388329],[-74.264872,41.388535],[-74.268321,41.389734],[-74.26921900000001,41.390043],[-74.269975,41.390338],[-74.27079500000001,41.390682],[-74.2718,41.391179],[-74.273258,41.391947],[-74.27348600000001,41.392054],[-74.274353,41.392498],[-74.274992,41.392797],[-74.275672,41.393102],[-74.276253,41.393319],[-74.277005,41.393547],[-74.277484,41.393659],[-74.278265,41.393801],[-74.27939499999999,41.393948],[-74.27956,41.393979],[-74.279963,41.394082],[-74.28010399999999,41.394126],[-74.280494,41.394298],[-74.28073000000001,41.394442],[-74.281008,41.394659],[-74.281249,41.39486],[-74.281525,41.395107],[-74.28175899999999,41.395255],[-74.281989,41.395371],[-74.28224899999999,41.395456],[-74.28267200000001,41.395552],[-74.28375800000001,41.395762],[-74.28643700000001,41.396276],[-74.286479,41.396284],[-74.28724800000001,41.396431],[-74.28860899999999,41.396693],[-74.28917300000001,41.396788],[-74.290041,41.396929],[-74.290454,41.396979],[-74.291612,41.397098],[-74.292007,41.39718],[-74.292277,41.397273],[-74.292509,41.397365],[-74.29285400000001,41.397527],[-74.29316300000001,41.397686],[-74.29361299999999,41.397915],[-74.293791,41.397997],[-74.29421499999999,41.398154],[-74.294603,41.398248],[-74.29475499999999,41.398277],[-74.29584699999999,41.398429],[-74.29643,41.398502],[-74.29721000000001,41.398675],[-74.298073,41.39891],[-74.29901599999999,41.399171],[-74.299468,41.399335],[-74.299881,41.39952],[-74.30044700000001,41.399835],[-74.301322,41.400359],[-74.30180300000001,41.400648],[-74.302469,41.401058],[-74.302526,41.401093],[-74.30360899999999,41.401753],[-74.30459500000001,41.40234],[-74.30521,41.402714],[-74.306848,41.403682],[-74.30942,41.405216],[-74.30807799999999,41.407015],[-74.306956,41.408523],[-74.306398,41.409264],[-74.305868,41.409974],[-74.306476,41.410614],[-74.306281,41.410673],[-74.307698,41.411508],[-74.30848400000001,41.411971],[-74.30768500000001,41.41341],[-74.30929500000001,41.41416],[-74.309614,41.413768],[-74.31035799999999,41.412924],[-74.3116,41.413691],[-74.30855200000001,41.415247],[-74.308367,41.415532],[-74.308307,41.415625],[-74.308036,41.416032],[-74.307975,41.416121],[-74.30782600000001,41.416286],[-74.309388,41.415684],[-74.31000899999999,41.416024],[-74.310281,41.4169],[-74.311176,41.4176],[-74.312077,41.418029],[-74.313348,41.418604],[-74.314492,41.419129],[-74.314899,41.418815],[-74.315515,41.418341],[-74.31567200000001,41.418607],[-74.317701,41.416873],[-74.319216,41.415564],[-74.32166100000001,41.413512],[-74.323936,41.415647],[-74.324848,41.416504],[-74.325451,41.416062],[-74.32583200000001,41.41616],[-74.32592099999999,41.41617],[-74.32597800000001,41.416178],[-74.32623599999999,41.416184],[-74.326758,41.416117],[-74.327185,41.415957],[-74.327365,41.415915],[-74.32752600000001,41.415906],[-74.327702,41.415939],[-74.327776,41.415977],[-74.327881,41.416079],[-74.32808300000001,41.416385],[-74.328283,41.416616],[-74.328468,41.416799],[-74.328564,41.416879],[-74.329464,41.417635],[-74.32961400000001,41.417739],[-74.329876,41.417839],[-74.33014799999999,41.417596],[-74.330281,41.417465],[-74.33082400000001,41.416904],[-74.33088100000001,41.416845],[-74.33108300000001,41.41664],[-74.33118899999999,41.416549],[-74.331399,41.416427],[-74.331852,41.416274],[-74.33205100000001,41.416188],[-74.33229,41.416038],[-74.33231499999999,41.416017],[-74.332573,41.415802],[-74.33291800000001,41.415486],[-74.33375700000001,41.414748],[-74.334683,41.413962],[-74.335167,41.413539],[-74.335059,41.413373],[-74.334847,41.413157],[-74.334332,41.412695],[-74.333958,41.412365],[-74.33366700000001,41.41209],[-74.333376,41.411807],[-74.333095,41.411505],[-74.33297899999999,41.411319],[-74.33201099999999,41.411615],[-74.332008,41.411604],[-74.331509,41.410622],[-74.33185899999999,41.410583],[-74.33204000000001,41.410552],[-74.33222600000001,41.410498],[-74.332403,41.41041],[-74.332606,41.410258],[-74.332587,41.410234],[-74.332554,41.410153],[-74.33248399999999,41.409892],[-74.33248,41.409704],[-74.332506,41.409549],[-74.332644,41.409056],[-74.33265400000001,41.40901],[-74.33548999999999,41.411511],[-74.33598000000001,41.410862],[-74.33755600000001,41.408882],[-74.338713,41.407718],[-74.33824799999999,41.407484],[-74.33945900000001,41.406574],[-74.33983000000001,41.406883],[-74.340109,41.406653],[-74.340913,41.406012],[-74.341264,41.406224],[-74.342001,41.405601],[-74.342198,41.405726],[-74.342474,41.405475],[-74.342654,41.405335],[-74.34196300000001,41.404673],[-74.341677,41.404292],[-74.341543,41.404091],[-74.34124300000001,41.40372],[-74.340915,41.403175],[-74.340886,41.403124],[-74.34067400000001,41.402754],[-74.340476,41.402349],[-74.340282,41.401613],[-74.340441,41.40153],[-74.340627,41.401429],[-74.340748,41.401364],[-74.340858,41.401306],[-74.34282399999999,41.400261],[-74.343907,41.400813],[-74.347156,41.398873],[-74.34944,41.400114],[-74.35019200000001,41.399466],[-74.35136900000001,41.400049],[-74.352237,41.400535],[-74.35239,41.400302],[-74.35281999999999,41.399796],[-74.353883,41.398549],[-74.35415500000001,41.398232],[-74.355737,41.398168],[-74.357461,41.398085],[-74.358592,41.398044],[-74.35929,41.398004],[-74.360967,41.397909],[-74.36180299999999,41.397805],[-74.362092,41.397769],[-74.362618,41.397733],[-74.363377,41.397709],[-74.37018399999999,41.39754],[-74.371799,41.397538],[-74.37314000000001,41.397562],[-74.374071,41.397594],[-74.37456400000001,41.397627],[-74.37497,41.397666],[-74.375556,41.397746],[-74.377129,41.398014],[-74.378584,41.398236],[-74.378979,41.398297],[-74.380528,41.39855],[-74.381939,41.398853],[-74.382683,41.399064],[-74.382925,41.399143],[-74.383437,41.399343],[-74.384024,41.399591],[-74.38569200000001,41.400303],[-74.386619,41.400719],[-74.38973799999999,41.402115],[-74.390677,41.402533],[-74.392556,41.403365],[-74.39275499999999,41.403443],[-74.392955,41.403525],[-74.39381400000001,41.403828],[-74.394002,41.403891],[-74.39407,41.40391],[-74.39455,41.404042],[-74.39537,41.404221],[-74.396232,41.404403],[-74.396615,41.404489],[-74.398197,41.404848],[-74.398667,41.404975],[-74.399067,41.405106],[-74.39970599999999,41.405365],[-74.400025,41.40551],[-74.399907,41.405598]]],"type":"Polygon"}
}