{
  "id": "360710151004",
  "type": "Feature",
  "properties": {
    "area_land":320936,
    "area_water":0,
    "geoid":"360710151004",
    "name":"Block Group 4",
    "state":"ny"
},
  "bbox": [
    -74.438231,
    41.447087,
    -74.43027,
    41.458495
],
  "geometry": {"coordinates":[[[-74.438231,41.457456],[-74.43625299999999,41.458093],[-74.435024,41.458495],[-74.43489099999999,41.458217],[-74.434111,41.456538],[-74.432897,41.453956],[-74.43283099999999,41.453785],[-74.432501,41.453086],[-74.432052,41.452015],[-74.43026999999999,41.448218],[-74.430503,41.448207],[-74.430593,41.448202],[-74.430668,41.448198],[-74.430882,41.448168],[-74.431468,41.448049],[-74.431853,41.44795],[-74.433367,41.447605],[-74.434668,41.447344],[-74.435047,41.447266],[-74.43591499999999,41.447087],[-74.43657899999999,41.44789],[-74.43510999999999,41.449318],[-74.43393399999999,41.450461],[-74.43414900000001,41.450743],[-74.434208,41.450839],[-74.434298,41.451037],[-74.43441300000001,41.451347],[-74.43445,41.451438],[-74.434799,41.452312],[-74.435176,41.45334],[-74.435546,41.45432],[-74.435621,41.454474],[-74.435717,41.454621],[-74.435832,41.454771],[-74.43620900000001,41.455203],[-74.43634400000001,41.455343],[-74.436414,41.455419],[-74.43668599999999,41.455738],[-74.43705,41.45613],[-74.437262,41.456358],[-74.437288,41.456386],[-74.43732199999999,41.456424],[-74.43737,41.456477],[-74.437404,41.456514],[-74.43760899999999,41.456756],[-74.438231,41.457456]]],"type":"Polygon"}
}