{
  "id": "361170210002",
  "type": "Feature",
  "properties": {
    "area_land":53483760,
    "area_water":38308,
    "geoid":"361170210002",
    "name":"Block Group 2",
    "state":"ny"
},
  "bbox": [
    -77.095491,
    43.012614,
    -76.98416,
    43.115769
],
  "geometry": {"coordinates":[[[-77.09548599999999,43.064575],[-77.095471,43.0648],[-77.0954,43.065135],[-77.095387,43.065197],[-77.095349,43.065317],[-77.09531699999999,43.065396],[-77.095229,43.065623],[-77.09522200000001,43.065634],[-77.09518199999999,43.06571],[-77.095033,43.065989],[-77.09493000000001,43.066138],[-77.094909,43.066169],[-77.094584,43.066568],[-77.09436100000001,43.066786],[-77.09416299999999,43.066959],[-77.09387099999999,43.067181],[-77.09383099999999,43.067212],[-77.093452,43.06745],[-77.093271,43.06754],[-77.093022,43.067666],[-77.09272199999999,43.0678],[-77.092538,43.067884],[-77.090232,43.068889],[-77.089161,43.069396],[-77.088685,43.069623],[-77.08853499999999,43.069698],[-77.088218,43.069901],[-77.087931,43.070119],[-77.087503,43.070503],[-77.087329,43.070676],[-77.08674499999999,43.071384],[-77.086516,43.071691],[-77.08581,43.072643],[-77.08567600000001,43.072816],[-77.085426,43.073144],[-77.08526500000001,43.073326],[-77.085121,43.073491],[-77.084896,43.073727],[-77.08443699999999,43.074135],[-77.08431299999999,43.074246],[-77.082999,43.075392],[-77.082301,43.075976],[-77.081581,43.076581],[-77.081537,43.076618],[-77.081405,43.076732],[-77.081362,43.07677],[-77.08125,43.076866],[-77.08091400000001,43.077157],[-77.080803,43.077254],[-77.080206,43.077789],[-77.07988899999999,43.0781],[-77.079694,43.078331],[-77.07949600000001,43.078599],[-77.07937200000001,43.078802],[-77.07925400000001,43.079029],[-77.079066,43.079463],[-77.078991,43.079638],[-77.078648,43.080562],[-77.078485,43.081042],[-77.078307,43.081671],[-77.078203,43.082195],[-77.077994,43.083931],[-77.07788499999999,43.085004],[-77.077781,43.086311],[-77.077726,43.086811],[-77.077662,43.087197],[-77.077533,43.087681],[-77.077482,43.08781],[-77.07737,43.088096],[-77.077241,43.088364],[-77.076201,43.090352],[-77.075829,43.091055],[-77.07518899999999,43.092266],[-77.07504,43.092572],[-77.07493599999999,43.092845],[-77.07485699999999,43.093117],[-77.07483499999999,43.093217],[-77.074797,43.093391],[-77.07476200000001,43.093649],[-77.074744,43.094006],[-77.074747,43.094208],[-77.074772,43.094426],[-77.07492999999999,43.095242],[-77.07554399999999,43.098091],[-77.076021,43.100299],[-77.07683400000001,43.103965],[-77.07696,43.10455],[-77.077206,43.105641],[-77.07733500000001,43.106042],[-77.077473,43.106379],[-77.07787,43.107205],[-77.07829599999999,43.108135],[-77.07847,43.108556],[-77.078549,43.108803],[-77.078633,43.109179],[-77.078653,43.109316],[-77.078706,43.110125],[-77.078723,43.110385],[-77.07883200000001,43.112393],[-77.078943,43.114287],[-77.07896,43.114583],[-77.07901200000001,43.115472],[-77.07903,43.115769],[-77.07859000000001,43.115716],[-77.078394,43.115679],[-77.078335,43.115655],[-77.078231,43.115572],[-77.078102,43.1154],[-77.078014,43.115229],[-77.077826,43.114807],[-77.077635,43.114377],[-77.07738500000001,43.113862],[-77.07699100000001,43.113167],[-77.076846,43.112953],[-77.076497,43.112595],[-77.076346,43.112426],[-77.076123,43.112114],[-77.07577999999999,43.111523],[-77.075554,43.111202],[-77.075084,43.110631],[-77.07501499999999,43.110561],[-77.074754,43.1103],[-77.07461499999999,43.110185],[-77.074335,43.109985],[-77.074011,43.109803],[-77.073604,43.10963],[-77.072315,43.10905],[-77.07217799999999,43.108989],[-77.070078,43.108052],[-77.068611,43.107364],[-77.06791699999999,43.107035],[-77.06711900000001,43.106657],[-77.066492,43.106398],[-77.065961,43.106218],[-77.06562700000001,43.106124],[-77.06496199999999,43.105938],[-77.06482800000001,43.105909],[-77.06451,43.105872],[-77.064212,43.105872],[-77.062938,43.105929],[-77.062033,43.105971],[-77.06181100000001,43.10598],[-77.06114599999999,43.106006],[-77.060925,43.106016],[-77.06054899999999,43.106031],[-77.059257,43.106089],[-77.05899599999999,43.106101],[-77.058024,43.106176],[-77.057287,43.10625],[-77.055401,43.106484],[-77.054823,43.106556],[-77.054119,43.106648],[-77.054131,43.106481],[-77.054171,43.10598],[-77.05418400000001,43.105814],[-77.05426799999999,43.10448],[-77.054267,43.10381],[-77.05421800000001,43.10291],[-77.054109,43.100899],[-77.05386,43.097313],[-77.05379000000001,43.095229],[-77.053737,43.094201],[-77.053698,43.093422],[-77.053544,43.0913],[-77.052386,43.091086],[-77.051422,43.090886],[-77.05068300000001,43.090734],[-77.04913999999999,43.090392],[-77.048411,43.09022],[-77.045092,43.089483],[-77.04437,43.089323],[-77.04297800000001,43.089033],[-77.042551,43.088958],[-77.042502,43.08895],[-77.041501,43.08879],[-77.041268,43.088759],[-77.04083900000001,43.088702],[-77.040694,43.088681],[-77.04025900000001,43.088618],[-77.040115,43.088597],[-77.039339,43.08848],[-77.039115,43.088439],[-77.03894200000001,43.088408],[-77.038561,43.088322],[-77.03812600000001,43.088172],[-77.03779400000001,43.088015],[-77.037333,43.087753],[-77.037142,43.087612],[-77.036974,43.087463],[-77.036788,43.08727],[-77.036547,43.086975],[-77.03590699999999,43.086193],[-77.035831,43.086098],[-77.035605,43.085816],[-77.03552999999999,43.085722],[-77.035398,43.085519],[-77.035301,43.085351],[-77.03495100000001,43.084561],[-77.034761,43.084107],[-77.034688,43.08387],[-77.034659,43.083663],[-77.034435,43.082034],[-77.03433200000001,43.081546],[-77.03420300000001,43.081155],[-77.033975,43.080664],[-77.033834,43.08045],[-77.033537,43.080158],[-77.03319999999999,43.079923],[-77.03212600000001,43.079277],[-77.03183900000001,43.079137],[-77.031465,43.078995],[-77.03110700000001,43.078911],[-77.03088200000001,43.07888],[-77.030732,43.07886],[-77.02994,43.078803],[-77.028638,43.078758],[-77.027023,43.078723],[-77.026117,43.078715],[-77.025317,43.078708],[-77.022717,43.078722],[-77.021829,43.078722],[-77.02076599999999,43.078743],[-77.018559,43.078855],[-77.016938,43.078939],[-77.016042,43.078978],[-77.01584200000001,43.078979],[-77.015618,43.078982],[-77.01524499999999,43.078948],[-77.01517,43.078942],[-77.01504799999999,43.07892],[-77.014775,43.078857],[-77.014223,43.078693],[-77.014118,43.07866],[-77.011917,43.077975],[-77.01169299999999,43.077905],[-77.011353,43.077794],[-77.010435,43.077495],[-77.01107399999999,43.077494],[-77.01299299999999,43.077492],[-77.013633,43.077492],[-77.014357,43.077448],[-77.01433299999999,43.077265],[-77.013988,43.074559],[-77.013873,43.073658],[-77.013755,43.072431],[-77.01367,43.071624],[-77.013306,43.068134],[-77.013046,43.065526],[-77.012845,43.063493],[-77.012787,43.062955],[-77.012733,43.062448],[-77.012613,43.061343],[-77.012556,43.060806],[-77.012542,43.060666],[-77.012501,43.060246],[-77.012488,43.060106],[-77.01246999999999,43.059934],[-77.012416,43.05942],[-77.012398,43.059249],[-77.01239200000001,43.059193],[-77.01237399999999,43.059025],[-77.012368,43.05897],[-77.012359,43.058902],[-77.01233499999999,43.058698],[-77.012328,43.05863],[-77.012326,43.058601],[-77.01232,43.058515],[-77.01231799999999,43.058487],[-77.012148,43.056898],[-77.011692,43.052624],[-77.01164799999999,43.052132],[-77.011506,43.050542],[-77.011413,43.049536],[-77.01131100000001,43.048425],[-77.0094,43.048464],[-77.008391,43.048485],[-77.007966,43.048508],[-77.006694,43.048579],[-77.00627,43.048603],[-77.005865,43.048609],[-77.005267,43.048618],[-77.00465199999999,43.048631],[-77.004248,43.048641],[-77.00308699999999,43.048693],[-76.99990099999999,43.048838],[-76.999606,43.048859],[-76.998448,43.048943],[-76.99802099999999,43.048964],[-76.99673900000001,43.04903],[-76.996313,43.049052],[-76.995819,43.049077],[-76.994339,43.049153],[-76.993846,43.049179],[-76.993852,43.048938],[-76.993872,43.048218],[-76.99387900000001,43.047978],[-76.99388,43.047871],[-76.99388399999999,43.047552],[-76.993886,43.047446],[-76.99388999999999,43.047158],[-76.993894,43.0469],[-76.99390099999999,43.046296],[-76.993903,43.046214],[-76.993889,43.04601],[-76.99385700000001,43.045757],[-76.993764,43.044998],[-76.99373300000001,43.044745],[-76.993703,43.0445],[-76.993584,43.043646],[-76.993464,43.042779],[-76.993371,43.042046],[-76.993352,43.041892],[-76.99323699999999,43.040842],[-76.99317499999999,43.040276],[-76.993075,43.03953],[-76.993009,43.039219],[-76.992779,43.038423],[-76.99265,43.038139],[-76.992087,43.037096],[-76.991907,43.036678],[-76.991691,43.036051],[-76.991587,43.035667],[-76.991506,43.035215],[-76.99146399999999,43.034849],[-76.99146,43.03467],[-76.991462,43.033784],[-76.991585,43.031987],[-76.991591,43.031488],[-76.991579,43.031082],[-76.991527,43.030323],[-76.991455,43.029363],[-76.991439,43.029149],[-76.99141,43.028907],[-76.99135699999999,43.028629],[-76.991241,43.028143],[-76.991089,43.027609],[-76.99102499999999,43.027443],[-76.990849,43.02708],[-76.990651,43.026751],[-76.990353,43.026307],[-76.989986,43.025786],[-76.989823,43.025553],[-76.989334,43.024856],[-76.989171,43.024624],[-76.989029,43.024405],[-76.988806,43.023996],[-76.988671,43.023723],[-76.988597,43.023596],[-76.98846500000001,43.023374],[-76.98733300000001,43.021275],[-76.986767,43.020095],[-76.98642,43.019403],[-76.98623499999999,43.018937],[-76.985998,43.018313],[-76.985584,43.016976],[-76.98416,43.012971],[-76.98472,43.012965],[-76.98639900000001,43.01295],[-76.98696,43.012945],[-76.988809,43.012927],[-76.994361,43.012875],[-76.996212,43.012859],[-76.99808899999999,43.012849],[-76.99974400000001,43.012841],[-77.003722,43.012836],[-77.005601,43.012836],[-77.005893,43.012835],[-77.006772,43.012834],[-77.007065,43.012834],[-77.00862100000001,43.012832],[-77.011608,43.012829],[-77.013289,43.012844],[-77.01484600000001,43.012859],[-77.015755,43.012859],[-77.01848200000001,43.012862],[-77.019391,43.012863],[-77.01984899999999,43.012858],[-77.021224,43.012851],[-77.02168399999999,43.01285],[-77.02197099999999,43.012847],[-77.02284,43.012839],[-77.02313100000001,43.012838],[-77.023166,43.012837],[-77.02327,43.012837],[-77.02330600000001,43.012837],[-77.02357600000001,43.012833],[-77.024387,43.012826],[-77.02466,43.012826],[-77.02569200000001,43.012819],[-77.02879799999999,43.012799],[-77.02983399999999,43.012795],[-77.030511,43.012791],[-77.032543,43.012783],[-77.03322199999999,43.012781],[-77.03565399999999,43.012768],[-77.04294899999999,43.012732],[-77.045382,43.01272],[-77.045772,43.012718],[-77.04694499999999,43.012711],[-77.047336,43.01271],[-77.048416,43.012704],[-77.051655,43.012688],[-77.052736,43.012683],[-77.053567,43.012679],[-77.056061,43.012666],[-77.056893,43.012663],[-77.057106,43.012662],[-77.057748,43.01266],[-77.057962,43.01266],[-77.05867600000001,43.012658],[-77.060818,43.012654],[-77.061533,43.012653],[-77.062095,43.012651],[-77.063783,43.012647],[-77.064346,43.012646],[-77.065594,43.012643],[-77.06934099999999,43.012635],[-77.070508,43.012633],[-77.07059,43.012632],[-77.071012,43.012631],[-77.072278,43.012628],[-77.0727,43.012627],[-77.07306800000001,43.012624],[-77.074174,43.01262],[-77.074545,43.012621],[-77.075445,43.012619],[-77.078148,43.012614],[-77.07905100000001,43.012614],[-77.079052,43.012716],[-77.07905700000001,43.013025],[-77.079059,43.013128],[-77.07906800000001,43.01376],[-77.07908399999999,43.014753],[-77.07910800000001,43.015658],[-77.079126,43.016291],[-77.079128,43.016392],[-77.079137,43.016696],[-77.07914,43.016798],[-77.07916400000001,43.017684],[-77.079227,43.019977],[-77.079241,43.020343],[-77.079278,43.02123],[-77.078954,43.021223],[-77.078659,43.021198],[-77.07767,43.02109],[-77.07619200000001,43.02093],[-77.075231,43.020811],[-77.07503800000001,43.020781],[-77.074562,43.020692],[-77.073167,43.020347],[-77.073095,43.020331],[-77.072902,43.020298],[-77.07277999999999,43.020278],[-77.07253,43.020258],[-77.07219499999999,43.020245],[-77.071291,43.020253],[-77.071209,43.020255],[-77.071085,43.020259],[-77.070964,43.020263],[-77.07088299999999,43.020267],[-77.070401,43.020286],[-77.070137,43.020297],[-77.06967899999999,43.020339],[-77.069033,43.020414],[-77.068961,43.020424],[-77.068484,43.020492],[-77.068529,43.021201],[-77.068556,43.021307],[-77.068617,43.021372],[-77.068624,43.021539],[-77.06871099999999,43.021993],[-77.06877900000001,43.022246],[-77.068955,43.023201],[-77.068991,43.023472],[-77.06905399999999,43.023643],[-77.06905500000001,43.023767],[-77.069045,43.023926],[-77.069102,43.024003],[-77.06910000000001,43.024066],[-77.069039,43.02414],[-77.069035,43.024176],[-77.06914,43.02429],[-77.069136,43.024356],[-77.069185,43.024575],[-77.0692,43.024694],[-77.06925699999999,43.024905],[-77.069461,43.025107],[-77.06949,43.025184],[-77.06949,43.025266],[-77.06941500000001,43.025482],[-77.069423,43.025523],[-77.06946600000001,43.025596],[-77.06950399999999,43.025738],[-77.069506,43.025795],[-77.06953,43.025824],[-77.06954500000001,43.02592],[-77.06966300000001,43.026195],[-77.069694,43.026287],[-77.06970800000001,43.026327],[-77.069816,43.02658],[-77.069909,43.026891],[-77.069992,43.027292],[-77.070013,43.027341],[-77.070127,43.027861],[-77.070289,43.028504],[-77.070334,43.028556],[-77.070455,43.028625],[-77.07049499999999,43.028674],[-77.070491,43.028733],[-77.07045599999999,43.028778],[-77.070458,43.028823],[-77.070475,43.028867],[-77.070532,43.028939],[-77.070581,43.029061],[-77.070615,43.029098],[-77.07066399999999,43.029116],[-77.070668,43.029151],[-77.07061299999999,43.029228],[-77.070626,43.029281],[-77.070688,43.029346],[-77.07075500000001,43.029368],[-77.070843,43.029462],[-77.070837,43.029503],[-77.070818,43.029529],[-77.070835,43.02958],[-77.070892,43.029619],[-77.070977,43.029641],[-77.071045,43.029635],[-77.071147,43.02959],[-77.071183,43.029592],[-77.071208,43.029631],[-77.071253,43.029741],[-77.071243,43.029782],[-77.071207,43.029808],[-77.07112499999999,43.029843],[-77.07109,43.029902],[-77.071111,43.029953],[-77.071135,43.029969],[-77.07118800000001,43.029978],[-77.07123900000001,43.029988],[-77.07127199999999,43.029998],[-77.071358,43.030065],[-77.07138399999999,43.030069],[-77.071445,43.030051],[-77.071517,43.03001],[-77.071637,43.029969],[-77.07175100000001,43.029917],[-77.071782,43.029943],[-77.071831,43.030034],[-77.071907,43.030087],[-77.07198200000001,43.030106],[-77.07207200000001,43.030087],[-77.072157,43.030101],[-77.07220100000001,43.030121],[-77.072282,43.030133],[-77.072351,43.030129],[-77.07243200000001,43.030109],[-77.072504,43.030063],[-77.072558,43.030033],[-77.072619,43.029999],[-77.07274,43.029979],[-77.072822,43.029991],[-77.072884,43.030037],[-77.07291499999999,43.03006],[-77.07310099999999,43.030279],[-77.073211,43.030372],[-77.073543,43.030603],[-77.07359599999999,43.030672],[-77.073624,43.030765],[-77.073612,43.03085],[-77.073499,43.031022],[-77.073487,43.031083],[-77.07347900000001,43.03112],[-77.073483,43.03118],[-77.073734,43.031602],[-77.07373,43.031675],[-77.073661,43.031756],[-77.07356,43.031845],[-77.073536,43.031889],[-77.073536,43.031922],[-77.073609,43.032055],[-77.073645,43.032121],[-77.073657,43.032206],[-77.07364,43.032259],[-77.073584,43.032348],[-77.073576,43.032441],[-77.073604,43.032502],[-77.073734,43.03264],[-77.073774,43.032709],[-77.073852,43.033169],[-77.07384,43.033278],[-77.073823,43.033339],[-77.073836,43.033383],[-77.07395699999999,43.033469],[-77.074026,43.033558],[-77.074026,43.033586],[-77.073988,43.03365],[-77.073837,43.033768],[-77.073818,43.033815],[-77.073846,43.034028],[-77.073896,43.034185],[-77.07391200000001,43.034298],[-77.073984,43.034443],[-77.074101,43.034973],[-77.074167,43.035051],[-77.074186,43.035122],[-77.074146,43.035162],[-77.074151,43.035187],[-77.07418199999999,43.035218],[-77.074179,43.035291],[-77.074102,43.03539],[-77.07408,43.035501],[-77.074089,43.035531],[-77.07417,43.035598],[-77.07414,43.03571],[-77.07414799999999,43.036052],[-77.07412100000001,43.036273],[-77.074011,43.036625],[-77.07396900000001,43.036881],[-77.073971,43.036965],[-77.073976,43.037146],[-77.07396900000001,43.03735],[-77.073994,43.037418],[-77.074088,43.037507],[-77.074102,43.037565],[-77.074084,43.037611],[-77.074005,43.037657],[-77.07393,43.037688],[-77.073886,43.037734],[-77.073883,43.037792],[-77.073914,43.03785],[-77.074018,43.037932],[-77.07402399999999,43.037983],[-77.07399599999999,43.038095],[-77.074005,43.038122],[-77.074091,43.038179],[-77.07417100000001,43.038299],[-77.074252,43.038491],[-77.074293,43.0385],[-77.074355,43.038502],[-77.07439100000001,43.038529],[-77.07445,43.038629],[-77.07451500000001,43.038686],[-77.074534,43.038753],[-77.074524,43.038884],[-77.07454300000001,43.038907],[-77.07459799999999,43.03891],[-77.07471,43.038898],[-77.074763,43.038919],[-77.074887,43.039022],[-77.0749,43.039108],[-77.07490799999999,43.039156],[-77.074944,43.03923],[-77.07490199999999,43.039411],[-77.07458800000001,43.039408],[-77.07364699999999,43.0394],[-77.073583,43.0394],[-77.073334,43.039404],[-77.073053,43.039403],[-77.07272500000001,43.039403],[-77.072343,43.039393],[-77.07221,43.039381],[-77.07214399999999,43.039376],[-77.07193599999999,43.039327],[-77.07196,43.040213],[-77.071986,43.041147],[-77.072006,43.042023],[-77.072024,43.042871],[-77.07203,43.043121],[-77.07200400000001,43.043757],[-77.07197600000001,43.043996],[-77.071969,43.044064],[-77.07186900000001,43.044501],[-77.071822,43.044701],[-77.071791,43.044838],[-77.071771,43.044937],[-77.071561,43.045014],[-77.07135100000001,43.044951],[-77.07131699999999,43.044926],[-77.071252,43.044878],[-77.070876,43.044897],[-77.070825,43.044852],[-77.070688,43.044872],[-77.069914,43.04502],[-77.069439,43.045111],[-77.069299,43.045147],[-77.06916,43.045182],[-77.069113,43.044784],[-77.069108,43.04474],[-77.069093,43.044745],[-77.068105,43.045047],[-77.06738199999999,43.045269],[-77.064628,43.046312],[-77.064215,43.046617],[-77.063146,43.046981],[-77.06285099999999,43.047083],[-77.06142699999999,43.047443],[-77.061348,43.047465],[-77.06111199999999,43.047533],[-77.06103400000001,43.047556],[-77.060872,43.047606],[-77.060492,43.047725],[-77.060389,43.04776],[-77.06023,43.047816],[-77.059601,43.048187],[-77.059736,43.048776],[-77.05965,43.04877],[-77.05915,43.048735],[-77.05908599999999,43.048522],[-77.058249,43.049117],[-77.058481,43.049293],[-77.05770099999999,43.049715],[-77.057608,43.0496],[-77.056776,43.050441],[-77.05622200000001,43.051002],[-77.056104,43.051623],[-77.056071,43.051703],[-77.056032,43.0518],[-77.056077,43.05195],[-77.056102,43.052034],[-77.056121,43.052144],[-77.056231,43.052402],[-77.056234,43.05247],[-77.056237,43.052518],[-77.056229,43.052585],[-77.056231,43.052772],[-77.056234,43.053041],[-77.056144,43.053321],[-77.05608700000001,43.0535],[-77.056037,43.053593],[-77.05588299999999,43.053736],[-77.055829,43.053757],[-77.055836,43.053917],[-77.05577099999999,43.053969],[-77.055673,43.054038],[-77.055469,43.054148],[-77.05539400000001,43.054221],[-77.055384,43.054247],[-77.05540000000001,43.054306],[-77.055536,43.054564],[-77.055553,43.054601],[-77.055716,43.054938],[-77.05706600000001,43.054339],[-77.061116,43.052544],[-77.062062,43.052125],[-77.062415,43.051858],[-77.06245800000001,43.051623],[-77.06247399999999,43.051539],[-77.063104,43.051503],[-77.063343,43.05149],[-77.063626,43.051432],[-77.06765799999999,43.049512],[-77.06780999999999,43.049377],[-77.067897,43.049162],[-77.068018,43.048382],[-77.068093,43.047904],[-77.070352,43.047002],[-77.07040600000001,43.047136],[-77.070415,43.047158],[-77.07137299999999,43.046881],[-77.071518,43.046819],[-77.071746,43.046723],[-77.071766,43.04671],[-77.071905,43.046623],[-77.07194,43.046611],[-77.072091,43.046565],[-77.072098,43.046745],[-77.07212199999999,43.047285],[-77.07213,43.047466],[-77.07213900000001,43.047791],[-77.07216699999999,43.048766],[-77.072177,43.049092],[-77.072187,43.049573],[-77.072209,43.050575],[-77.07222400000001,43.051019],[-77.07224100000001,43.051501],[-77.07225099999999,43.051996],[-77.072281,43.053481],[-77.07229100000001,43.053977],[-77.07226799999999,43.054096],[-77.07220100000001,43.054454],[-77.07218,43.054574],[-77.0722,43.054564],[-77.07226,43.054535],[-77.072281,43.054526],[-77.07234699999999,43.054594],[-77.07238700000001,43.054627],[-77.072596,43.054709],[-77.072867,43.054783],[-77.07316,43.054837],[-77.073408,43.054862],[-77.07437899999999,43.054923],[-77.07512199999999,43.055021],[-77.07535,43.055051],[-77.07653000000001,43.055245],[-77.077258,43.05541],[-77.077941,43.055604],[-77.078692,43.055862],[-77.079527,43.056163],[-77.08032799999999,43.056477],[-77.081107,43.056802],[-77.081603,43.057054],[-77.081829,43.057182],[-77.08287300000001,43.057878],[-77.08323799999999,43.058099],[-77.084115,43.058629],[-77.085379,43.059375],[-77.085663,43.059554],[-77.08572599999999,43.059625],[-77.085821,43.059732],[-77.085866,43.059831],[-77.085893,43.060055],[-77.085894,43.060516],[-77.0859,43.06185],[-77.08592899999999,43.063333],[-77.085938,43.063793],[-77.085959,43.064126],[-77.085994,43.064268],[-77.08604,43.064261],[-77.086596,43.064242],[-77.08742700000001,43.064214],[-77.08831000000001,43.064203],[-77.088404,43.0642],[-77.089007,43.064188],[-77.089748,43.064179],[-77.090197,43.064174],[-77.090349,43.064158],[-77.090614,43.064114],[-77.091543,43.063864],[-77.091925,43.063778],[-77.09199599999999,43.063763],[-77.092426,43.063714],[-77.092662,43.063704],[-77.092871,43.0637],[-77.093146,43.063722],[-77.093243,43.063737],[-77.09339,43.063762],[-77.093549,43.063797],[-77.093879,43.06389],[-77.094919,43.064238],[-77.094956,43.064251],[-77.095129,43.064309],[-77.09541299999999,43.064376],[-77.095483,43.064387],[-77.095491,43.064511],[-77.09548599999999,43.064575]]],"type":"Polygon"}
}