{
  "id": "360594076006",
  "type": "Feature",
  "properties": {
    "area_land":373207,
    "area_water":0,
    "geoid":"360594076006",
    "name":"Block Group 6",
    "state":"ny"
},
  "bbox": [
    -73.571535,
    40.740117,
    -73.560281,
    40.746885
],
  "geometry": {"coordinates":[[[-73.571427,40.744128],[-73.571431,40.744595],[-73.57142,40.744682],[-73.57138999999999,40.744825],[-73.571331,40.744989],[-73.57122099999999,40.745198],[-73.57109,40.745384],[-73.570941,40.745548],[-73.57076000000001,40.745712],[-73.570677,40.745774],[-73.570386,40.74599],[-73.570277,40.746108],[-73.57022600000001,40.746204],[-73.570218,40.746234],[-73.570193,40.746325],[-73.57019200000001,40.746456],[-73.57023100000001,40.746621],[-73.57028800000001,40.746721],[-73.569951,40.746842],[-73.569745,40.746883],[-73.569587,40.746885],[-73.569283,40.74687],[-73.569157,40.746872],[-73.56908,40.746863],[-73.567869,40.74681],[-73.56765900000001,40.746793],[-73.567487,40.746787],[-73.567386,40.746767],[-73.567285,40.746731],[-73.567199,40.746687],[-73.567116,40.746626],[-73.56697200000001,40.746496],[-73.566771,40.746295],[-73.566154,40.745697],[-73.565667,40.745221],[-73.565596,40.745111],[-73.565527,40.74494],[-73.565296,40.744955],[-73.565181,40.744974],[-73.565054,40.745017],[-73.564964,40.745061],[-73.563457,40.74592],[-73.563255,40.746083],[-73.56302100000001,40.746272],[-73.56264899999999,40.746535],[-73.562032,40.746025],[-73.561426,40.745524],[-73.560817,40.745018],[-73.560281,40.74457],[-73.560638,40.744392],[-73.561165,40.744082],[-73.561853,40.743665],[-73.562079,40.743533],[-73.563931,40.74243],[-73.565915,40.741247],[-73.56600299999999,40.741194],[-73.56679699999999,40.740714],[-73.567138,40.740508],[-73.56719200000001,40.740486],[-73.567235,40.740452],[-73.567616,40.740213],[-73.567786,40.740117],[-73.567787,40.74057],[-73.567848,40.740673],[-73.56823799999999,40.741091],[-73.56901999999999,40.741958],[-73.570217,40.743278],[-73.57044999999999,40.743441],[-73.57059700000001,40.743513],[-73.570694,40.743546],[-73.570835,40.743582],[-73.570965,40.743605],[-73.571196,40.743611],[-73.571333,40.743625],[-73.571535,40.743693],[-73.571427,40.744128]]],"type":"Polygon"}
}