{
  "id": "360610247005",
  "type": "Feature",
  "properties": {
    "area_land":64475,
    "area_water":0,
    "geoid":"360610247005",
    "name":"Block Group 5",
    "state":"ny"
},
  "bbox": [
    -73.94727,
    40.837752,
    -73.943066,
    40.841051
],
  "geometry": {"coordinates":[[[-73.94727,40.837991],[-73.9468,40.838397],[-73.94661000000001,40.838613],[-73.946483,40.838786],[-73.946372,40.838965],[-73.946279,40.839149],[-73.946138,40.83941],[-73.94597899999999,40.839667],[-73.945802,40.839918],[-73.94560799999999,40.840162],[-73.945398,40.840398],[-73.945173,40.840626],[-73.94493300000001,40.840844],[-73.94468000000001,40.841051],[-73.943066,40.840193],[-73.943465,40.839174],[-73.943741,40.838477],[-73.944022,40.83778],[-73.94585600000001,40.838559],[-73.94664,40.838058],[-73.94671099999999,40.83794],[-73.946765,40.837818],[-73.94678500000001,40.837752],[-73.94710000000001,40.837859],[-73.94727,40.837991]]],"type":"Polygon"}
}