{
  "id": "360099605003",
  "type": "Feature",
  "properties": {
    "area_land":118637028,
    "area_water":95580,
    "geoid":"360099605003",
    "name":"Block Group 3",
    "state":"ny"
},
  "bbox": [
    -79.060708,
    42.230397,
    -78.942871,
    42.347917
],
  "geometry": {"coordinates":[[[-79.06070800000001,42.347917],[-79.058565,42.347898],[-79.055998,42.347888],[-79.055599,42.347884],[-79.04309499999999,42.347807],[-79.036672,42.347766],[-79.011921,42.347633],[-79.001925,42.347579],[-78.99999800000001,42.347568],[-78.991191,42.347519],[-78.987216,42.347496],[-78.985787,42.347488],[-78.983558,42.347476],[-78.983163,42.347457],[-78.982838,42.34746],[-78.982283,42.347448],[-78.980464,42.347445],[-78.979848,42.34743],[-78.97776399999999,42.347407],[-78.975346,42.347406],[-78.973223,42.347373],[-78.97253600000001,42.347374],[-78.971485,42.347366],[-78.970388,42.347353],[-78.969673,42.347335],[-78.967006,42.347297],[-78.96421100000001,42.347286],[-78.962098,42.347244],[-78.960634,42.34723],[-78.958414,42.347198],[-78.957909,42.347198],[-78.95582,42.347157],[-78.954286,42.347123],[-78.94981199999999,42.347073],[-78.948099,42.347012],[-78.947695,42.346985],[-78.947185,42.346905],[-78.94586,42.347007],[-78.944976,42.346954],[-78.944419,42.346977],[-78.944147,42.346973],[-78.943915,42.34695],[-78.943827,42.346922],[-78.943387,42.346977],[-78.943386,42.346538],[-78.943392,42.345048],[-78.94339600000001,42.336565],[-78.943393,42.336468],[-78.943388,42.335912],[-78.943381,42.319721],[-78.943366,42.317226],[-78.94337899999999,42.316904],[-78.94338,42.316476],[-78.943397,42.316042],[-78.94338,42.3156],[-78.943369,42.315204],[-78.943377,42.308851],[-78.94337299999999,42.297671],[-78.943371,42.293707],[-78.943365,42.293624],[-78.943327,42.293187],[-78.94333,42.292924],[-78.943331,42.288896],[-78.943332,42.282713],[-78.943332,42.28243],[-78.943335,42.282186],[-78.942871,42.277013],[-78.943318,42.271467],[-78.943338,42.266466],[-78.94338,42.263553],[-78.943352,42.260456],[-78.94335599999999,42.257113],[-78.943359,42.250284],[-78.94332799999999,42.244204],[-78.94328400000001,42.238748],[-78.94320500000001,42.230422],[-78.947328,42.230397],[-78.94776400000001,42.230404],[-78.948318,42.230412],[-78.94886700000001,42.230421],[-78.94937299999999,42.230411],[-78.95058899999999,42.230425],[-78.951014,42.230419],[-78.951289,42.230428],[-78.951685,42.230495],[-78.951993,42.230569],[-78.953892,42.231064],[-78.956176,42.231708],[-78.95640400000001,42.231762],[-78.956654,42.231797],[-78.960283,42.23178],[-78.964906,42.231794],[-78.96788599999999,42.231838],[-78.96934,42.231833],[-78.97005900000001,42.231818],[-78.971687,42.231833],[-78.971694,42.234547],[-78.97166799999999,42.23694],[-78.971643,42.237707],[-78.971653,42.238391],[-78.97170699999999,42.238453],[-78.971791,42.238496],[-78.97202,42.238538],[-78.972273,42.238501],[-78.972729,42.238481],[-78.973641,42.238467],[-78.975246,42.238472],[-78.97685799999999,42.238505],[-78.978477,42.23851],[-78.981675,42.238554],[-78.982383,42.238552],[-78.983268,42.238549],[-78.986425,42.23859],[-78.988072,42.238573],[-78.989975,42.238608],[-78.991305,42.238589],[-78.99508299999999,42.238582],[-78.99752100000001,42.238601],[-78.998396,42.238599],[-79.001244,42.238603],[-79.006613,42.238614],[-79.01369,42.238655],[-79.01702899999999,42.238666],[-79.018542,42.238658],[-79.020066,42.238673],[-79.021582,42.238668],[-79.022865,42.238674],[-79.025982,42.238665],[-79.02696899999999,42.238673],[-79.027688,42.23867],[-79.028329,42.238668],[-79.028667,42.238678],[-79.028948,42.238675],[-79.02980599999999,42.238676],[-79.031057,42.238687],[-79.031222,42.23868],[-79.03174199999999,42.238681],[-79.032173,42.238671],[-79.034397,42.238682],[-79.036214,42.238675],[-79.039603,42.238679],[-79.045731,42.238696],[-79.046728,42.238704],[-79.047455,42.238703],[-79.048179,42.238715],[-79.04839800000001,42.238711],[-79.048929,42.238701],[-79.04965,42.238717],[-79.050382,42.238718],[-79.051008,42.238734],[-79.051885,42.238757],[-79.054299,42.23889],[-79.054587,42.238904],[-79.055127,42.238978],[-79.055408,42.239045],[-79.05593500000001,42.239236],[-79.05682,42.239628],[-79.056984,42.239701],[-79.058775,42.240496],[-79.058864,42.240535],[-79.059181,42.24066],[-79.05929500000001,42.240693],[-79.059597,42.240769],[-79.059804,42.240794],[-79.05995,42.240805],[-79.060041,42.240807],[-79.060126,42.240802],[-79.060166,42.242062],[-79.060187,42.242668],[-79.060305,42.24735],[-79.06030800000001,42.247404],[-79.06031299999999,42.247498],[-79.06031299999999,42.247517],[-79.06031900000001,42.248358],[-79.060303,42.249935],[-79.06030199999999,42.250051],[-79.060309,42.250909],[-79.060367,42.253888],[-79.06035199999999,42.25767],[-79.06041999999999,42.259611],[-79.060405,42.259819],[-79.060399,42.260256],[-79.06039800000001,42.260372],[-79.060417,42.265439],[-79.06044900000001,42.26808],[-79.06047700000001,42.268346],[-79.060474,42.268429],[-79.060479,42.268984],[-79.06048800000001,42.269254],[-79.06048,42.269274],[-79.060491,42.276972],[-79.060491,42.276999],[-79.060492,42.277688],[-79.060515,42.292942],[-79.06052,42.295782],[-79.060526,42.298747],[-79.060529,42.301004],[-79.060536,42.304231],[-79.06054,42.306695],[-79.06054,42.306754],[-79.06054,42.306948],[-79.06054,42.307066],[-79.06054,42.307084],[-79.060541,42.307104],[-79.060541,42.307142],[-79.060541,42.307204],[-79.060541,42.30736],[-79.060541,42.307461],[-79.060541,42.307505],[-79.060547,42.31096],[-79.06057800000001,42.326605],[-79.06058899999999,42.328606],[-79.06062900000001,42.335058],[-79.060633,42.335684],[-79.06063399999999,42.335831],[-79.06063399999999,42.335875],[-79.06063399999999,42.335889],[-79.060689,42.34485],[-79.06069100000001,42.345275],[-79.06070800000001,42.347917]]],"type":"Polygon"}
}