{
  "id": "361031583062",
  "type": "Feature",
  "properties": {
    "area_land":1282344,
    "area_water":0,
    "geoid":"361031583062",
    "name":"Block Group 2",
    "state":"ny"
},
  "bbox": [
    -73.008941,
    40.912616,
    -72.996314,
    40.933189
],
  "geometry": {"coordinates":[[[-73.008483,40.932888],[-73.00733200000001,40.932113],[-73.00633500000001,40.931396],[-73.006286,40.931361],[-73.00559199999999,40.930862],[-73.003455,40.929317],[-73.003181,40.929087],[-73.002548,40.928862],[-73.00147800000001,40.92852],[-73.000113,40.92741],[-72.998839,40.926391],[-72.997077,40.92503],[-72.996714,40.924514],[-72.996651,40.924424],[-72.996314,40.923946],[-72.99773399999999,40.923691],[-72.99829,40.923603],[-72.998481,40.923561],[-72.99866400000001,40.923508],[-72.998825,40.923446],[-72.998923,40.923397],[-72.99903,40.923313],[-72.999129,40.923213],[-72.999229,40.923092],[-72.999298,40.922863],[-72.999297,40.922702],[-72.999258,40.922497],[-72.999191,40.92234],[-72.999122,40.922134],[-72.999098,40.921974],[-72.999083,40.921817],[-72.9991,40.921676],[-72.999138,40.921539],[-72.999297,40.921181],[-72.99948000000001,40.920795],[-72.999633,40.920467],[-72.99974,40.920222],[-72.999869,40.919802],[-72.999892,40.919609],[-72.999945,40.919365],[-73.000029,40.91917],[-73.000266,40.918899],[-73.000563,40.918608],[-73.000806,40.918339],[-73.000922,40.918143],[-73.001014,40.917937],[-73.001098,40.917655],[-73.001159,40.917415],[-73.00123499999999,40.917201],[-73.001266,40.917019],[-73.001274,40.916832],[-73.00125800000001,40.916733],[-73.001144,40.916267],[-73.00108299999999,40.916054],[-73.001052,40.915836],[-73.000884,40.91531],[-73.000846,40.915099],[-73.000839,40.914909],[-73.000877,40.914757],[-73.00098300000001,40.91452],[-73.001313,40.913907],[-73.001655,40.913273],[-73.002028,40.912616],[-73.00529899999999,40.913637],[-73.00679,40.914103],[-73.00685799999999,40.914673],[-73.007102,40.916035],[-73.007491,40.918255],[-73.00775,40.920059],[-73.00797300000001,40.921291],[-73.008064,40.922008],[-73.00818599999999,40.923118],[-73.00894099999999,40.933189],[-73.008483,40.932888]]],"type":"Polygon"}
}