{
  "id": "361031119005",
  "type": "Feature",
  "properties": {
    "area_land":3926863,
    "area_water":0,
    "geoid":"361031119005",
    "name":"Block Group 5",
    "state":"ny"
},
  "bbox": [
    -73.451901,
    40.802009,
    -73.420967,
    40.828747
],
  "geometry": {"coordinates":[[[-73.45099500000001,40.819831],[-73.449198,40.820137],[-73.446962,40.820534],[-73.446061,40.820919],[-73.445435,40.821255],[-73.44489400000001,40.820671],[-73.44435300000001,40.820137],[-73.443803,40.819732],[-73.443597,40.819626],[-73.443116,40.81934],[-73.442971,40.819214],[-73.442826,40.819099],[-73.442764,40.819149],[-73.442391,40.819458],[-73.441866,40.819396],[-73.441659,40.819529],[-73.440811,40.820251],[-73.44036199999999,40.82064],[-73.438766,40.821979],[-73.438844,40.82204],[-73.438981,40.822185],[-73.439066,40.822262],[-73.438867,40.822361],[-73.438706,40.822417],[-73.438531,40.822441],[-73.43834,40.822422],[-73.437974,40.822326],[-73.43780599999999,40.822288],[-73.437623,40.822258],[-73.437348,40.822243],[-73.43715,40.822262],[-73.43692900000001,40.822304],[-73.436707,40.822368],[-73.436532,40.822429],[-73.436013,40.822658],[-73.43553300000001,40.822246],[-73.43461600000001,40.822948],[-73.43438,40.823082],[-73.43415899999999,40.823189],[-73.43394600000001,40.823246],[-73.433649,40.823307],[-73.43334900000001,40.823376],[-73.43303,40.823462],[-73.432749,40.823554],[-73.432233,40.823697],[-73.431766,40.82315],[-73.431307,40.82259],[-73.431151,40.822435],[-73.430978,40.822376],[-73.430774,40.822338],[-73.42998799999999,40.822274],[-73.429783,40.822274],[-73.429586,40.822298],[-73.429216,40.822413],[-73.429807,40.822934],[-73.429918,40.823045],[-73.430115,40.823241],[-73.430589,40.823772],[-73.43100699999999,40.824264],[-73.43119900000001,40.824542],[-73.43141900000001,40.824924],[-73.431535,40.825153],[-73.431619,40.825279],[-73.431755,40.82539],[-73.43192999999999,40.825469],[-73.432084,40.825523],[-73.432259,40.82555],[-73.43240400000001,40.825579],[-73.432732,40.825694],[-73.43301599999999,40.825825],[-73.433244,40.825966],[-73.43348,40.826153],[-73.433679,40.82637],[-73.433824,40.826595],[-73.433908,40.826832],[-73.43394600000001,40.827099],[-73.434106,40.827881],[-73.43218400000001,40.828144],[-73.430603,40.828357],[-73.428139,40.82867],[-73.427635,40.828716],[-73.427094,40.828747],[-73.421967,40.8287],[-73.42109000000001,40.828677],[-73.421052,40.827667],[-73.420967,40.825728],[-73.420967,40.825203],[-73.42100600000001,40.825081],[-73.42109000000001,40.824962],[-73.42119599999999,40.824851],[-73.421333,40.824744],[-73.421983,40.824298],[-73.42212000000001,40.82418],[-73.422211,40.823986],[-73.422134,40.823822],[-73.42203499999999,40.82368],[-73.421798,40.823448],[-73.4217,40.823337],[-73.421662,40.823215],[-73.42167000000001,40.823074],[-73.4217,40.82291],[-73.421768,40.822716],[-73.421814,40.822552],[-73.421746,40.82241],[-73.4217,40.822197],[-73.421616,40.821979],[-73.421539,40.821742],[-73.421516,40.821598],[-73.421502,40.821392],[-73.421516,40.821159],[-73.42151699999999,40.821003],[-73.42150100000001,40.820815],[-73.421464,40.820598],[-73.42139299999999,40.820373],[-73.42134799999999,40.820201],[-73.421143,40.819861],[-73.421639,40.819923],[-73.42196,40.819819],[-73.422195,40.819755],[-73.42241799999999,40.819705],[-73.42265399999999,40.819678],[-73.42293600000001,40.819675],[-73.423951,40.819736],[-73.424232,40.819671],[-73.42446200000001,40.819594],[-73.424706,40.819503],[-73.425117,40.819404],[-73.425355,40.81937],[-73.42559900000001,40.819298],[-73.426011,40.819122],[-73.426269,40.818985],[-73.426384,40.818737],[-73.42690399999999,40.818389],[-73.427567,40.818004],[-73.42793899999999,40.817921],[-73.428353,40.817821],[-73.428665,40.817737],[-73.429559,40.817344],[-73.43032100000001,40.81694],[-73.430421,40.816833],[-73.43049000000001,40.8167],[-73.43057399999999,40.816459],[-73.43074900000001,40.815692],[-73.43085600000001,40.815506],[-73.431009,40.815437],[-73.43131200000001,40.815445],[-73.432435,40.815998],[-73.432626,40.816077],[-73.432862,40.816101],[-73.433091,40.816081],[-73.433289,40.81604],[-73.433503,40.815948],[-73.43374,40.815803],[-73.433885,40.815517],[-73.43399100000001,40.814964],[-73.434083,40.814773],[-73.434296,40.8144],[-73.434403,40.814167],[-73.43446299999999,40.813988],[-73.434472,40.813751],[-73.43445800000001,40.813465],[-73.43441799999999,40.813175],[-73.43428900000001,40.812988],[-73.434061,40.812687],[-73.43383900000001,40.812347],[-73.43370899999999,40.812134],[-73.433626,40.811874],[-73.43304500000001,40.809574],[-73.432984,40.809212],[-73.43300000000001,40.809048],[-73.433054,40.808834],[-73.43315200000001,40.808601],[-73.433412,40.808044],[-73.43351800000001,40.807819],[-73.433628,40.807533],[-73.433755,40.807106],[-73.43379299999999,40.80664],[-73.433785,40.806137],[-73.433739,40.805523],[-73.434235,40.804218],[-73.43399100000001,40.803394],[-73.433965,40.803277],[-73.433806,40.802754],[-73.433784,40.802681],[-73.43611,40.802551],[-73.436778,40.802494],[-73.43743600000001,40.802402],[-73.43844900000001,40.802248],[-73.43919200000001,40.802122],[-73.439561,40.802069],[-73.440167,40.802017],[-73.440417,40.802009],[-73.440836,40.802009],[-73.441249,40.802018],[-73.44123500000001,40.802113],[-73.44170099999999,40.802145],[-73.44213499999999,40.802202],[-73.442739,40.80232],[-73.443414,40.802497],[-73.44391,40.802672],[-73.44415100000001,40.802774],[-73.44439800000001,40.802879],[-73.444576,40.802963],[-73.44503,40.803204],[-73.445927,40.803753],[-73.446518,40.8041],[-73.446955,40.804325],[-73.44748300000001,40.804563],[-73.447506,40.804467],[-73.448103,40.804694],[-73.448747,40.804901],[-73.448763,40.804999],[-73.448768,40.805318],[-73.449635,40.809729],[-73.449766,40.810398],[-73.450005,40.8116],[-73.45190100000001,40.819685],[-73.45099500000001,40.819831]]],"type":"Polygon"}
}