{
  "id": "360050293010",
  "type": "Feature",
  "properties": {
    "area_land":0,
    "area_water":733019,
    "geoid":"360050293010",
    "name":"Block Group 0",
    "state":"ny"
},
  "bbox": [
    -73.933808,
    40.879144,
    -73.920956,
    40.889692
],
  "geometry": {"coordinates":[[[-73.933652,40.882463],[-73.931729,40.885578],[-73.929821,40.888682],[-73.929455,40.889622],[-73.929428,40.889692],[-73.920956,40.887288],[-73.92497400000001,40.879144],[-73.933808,40.882214],[-73.933652,40.882463]]],"type":"Polygon"}
}