{
  "id": "360595171021",
  "type": "Feature",
  "properties": {
    "area_land":736879,
    "area_water":0,
    "geoid":"360595171021",
    "name":"Block Group 1",
    "state":"ny"
},
  "bbox": [
    -73.624582,
    40.873225,
    -73.61399,
    40.884942
],
  "geometry": {"coordinates":[[[-73.624582,40.883656],[-73.62299,40.883815],[-73.622444,40.883877],[-73.621977,40.883916],[-73.621717,40.883951],[-73.621065,40.884111],[-73.620833,40.884154],[-73.620514,40.8842],[-73.620182,40.884228],[-73.619255,40.884308],[-73.61870500000001,40.884361],[-73.61844499999999,40.884399],[-73.618155,40.884488],[-73.618002,40.884573],[-73.617824,40.884723],[-73.617609,40.884942],[-73.616837,40.882807],[-73.61615999999999,40.880262],[-73.61515900000001,40.878267],[-73.61412,40.876726],[-73.614062,40.876644],[-73.614041,40.87658],[-73.61404,40.876523],[-73.614006,40.875895],[-73.61399,40.875586],[-73.614026,40.875415],[-73.61405999999999,40.87528],[-73.614188,40.874979],[-73.614228,40.874976],[-73.61455100000001,40.874784],[-73.614881,40.874588],[-73.615055,40.874509],[-73.615202,40.87438],[-73.615309,40.874406],[-73.61560900000001,40.874388],[-73.61662200000001,40.874267],[-73.617549,40.874153],[-73.61804600000001,40.874091],[-73.619225,40.873941],[-73.619488,40.873906],[-73.619894,40.873839],[-73.62034300000001,40.873745],[-73.62052,40.87369],[-73.62078099999999,40.873595],[-73.621725,40.873225],[-73.62178400000001,40.873439],[-73.621821,40.873791],[-73.62185700000001,40.873901],[-73.62183400000001,40.874005],[-73.62183400000001,40.874191],[-73.622035,40.875076],[-73.62208699999999,40.875302],[-73.622158,40.8756],[-73.622176,40.875713],[-73.62219399999999,40.875749],[-73.622218,40.875829],[-73.622343,40.876143],[-73.622394,40.876161],[-73.62263799999999,40.876511],[-73.622652,40.876536],[-73.62277400000001,40.876758],[-73.62282399999999,40.876882],[-73.622873,40.877071],[-73.622922,40.87734],[-73.622939,40.877473],[-73.622978,40.877648],[-73.623167,40.878667],[-73.62327999999999,40.879257],[-73.623322,40.879368],[-73.623384,40.879516],[-73.623604,40.879834],[-73.62376399999999,40.880099],[-73.62382599999999,40.880274],[-73.62387,40.880379],[-73.623909,40.880533],[-73.624582,40.883656]]],"type":"Polygon"}
}