{
  "id": "360050266012",
  "type": "Feature",
  "properties": {
    "area_land":44065,
    "area_water":0,
    "geoid":"360050266012",
    "name":"Block Group 2",
    "state":"ny"
},
  "bbox": [
    -73.833346,
    40.846848,
    -73.830542,
    40.849479
],
  "geometry": {"coordinates":[[[-73.833105,40.849479],[-73.83220799999999,40.849394],[-73.831309,40.849308],[-73.83054199999999,40.849218],[-73.830586,40.849101],[-73.83068799999999,40.848881],[-73.831152,40.848046],[-73.83146000000001,40.847736],[-73.832235,40.847022],[-73.832499,40.846848],[-73.832449,40.847035],[-73.83334600000001,40.847248],[-73.833105,40.849479]]],"type":"Polygon"}
}