{
  "id": "360070142003",
  "type": "Feature",
  "properties": {
    "area_land":2622585,
    "area_water":0,
    "geoid":"360070142003",
    "name":"Block Group 3",
    "state":"ny"
},
  "bbox": [
    -75.98433,
    42.116975,
    -75.960518,
    42.141191
],
  "geometry": {"coordinates":[[[-75.98433,42.134677],[-75.983845,42.13467],[-75.97884999999999,42.134766],[-75.980521,42.140865],[-75.980378,42.140948],[-75.979962,42.141191],[-75.979669,42.140788],[-75.97955899999999,42.140641],[-75.979399,42.140481],[-75.979308,42.140389],[-75.979129,42.140258],[-75.97855199999999,42.139836],[-75.978177,42.139544],[-75.977806,42.139184],[-75.977485,42.138823],[-75.977215,42.138471],[-75.976994,42.138115],[-75.976924,42.137951],[-75.9769,42.137734],[-75.976916,42.136502],[-75.97713,42.134509],[-75.977253,42.133119],[-75.976474,42.133114],[-75.975994,42.13312],[-75.975245,42.133148],[-75.97411700000001,42.133209],[-75.972436,42.133297],[-75.97207899999999,42.133298],[-75.972104,42.133198],[-75.97211299999999,42.133056],[-75.972009,42.131634],[-75.971971,42.131129],[-75.971898,42.130127],[-75.97181399999999,42.129201],[-75.97180400000001,42.128337],[-75.971816,42.12789],[-75.969979,42.128062],[-75.96914099999999,42.128131],[-75.968999,42.12815],[-75.967663,42.128269],[-75.96660199999999,42.128368],[-75.965563,42.128466],[-75.965007,42.128509],[-75.964832,42.128524],[-75.96462,42.128543],[-75.964395,42.128518],[-75.964173,42.128457],[-75.963973,42.128368],[-75.963825,42.128267],[-75.963646,42.128095],[-75.96333,42.127732],[-75.963257,42.127661],[-75.96310200000001,42.127552],[-75.963002,42.127502],[-75.962796,42.127437],[-75.962574,42.127395],[-75.96233700000001,42.127393],[-75.962181,42.125707],[-75.962018,42.124032],[-75.961896,42.122725],[-75.96132,42.122761],[-75.96081700000001,42.122776],[-75.96067499999999,42.121244],[-75.960584,42.120354],[-75.960534,42.119689],[-75.960525,42.119667],[-75.960521,42.119515],[-75.96051799999999,42.119365],[-75.96118,42.119385],[-75.96116499999999,42.119249],[-75.961139,42.119009],[-75.961084,42.118503],[-75.96103100000001,42.117901],[-75.961017,42.117715],[-75.96096900000001,42.117349],[-75.96097399999999,42.117309],[-75.961055,42.117305],[-75.96104800000001,42.117162],[-75.96103100000001,42.117015],[-75.961028,42.116975],[-75.961535,42.117012],[-75.961589,42.117016],[-75.96435700000001,42.117216],[-75.96528499999999,42.117281],[-75.965343,42.117285],[-75.967957,42.117477],[-75.96819499999999,42.117496],[-75.96834200000001,42.117504],[-75.968993,42.117553],[-75.969067,42.117559],[-75.97102700000001,42.117697],[-75.977013,42.118131],[-75.98040399999999,42.118373],[-75.980964,42.118413],[-75.98094,42.118447],[-75.98084900000001,42.118687],[-75.98091700000001,42.119539],[-75.980929,42.119706],[-75.980987,42.121059],[-75.98124,42.124865],[-75.98143399999999,42.125962],[-75.981522,42.126976],[-75.981613,42.128043],[-75.98181,42.130328],[-75.982151,42.130483],[-75.982313,42.130542],[-75.982466,42.130578],[-75.982724,42.130605],[-75.98311699999999,42.130613],[-75.983728,42.130609],[-75.984111,42.130615],[-75.98433,42.134677]]],"type":"Polygon"}
}