{
  "id": "361031580073",
  "type": "Feature",
  "properties": {
    "area_land":1426079,
    "area_water":0,
    "geoid":"361031580073",
    "name":"Block Group 3",
    "state":"ny"
},
  "bbox": [
    -73.131886,
    40.893074,
    -73.115899,
    40.915235
],
  "geometry": {"coordinates":[[[-73.13188599999999,40.902874],[-73.122878,40.905381],[-73.124854,40.908554],[-73.124928,40.908618],[-73.125039,40.908763],[-73.12640500000001,40.908087],[-73.127775,40.908041],[-73.128444,40.908202],[-73.129133,40.907954],[-73.129231,40.90837],[-73.12954000000001,40.908662],[-73.130275,40.908446],[-73.13060400000001,40.908645],[-73.130016,40.909076],[-73.129986,40.909411],[-73.129817,40.909561],[-73.129307,40.910292],[-73.12840199999999,40.910501],[-73.1281,40.910523],[-73.127859,40.910527],[-73.12754200000001,40.910479],[-73.127314,40.910407],[-73.127133,40.910318],[-73.12702899999999,40.910282],[-73.126897,40.910314],[-73.126744,40.910359],[-73.12658399999999,40.910407],[-73.126367,40.910387],[-73.125793,40.910196],[-73.125626,40.910106],[-73.125417,40.909969],[-73.125148,40.909746],[-73.124286,40.910318],[-73.12385500000001,40.910221],[-73.123166,40.909811],[-73.12281400000001,40.909877],[-73.12193000000001,40.90988],[-73.121753,40.909852],[-73.12143399999999,40.909785],[-73.120784,40.909716],[-73.120266,40.909693],[-73.11971699999999,40.909713],[-73.119561,40.909757],[-73.119401,40.909834],[-73.119253,40.90995],[-73.11917099999999,40.910035],[-73.119108,40.910152],[-73.11906999999999,40.910249],[-73.119038,40.910789],[-73.119007,40.910972],[-73.11895,40.911114],[-73.118843,40.911386],[-73.118751,40.911742],[-73.118707,40.91191],[-73.118675,40.912194],[-73.118675,40.912491],[-73.11870999999999,40.91274],[-73.118757,40.91291],[-73.118855,40.913194],[-73.119,40.913611],[-73.11907600000001,40.913851],[-73.119105,40.914022],[-73.119111,40.914157],[-73.119101,40.914309],[-73.11907600000001,40.914482],[-73.119023,40.914754],[-73.11894700000001,40.914988],[-73.118838,40.915235],[-73.11838299999999,40.914875],[-73.118076,40.914785],[-73.11764599999999,40.9146],[-73.117378,40.914451],[-73.117034,40.914328],[-73.116485,40.914167],[-73.11629000000001,40.914127],[-73.11607600000001,40.914068],[-73.116221,40.913782],[-73.116511,40.91328],[-73.11714600000001,40.912328],[-73.117997,40.911058],[-73.118212,40.910653],[-73.118386,40.910192],[-73.11852500000001,40.909747],[-73.118583,40.909386],[-73.11859699999999,40.908916],[-73.118593,40.908828],[-73.11854,40.908247],[-73.118506,40.908075],[-73.118379,40.907638],[-73.118174,40.907122],[-73.11769099999999,40.906198],[-73.116867,40.904854],[-73.11662,40.904379],[-73.11635200000001,40.903889],[-73.115899,40.903084],[-73.11609199999999,40.903048],[-73.116007,40.901959],[-73.117144,40.90189],[-73.121122,40.901336],[-73.12264500000001,40.900869],[-73.12199,40.899257],[-73.121067,40.896946],[-73.120418,40.895308],[-73.11971200000001,40.893456],[-73.120824,40.893635],[-73.121246,40.893683],[-73.123321,40.893641],[-73.125175,40.893582],[-73.125632,40.895332],[-73.12731100000001,40.895081],[-73.12677600000001,40.893376],[-73.127695,40.893074],[-73.129244,40.897935],[-73.12929200000001,40.898085],[-73.129499,40.898852],[-73.12859,40.899155],[-73.12879599999999,40.899921],[-73.130177,40.899649],[-73.130268,40.899882],[-73.130307,40.899952],[-73.130482,40.900237],[-73.130527,40.900298],[-73.130574,40.900347],[-73.12952300000001,40.900677],[-73.129897,40.901077],[-73.130855,40.900677],[-73.13113800000001,40.901031],[-73.131207,40.901126],[-73.13126099999999,40.901221],[-73.131299,40.901301],[-73.130274,40.901557],[-73.130415,40.901894],[-73.131466,40.901702],[-73.131496,40.901797],[-73.131642,40.902188],[-73.13184800000001,40.902735],[-73.13188599999999,40.902874]]],"type":"Polygon"}
}