{
  "id": "361059521001",
  "type": "Feature",
  "properties": {
    "area_land":47767627,
    "area_water":757384,
    "geoid":"361059521001",
    "name":"Block Group 1",
    "state":"ny"
},
  "bbox": [
    -75.026322,
    41.713708,
    -74.92189,
    41.788408
],
  "geometry": {"coordinates":[[[-75.02605,41.757238],[-75.02594000000001,41.757259],[-75.02533099999999,41.757296],[-75.02516,41.757329],[-75.024978,41.757394],[-75.024597,41.757584],[-75.024192,41.757715],[-75.024046,41.75778],[-75.023933,41.757853],[-75.023813,41.757963],[-75.023674,41.758119],[-75.023532,41.758345],[-75.023264,41.758826],[-75.023071,41.759132],[-75.02279,41.759514],[-75.022589,41.75974],[-75.022361,41.759949],[-75.021973,41.760247],[-75.02181299999999,41.760385],[-75.021547,41.760568],[-75.02138600000001,41.760662],[-75.02123,41.760728],[-75.021109,41.760793],[-75.02083,41.761027],[-75.020544,41.761323],[-75.01993,41.761969],[-75.019828,41.762056],[-75.019711,41.762107],[-75.01960099999999,41.762115],[-75.01912900000001,41.762038],[-75.019023,41.762038],[-75.01892100000001,41.76206],[-75.018845,41.7621],[-75.01876799999999,41.762177],[-75.018721,41.762275],[-75.018703,41.762381],[-75.01870599999999,41.762501],[-75.018728,41.762657],[-75.018739,41.763157],[-75.01869499999999,41.763266],[-75.01863299999999,41.763328],[-75.018529,41.763389],[-75.01813900000001,41.763601],[-75.01802600000001,41.76363],[-75.01784000000001,41.763648],[-75.017691,41.763626],[-75.01720400000001,41.763503],[-75.017127,41.76351],[-75.017062,41.76355],[-75.01698500000001,41.763626],[-75.01658399999999,41.763965],[-75.016308,41.764149],[-75.015941,41.764359],[-75.01579099999999,41.764424],[-75.015674,41.764508],[-75.01558,41.764596],[-75.01549900000001,41.764716],[-75.015236,41.765261],[-75.01514,41.765379],[-75.015024,41.765459],[-75.014903,41.765525],[-75.01478299999999,41.765576],[-75.01464799999999,41.765608],[-75.014528,41.765612],[-75.01412000000001,41.765559],[-75.013803,41.765557],[-75.013555,41.76559],[-75.013049,41.765689],[-75.012383,41.765884],[-75.011979,41.766026],[-75.011284,41.766342],[-75.010499,41.766884],[-75.01034900000001,41.766959],[-75.009839,41.767128],[-75.009581,41.767255],[-75.00936400000001,41.767381],[-75.009259,41.767501],[-75.009199,41.767591],[-75.009169,41.767681],[-75.00906500000001,41.767816],[-75.008945,41.767816],[-75.00881,41.767801],[-75.008611,41.767746],[-75.00839000000001,41.767696],[-75.00813100000001,41.767681],[-75.008,41.767685],[-75.007829,41.767725],[-75.00745999999999,41.767881],[-75.007205,41.768016],[-75.006704,41.768348],[-75.006518,41.768548],[-75.006503,41.768639],[-75.006511,41.768716],[-75.00654400000001,41.768778],[-75.006709,41.768945],[-75.006742,41.769033],[-75.00673500000001,41.769098],[-75.00668400000001,41.769156],[-75.006604,41.769208],[-75.006472,41.769266],[-75.006327,41.76931],[-75.006141,41.769346],[-75.006017,41.769382],[-75.00586699999999,41.769463],[-75.005758,41.769546],[-75.005714,41.769601],[-75.00569900000001,41.769663],[-75.005707,41.769736],[-75.005745,41.769805],[-75.005792,41.769852],[-75.00592,41.769929],[-75.00592399999999,41.769962],[-75.005906,41.769998],[-75.00573,41.770082],[-75.00528,41.77033],[-75.00505,41.770421],[-75.004806,41.770457],[-75.00413,41.770592],[-75.004042,41.770639],[-75.00397700000001,41.770709],[-75.003944,41.770821],[-75.003947,41.770949],[-75.004002,41.771076],[-75.004017,41.771193],[-75.004006,41.771306],[-75.003962,41.771404],[-75.00380699999999,41.771623],[-75.003477,41.772024],[-75.003451,41.772111],[-75.003451,41.772199],[-75.003561,41.772341],[-75.003597,41.772425],[-75.00360499999999,41.772512],[-75.00357200000001,41.772603],[-75.00351000000001,41.77265],[-75.00340799999999,41.772676],[-75.003224,41.772706],[-75.003096,41.772776],[-75.003052,41.772834],[-75.002983,41.773067],[-75.003006,41.773435],[-75.002967,41.7735],[-75.00287400000001,41.773561],[-75.00282799999999,41.773605],[-75.002808,41.773654],[-75.002799,41.773728],[-75.00280600000001,41.773792],[-75.0029,41.773992],[-75.00290800000001,41.774062],[-75.002854,41.774209],[-75.00281099999999,41.774264],[-75.00277,41.774295],[-75.00271600000001,41.774317],[-75.002528,41.77435],[-75.00245,41.774379],[-75.002399,41.77441],[-75.00236,41.774453],[-75.00232200000001,41.774528],[-75.00226499999999,41.774728],[-75.002224,41.775063],[-75.002189,41.775101],[-75.001975,41.77522],[-75.00182,41.775406],[-75.00172999999999,41.775497],[-75.001698,41.775548],[-75.001637,41.775727],[-75.00160099999999,41.775778],[-75.00156800000001,41.775799],[-75.00148,41.77581],[-75.001171,41.77581],[-75.001065,41.77584],[-75.00099899999999,41.775872],[-75.000906,41.775934],[-75.000777,41.775973],[-75.000708,41.776003],[-75.000609,41.776082],[-75.00057099999999,41.776133],[-75.00055399999999,41.776238],[-75.000562,41.776289],[-75.000613,41.776377],[-75.000618,41.77643],[-75.000609,41.776475],[-75.000545,41.776568],[-75.00043100000001,41.776696],[-75.000091,41.777244],[-74.999959,41.777398],[-74.9999,41.777437],[-74.999619,41.777569],[-74.999168,41.777836],[-74.99903999999999,41.777927],[-74.998949,41.778049],[-74.998634,41.778771],[-74.998549,41.778909],[-74.997795,41.779557],[-74.997744,41.779638],[-74.997721,41.779726],[-74.99771800000001,41.780559],[-74.997691,41.781076],[-74.99771,41.781253],[-74.997756,41.781469],[-74.998002,41.782236],[-74.998029,41.782309],[-74.998064,41.782355],[-74.99815599999999,41.782421],[-74.998195,41.782494],[-74.99830300000001,41.782582],[-74.998572,41.782751],[-74.99859499999999,41.782786],[-74.998588,41.783422],[-74.998611,41.783453],[-74.998654,41.783486],[-74.998696,41.783558],[-74.998722,41.783619],[-74.99872999999999,41.783676],[-74.998715,41.783703],[-74.998688,41.783719],[-74.99851099999999,41.783753],[-74.998476,41.783772],[-74.99839900000001,41.78388],[-74.998268,41.783915],[-74.998226,41.783946],[-74.998172,41.784032],[-74.998114,41.784097],[-74.997895,41.784267],[-74.997787,41.784324],[-74.99759400000001,41.784382],[-74.99747499999999,41.784409],[-74.997117,41.78454],[-74.997013,41.784532],[-74.996717,41.784338],[-74.996717,41.784315],[-74.996801,41.784284],[-74.99685100000001,41.784276],[-74.99687400000001,41.784261],[-74.996878,41.784238],[-74.996836,41.784211],[-74.996459,41.78418],[-74.996432,41.784196],[-74.99642,41.784242],[-74.996466,41.784296],[-74.996455,41.784338],[-74.996397,41.784361],[-74.996255,41.784361],[-74.996182,41.784349],[-74.996143,41.784353],[-74.995954,41.784451],[-74.995893,41.784467],[-74.99575400000001,41.784482],[-74.995631,41.784536],[-74.99550000000001,41.784571],[-74.995454,41.784594],[-74.995419,41.784628],[-74.9953,41.784913],[-74.995265,41.784971],[-74.99509999999999,41.785074],[-74.995034,41.785132],[-74.99500399999999,41.785182],[-74.994984,41.785244],[-74.994992,41.785534],[-74.994984,41.785576],[-74.994946,41.785646],[-74.994896,41.785811],[-74.994873,41.785834],[-74.994838,41.785842],[-74.994603,41.785853],[-74.994553,41.785865],[-74.994522,41.785888],[-74.99449199999999,41.78593],[-74.994472,41.786042],[-74.99446500000001,41.786219],[-74.99444200000001,41.786265],[-74.99431800000001,41.786386],[-74.994288,41.786432],[-74.99422199999999,41.786686],[-74.99418,41.786717],[-74.99413,41.786732],[-74.993864,41.786744],[-74.993847,41.786731],[-74.99382199999999,41.786682],[-74.993797,41.786681],[-74.99377200000001,41.78669],[-74.993752,41.786717],[-74.993725,41.786878],[-74.99370999999999,41.786909],[-74.993685,41.786908],[-74.993602,41.786882],[-74.99356400000001,41.786886],[-74.993452,41.786955],[-74.99338299999999,41.786967],[-74.99322100000001,41.786967],[-74.993133,41.787005],[-74.99305200000001,41.787001],[-74.99301699999999,41.787013],[-74.99296699999999,41.787147],[-74.992932,41.787194],[-74.99288199999999,41.787213],[-74.992717,41.787357],[-74.992644,41.787457],[-74.992574,41.787446],[-74.99247800000001,41.787396],[-74.99244,41.787388],[-74.99240500000001,41.787399],[-74.992324,41.787453],[-74.992293,41.787492],[-74.992282,41.787538],[-74.992293,41.787599],[-74.992386,41.787699],[-74.992401,41.787726],[-74.99239,41.787776],[-74.99235899999999,41.787796],[-74.99229699999999,41.787799],[-74.992116,41.787776],[-74.991889,41.787799],[-74.991816,41.787819],[-74.99168899999999,41.787892],[-74.991658,41.787922],[-74.991651,41.787953],[-74.991658,41.787984],[-74.991685,41.787999],[-74.991805,41.788003],[-74.991816,41.788072],[-74.991793,41.788111],[-74.991754,41.788142],[-74.991697,41.788161],[-74.99157,41.788172],[-74.99150400000001,41.788188],[-74.99137,41.788274],[-74.99115399999999,41.788309],[-74.991077,41.788344],[-74.99099699999999,41.788408],[-74.98909999999999,41.788043],[-74.988387,41.788021],[-74.980385,41.786348],[-74.980031,41.786293],[-74.969047,41.784235],[-74.966156,41.783699],[-74.946939,41.780165],[-74.946054,41.779997],[-74.94601,41.779977],[-74.945841,41.77993],[-74.945139,41.779807],[-74.941661,41.779116],[-74.94126,41.779033],[-74.94044700000001,41.778875],[-74.94005799999999,41.778813],[-74.9388,41.778574],[-74.936689,41.778174],[-74.935497,41.77793],[-74.934606,41.777842],[-74.93387199999999,41.777799],[-74.92360600000001,41.775631],[-74.922202,41.775354],[-74.921903,41.77528],[-74.92189,41.775002],[-74.921953,41.773251],[-74.922145,41.772461],[-74.92219,41.772107],[-74.922256,41.771675],[-74.922284,41.770216],[-74.92309299999999,41.766369],[-74.923109,41.766049],[-74.923129,41.765637],[-74.923553,41.76055],[-74.924644,41.750102],[-74.924705,41.749491],[-74.92576,41.742518],[-74.92675199999999,41.735854],[-74.92704999999999,41.733603],[-74.927561,41.730611],[-74.928141,41.726754],[-74.928369,41.725132],[-74.928399,41.724981],[-74.93018499999999,41.713708],[-74.94790399999999,41.715851],[-74.951612,41.716058],[-74.952476,41.716143],[-74.953542,41.716275],[-74.962457,41.71736],[-74.962678,41.717386],[-74.96274099999999,41.717397],[-74.962858,41.717414],[-74.963139,41.717458],[-74.96360199999999,41.717523],[-74.964079,41.717586],[-74.96510600000001,41.717664],[-74.966579,41.717821],[-74.966443,41.717891],[-74.96804400000001,41.718028],[-74.967305,41.720521],[-74.97393099999999,41.721177],[-74.97483800000001,41.721267],[-74.97492,41.721276],[-74.974964,41.721281],[-74.97605299999999,41.721886],[-74.97692600000001,41.722409],[-74.977643,41.722835],[-74.978432,41.723299],[-74.97947499999999,41.72392],[-74.97973,41.724081],[-74.97991399999999,41.724213],[-74.98029,41.724557],[-74.980559,41.724873],[-74.980728,41.72514],[-74.980906,41.725386],[-74.981202,41.7259],[-74.981516,41.726477],[-74.981916,41.727125],[-74.98209300000001,41.727335],[-74.98236300000001,41.727572],[-74.98253200000001,41.727679],[-74.982816,41.727819],[-74.983333,41.728018],[-74.983504,41.728078],[-74.983763,41.728169],[-74.98409599999999,41.728273],[-74.984157,41.728058],[-74.984228,41.7277],[-74.984247,41.727521],[-74.984318,41.72674],[-74.98437300000001,41.726558],[-74.984435,41.726458],[-74.98451900000001,41.726356],[-74.984622,41.726266],[-74.98474899999999,41.726184],[-74.984898,41.726116],[-74.98521599999999,41.726025],[-74.986239,41.725863],[-74.98653,41.725849],[-74.986738,41.725876],[-74.986852,41.725901],[-74.987092,41.725988],[-74.98745,41.726156],[-74.98774299999999,41.726282],[-74.988106,41.726404],[-74.98819,41.726427],[-74.988314,41.726462],[-74.98913899999999,41.726669],[-74.989262,41.726706],[-74.989507,41.726819],[-74.989856,41.727081],[-74.99014200000001,41.727318],[-74.990414,41.727598],[-74.990531,41.727753],[-74.990639,41.727964],[-74.990771,41.728328],[-74.99080499999999,41.728397],[-74.990942,41.728573],[-74.99101,41.728635],[-74.991096,41.728694],[-74.991213,41.728759],[-74.991347,41.728811],[-74.991479,41.728848],[-74.991775,41.728893],[-74.99192600000001,41.7289],[-74.99247099999999,41.728901],[-74.992715,41.72892],[-74.99297,41.728962],[-74.993225,41.729022],[-74.99345700000001,41.729053],[-74.994043,41.729049],[-74.994389,41.72906],[-74.994805,41.729105],[-74.995171,41.72917],[-74.995459,41.729257],[-74.995616,41.729316],[-74.996375,41.729664],[-74.996483,41.729702],[-74.997056,41.729855],[-74.997379,41.729981],[-74.997778,41.730152],[-74.998009,41.730241],[-74.998414,41.730364],[-74.99896699999999,41.730519],[-74.999448,41.730634],[-74.999582,41.730656],[-74.999858,41.730683],[-75.000967,41.730713],[-75.00125300000001,41.730733],[-75.001347,41.73075],[-75.001537,41.730825],[-75.001616,41.730865],[-75.00182,41.731009],[-75.00209099999999,41.731227],[-75.002685,41.731713],[-75.002954,41.731977],[-75.00312099999999,41.732218],[-75.003272,41.732493],[-75.003455,41.732756],[-75.003866,41.733223],[-75.004409,41.73383],[-75.004622,41.734117],[-75.005189,41.735032],[-75.005503,41.735515],[-75.00556,41.735638],[-75.00560400000001,41.735815],[-75.005616,41.735962],[-75.005526,41.736379],[-75.00543999999999,41.736708],[-75.005341,41.737169],[-75.00530999999999,41.737478],[-75.005308,41.737756],[-75.00535000000001,41.73803],[-75.00539000000001,41.738161],[-75.00554200000001,41.738493],[-75.005786,41.738936],[-75.005948,41.739159],[-75.006032,41.739249],[-75.006226,41.739424],[-75.006812,41.739827],[-75.007075,41.739992],[-75.00740500000001,41.740196],[-75.007592,41.740278],[-75.00798500000001,41.740418],[-75.00835600000001,41.740505],[-75.00861500000001,41.740537],[-75.008916,41.740569],[-75.00913199999999,41.740595],[-75.009416,41.740635],[-75.00967199999999,41.740694],[-75.009906,41.740761],[-75.010167,41.740851],[-75.010482,41.741],[-75.010802,41.741184],[-75.01114800000001,41.74136],[-75.011476,41.741535],[-75.01168800000001,41.741648],[-75.012007,41.741841],[-75.01222799999999,41.74199],[-75.01244800000001,41.742169],[-75.01258799999999,41.7423],[-75.012772,41.742471],[-75.01292100000001,41.74261],[-75.013029,41.742687],[-75.013344,41.742867],[-75.01355100000001,41.742988],[-75.01377100000001,41.743146],[-75.01395100000001,41.743335],[-75.014082,41.743591],[-75.01418099999999,41.743789],[-75.014329,41.744104],[-75.014482,41.744334],[-75.014707,41.744509],[-75.01498599999999,41.744635],[-75.015359,41.744761],[-75.01576,41.744919],[-75.016147,41.745018],[-75.01652900000001,41.745072],[-75.016732,41.745067],[-75.017056,41.745058],[-75.01731700000001,41.745031],[-75.017528,41.745009],[-75.017748,41.744995],[-75.01794200000001,41.745022],[-75.01814,41.745058],[-75.01836,41.745157],[-75.01873399999999,41.745364],[-75.01915700000001,41.745634],[-75.019328,41.745751],[-75.01969699999999,41.746016],[-75.020039,41.746286],[-75.02028199999999,41.746516],[-75.020426,41.746736],[-75.020565,41.747051],[-75.02068199999999,41.747443],[-75.020911,41.748383],[-75.020988,41.748945],[-75.021136,41.749616],[-75.021204,41.750174],[-75.02122199999999,41.75043],[-75.021298,41.750615],[-75.021433,41.750795],[-75.021483,41.750898],[-75.021537,41.751033],[-75.021688,41.751236],[-75.021805,41.751371],[-75.022246,41.75169],[-75.022358,41.75178],[-75.022638,41.752078],[-75.022851,41.752448],[-75.023087,41.75289],[-75.023668,41.754203],[-75.023762,41.754375],[-75.023794,41.75447],[-75.023853,41.754828],[-75.023881,41.754905],[-75.023982,41.755071],[-75.024102,41.755198],[-75.024227,41.755311],[-75.025267,41.756166],[-75.02632199999999,41.757114],[-75.02605,41.757238]]],"type":"Polygon"}
}