{
  "id": "360290070001",
  "type": "Feature",
  "properties": {
    "area_land":281415,
    "area_water":234148,
    "geoid":"360290070001",
    "name":"Block Group 1",
    "state":"ny"
},
  "bbox": [
    -78.905769,
    42.905994,
    -78.894207,
    42.913057
],
  "geometry": {"coordinates":[[[-78.90575800000001,42.908049],[-78.905759,42.913057],[-78.90293800000001,42.912857],[-78.902648,42.912827],[-78.90205,42.912759],[-78.90167599999999,42.912854],[-78.90168,42.913032],[-78.901574,42.913032],[-78.90154200000001,42.913033],[-78.901484,42.913034],[-78.90138399999999,42.913035],[-78.90078200000001,42.913038],[-78.900676,42.913038],[-78.900588,42.913039],[-78.89970700000001,42.913043],[-78.89971300000001,42.912979],[-78.89962800000001,42.912904],[-78.89955,42.912827],[-78.89861500000001,42.911853],[-78.898128,42.911341],[-78.898111,42.911324],[-78.897434,42.910617],[-78.897167,42.91035],[-78.897058,42.910235],[-78.89686500000001,42.910034],[-78.89600900000001,42.909119],[-78.89581800000001,42.90892],[-78.895685,42.908778],[-78.89420699999999,42.9072],[-78.895466,42.906553],[-78.896592,42.905994],[-78.897008,42.906448],[-78.89769699999999,42.907171],[-78.89806,42.907561],[-78.89919500000001,42.906976],[-78.90023100000001,42.906447],[-78.90026899999999,42.906429],[-78.900312,42.90645],[-78.90042200000001,42.906505],[-78.900457,42.906281],[-78.900498,42.906061],[-78.90073,42.906166],[-78.90123,42.906324],[-78.901366,42.906343],[-78.901687,42.906388],[-78.90282000000001,42.906542],[-78.90576900000001,42.906942],[-78.90575800000001,42.908049]]],"type":"Polygon"}
}