{
  "id": "360290090061",
  "type": "Feature",
  "properties": {
    "area_land":512223,
    "area_water":0,
    "geoid":"360290090061",
    "name":"Block Group 1",
    "state":"ny"
},
  "bbox": [
    -78.710051,
    42.977972,
    -78.704719,
    42.989783
],
  "geometry": {"coordinates":[[[-78.71005100000001,42.980696],[-78.710036,42.981306],[-78.710025,42.98213],[-78.710022,42.982995],[-78.71001699999999,42.983217],[-78.710013,42.983409],[-78.709985,42.985281],[-78.70992200000001,42.989007],[-78.708641,42.989007],[-78.707373,42.989009],[-78.707363,42.989783],[-78.70602700000001,42.989644],[-78.705922,42.989632],[-78.704719,42.989506],[-78.70477099999999,42.986471],[-78.704793,42.983382],[-78.70482699999999,42.981358],[-78.704846,42.979878],[-78.705037,42.979889],[-78.705434,42.979922],[-78.705465,42.978034],[-78.706306,42.978017],[-78.7064,42.978015],[-78.707067,42.977998],[-78.70736100000001,42.977994],[-78.707632,42.977991],[-78.70846299999999,42.977975],[-78.708558,42.977973],[-78.70861499999999,42.977972],[-78.708686,42.978129],[-78.708736,42.978368],[-78.708775,42.978983],[-78.710044,42.978982],[-78.71004000000001,42.979531],[-78.710048,42.980426],[-78.71005100000001,42.980696]]],"type":"Polygon"}
}