{
  "id": "360050210021",
  "type": "Feature",
  "properties": {
    "area_land":23525,
    "area_water":0,
    "geoid":"360050210021",
    "name":"Block Group 1",
    "state":"ny"
},
  "bbox": [
    -73.859136,
    40.835897,
    -73.855765,
    40.838428
],
  "geometry": {"coordinates":[[[-73.85913600000001,40.838239],[-73.85744200000001,40.838428],[-73.857473,40.838076],[-73.857422,40.837682],[-73.857173,40.837295],[-73.856632,40.836823],[-73.85576500000001,40.836506],[-73.855825,40.836248],[-73.855825,40.836042],[-73.855858,40.835897],[-73.85654700000001,40.836289],[-73.857107,40.83667],[-73.857679,40.837017],[-73.85865200000001,40.837589],[-73.85886600000001,40.837726],[-73.85906900000001,40.838056],[-73.85913600000001,40.838239]]],"type":"Polygon"}
}