{
  "id": "360471018001",
  "type": "Feature",
  "properties": {
    "area_land":283765,
    "area_water":0,
    "geoid":"360471018001",
    "name":"Block Group 1",
    "state":"ny"
},
  "bbox": [
    -73.892551,
    40.63768,
    -73.880739,
    40.650026
],
  "geometry": {"coordinates":[[[-73.89125199999999,40.650026],[-73.88958700000001,40.648111],[-73.886557,40.645087],[-73.886186,40.644771],[-73.88432400000001,40.642937],[-73.883735,40.642451],[-73.88311299999999,40.641874],[-73.882516,40.641351],[-73.881901,40.640835],[-73.88073900000001,40.639613],[-73.881007,40.639433],[-73.881574,40.639052],[-73.883718,40.63768],[-73.884372,40.638272],[-73.884953,40.638787],[-73.885565,40.639347],[-73.886186,40.639904],[-73.886762,40.640427],[-73.88738600000001,40.640981],[-73.88525300000001,40.642357],[-73.88587200000001,40.642909],[-73.886459,40.643434],[-73.887074,40.643985],[-73.887697,40.644548],[-73.88827000000001,40.645062],[-73.888901,40.64563],[-73.889521,40.646174],[-73.890094,40.646697],[-73.89071,40.647256],[-73.892551,40.648911],[-73.89125199999999,40.650026]]],"type":"Polygon"}
}