{
  "id": "361190131021",
  "type": "Feature",
  "properties": {
    "area_land":10736407,
    "area_water":159692,
    "geoid":"361190131021",
    "name":"Block Group 1",
    "state":"ny"
},
  "bbox": [
    -73.75406,
    41.140171,
    -73.703433,
    41.191354
],
  "geometry": {"coordinates":[[[-73.75406,41.151487],[-73.752925,41.151623],[-73.752448,41.151668],[-73.751772,41.151748],[-73.751524,41.1518],[-73.750775,41.152027],[-73.750264,41.15214],[-73.750122,41.152197],[-73.749765,41.152511],[-73.749661,41.152619],[-73.749572,41.15273],[-73.74948500000001,41.152859],[-73.749399,41.15302],[-73.74932800000001,41.153207],[-73.749206,41.153479],[-73.749084,41.153805],[-73.74896200000001,41.154069],[-73.748897,41.154162],[-73.748851,41.154209],[-73.748797,41.154241],[-73.748732,41.154252],[-73.748564,41.154244],[-73.748406,41.154255],[-73.748223,41.154334],[-73.748144,41.154384],[-73.747975,41.154563],[-73.747832,41.154753],[-73.74745900000001,41.155361],[-73.74724399999999,41.155746],[-73.746971,41.156305],[-73.74685599999999,41.156597],[-73.746713,41.157139],[-73.746548,41.15749],[-73.74644000000001,41.15768],[-73.74632200000001,41.157943],[-73.746289,41.158062],[-73.746264,41.15823],[-73.746275,41.158752],[-73.74630000000001,41.158974],[-73.74629299999999,41.15906],[-73.746268,41.159146],[-73.74619300000001,41.159311],[-73.746053,41.159578],[-73.745895,41.159832],[-73.74580899999999,41.159943],[-73.745637,41.160072],[-73.745464,41.160155],[-73.74489800000001,41.160468],[-73.744815,41.160554],[-73.74476900000001,41.160626],[-73.744722,41.160766],[-73.74461100000001,41.161246],[-73.74452100000001,41.161329],[-73.744399,41.16135],[-73.74402600000001,41.161379],[-73.743725,41.161427],[-73.74361399999999,41.161456],[-73.743382,41.161575],[-73.743439,41.161832],[-73.743453,41.161958],[-73.74345700000001,41.162158],[-73.743493,41.162467],[-73.74355,41.162592],[-73.74364300000001,41.162707],[-73.74378,41.16285],[-73.744225,41.163545],[-73.74429600000001,41.163678],[-73.744339,41.163818],[-73.74435,41.163943],[-73.744332,41.164198],[-73.74430700000001,41.164273],[-73.74426,41.164334],[-73.743973,41.164577],[-73.743909,41.164571],[-73.74374,41.164521],[-73.743579,41.164453],[-73.74321999999999,41.164191],[-73.742869,41.163885],[-73.742108,41.163294],[-73.741972,41.163225],[-73.741843,41.16319],[-73.74170700000001,41.163186],[-73.741603,41.163199],[-73.741384,41.163277],[-73.74127300000001,41.163356],[-73.741179,41.163449],[-73.741086,41.163575],[-73.74083899999999,41.163987],[-73.740681,41.164154],[-73.740559,41.164236],[-73.740455,41.164272],[-73.74038299999999,41.164284],[-73.740376,41.164485],[-73.74039,41.164935],[-73.74041,41.165149],[-73.74040100000001,41.165427],[-73.740345,41.1658],[-73.74029400000001,41.166075],[-73.739982,41.166942],[-73.739732,41.167503],[-73.739616,41.16761],[-73.739313,41.167788],[-73.739268,41.167886],[-73.739119,41.16848],[-73.739081,41.168594],[-73.73900500000001,41.168722],[-73.738849,41.168878],[-73.73874499999999,41.168947],[-73.73858199999999,41.169164],[-73.73862,41.169182],[-73.73864399999999,41.16924],[-73.738658,41.169337],[-73.738648,41.169472],[-73.73861599999999,41.169642],[-73.738578,41.16977],[-73.738519,41.169839],[-73.738377,41.169898],[-73.738258,41.169923],[-73.738229,41.169929],[-73.738073,41.169991],[-73.737931,41.170225],[-73.73774299999999,41.170586],[-73.737737,41.170668],[-73.737775,41.170872],[-73.73789600000001,41.171105],[-73.73791300000001,41.171168],[-73.738055,41.171348],[-73.738152,41.171434],[-73.73816600000001,41.171486],[-73.738114,41.171694],[-73.738114,41.171801],[-73.73816600000001,41.171887],[-73.738332,41.172019],[-73.738384,41.1721],[-73.738758,41.17282],[-73.738793,41.17292],[-73.738793,41.172979],[-73.738772,41.173045],[-73.738592,41.173334],[-73.73852599999999,41.173472],[-73.738516,41.173573],[-73.73853,41.173673],[-73.73866099999999,41.173811],[-73.738831,41.173938],[-73.738882,41.17402],[-73.73904899999999,41.174346],[-73.73912199999999,41.174408],[-73.739482,41.174533],[-73.73953,41.174558],[-73.73893200000001,41.174633],[-73.73875200000001,41.174694],[-73.73870599999999,41.174726],[-73.73866599999999,41.174769],[-73.73862699999999,41.174866],[-73.738579,41.175089],[-73.738518,41.175336],[-73.738482,41.175627],[-73.738489,41.175731],[-73.738568,41.175994],[-73.738647,41.176363],[-73.738647,41.176446],[-73.73863299999999,41.176517],[-73.738572,41.176618],[-73.737578,41.177333],[-73.73720899999999,41.177666],[-73.737083,41.177756],[-73.736836,41.17787],[-73.736628,41.177949],[-73.736165,41.178051],[-73.735964,41.178083],[-73.735838,41.177311],[-73.735816,41.177111],[-73.73581,41.176892],[-73.735816,41.17667],[-73.73586299999999,41.176372],[-73.735935,41.176177],[-73.73603900000001,41.175829],[-73.73589200000001,41.175906],[-73.73531699999999,41.176296],[-73.73499,41.17647],[-73.734658,41.176611],[-73.73459200000001,41.176644],[-73.73450699999999,41.176675],[-73.734402,41.176714],[-73.734319,41.176744],[-73.734218,41.176755],[-73.73406799999999,41.17677],[-73.733752,41.176803],[-73.73352300000001,41.176827],[-73.733324,41.176872],[-73.733133,41.176927],[-73.73299299999999,41.176999],[-73.73289,41.177088],[-73.73280099999999,41.177193],[-73.73275700000001,41.177288],[-73.732753,41.177358],[-73.73235099999999,41.177383],[-73.73206500000001,41.17738],[-73.731914,41.177362],[-73.73181,41.177333],[-73.731674,41.177276],[-73.731548,41.17719],[-73.73139399999999,41.177068],[-73.73126000000001,41.176915],[-73.731387,41.176687],[-73.73142,41.176533],[-73.731398,41.176426],[-73.731262,41.176178],[-73.731032,41.175887],[-73.730677,41.176436],[-73.730485,41.176701],[-73.7303,41.176957],[-73.729636,41.177819],[-73.72938499999999,41.178282],[-73.729331,41.178472],[-73.729303,41.178615],[-73.729313,41.178914],[-73.729356,41.179079],[-73.729421,41.179224],[-73.72950400000001,41.179357],[-73.72962200000001,41.179504],[-73.729769,41.179658],[-73.730113,41.179956],[-73.73040399999999,41.180176],[-73.730526,41.180258],[-73.73061199999999,41.180327],[-73.730716,41.180452],[-73.730784,41.180581],[-73.730845,41.180742],[-73.73092,41.181106],[-73.73090999999999,41.181439],[-73.73091700000001,41.181837],[-73.730902,41.182102],[-73.73084900000001,41.182454],[-73.730813,41.182563],[-73.730727,41.182739],[-73.73049,41.183133],[-73.730397,41.183244],[-73.730113,41.183525],[-73.729966,41.183737],[-73.729884,41.18388],[-73.729843,41.183998],[-73.729794,41.18419],[-73.729783,41.18433],[-73.729787,41.184441],[-73.729805,41.184559],[-73.729855,41.184703],[-73.730142,41.185247],[-73.73027500000001,41.185457],[-73.730386,41.185658],[-73.73044,41.185801],[-73.730529,41.186181],[-73.730552,41.18633],[-73.730558,41.186405],[-73.730542,41.18707],[-73.73,41.18769],[-73.727705,41.190077],[-73.726046,41.190682],[-73.725194,41.191354],[-73.725396,41.191088],[-73.725427,41.190936],[-73.725416,41.190661],[-73.725298,41.190194],[-73.72486499999999,41.189535],[-73.724569,41.18918],[-73.724131,41.188866],[-73.723527,41.188589],[-73.723163,41.188301],[-73.723207,41.188139],[-73.723293,41.188043],[-73.723427,41.187931],[-73.723474,41.187858],[-73.723491,41.187772],[-73.723483,41.187703],[-73.723371,41.187556],[-73.72336199999999,41.187466],[-73.72339599999999,41.187367],[-73.72345199999999,41.187304],[-73.723702,41.18713],[-73.723643,41.187058],[-73.722943,41.187322],[-73.72216400000001,41.18654],[-73.72051500000001,41.186014],[-73.718514,41.187439],[-73.71974899999999,41.188538],[-73.71904600000001,41.189773],[-73.718283,41.188583],[-73.716855,41.186595],[-73.713268,41.182883],[-73.710658,41.17918],[-73.70442799999999,41.168021],[-73.703433,41.16609],[-73.703694,41.165984],[-73.70500800000001,41.165633],[-73.706245,41.16522],[-73.707296,41.16487],[-73.70795699999999,41.164377],[-73.70931400000001,41.163364],[-73.71105,41.162048],[-73.711427,41.161791],[-73.714353,41.159613],[-73.717011,41.157633],[-73.719301,41.155928],[-73.72393599999999,41.152763],[-73.724194,41.152612],[-73.72717900000001,41.150862],[-73.729192,41.149683],[-73.729753,41.149354],[-73.73230599999999,41.147857],[-73.73277,41.147585],[-73.733437,41.147195],[-73.734754,41.146432],[-73.737621,41.144741],[-73.737768,41.144656],[-73.73872299999999,41.144095],[-73.739254,41.143784],[-73.74024799999999,41.143202],[-73.74045099999999,41.143082],[-73.741378,41.142539],[-73.74196999999999,41.142192],[-73.742744,41.141738],[-73.743489,41.141319],[-73.744609,41.140689],[-73.74553,41.140171],[-73.74985700000001,41.141348],[-73.75048099999999,41.142237],[-73.75067900000001,41.142567],[-73.750868,41.142909],[-73.751228,41.14351],[-73.75138200000001,41.143801],[-73.751482,41.143971],[-73.751655,41.144207],[-73.751852,41.144419],[-73.75229400000001,41.144821],[-73.752442,41.145013],[-73.75260900000001,41.145279],[-73.75275000000001,41.145563],[-73.75281200000001,41.145688],[-73.75289100000001,41.14587],[-73.75302600000001,41.146183],[-73.75305899999999,41.146341],[-73.75311499999999,41.146621],[-73.75309799999999,41.146944],[-73.752888,41.147956],[-73.75282199999999,41.148225],[-73.752787,41.148422],[-73.752797,41.148589],[-73.75285100000001,41.148747],[-73.752967,41.149015],[-73.753224,41.149467],[-73.75344,41.149848],[-73.753491,41.14997],[-73.753654,41.150239],[-73.753767,41.150494],[-73.75395899999999,41.151189],[-73.75406,41.151487]]],"type":"Polygon"}
}