{
  "id": "360810585003",
  "type": "Feature",
  "properties": {
    "area_land":64250,
    "area_water":0,
    "geoid":"360810585003",
    "name":"Block Group 3",
    "state":"ny"
},
  "bbox": [
    -73.903381,
    40.702337,
    -73.899523,
    40.705518
],
  "geometry": {"coordinates":[[[-73.903381,40.703538],[-73.90228999999999,40.704608],[-73.90199699999999,40.704871],[-73.902119,40.705149],[-73.90083799999999,40.705518],[-73.900432,40.704712],[-73.900114,40.704067],[-73.89982000000001,40.703476],[-73.899523,40.702873],[-73.900986,40.702449],[-73.90136800000001,40.702337],[-73.901898,40.702665],[-73.90263899999999,40.7031],[-73.903381,40.703538]]],"type":"Polygon"}
}