{
  "id": "360050138000",
  "type": "Feature",
  "properties": {
    "area_land":0,
    "area_water":3460009,
    "geoid":"360050138000",
    "name":"Block Group 0",
    "state":"ny"
},
  "bbox": [
    -73.813804,
    40.811247,
    -73.774977,
    40.830879
],
  "geometry": {"coordinates":[[[-73.813804,40.825468],[-73.798866,40.827553],[-73.77497700000001,40.830879],[-73.780193,40.8264],[-73.778958,40.811713],[-73.779556,40.811247],[-73.790679,40.814182],[-73.797361,40.815946],[-73.797453,40.815892],[-73.79757600000001,40.815821],[-73.797715,40.816048],[-73.79806499999999,40.816617],[-73.798064,40.816811],[-73.79837000000001,40.816924],[-73.79866,40.81694],[-73.80054800000001,40.817653],[-73.800527,40.81789],[-73.800687,40.818099],[-73.800864,40.818131],[-73.801154,40.818131],[-73.801299,40.818099],[-73.801862,40.818308],[-73.802216,40.81834],[-73.80261900000001,40.818276],[-73.80349099999999,40.818229],[-73.804624,40.819113],[-73.805728,40.820177],[-73.805723,40.820607],[-73.806023,40.820978],[-73.806017,40.821218],[-73.80586599999999,40.821526],[-73.805819,40.821615],[-73.805971,40.821917],[-73.806264,40.822253],[-73.806211,40.82261],[-73.806532,40.824179],[-73.80722900000001,40.825455],[-73.808469,40.825861],[-73.80968,40.825263],[-73.810822,40.824884],[-73.811764,40.824441],[-73.812522,40.824487],[-73.81307700000001,40.824158],[-73.81307,40.823913],[-73.813219,40.823878],[-73.813738,40.824077],[-73.813804,40.825468]]],"type":"Polygon"}
}