{
  "id": "360471176012",
  "type": "Feature",
  "properties": {
    "area_land":72396,
    "area_water":0,
    "geoid":"360471176012",
    "name":"Block Group 2",
    "state":"ny"
},
  "bbox": [
    -73.878362,
    40.682039,
    -73.874105,
    40.684955
],
  "geometry": {"coordinates":[[[-73.878362,40.684009],[-73.87709599999999,40.684323],[-73.87583100000001,40.684639],[-73.874566,40.684955],[-73.874105,40.683104],[-73.875361,40.682749],[-73.876616,40.682391],[-73.877674,40.682087],[-73.87786699999999,40.682039],[-73.877937,40.682284],[-73.878362,40.684009]]],"type":"Polygon"}
}