{
  "id": "360811039004",
  "type": "Feature",
  "properties": {
    "area_land":265577,
    "area_water":0,
    "geoid":"360811039004",
    "name":"Block Group 4",
    "state":"ny"
},
  "bbox": [
    -73.825285,
    40.781694,
    -73.818338,
    40.789697
],
  "geometry": {"coordinates":[[[-73.825253,40.781781],[-73.825233,40.781832],[-73.82518899999999,40.781958],[-73.82514999999999,40.782071],[-73.82507099999999,40.782314],[-73.82502100000001,40.782483],[-73.824907,40.782933],[-73.824888,40.783032],[-73.824859,40.783178],[-73.824826,40.783378],[-73.824805,40.7835],[-73.824788,40.78361],[-73.824656,40.784431],[-73.82464299999999,40.784508],[-73.824522,40.785225],[-73.824478,40.785476],[-73.824343,40.78432],[-73.824185,40.785203],[-73.823927,40.786346],[-73.82383400000001,40.786756],[-73.82358600000001,40.787402],[-73.82349600000001,40.787635],[-73.823331,40.787884],[-73.823311,40.787914],[-73.822991,40.788397],[-73.822861,40.788617],[-73.822772,40.788765],[-73.822695,40.788895],[-73.822664,40.78896],[-73.822591,40.789108],[-73.82253300000001,40.789471],[-73.822537,40.789568],[-73.82248,40.789587],[-73.822362,40.789616],[-73.82221199999999,40.789653],[-73.82202599999999,40.789682],[-73.82185800000001,40.789696],[-73.821648,40.789697],[-73.821321,40.789666],[-73.820995,40.789624],[-73.820673,40.789571],[-73.82035399999999,40.789507],[-73.820249,40.789482],[-73.82003899999999,40.789432],[-73.819417,40.789163],[-73.81934800000001,40.789144],[-73.819096,40.788506],[-73.818753,40.787676],[-73.818338,40.786639],[-73.81922900000001,40.786445],[-73.82018100000001,40.786222],[-73.82102500000001,40.786023],[-73.821906,40.785802],[-73.821403,40.784567],[-73.821352,40.784381],[-73.82131699999999,40.784193],[-73.821299,40.784004],[-73.821303,40.783825],[-73.82132,40.783647],[-73.821352,40.78347],[-73.821397,40.783296],[-73.821473,40.78306],[-73.821563,40.782826],[-73.82166700000001,40.782597],[-73.82178399999999,40.782362],[-73.82191899999999,40.782133],[-73.82207200000001,40.781909],[-73.82224100000001,40.781694],[-73.823841,40.781717],[-73.824624,40.781706],[-73.82499799999999,40.7817],[-73.82528499999999,40.781697],[-73.825253,40.781781]]],"type":"Polygon"}
}