{
  "id": "361019611002",
  "type": "Feature",
  "properties": {
    "area_land":663181,
    "area_water":0,
    "geoid":"361019611002",
    "name":"Block Group 2",
    "state":"ny"
},
  "bbox": [
    -77.328452,
    42.337015,
    -77.316922,
    42.345176
],
  "geometry": {"coordinates":[[[-77.328405,42.338052],[-77.328199,42.339565],[-77.328163,42.339866],[-77.32808900000001,42.340419],[-77.32798099999999,42.341308],[-77.327932,42.34167],[-77.327454,42.345176],[-77.326916,42.345151],[-77.32437400000001,42.344955],[-77.324506,42.343942],[-77.321951,42.343745],[-77.320352,42.343635],[-77.320314,42.343935],[-77.318832,42.343825],[-77.317367,42.343723],[-77.31692200000001,42.343685],[-77.317114,42.342684],[-77.317502,42.340668],[-77.31764099999999,42.339969],[-77.317702,42.339574],[-77.317725,42.339359],[-77.31775500000001,42.338983],[-77.31774900000001,42.33884],[-77.317804,42.338413],[-77.317956,42.33723],[-77.317983,42.337015],[-77.31826,42.337032],[-77.32060199999999,42.337177],[-77.32120399999999,42.337211],[-77.321815,42.337249],[-77.322559,42.337293],[-77.32376499999999,42.337366],[-77.32568999999999,42.337482],[-77.326673,42.337536],[-77.328452,42.337633],[-77.328405,42.338052]]],"type":"Polygon"}
}