{
  "id": "360810284001",
  "type": "Feature",
  "properties": {
    "area_land":283775,
    "area_water":0,
    "geoid":"360810284001",
    "name":"Block Group 1",
    "state":"ny"
},
  "bbox": [
    -73.779668,
    40.679032,
    -73.772203,
    40.686283
],
  "geometry": {"coordinates":[[[-73.779668,40.685377],[-73.77870799999999,40.6857],[-73.77785,40.685989],[-73.77699800000001,40.686283],[-73.776324,40.685217],[-73.775673,40.684742],[-73.775012,40.684276],[-73.774621,40.683991],[-73.77442000000001,40.683654],[-73.77418400000001,40.683238],[-73.773499,40.683482],[-73.773287,40.683455],[-73.773144,40.683188],[-73.77297799999999,40.682934],[-73.77256199999999,40.68221],[-73.77224200000001,40.681675],[-73.772203,40.68161],[-73.772322,40.681491],[-73.77299499999999,40.681209],[-73.773565,40.680964],[-73.774081,40.68076],[-73.7747,40.680487],[-73.775498,40.68022],[-73.776365,40.679937],[-73.777231,40.679654],[-73.77842200000001,40.679032],[-73.778567,40.679752],[-73.778711,40.68042],[-73.778999,40.68092],[-73.77933400000001,40.6815],[-73.778959,40.681617],[-73.779155,40.682871],[-73.779335,40.683631],[-73.779416,40.684118],[-73.77950800000001,40.68454],[-73.779668,40.685377]]],"type":"Polygon"}
}