{
  "id": "360290147011",
  "type": "Feature",
  "properties": {
    "area_land":2237455,
    "area_water":0,
    "geoid":"360290147011",
    "name":"Block Group 1",
    "state":"ny"
},
  "bbox": [
    -78.652351,
    43.010163,
    -78.617237,
    43.02109
],
  "geometry": {"coordinates":[[[-78.652351,43.015985],[-78.64865,43.015658],[-78.647195,43.0156],[-78.644289,43.015486],[-78.637129,43.01512],[-78.637125,43.015304],[-78.637108,43.016418],[-78.637091,43.018064],[-78.637095,43.018383],[-78.637085,43.018756],[-78.637068,43.0191],[-78.63704300000001,43.02109],[-78.636134,43.021074],[-78.635339,43.021055],[-78.633427,43.021018],[-78.63252300000001,43.021004],[-78.63193,43.020992],[-78.631629,43.020986],[-78.63159,43.020985],[-78.631167,43.020976],[-78.63041,43.020974],[-78.629397,43.020953],[-78.627596,43.020921],[-78.626344,43.020898],[-78.625443,43.020882],[-78.62536,43.02088],[-78.624734,43.020866],[-78.624027,43.020855],[-78.623465,43.02084],[-78.622631,43.020864],[-78.61761199999999,43.02086],[-78.61755700000001,43.019824],[-78.61751099999999,43.018567],[-78.617355,43.014349],[-78.617344,43.014044],[-78.617237,43.010163],[-78.617875,43.010169],[-78.61820899999999,43.010173],[-78.619961,43.010198],[-78.62564399999999,43.01024],[-78.627268,43.010295],[-78.62763699999999,43.010299],[-78.62822,43.010304],[-78.629594,43.010325],[-78.62961900000001,43.010325],[-78.630602,43.010332],[-78.631658,43.010349],[-78.632198,43.010352],[-78.63325500000001,43.010367],[-78.634156,43.010372],[-78.635486,43.010379],[-78.635965,43.01039],[-78.637182,43.010399],[-78.637682,43.010431],[-78.63875400000001,43.010487],[-78.639707,43.010544],[-78.640418,43.01101],[-78.64057200000001,43.011111],[-78.641473,43.011715],[-78.642566,43.012437],[-78.644434,43.013686],[-78.646647,43.013984],[-78.64712,43.014046],[-78.647215,43.014058],[-78.648132,43.014317],[-78.64856399999999,43.014444],[-78.649513,43.014712],[-78.65004999999999,43.01487],[-78.65086700000001,43.015102],[-78.65197000000001,43.015414],[-78.65234100000001,43.015519],[-78.652351,43.015985]]],"type":"Polygon"}
}