{
  "id": "361032009024",
  "type": "Feature",
  "properties": {
    "area_land":6156920,
    "area_water":0,
    "geoid":"361032009024",
    "name":"Block Group 4",
    "state":"ny"
},
  "bbox": [
    -72.229853,
    40.951613,
    -72.192161,
    40.981748
],
  "geometry": {"coordinates":[[[-72.22927900000001,40.954142],[-72.228516,40.955498],[-72.228364,40.955743],[-72.228426,40.957159],[-72.228432,40.958002],[-72.22842799999999,40.95842],[-72.228444,40.958566],[-72.228463,40.958739],[-72.228495,40.958907],[-72.228511,40.959052],[-72.228534,40.959266],[-72.228567,40.959573],[-72.228577,40.959756],[-72.228624,40.960593],[-72.22862499999999,40.96104],[-72.22835499999999,40.96199],[-72.228032,40.96283],[-72.22778099999999,40.963319],[-72.227295,40.964064],[-72.226865,40.964661],[-72.22609300000001,40.965597],[-72.225375,40.96629],[-72.22476399999999,40.966847],[-72.22443199999999,40.967231],[-72.224307,40.967388],[-72.22409,40.967661],[-72.223935,40.967897],[-72.223332,40.969075],[-72.222752,40.970187],[-72.222374,40.970973],[-72.222138,40.971423],[-72.221795,40.972198],[-72.220945,40.97398],[-72.220752,40.974721],[-72.22068400000001,40.975014],[-72.220601,40.975373],[-72.21982800000001,40.976317],[-72.219414,40.976519],[-72.219168,40.976776],[-72.218475,40.977501],[-72.21820700000001,40.977796],[-72.21765499999999,40.978361],[-72.217129,40.978888],[-72.21666399999999,40.979406],[-72.216493,40.980005],[-72.216359,40.980162],[-72.21588,40.980478],[-72.215574,40.980699],[-72.215391,40.980874],[-72.215183,40.981601],[-72.215208,40.981748],[-72.212317,40.980436],[-72.211851,40.980366],[-72.21122099999999,40.980165],[-72.210756,40.979978],[-72.210132,40.979687],[-72.20977999999999,40.979714],[-72.20905,40.979813],[-72.208493,40.979802],[-72.207943,40.979691],[-72.207538,40.979597],[-72.20710800000001,40.979481],[-72.206947,40.979438],[-72.205879,40.978956],[-72.204537,40.978283],[-72.202465,40.977248],[-72.19908700000001,40.97556],[-72.196873,40.974454],[-72.196519,40.974268],[-72.195425,40.97364],[-72.195311,40.973568],[-72.194638,40.973204],[-72.19388499999999,40.972875],[-72.193378,40.972691],[-72.19270899999999,40.972471],[-72.192161,40.972284],[-72.192516,40.971222],[-72.192947,40.96985],[-72.193015,40.969643],[-72.193095,40.96941],[-72.195143,40.969887],[-72.19542,40.969072],[-72.196195,40.969172],[-72.196562,40.968182],[-72.19722299999999,40.968174],[-72.198457,40.968387],[-72.198739,40.968438],[-72.19900699999999,40.967758],[-72.19949800000001,40.96798],[-72.199558,40.968006],[-72.199978,40.968187],[-72.200446,40.966577],[-72.20005999999999,40.966466],[-72.199709,40.966372],[-72.19901900000001,40.96617],[-72.198669,40.966068],[-72.198511,40.965971],[-72.19872700000001,40.965531],[-72.200147,40.96383],[-72.201108,40.963651],[-72.202039,40.96038],[-72.202055,40.960327],[-72.202229,40.959813],[-72.20302100000001,40.957301],[-72.20393,40.954535],[-72.204711,40.954535],[-72.20491699999999,40.954537],[-72.205614,40.954543],[-72.206137,40.954535],[-72.207227,40.954541],[-72.208175,40.954985],[-72.20869399999999,40.954952],[-72.20908,40.954901],[-72.20951599999999,40.95482],[-72.209968,40.954755],[-72.210641,40.954565],[-72.211158,40.954422],[-72.21147000000001,40.954231],[-72.211923,40.954025],[-72.212611,40.953723],[-72.21315800000001,40.953469],[-72.21361,40.953182],[-72.214438,40.952737],[-72.214859,40.952514],[-72.215189,40.952423],[-72.21538099999999,40.95237],[-72.21592699999999,40.952239],[-72.216634,40.952011],[-72.217421,40.951815],[-72.218,40.951684],[-72.21869100000001,40.951617],[-72.219446,40.951613],[-72.21979899999999,40.951691],[-72.220426,40.951816],[-72.22111700000001,40.952005],[-72.221695,40.95213],[-72.222048,40.952176],[-72.222418,40.952286],[-72.223198,40.952435],[-72.224248,40.952602],[-72.225362,40.952753],[-72.226238,40.952967],[-72.227081,40.953117],[-72.227845,40.953234],[-72.22802,40.953268],[-72.22860300000001,40.953375],[-72.229277,40.953506],[-72.22985300000001,40.953585],[-72.22927900000001,40.954142]]],"type":"Polygon"}
}