{
  "id": "360910627004",
  "type": "Feature",
  "properties": {
    "area_land":4340261,
    "area_water":1212784,
    "geoid":"360910627004",
    "name":"Block Group 4",
    "state":"ny"
},
  "bbox": [
    -73.720563,
    42.775377,
    -73.676662,
    42.807284
],
  "geometry": {"coordinates":[[[-73.72036300000001,42.804177],[-73.719863,42.804877],[-73.71866300000001,42.805677],[-73.71776300000001,42.806277],[-73.717091,42.807284],[-73.71601099999999,42.806813],[-73.71481799999999,42.805874],[-73.71346200000001,42.80489],[-73.71336100000001,42.804851],[-73.709976,42.803562],[-73.708597,42.803399],[-73.703695,42.803161],[-73.695521,42.802021],[-73.693511,42.801819],[-73.692108,42.801133],[-73.69085699999999,42.800519],[-73.689969,42.8002],[-73.689111,42.79978],[-73.687602,42.798307],[-73.686981,42.796677],[-73.686752,42.79608],[-73.68672599999999,42.795977],[-73.68672599999999,42.795843],[-73.68653399999999,42.795456],[-73.686508,42.795409],[-73.686387,42.795192],[-73.68601,42.794345],[-73.685946,42.794261],[-73.68589900000001,42.794232],[-73.685835,42.79406],[-73.685525,42.793418],[-73.685425,42.79321],[-73.686272,42.790633],[-73.68638199999999,42.790467],[-73.68619099999999,42.790475],[-73.68507200000001,42.790529],[-73.683395,42.790607],[-73.682817,42.790413],[-73.682672,42.790454],[-73.682474,42.79024],[-73.682445,42.790261],[-73.68238700000001,42.790276],[-73.68208300000001,42.790248],[-73.681873,42.790229],[-73.681237,42.788905],[-73.681074,42.788835],[-73.681023,42.788793],[-73.680882,42.788613],[-73.680846,42.788544],[-73.68082800000001,42.788526],[-73.680187,42.787487],[-73.680162,42.787377],[-73.680262,42.787077],[-73.679462,42.786477],[-73.679396,42.78643],[-73.679329,42.786384],[-73.67931400000001,42.786373],[-73.67666199999999,42.783677],[-73.676762,42.783277],[-73.678262,42.783477],[-73.680064,42.783576],[-73.680188,42.783447],[-73.68020199999999,42.783437],[-73.680262,42.783377],[-73.681162,42.782977],[-73.681403,42.7819],[-73.68186900000001,42.780962],[-73.682704,42.779931],[-73.683457,42.779112],[-73.68395200000001,42.778736],[-73.684862,42.778277],[-73.685928,42.777743],[-73.687262,42.777077],[-73.68776200000001,42.776377],[-73.688362,42.775477],[-73.689162,42.775377],[-73.690065,42.775459],[-73.690262,42.775477],[-73.691362,42.775777],[-73.69352499999999,42.776858],[-73.69376200000001,42.776977],[-73.696763,42.778332],[-73.69679499999999,42.778347],[-73.696774,42.778462],[-73.69657100000001,42.77941],[-73.69641300000001,42.78021],[-73.69635,42.780486],[-73.695588,42.782762],[-73.6952,42.783945],[-73.695069,42.784308],[-73.694844,42.784837],[-73.69441399999999,42.785764],[-73.694344,42.785951],[-73.694158,42.786403],[-73.694084,42.786539],[-73.694008,42.786634],[-73.69374500000001,42.786832],[-73.692273,42.787634],[-73.69188800000001,42.787865],[-73.69157800000001,42.788085],[-73.691461,42.788167],[-73.69083999999999,42.78861],[-73.691198,42.788818],[-73.691742,42.789211],[-73.692213,42.789548],[-73.692756,42.789978],[-73.693707,42.790663],[-73.694047,42.790933],[-73.694159,42.79098],[-73.694318,42.791017],[-73.69449899999999,42.79104],[-73.694654,42.791037],[-73.694762,42.791021],[-73.695106,42.790942],[-73.696798,42.789559],[-73.69588400000001,42.788883],[-73.696135,42.788673],[-73.696386,42.788436],[-73.69647399999999,42.788371],[-73.69668,42.78828],[-73.69699799999999,42.788194],[-73.697553,42.788015],[-73.697661,42.787954],[-73.698421,42.787455],[-73.698829,42.787171],[-73.699028,42.787031],[-73.69891800000001,42.787212],[-73.698954,42.787189],[-73.698977,42.787181],[-73.698994,42.787208],[-73.698984,42.787248],[-73.698899,42.787369],[-73.698899,42.787402],[-73.698958,42.787491],[-73.69901400000001,42.787592],[-73.699056,42.78764],[-73.69934000000001,42.787406],[-73.69985200000001,42.787163],[-73.70140600000001,42.786475],[-73.7012,42.786277],[-73.700997,42.786059],[-73.700564,42.785604],[-73.70036399999999,42.785376],[-73.700249,42.785244],[-73.699639,42.784529],[-73.69883400000001,42.783517],[-73.69794400000001,42.782433],[-73.698885,42.781992],[-73.699349,42.78174],[-73.69938999999999,42.781682],[-73.69938500000001,42.781623],[-73.699185,42.78138],[-73.698944,42.781018],[-73.698857,42.78091],[-73.698677,42.780664],[-73.698564,42.780407],[-73.69851,42.780352],[-73.69838799999999,42.780296],[-73.697898,42.78017],[-73.69769599999999,42.780134],[-73.697571,42.780128],[-73.697518,42.780146],[-73.697486,42.780269],[-73.697406,42.78067],[-73.69729700000001,42.78065],[-73.69745399999999,42.779832],[-73.69764499999999,42.778847],[-73.69766799999999,42.778735],[-73.697761,42.778777],[-73.697862,42.778777],[-73.703163,42.782477],[-73.70359000000001,42.78286],[-73.708699,42.78744],[-73.708963,42.787677],[-73.709963,42.793377],[-73.710663,42.794077],[-73.71093500000001,42.794504],[-73.71136300000001,42.795177],[-73.712363,42.795977],[-73.713663,42.796977],[-73.71460999999999,42.797633],[-73.71826299999999,42.800167],[-73.719863,42.801277],[-73.72036300000001,42.802277],[-73.720563,42.803077],[-73.72036300000001,42.804177]]],"type":"Polygon"}
}