{
  "id": "361190149082",
  "type": "Feature",
  "properties": {
    "area_land":8884339,
    "area_water":20364,
    "geoid":"361190149082",
    "name":"Block Group 2",
    "state":"ny"
},
  "bbox": [
    -73.780007,
    41.304519,
    -73.747513,
    41.345342
],
  "geometry": {"coordinates":[[[-73.780007,41.342492],[-73.77632,41.34291],[-73.772054,41.343393],[-73.771839,41.343417],[-73.771004,41.343511],[-73.766957,41.343929],[-73.766869,41.343938],[-73.766052,41.344023],[-73.765879,41.344041],[-73.764484,41.344187],[-73.75823200000001,41.344838],[-73.75791599999999,41.344871],[-73.757605,41.344904],[-73.75728599999999,41.344938],[-73.753122,41.345342],[-73.75308699999999,41.345333],[-73.753038,41.3453],[-73.75299200000001,41.34524],[-73.75295800000001,41.345175],[-73.752922,41.34495],[-73.75278400000001,41.343973],[-73.75274400000001,41.343748],[-73.752627,41.343005],[-73.752347,41.341301],[-73.75220400000001,41.340429],[-73.752042,41.339498],[-73.751876,41.338471],[-73.751862,41.33838],[-73.751818,41.338096],[-73.751783,41.337882],[-73.75169200000001,41.337326],[-73.75166,41.337156],[-73.751583,41.33674],[-73.751514,41.336345],[-73.751242,41.334772],[-73.750939,41.332977],[-73.750865,41.332551],[-73.75078000000001,41.332085],[-73.750592,41.331052],[-73.750525,41.33059],[-73.750426,41.329869],[-73.750415,41.329817],[-73.75035200000001,41.329499],[-73.75029499999999,41.329031],[-73.75014299999999,41.328164],[-73.750102,41.327879],[-73.749988,41.327372],[-73.74991900000001,41.326925],[-73.74985100000001,41.32635],[-73.74976700000001,41.325721],[-73.74964,41.324868],[-73.74960299999999,41.324632],[-73.749527,41.324147],[-73.749387,41.323636],[-73.749089,41.321664],[-73.74889899999999,41.320628],[-73.74866400000001,41.319207],[-73.74863000000001,41.319052],[-73.748518,41.318647],[-73.748476,41.318376],[-73.74843799999999,41.318206],[-73.74838099999999,41.317838],[-73.74834300000001,41.317527],[-73.74832000000001,41.317312],[-73.74828100000001,41.317051],[-73.747722,41.314439],[-73.747691,41.31419],[-73.74764500000001,41.31396],[-73.747625,41.313833],[-73.747592,41.313694],[-73.74755500000001,41.313576],[-73.747513,41.313477],[-73.747736,41.313415],[-73.748981,41.313229],[-73.750772,41.31305],[-73.75196699999999,41.312886],[-73.753629,41.312686],[-73.7542,41.312629],[-73.75472000000001,41.312557],[-73.754931,41.312506],[-73.75527599999999,41.312349],[-73.755402,41.312263],[-73.755511,41.312165],[-73.75586199999999,41.311849],[-73.756625,41.311228],[-73.757296,41.310604],[-73.757515,41.310433],[-73.757755,41.310322],[-73.75794500000001,41.310266],[-73.758234,41.310224],[-73.758544,41.31016],[-73.758945,41.310041],[-73.759213,41.309928],[-73.759372,41.309883],[-73.759433,41.309895],[-73.759548,41.309889],[-73.75973500000001,41.309828],[-73.759973,41.30968],[-73.76005600000001,41.309629],[-73.760733,41.309064],[-73.760952,41.308933],[-73.761128,41.308872],[-73.76139999999999,41.308824],[-73.76234100000001,41.308605],[-73.762777,41.308472],[-73.763316,41.308242],[-73.763824,41.307994],[-73.765225,41.307261],[-73.765412,41.307152],[-73.766181,41.306559],[-73.76651,41.306291],[-73.76660800000001,41.306212],[-73.767116,41.30577],[-73.76755799999999,41.305456],[-73.768011,41.305274],[-73.768061,41.305256],[-73.768351,41.305195],[-73.768799,41.305117],[-73.76984899999999,41.304988],[-73.771562,41.30474],[-73.77246100000001,41.304644],[-73.773623,41.304519],[-73.77365899999999,41.304697],[-73.773737,41.304915],[-73.775389,41.315949],[-73.775589,41.316922],[-73.776462,41.321339],[-73.77676700000001,41.322882],[-73.776979,41.323955],[-73.77742000000001,41.326255],[-73.778093,41.329933],[-73.778854,41.334093],[-73.779212,41.33742],[-73.780007,41.342492]]],"type":"Polygon"}
}