{
  "id": "360272101014",
  "type": "Feature",
  "properties": {
    "area_land":293097,
    "area_water":0,
    "geoid":"360272101014",
    "name":"Block Group 4",
    "state":"ny"
},
  "bbox": [
    -73.977876,
    41.5054,
    -73.968034,
    41.512644
],
  "geometry": {"coordinates":[[[-73.97787599999999,41.510566],[-73.977862,41.510732],[-73.977816,41.510987],[-73.977704,41.511482],[-73.977643,41.511662],[-73.977588,41.51179],[-73.977498,41.511955],[-73.977406,41.512057],[-73.977209,41.512265],[-73.97712199999999,41.512334],[-73.976632,41.512644],[-73.976443,41.512492],[-73.976249,41.512365],[-73.97583299999999,41.512119],[-73.97557500000001,41.511992],[-73.974811,41.511554],[-73.974172,41.511204],[-73.97327300000001,41.510715],[-73.97307600000001,41.510582],[-73.972272,41.509975],[-73.97176399999999,41.509582],[-73.97170199999999,41.509547],[-73.971524,41.509445],[-73.970983,41.509223],[-73.970264,41.508928],[-73.970107,41.508884],[-73.970054,41.508869],[-73.96998499999999,41.508847],[-73.969627,41.508729],[-73.969201,41.508567],[-73.96892800000001,41.508446],[-73.968338,41.508207],[-73.968034,41.508044],[-73.969083,41.506976],[-73.969808,41.506234],[-73.970606,41.5054],[-73.971431,41.50588],[-73.97239500000001,41.506418],[-73.97326200000001,41.506905],[-73.973951,41.507286],[-73.974327,41.507506],[-73.97458899999999,41.507648],[-73.974932,41.507835],[-73.97563100000001,41.508226],[-73.975764,41.50828],[-73.975925,41.508315],[-73.976071,41.508322],[-73.97629000000001,41.508322],[-73.97725199999999,41.508357],[-73.977555,41.508385],[-73.977535,41.50866],[-73.97753899999999,41.508808],[-73.977564,41.509002],[-73.977661,41.509392],[-73.977839,41.510141],[-73.97786600000001,41.510307],[-73.97787599999999,41.510566]]],"type":"Polygon"}
}