{
  "id": "360810540001",
  "type": "Feature",
  "properties": {
    "area_land":213227,
    "area_water":0,
    "geoid":"360810540001",
    "name":"Block Group 1",
    "state":"ny"
},
  "bbox": [
    -73.749345,
    40.709132,
    -73.743345,
    40.715608
],
  "geometry": {"coordinates":[[[-73.74934500000001,40.715145],[-73.74844400000001,40.715346],[-73.747017,40.715608],[-73.746905,40.714889],[-73.746786,40.714369],[-73.746751,40.714223],[-73.745501,40.714362],[-73.744215,40.714499],[-73.743996,40.713312],[-73.743948,40.713061],[-73.743742,40.712006],[-73.743566,40.711116],[-73.74334500000001,40.709986],[-73.74396299999999,40.709856],[-73.7443,40.709784],[-73.74485799999999,40.70967],[-73.745181,40.7096],[-73.745801,40.709471],[-73.746818,40.709132],[-73.747159,40.709948],[-73.747778,40.711437],[-73.748797,40.7139],[-73.74903399999999,40.714461],[-73.74934500000001,40.715145]]],"type":"Polygon"}
}