{
  "id": "360650264005",
  "type": "Feature",
  "properties": {
    "area_land":222377,
    "area_water":0,
    "geoid":"360650264005",
    "name":"Block Group 5",
    "state":"ny"
},
  "bbox": [
    -75.250328,
    43.084262,
    -75.241619,
    43.089746
],
  "geometry": {"coordinates":[[[-75.250083,43.087011],[-75.249645,43.087392],[-75.249146,43.087834],[-75.24842599999999,43.088487],[-75.24810100000001,43.088776],[-75.24788599999999,43.088963],[-75.24766099999999,43.08918],[-75.24758799999999,43.089257],[-75.247197,43.089746],[-75.245797,43.08912],[-75.244376,43.088489],[-75.243264,43.087997],[-75.241619,43.087264],[-75.24252799999999,43.086169],[-75.24297900000001,43.085649],[-75.243286,43.08525],[-75.243379,43.085146],[-75.24378,43.084685],[-75.244119,43.084262],[-75.246923,43.085349],[-75.24839799999999,43.085951],[-75.249121,43.086271],[-75.25,43.086635],[-75.250328,43.086759],[-75.250083,43.087011]]],"type":"Polygon"}
}