{
  "id": "360810212002",
  "type": "Feature",
  "properties": {
    "area_land":125544,
    "area_water":0,
    "geoid":"360810212002",
    "name":"Block Group 2",
    "state":"ny"
},
  "bbox": [
    -73.816477,
    40.698497,
    -73.811474,
    40.702542
],
  "geometry": {"coordinates":[[[-73.816293,40.702453],[-73.81594,40.702459],[-73.815316,40.702487],[-73.81496199999999,40.702499],[-73.814294,40.702531],[-73.813987,40.702542],[-73.813571,40.702527],[-73.81313900000001,40.702502],[-73.813018,40.702495],[-73.811905,40.702337],[-73.811638,40.70171],[-73.812505,40.701458],[-73.811926,40.700274],[-73.811474,40.699353],[-73.812325,40.69911],[-73.813187,40.698864],[-73.814194,40.69858],[-73.814347,40.698538],[-73.814499,40.698497],[-73.814995,40.699406],[-73.815023,40.699459],[-73.815456,40.700279],[-73.815466,40.700309],[-73.81548600000001,40.700345],[-73.81647700000001,40.70245],[-73.816293,40.702453]]],"type":"Polygon"}
}