{
  "id": "360050135002",
  "type": "Feature",
  "properties": {
    "area_land":61416,
    "area_water":0,
    "geoid":"360050135002",
    "name":"Block Group 2",
    "state":"ny"
},
  "bbox": [
    -73.904922,
    40.824389,
    -73.900541,
    40.82692
],
  "geometry": {"coordinates":[[[-73.904922,40.825287],[-73.904293,40.82692],[-73.903522,40.826725],[-73.902754,40.826521],[-73.901651,40.826217],[-73.900541,40.825944],[-73.90117600000001,40.824389],[-73.901242,40.824404],[-73.902331,40.824666],[-73.903114,40.824854],[-73.904417,40.825166],[-73.904922,40.825287]]],"type":"Polygon"}
}