{
  "id": "360050373002",
  "type": "Feature",
  "properties": {
    "area_land":44902,
    "area_water":0,
    "geoid":"360050373002",
    "name":"Block Group 2",
    "state":"ny"
},
  "bbox": [
    -73.891334,
    40.846793,
    -73.888155,
    40.849869
],
  "geometry": {"coordinates":[[[-73.891334,40.84747],[-73.89046,40.848933],[-73.8899,40.849869],[-73.889239,40.849472],[-73.888155,40.848929],[-73.888837,40.848134],[-73.88947,40.847384],[-73.889965,40.846793],[-73.890866,40.847241],[-73.891334,40.84747]]],"type":"Polygon"}
}