{
  "id": "360290163001",
  "type": "Feature",
  "properties": {
    "area_land":873956,
    "area_water":0,
    "geoid":"360290163001",
    "name":"Block Group 1",
    "state":"ny"
},
  "bbox": [
    -78.845267,
    42.868968,
    -78.830397,
    42.879293
],
  "geometry": {"coordinates":[[[-78.845249,42.870774],[-78.845225,42.870846],[-78.84516499999999,42.871031],[-78.844959,42.871653],[-78.84480000000001,42.872135],[-78.844758,42.872261],[-78.844748,42.872291],[-78.844729,42.872348],[-78.84469900000001,42.87244],[-78.84437200000001,42.873428],[-78.844323,42.873583],[-78.844092,42.874296],[-78.843875,42.874815],[-78.84410099999999,42.875014],[-78.84408999999999,42.875959],[-78.844086,42.877213],[-78.842687,42.876973],[-78.841917,42.876841],[-78.841914,42.876667],[-78.841719,42.876788],[-78.841521,42.876935],[-78.83984,42.878188],[-78.83974499999999,42.878259],[-78.839614,42.878374],[-78.839467,42.878542],[-78.83938000000001,42.878674],[-78.839311,42.878811],[-78.83926200000001,42.878953],[-78.839232,42.879098],[-78.83922200000001,42.879245],[-78.839223,42.879293],[-78.838491,42.87917],[-78.83838,42.879127],[-78.837631,42.878837],[-78.836855,42.878541],[-78.83595200000001,42.878198],[-78.835854,42.87816],[-78.834981,42.877825],[-78.834119,42.877494],[-78.833254,42.87716],[-78.832943,42.877045],[-78.832623,42.876918],[-78.832173,42.876738],[-78.832077,42.8767],[-78.830397,42.876057],[-78.831401,42.874646],[-78.832014,42.873785],[-78.832379,42.873258],[-78.832577,42.872971],[-78.834318,42.870542],[-78.83438,42.870463],[-78.835183,42.869319],[-78.835345,42.869092],[-78.835391,42.869028],[-78.83543400000001,42.868968],[-78.839595,42.869682],[-78.841756,42.870078],[-78.84219299999999,42.870155],[-78.842651,42.870218],[-78.843102,42.870301],[-78.843171,42.87031],[-78.84336399999999,42.870336],[-78.84484999999999,42.870631],[-78.845094,42.870682],[-78.84526700000001,42.870718],[-78.845249,42.870774]]],"type":"Polygon"}
}