{
  "id": "360272208011",
  "type": "Feature",
  "properties": {
    "area_land":1021770,
    "area_water":1989,
    "geoid":"360272208011",
    "name":"Block Group 1",
    "state":"ny"
},
  "bbox": [
    -73.931978,
    41.67998,
    -73.916831,
    41.69315
],
  "geometry": {"coordinates":[[[-73.931978,41.6922],[-73.931945,41.692834],[-73.931909,41.693052],[-73.931881,41.69315],[-73.931089,41.692994],[-73.93037200000001,41.692838],[-73.929292,41.692579],[-73.92910000000001,41.692541],[-73.92790100000001,41.692307],[-73.92747300000001,41.692212],[-73.92678600000001,41.692061],[-73.925817,41.691858],[-73.92585699999999,41.691493],[-73.92589599999999,41.691047],[-73.92596899999999,41.690681],[-73.925788,41.690673],[-73.925714,41.690671],[-73.92541900000001,41.690721],[-73.92451199999999,41.691019],[-73.924573,41.690389],[-73.924566,41.69024],[-73.924533,41.69013],[-73.92441599999999,41.689944],[-73.92395,41.689297],[-73.92358,41.689461],[-73.923456,41.689556],[-73.92283999999999,41.689336],[-73.922657,41.689303],[-73.92223799999999,41.689263],[-73.922038,41.689259],[-73.921786,41.689274],[-73.921374,41.689336],[-73.921239,41.689354],[-73.92111199999999,41.689341],[-73.920947,41.689318],[-73.91994800000001,41.689088],[-73.91982,41.689082],[-73.91965999999999,41.689094],[-73.91960899999999,41.689099],[-73.919387,41.689175],[-73.91910300000001,41.689288],[-73.918986,41.689358],[-73.91886599999999,41.689445],[-73.918589,41.689693],[-73.91822000000001,41.690046],[-73.918195,41.690098],[-73.917844,41.689863],[-73.916831,41.689234],[-73.91762799999999,41.68787],[-73.917733,41.687674],[-73.917832,41.687509],[-73.918351,41.686607],[-73.919,41.68567],[-73.91914800000001,41.685464],[-73.919349,41.685048],[-73.919422,41.684851],[-73.919498,41.684426],[-73.919488,41.684023],[-73.91950900000001,41.683736],[-73.91955400000001,41.683635],[-73.919622,41.683524],[-73.91974500000001,41.683375],[-73.920092,41.683062],[-73.920951,41.682363],[-73.921155,41.682197],[-73.921319,41.68202],[-73.921342,41.681979],[-73.92139899999999,41.681879],[-73.921464,41.681642],[-73.921491,41.681421],[-73.921488,41.681336],[-73.921426,41.680831],[-73.92137700000001,41.680617],[-73.921246,41.680046],[-73.92207000000001,41.67998],[-73.922157,41.680551],[-73.922397,41.682121],[-73.922394,41.682245],[-73.922648,41.682081],[-73.923224,41.681954],[-73.92401099999999,41.681828],[-73.924386,41.682016],[-73.92575100000001,41.681932],[-73.928355,41.681906],[-73.92944900000001,41.681705],[-73.929613,41.681695],[-73.929631,41.681999],[-73.9297,41.682538],[-73.929891,41.683057],[-73.930148,41.683657],[-73.930921,41.685573],[-73.931236,41.686392],[-73.93128900000001,41.686528],[-73.93154800000001,41.68742],[-73.931438,41.687506],[-73.93124400000001,41.687763],[-73.931223,41.68779],[-73.931201,41.687818],[-73.93117599999999,41.687851],[-73.931118,41.687926],[-73.93104700000001,41.688125],[-73.931011,41.68828],[-73.93101799999999,41.688511],[-73.93107500000001,41.688709],[-73.931309,41.689045],[-73.931427,41.689238],[-73.931511,41.689334],[-73.931578,41.689448],[-73.93162599999999,41.68956],[-73.931631,41.689696],[-73.931607,41.690112],[-73.93162599999999,41.690414],[-73.931646,41.690694],[-73.931766,41.691276],[-73.93190199999999,41.691712],[-73.931956,41.692043],[-73.931978,41.6922]]],"type":"Polygon"}
}