{
  "id": "361059512001",
  "type": "Feature",
  "properties": {
    "area_land":27260239,
    "area_water":118319,
    "geoid":"361059512001",
    "name":"Block Group 1",
    "state":"ny"
},
  "bbox": [
    -74.451497,
    41.586385,
    -74.364334,
    41.660596
],
  "geometry": {"coordinates":[[[-74.451497,41.624925],[-74.451471,41.625119],[-74.451432,41.625219],[-74.451232,41.625454],[-74.451145,41.625575],[-74.451053,41.625736],[-74.450898,41.626063],[-74.450869,41.626115],[-74.450738,41.626345],[-74.45002100000001,41.626137],[-74.44926700000001,41.62609],[-74.448261,41.625679],[-74.44756,41.625724],[-74.446736,41.62593],[-74.44624899999999,41.626228],[-74.444999,41.627532],[-74.442285,41.6295],[-74.442224,41.629866],[-74.44231600000001,41.629912],[-74.44231600000001,41.630049],[-74.442834,41.630438],[-74.442834,41.631216],[-74.442712,41.63149],[-74.44237699999999,41.631788],[-74.44173600000001,41.631994],[-74.440974,41.631994],[-74.440273,41.632177],[-74.438351,41.633412],[-74.437741,41.633481],[-74.43694600000001,41.634102],[-74.43664099999999,41.634506],[-74.436089,41.635957],[-74.43575300000001,41.63651],[-74.43587599999999,41.636474],[-74.43611799999999,41.63645],[-74.436245,41.63645],[-74.436303,41.63646],[-74.43640000000001,41.636515],[-74.436643,41.636682],[-74.436921,41.636843],[-74.43723900000001,41.636999],[-74.43749699999999,41.637095],[-74.437889,41.637213],[-74.438008,41.637259],[-74.438131,41.637325],[-74.43854899999999,41.63763],[-74.438711,41.637719],[-74.43879099999999,41.637753],[-74.43955699999999,41.637961],[-74.43984,41.638013],[-74.44009800000001,41.63804],[-74.440572,41.638048],[-74.441802,41.638007],[-74.442187,41.638015],[-74.442549,41.638057],[-74.442824,41.638117],[-74.443083,41.63819],[-74.443247,41.638243],[-74.443648,41.638395],[-74.44376099999999,41.638466],[-74.443955,41.638624],[-74.44407099999999,41.638697],[-74.44422900000001,41.638775],[-74.444434,41.638835],[-74.444554,41.63885],[-74.444716,41.638842],[-74.444816,41.638823],[-74.444931,41.63878],[-74.445463,41.638496],[-74.44559,41.638461],[-74.445713,41.638461],[-74.44587799999999,41.638515],[-74.44590100000001,41.638534],[-74.445913,41.63858],[-74.44589000000001,41.638684],[-74.445724,41.638915],[-74.44572100000001,41.639007],[-74.445796,41.639103],[-74.445887,41.639156],[-74.446107,41.639274],[-74.44623300000001,41.639359],[-74.445351,41.639778],[-74.442831,41.640981],[-74.442104,41.641321],[-74.440645,41.642028],[-74.439916,41.642374],[-74.439193,41.6427],[-74.438799,41.642845],[-74.437862,41.643122],[-74.437545,41.643207],[-74.435649,41.643722],[-74.434884,41.643936],[-74.43456399999999,41.644048],[-74.434279,41.644173],[-74.433891,41.644383],[-74.433559,41.644612],[-74.433413,41.644726],[-74.433305,41.644824],[-74.43306200000001,41.645061],[-74.431431,41.646767],[-74.431209,41.647014],[-74.43092300000001,41.647401],[-74.430753,41.64767],[-74.430474,41.648246],[-74.43033,41.648688],[-74.43025799999999,41.648991],[-74.430206,41.649331],[-74.430127,41.650852],[-74.429975,41.653111],[-74.429918,41.653566],[-74.429852,41.653868],[-74.429699,41.65433],[-74.429554,41.65466],[-74.42933600000001,41.655058],[-74.429131,41.65536],[-74.428957,41.655592],[-74.427368,41.65751],[-74.42622900000001,41.658809],[-74.42582,41.659305],[-74.42568900000001,41.659511],[-74.425523,41.65985],[-74.425406,41.660214],[-74.42536800000001,41.660465],[-74.425354,41.660596],[-74.42411800000001,41.659908],[-74.42381399999999,41.659739],[-74.422228,41.658919],[-74.42142800000001,41.658506],[-74.407597,41.651353],[-74.400015,41.647433],[-74.395071,41.644876],[-74.395105,41.644839],[-74.395264,41.644714],[-74.39527200000001,41.644649],[-74.395228,41.644573],[-74.394989,41.644383],[-74.39477100000001,41.644123],[-74.39438,41.643495],[-74.394322,41.643337],[-74.3943,41.643164],[-74.394308,41.643039],[-74.39433699999999,41.642909],[-74.39438699999999,41.642747],[-74.394395,41.64266],[-74.394373,41.642562],[-74.394228,41.642378],[-74.394054,41.642232],[-74.392734,41.641419],[-74.39259699999999,41.641348],[-74.39250199999999,41.64124],[-74.392495,41.641147],[-74.392589,41.64092],[-74.392684,41.640811],[-74.392814,41.640741],[-74.392967,41.640714],[-74.393112,41.640698],[-74.393199,41.640649],[-74.393249,41.640584],[-74.393242,41.640503],[-74.39316700000001,41.640417],[-74.39298599999999,41.640157],[-74.392841,41.639972],[-74.392617,41.639728],[-74.39224,41.639295],[-74.392051,41.638759],[-74.391921,41.638472],[-74.39155100000001,41.637101],[-74.391457,41.633455],[-74.39094900000001,41.632842],[-74.39079,41.632452],[-74.390174,41.631748],[-74.38913700000001,41.630393],[-74.38910799999999,41.630226],[-74.38879,41.629768],[-74.38830299999999,41.629285],[-74.38722799999999,41.628997],[-74.387069,41.628947],[-74.386985,41.62889],[-74.386943,41.628815],[-74.386842,41.628559],[-74.38681699999999,41.628295],[-74.386842,41.628239],[-74.386876,41.628189],[-74.387002,41.628163],[-74.387044,41.628132],[-74.387052,41.628082],[-74.387052,41.627963],[-74.387086,41.627837],[-74.387162,41.627668],[-74.387162,41.62753],[-74.387136,41.627455],[-74.387069,41.627392],[-74.386759,41.627141],[-74.386624,41.627009],[-74.386608,41.626915],[-74.386633,41.626789],[-74.386692,41.626639],[-74.386717,41.626532],[-74.386667,41.626463],[-74.386591,41.626375],[-74.386465,41.626294],[-74.386381,41.626212],[-74.386314,41.626099],[-74.386306,41.625986],[-74.386306,41.625886],[-74.386323,41.625792],[-74.38642299999999,41.625597],[-74.386658,41.625227],[-74.3867,41.625094],[-74.386723,41.625014],[-74.386714,41.624913],[-74.386697,41.624838],[-74.386527,41.624216],[-74.386503,41.623987],[-74.38659699999999,41.623735],[-74.386644,41.62363],[-74.38677,41.623518],[-74.386927,41.623401],[-74.38695800000001,41.623295],[-74.387013,41.623072],[-74.387092,41.622984],[-74.387139,41.622896],[-74.387193,41.622749],[-74.387168,41.622661],[-74.387118,41.622636],[-74.386858,41.622573],[-74.386791,41.622542],[-74.386723,41.622448],[-74.386707,41.622385],[-74.38669899999999,41.622322],[-74.386707,41.622281],[-74.38667599999999,41.622099],[-74.38666000000001,41.621946],[-74.386762,41.6216],[-74.38681699999999,41.621237],[-74.386841,41.621113],[-74.386841,41.621024],[-74.386782,41.62088],[-74.38666499999999,41.620773],[-74.38654699999999,41.620698],[-74.38643,41.620578],[-74.386331,41.620468],[-74.38625999999999,41.620339],[-74.38620299999999,41.620183],[-74.386211,41.620033],[-74.38633799999999,41.619571],[-74.38636200000001,41.61946],[-74.38636200000001,41.619372],[-74.38609599999999,41.618437],[-74.38603999999999,41.61824],[-74.38600099999999,41.618011],[-74.385954,41.617911],[-74.385648,41.617449],[-74.38548299999999,41.617296],[-74.385138,41.617056],[-74.38496499999999,41.616786],[-74.38492599999999,41.616686],[-74.38484699999999,41.616575],[-74.38470599999999,41.616534],[-74.384643,41.616493],[-74.38462800000001,41.616411],[-74.384659,41.616263],[-74.38465100000001,41.616211],[-74.384604,41.616164],[-74.384456,41.616059],[-74.384373,41.616014],[-74.384283,41.615965],[-74.384197,41.615901],[-74.384134,41.615807],[-74.38411000000001,41.615678],[-74.38412599999999,41.615525],[-74.384157,41.615378],[-74.38411000000001,41.615261],[-74.38400799999999,41.615197],[-74.383836,41.615191],[-74.383678,41.615173],[-74.383647,41.615173],[-74.383521,41.615091],[-74.383388,41.615038],[-74.38315299999999,41.614985],[-74.38281600000001,41.614921],[-74.38258,41.614909],[-74.382368,41.614939],[-74.382234,41.614921],[-74.382124,41.614892],[-74.381975,41.61481],[-74.381834,41.614716],[-74.381732,41.614598],[-74.381677,41.614487],[-74.38166099999999,41.614405],[-74.38151999999999,41.614235],[-74.381379,41.614205],[-74.38120600000001,41.614229],[-74.381167,41.614217],[-74.381089,41.614205],[-74.38082199999999,41.614153],[-74.380724,41.614125],[-74.38068199999999,41.613836],[-74.38068199999999,41.613685],[-74.380708,41.613525],[-74.38079399999999,41.613317],[-74.380949,41.612896],[-74.38100799999999,41.612717],[-74.381024,41.612066],[-74.38096,41.611909],[-74.380841,41.611751],[-74.37966,41.610744],[-74.379468,41.610529],[-74.37933,41.61027],[-74.37929099999999,41.609897],[-74.379283,41.60977],[-74.37930799999999,41.609686],[-74.379384,41.609607],[-74.379678,41.609336],[-74.379783,41.609167],[-74.37981600000001,41.609022],[-74.379807,41.608878],[-74.379775,41.608769],[-74.379654,41.608486],[-74.379614,41.608227],[-74.379639,41.607987],[-74.379599,41.607561],[-74.379549,41.607322],[-74.379431,41.607094],[-74.379339,41.606881],[-74.37927500000001,41.606586],[-74.379194,41.606447],[-74.378986,41.606134],[-74.37863,41.605545],[-74.37856499999999,41.605496],[-74.37849300000001,41.605472],[-74.378364,41.605484],[-74.37796899999999,41.605707],[-74.377872,41.605731],[-74.377776,41.605743],[-74.37768699999999,41.605731],[-74.377566,41.605701],[-74.377494,41.605653],[-74.377155,41.605298],[-74.376785,41.605027],[-74.376339,41.604953],[-74.376098,41.604802],[-74.37593699999999,41.604574],[-74.37593699999999,41.604321],[-74.376065,41.604218],[-74.37625199999999,41.604171],[-74.376283,41.604098],[-74.376267,41.603941],[-74.37617,41.603724],[-74.376017,41.603513],[-74.375767,41.603363],[-74.37549300000001,41.603212],[-74.375373,41.603067],[-74.375332,41.602929],[-74.375381,41.602796],[-74.37551000000001,41.60267],[-74.375759,41.602194],[-74.37591999999999,41.602043],[-74.376186,41.601905],[-74.376396,41.60182],[-74.376476,41.601772],[-74.376501,41.601682],[-74.376492,41.601363],[-74.376428,41.601025],[-74.376428,41.600598],[-74.37627500000001,41.600092],[-74.37625199999999,41.599736],[-74.37617,41.599388],[-74.376025,41.599207],[-74.375759,41.59902],[-74.37567900000001,41.59887],[-74.375671,41.598803],[-74.375711,41.598725],[-74.375775,41.598677],[-74.376009,41.59858],[-74.37608299999999,41.598501],[-74.37613899999999,41.598399],[-74.376155,41.59829],[-74.376138,41.598189],[-74.376009,41.597972],[-74.37582399999999,41.597791],[-74.375618,41.59751],[-74.375477,41.597278],[-74.37529600000001,41.597012],[-74.37525100000001,41.596971],[-74.375114,41.59691],[-74.375058,41.596886],[-74.374888,41.596853],[-74.374748,41.596852],[-74.374629,41.596851],[-74.37453499999999,41.596862],[-74.37446300000001,41.596871],[-74.374374,41.596894],[-74.374298,41.596898],[-74.374132,41.596884],[-74.373958,41.596831],[-74.37388199999999,41.596791],[-74.37376999999999,41.596713],[-74.373569,41.596574],[-74.37342200000001,41.596483],[-74.37331,41.596414],[-74.37322899999999,41.596347],[-74.373188,41.596325],[-74.37307300000001,41.596263],[-74.37292100000001,41.596213],[-74.372773,41.596183],[-74.372648,41.596185],[-74.37248200000001,41.596205],[-74.37233500000001,41.596245],[-74.372039,41.596372],[-74.37187400000001,41.596419],[-74.371771,41.596422],[-74.371686,41.596406],[-74.371498,41.596332],[-74.371377,41.596269],[-74.37128800000001,41.596235],[-74.371211,41.596225],[-74.37088300000001,41.596273],[-74.370786,41.596299],[-74.37071,41.596329],[-74.37053400000001,41.596461],[-74.370439,41.596493],[-74.370389,41.596503],[-74.370313,41.596507],[-74.370233,41.596483],[-74.369973,41.596393],[-74.369732,41.596293],[-74.369664,41.596276],[-74.369551,41.596267],[-74.369409,41.596276],[-74.369342,41.596276],[-74.369271,41.596262],[-74.369117,41.596207],[-74.369029,41.596182],[-74.368953,41.596175],[-74.368679,41.596207],[-74.368589,41.596213],[-74.36849100000001,41.596203],[-74.368246,41.596115],[-74.368039,41.596009],[-74.367923,41.595956],[-74.36781999999999,41.595929],[-74.367762,41.595933],[-74.367678,41.595961],[-74.36757900000001,41.595978],[-74.367507,41.595978],[-74.367454,41.595963],[-74.367355,41.595918],[-74.367261,41.595851],[-74.36723000000001,41.595821],[-74.367217,41.595787],[-74.367221,41.595747],[-74.367261,41.59568],[-74.367261,41.595643],[-74.367248,41.595573],[-74.367203,41.595513],[-74.36714000000001,41.595453],[-74.36705499999999,41.595403],[-74.36696600000001,41.595372],[-74.36688100000001,41.595359],[-74.366743,41.595359],[-74.36664500000001,41.595369],[-74.366542,41.595395],[-74.366443,41.595432],[-74.366286,41.59555],[-74.36620499999999,41.59559],[-74.366086,41.595622],[-74.366013,41.595623],[-74.365911,41.595588],[-74.365843,41.595526],[-74.365793,41.595463],[-74.365776,41.595403],[-74.365776,41.595306],[-74.36565400000001,41.595092],[-74.36539500000001,41.59477],[-74.365118,41.594476],[-74.36497900000001,41.594355],[-74.364648,41.594202],[-74.364504,41.594125],[-74.364401,41.594048],[-74.364361,41.594001],[-74.364334,41.59395],[-74.364361,41.59385],[-74.364424,41.5938],[-74.364486,41.593783],[-74.364795,41.593827],[-74.36495600000001,41.593807],[-74.36518,41.593696],[-74.365261,41.593623],[-74.365274,41.593569],[-74.36526499999999,41.593527],[-74.36514,41.593452],[-74.365082,41.593382],[-74.36504100000001,41.593315],[-74.365037,41.593255],[-74.36505200000001,41.593197],[-74.365323,41.592906],[-74.36539,41.592856],[-74.365681,41.592762],[-74.36574400000001,41.592729],[-74.365838,41.592632],[-74.365995,41.592401],[-74.366057,41.592367],[-74.366191,41.592357],[-74.36653200000001,41.592374],[-74.366648,41.592384],[-74.36675099999999,41.592384],[-74.366867,41.592364],[-74.366979,41.592334],[-74.36727,41.59223],[-74.367709,41.592053],[-74.367825,41.591995],[-74.36794500000001,41.591922],[-74.368272,41.591701],[-74.368362,41.591607],[-74.368402,41.591544],[-74.368397,41.591483],[-74.368353,41.591426],[-74.36829,41.59138],[-74.368191,41.591353],[-74.367552,41.591249],[-74.36738099999999,41.591202],[-74.36722899999999,41.591125],[-74.36705499999999,41.590977],[-74.367366,41.590786],[-74.368184,41.59045],[-74.36855300000001,41.590358],[-74.36899,41.590258],[-74.369136,41.590182],[-74.369327,41.590006],[-74.369528,41.589771],[-74.369663,41.589604],[-74.36973,41.589445],[-74.36973,41.589218],[-74.36975200000001,41.58895],[-74.36991999999999,41.588749],[-74.37008899999999,41.58859],[-74.370324,41.588481],[-74.370716,41.588447],[-74.37099600000001,41.588372],[-74.371287,41.588279],[-74.372016,41.587986],[-74.37215,41.587936],[-74.37228500000001,41.587911],[-74.37256499999999,41.587919],[-74.372901,41.587944],[-74.373316,41.587927],[-74.37370799999999,41.58786],[-74.374145,41.587751],[-74.374599,41.587589],[-74.374737,41.587528],[-74.376599,41.586703],[-74.377093,41.586519],[-74.37752999999999,41.586443],[-74.37797399999999,41.586385],[-74.37801,41.586519],[-74.378077,41.586864],[-74.37817800000001,41.587142],[-74.378293,41.587343],[-74.378486,41.587573],[-74.37854,41.587638],[-74.37854900000001,41.587646],[-74.378657,41.587747],[-74.37893800000001,41.587952],[-74.37899299999999,41.587983],[-74.380188,41.58867],[-74.38101399999999,41.589145],[-74.38175699999999,41.589581],[-74.382578,41.590113],[-74.383217,41.590522],[-74.383506,41.590685],[-74.38380100000001,41.590838],[-74.38441400000001,41.591149],[-74.384863,41.59141],[-74.38518000000001,41.591613],[-74.385953,41.592052],[-74.386622,41.592418],[-74.38742000000001,41.592913],[-74.38752599999999,41.592985],[-74.387702,41.593155],[-74.38802200000001,41.593556],[-74.38813500000001,41.593697],[-74.38833099999999,41.593897],[-74.388403,41.593956],[-74.388509,41.594042],[-74.3887,41.594159],[-74.38976099999999,41.594691],[-74.390429,41.595028],[-74.390614,41.595158],[-74.39076300000001,41.595284],[-74.39105000000001,41.595563],[-74.39179,41.596367],[-74.391941,41.596467],[-74.39206,41.596529],[-74.392245,41.596602],[-74.392349,41.596636],[-74.392607,41.596721],[-74.393013,41.596838],[-74.393317,41.596957],[-74.393472,41.597006],[-74.39386399999999,41.597123],[-74.394002,41.59715],[-74.39416,41.597165],[-74.394356,41.597157],[-74.394543,41.597132],[-74.394685,41.597102],[-74.395298,41.596932],[-74.39568199999999,41.596848],[-74.39661599999999,41.596711],[-74.397369,41.596586],[-74.397578,41.59657],[-74.39804599999999,41.596532],[-74.398904,41.596428],[-74.400571,41.596225],[-74.401295,41.596152],[-74.402513,41.596111],[-74.402607,41.596117],[-74.40284800000001,41.59613],[-74.403026,41.596161],[-74.403268,41.59623],[-74.40373599999999,41.596432],[-74.403998,41.596568],[-74.40434,41.596759],[-74.40491,41.597098],[-74.40542000000001,41.597361],[-74.405632,41.597438],[-74.406024,41.597542],[-74.406344,41.597615],[-74.406835,41.597702],[-74.407431,41.597752],[-74.407562,41.597771],[-74.408168,41.597962],[-74.409949,41.598575],[-74.410045,41.598598],[-74.41017600000001,41.598604],[-74.410211,41.598606],[-74.410971,41.5985],[-74.411772,41.598365],[-74.412057,41.598323],[-74.412368,41.598246],[-74.412655,41.598139],[-74.41310199999999,41.597886],[-74.41339000000001,41.59774],[-74.413488,41.597713],[-74.41353700000001,41.597709],[-74.413664,41.597717],[-74.413791,41.597744],[-74.414041,41.597813],[-74.415115,41.598196],[-74.415257,41.598239],[-74.415766,41.598381],[-74.41596199999999,41.598415],[-74.416387,41.598452],[-74.416815,41.598475],[-74.417115,41.598517],[-74.417388,41.598579],[-74.417609,41.598646],[-74.41811800000001,41.598857],[-74.41824800000001,41.598896],[-74.418318,41.5989],[-74.418391,41.598888],[-74.41891800000001,41.5987],[-74.41907999999999,41.598654],[-74.419207,41.598631],[-74.419403,41.598631],[-74.41963199999999,41.598648],[-74.420063,41.598705],[-74.421311,41.598827],[-74.42176000000001,41.598846],[-74.421852,41.598852],[-74.42191200000001,41.598866],[-74.422101,41.598907],[-74.422293,41.598976],[-74.422366,41.599003],[-74.422917,41.59926],[-74.423682,41.599596],[-74.42436600000001,41.599917],[-74.42471,41.600119],[-74.42482200000001,41.600234],[-74.424868,41.600296],[-74.42493,41.600446],[-74.424941,41.600576],[-74.424926,41.600653],[-74.42476000000001,41.600996],[-74.42447,41.601459],[-74.423873,41.602328],[-74.423767,41.602513],[-74.42365599999999,41.602767],[-74.42345899999999,41.603175],[-74.42335,41.603438],[-74.423288,41.603623],[-74.42324600000001,41.603835],[-74.42325,41.604004],[-74.42329599999999,41.604111],[-74.42338100000001,41.604207],[-74.42344,41.60426],[-74.42359,41.604344],[-74.42368999999999,41.604375],[-74.424864,41.604636],[-74.425625,41.604777],[-74.42588499999999,41.604853],[-74.42607599999999,41.604937],[-74.426157,41.604992],[-74.42626300000001,41.605089],[-74.42634200000001,41.605188],[-74.426429,41.605322],[-74.426315,41.605434],[-74.426376,41.60613],[-74.426498,41.60709],[-74.426559,41.607332],[-74.426671,41.60759],[-74.42697099999999,41.608136],[-74.42700600000001,41.608259],[-74.426981,41.608457],[-74.426919,41.608742],[-74.42690399999999,41.608843],[-74.426905,41.609021],[-74.426925,41.609136],[-74.426998,41.609375],[-74.427094,41.609521],[-74.427194,41.609602],[-74.427482,41.609739],[-74.427875,41.609915],[-74.428066,41.61],[-74.428378,41.610149],[-74.428877,41.61044],[-74.429108,41.610562],[-74.429365,41.610698],[-74.429666,41.610875],[-74.42993,41.611005],[-74.42999500000001,41.611028],[-74.430089,41.611044],[-74.431631,41.611131],[-74.432124,41.611131],[-74.433684,41.610982],[-74.43429500000001,41.610965],[-74.434614,41.610984],[-74.43499199999999,41.611027],[-74.43508,41.611046],[-74.435211,41.611111],[-74.435292,41.611173],[-74.43554399999999,41.611432],[-74.435883,41.611894],[-74.436075,41.612113],[-74.43634900000001,41.612386],[-74.436564,41.612567],[-74.43668,41.612648],[-74.437184,41.612898],[-74.43739100000001,41.612987],[-74.437687,41.613143],[-74.438053,41.613306],[-74.438265,41.613417],[-74.438788,41.613722],[-74.438965,41.613858],[-74.439622,41.61449],[-74.44004099999999,41.614812],[-74.440195,41.614944],[-74.44037,41.615131],[-74.440634,41.615487],[-74.440748,41.615641],[-74.44091299999999,41.61581],[-74.441079,41.615969],[-74.44121,41.616125],[-74.441236,41.616169],[-74.441394,41.61653],[-74.441531,41.616925],[-74.441806,41.617666],[-74.441947,41.617936],[-74.442367,41.618516],[-74.44265300000001,41.619047],[-74.442744,41.619159],[-74.442823,41.619198],[-74.442948,41.619206],[-74.44304200000001,41.619196],[-74.443352,41.619161],[-74.44422,41.619115],[-74.444749,41.619118],[-74.445049,41.619124],[-74.44586700000001,41.61914],[-74.446701,41.619141],[-74.447053,41.619119],[-74.447346,41.619079],[-74.44801200000001,41.618941],[-74.448289,41.618905],[-74.448449,41.618918],[-74.448545,41.618956],[-74.44864699999999,41.619031],[-74.448877,41.619313],[-74.44896799999999,41.619422],[-74.449074,41.619559],[-74.44985800000001,41.620576],[-74.450254,41.62115],[-74.450639,41.621676],[-74.450852,41.621933],[-74.45106199999999,41.622188],[-74.451114,41.622284],[-74.451133,41.622474],[-74.451095,41.622853],[-74.45102799999999,41.623164],[-74.451014,41.623354],[-74.45102300000001,41.623556],[-74.451052,41.62374],[-74.45112399999999,41.623937],[-74.451267,41.624277],[-74.451435,41.624617],[-74.45147799999999,41.624778],[-74.451497,41.624925]]],"type":"Polygon"}
}