{
  "id": "360630205001",
  "type": "Feature",
  "properties": {
    "area_land":863445,
    "area_water":170478,
    "geoid":"360630205001",
    "name":"Block Group 1",
    "state":"ny"
},
  "bbox": [
    -79.063559,
    43.095855,
    -79.048957,
    43.110497
],
  "geometry": {"coordinates":[[[-79.063559,43.095855],[-79.062287,43.098376],[-79.05847300000001,43.10594],[-79.05796100000001,43.106957],[-79.058037,43.108201],[-79.05806699999999,43.108455],[-79.058088,43.108544],[-79.05811,43.108633],[-79.05813999999999,43.108762],[-79.058184,43.108944],[-79.058232,43.109149],[-79.058257,43.109256],[-79.058262,43.109279],[-79.058145,43.109291],[-79.05797099999999,43.10931],[-79.057796,43.109329],[-79.05768,43.109342],[-79.057379,43.109377],[-79.056954,43.109427],[-79.056479,43.109485],[-79.05618,43.109523],[-79.056122,43.109529],[-79.05610299999999,43.109531],[-79.056059,43.109536],[-79.056009,43.109541],[-79.05587199999999,43.109555],[-79.055796,43.109564],[-79.054422,43.109744],[-79.054377,43.109592],[-79.05426300000001,43.109625],[-79.053916,43.109711],[-79.053731,43.109749],[-79.052402,43.110025],[-79.052171,43.110049],[-79.052122,43.110055],[-79.051581,43.110131],[-79.05114,43.110187],[-79.051067,43.110207],[-79.050877,43.110261],[-79.049525,43.110431],[-79.049009,43.110497],[-79.049008,43.110467],[-79.049003,43.110336],[-79.049002,43.110314],[-79.049001,43.110179],[-79.048998,43.109766],[-79.048998,43.109584],[-79.048996,43.109395],[-79.04899,43.108828],[-79.04898900000001,43.10864],[-79.048986,43.108453],[-79.04897699999999,43.107892],[-79.048974,43.107705],[-79.04897200000001,43.107516],[-79.048969,43.106951],[-79.048968,43.106763],[-79.048967,43.106536],[-79.048965,43.105856],[-79.048965,43.10563],[-79.048964,43.105469],[-79.04896100000001,43.10499],[-79.048959,43.104807],[-79.048959,43.104621],[-79.048958,43.104418],[-79.048958,43.104132],[-79.048957,43.103813],[-79.048957,43.103611],[-79.048957,43.103414],[-79.048958,43.103222],[-79.04896599999999,43.103124],[-79.04903899999999,43.102832],[-79.049088,43.102642],[-79.04913500000001,43.102466],[-79.04920300000001,43.102214],[-79.049277,43.101938],[-79.049325,43.101763],[-79.049376,43.101575],[-79.049457,43.101278],[-79.04952900000001,43.101012],[-79.049581,43.100825],[-79.049626,43.100655],[-79.049702,43.100373],[-79.049751,43.100187],[-79.049768,43.100146],[-79.049837,43.099985],[-79.049871,43.099924],[-79.04997299999999,43.099796],[-79.05010900000001,43.099659],[-79.05038,43.099461],[-79.050487,43.099405],[-79.050982,43.099208],[-79.051216,43.099925],[-79.05153900000001,43.09992],[-79.05251699999999,43.099927],[-79.05314199999999,43.099941],[-79.053493,43.09995],[-79.054092,43.099959],[-79.054885,43.099971],[-79.056943,43.099986],[-79.057543,43.099991],[-79.057751,43.099999],[-79.05789,43.100029],[-79.05800600000001,43.099869],[-79.058356,43.099393],[-79.05847300000001,43.099234],[-79.058582,43.099078],[-79.058592,43.09906],[-79.058858,43.098638],[-79.058921,43.098521],[-79.059023,43.098337],[-79.059135,43.098124],[-79.0592,43.098002],[-79.05924899999999,43.097897],[-79.059445,43.097472],[-79.059516,43.097317],[-79.059546,43.097254],[-79.059629,43.097066],[-79.059712,43.09688],[-79.05987500000001,43.096504],[-79.059945,43.096345],[-79.059957,43.096316],[-79.060131,43.096243],[-79.060463,43.096105],[-79.060653,43.096026],[-79.06083099999999,43.095952],[-79.06110700000001,43.09595],[-79.061936,43.095947],[-79.062213,43.095946],[-79.062482,43.095927],[-79.063289,43.095873],[-79.063559,43.095855]]],"type":"Polygon"}
}