{
  "id": "360595196012",
  "type": "Feature",
  "properties": {
    "area_land":205424,
    "area_water":0,
    "geoid":"360595196012",
    "name":"Block Group 2",
    "state":"ny"
},
  "bbox": [
    -73.50261,
    40.777026,
    -73.4943,
    40.780388
],
  "geometry": {"coordinates":[[[-73.50261,40.779756],[-73.50059899999999,40.779917],[-73.498637,40.780073],[-73.49664799999999,40.78023],[-73.49579799999999,40.780301],[-73.494675,40.780388],[-73.494579,40.779703],[-73.49448700000001,40.779022],[-73.494392,40.77834],[-73.4943,40.777657],[-73.496273,40.777501],[-73.498249,40.777343],[-73.50022300000001,40.777187],[-73.502239,40.777026],[-73.50233299999999,40.77771],[-73.502426,40.778391],[-73.50251799999999,40.779075],[-73.50261,40.779756]]],"type":"Polygon"}
}