{
  "id": "360593036005",
  "type": "Feature",
  "properties": {
    "area_land":306035,
    "area_water":0,
    "geoid":"360593036005",
    "name":"Block Group 5",
    "state":"ny"
},
  "bbox": [
    -73.652855,
    40.736848,
    -73.639772,
    40.742347
],
  "geometry": {"coordinates":[[[-73.65232399999999,40.739075],[-73.651488,40.739353],[-73.650946,40.739534],[-73.65066299999999,40.73963],[-73.649839,40.739902],[-73.649306,40.740075],[-73.649001,40.740183],[-73.648482,40.740351],[-73.648151,40.740464],[-73.647655,40.740627],[-73.647327,40.740737],[-73.646801,40.740854],[-73.646455,40.740939],[-73.64593499999999,40.741063],[-73.645591,40.741151],[-73.645071,40.741271],[-73.644722,40.741355],[-73.64458999999999,40.741388],[-73.643815,40.741579],[-73.643525,40.741648],[-73.643351,40.741689],[-73.642844,40.741809],[-73.64187,40.742039],[-73.640596,40.742347],[-73.640305,40.741646],[-73.640263,40.741513],[-73.639973,40.740858],[-73.639897,40.74071],[-73.63983399999999,40.740556],[-73.63977199999999,40.740405],[-73.641065,40.740112],[-73.64167399999999,40.739995],[-73.64261500000001,40.739778],[-73.64334700000001,40.739599],[-73.643484,40.739566],[-73.64339,40.739305],[-73.64426,40.739097],[-73.643856,40.738125],[-73.64474,40.737969],[-73.645053,40.737917],[-73.64563800000001,40.737809],[-73.64592399999999,40.737749],[-73.646593,40.737631],[-73.64747199999999,40.737472],[-73.648348,40.737314],[-73.64922900000001,40.737154],[-73.649778,40.737054],[-73.650102,40.736993],[-73.650374,40.736927],[-73.65052900000001,40.736907],[-73.650997,40.736848],[-73.65110199999999,40.736931],[-73.651601,40.737432],[-73.651859,40.737706],[-73.65188000000001,40.73773],[-73.652855,40.738898],[-73.65232399999999,40.739075]]],"type":"Polygon"}
}