{
  "id": "361031466062",
  "type": "Feature",
  "properties": {
    "area_land":1640193,
    "area_water":0,
    "geoid":"361031466062",
    "name":"Block Group 2",
    "state":"ny"
},
  "bbox": [
    -73.121723,
    40.75622,
    -73.098015,
    40.770094
],
  "geometry": {"coordinates":[[[-73.121723,40.768564],[-73.120002,40.768718],[-73.11860299999999,40.768836],[-73.11771400000001,40.76891],[-73.115272,40.769114],[-73.114448,40.769186],[-73.11203,40.769391],[-73.10957000000001,40.769609],[-73.10879,40.769671],[-73.10557300000001,40.769957],[-73.103933,40.770094],[-73.102934,40.768578],[-73.102457,40.767828],[-73.101845,40.766879],[-73.10139599999999,40.766193],[-73.10114400000001,40.765788],[-73.100891,40.765384],[-73.10086200000001,40.765337],[-73.100666,40.76502],[-73.10046699999999,40.764687],[-73.100393,40.764562],[-73.100363,40.764514],[-73.099929,40.763784],[-73.099819,40.763732],[-73.09972399999999,40.763559],[-73.099457,40.763178],[-73.099063,40.762576],[-73.09849,40.761688],[-73.098015,40.760951],[-73.09817200000001,40.760893],[-73.099063,40.760568],[-73.099721,40.760308],[-73.10056,40.760003],[-73.100613,40.759975],[-73.101377,40.759702],[-73.102172,40.759407],[-73.10314200000001,40.759051],[-73.10376100000001,40.758817],[-73.103827,40.758792],[-73.10633300000001,40.75783],[-73.106919,40.757576],[-73.107096,40.7575],[-73.107527,40.757317],[-73.110101,40.75622],[-73.11012700000001,40.756406],[-73.11013699999999,40.756476],[-73.110169,40.756705],[-73.110339,40.75785],[-73.11068400000001,40.760158],[-73.11072799999999,40.760458],[-73.11076799999999,40.760733],[-73.11087000000001,40.761434],[-73.110964,40.762099],[-73.111108,40.763161],[-73.111141,40.76333],[-73.111249,40.7641],[-73.11449,40.76382],[-73.11783200000001,40.763538],[-73.118736,40.763464],[-73.119668,40.763391],[-73.120166,40.762811],[-73.12036999999999,40.762638],[-73.12079799999999,40.762341],[-73.121026,40.76386],[-73.121312,40.765846],[-73.12135600000001,40.76609],[-73.121469,40.766944],[-73.121723,40.768564]]],"type":"Polygon"}
}