{
  "id": "360870114013",
  "type": "Feature",
  "properties": {
    "area_land":1695784,
    "area_water":0,
    "geoid":"360870114013",
    "name":"Block Group 3",
    "state":"ny"
},
  "bbox": [
    -74.018067,
    41.121329,
    -74.001893,
    41.140258
],
  "geometry": {"coordinates":[[[-74.018067,41.137727],[-74.01777,41.137849],[-74.017664,41.137894],[-74.017523,41.137969],[-74.017286,41.138114],[-74.017231,41.138149],[-74.016982,41.138347],[-74.01677100000001,41.138577],[-74.01672000000001,41.138635],[-74.01666400000001,41.138716],[-74.016614,41.138787],[-74.016589,41.138845],[-74.016549,41.138937],[-74.016336,41.139445],[-74.016312,41.139503],[-74.016217,41.139772],[-74.016195,41.139897],[-74.01622,41.140009],[-74.016035,41.140034],[-74.015162,41.140016],[-74.015084,41.140015],[-74.014465,41.140011],[-74.01415799999999,41.140009],[-74.013676,41.140006],[-74.013547,41.139981],[-74.013526,41.139974],[-74.013423,41.139919],[-74.013383,41.139875],[-74.013347,41.139801],[-74.01321,41.139433],[-74.01319100000001,41.139383],[-74.013043,41.138944],[-74.01265100000001,41.138965],[-74.012417,41.138972],[-74.012169,41.13896],[-74.011178,41.138913],[-74.010296,41.138893],[-74.009013,41.138855],[-74.008393,41.138825],[-74.006289,41.138752],[-74.00611499999999,41.138752],[-74.006073,41.139335],[-74.00603,41.140258],[-74.004946,41.140218],[-74.004795,41.140218],[-74.004389,41.14024],[-74.004447,41.139499],[-74.004496,41.139193],[-74.004713,41.138061],[-74.004955,41.136775],[-74.005179,41.135457],[-74.005267,41.13511],[-74.004903,41.135046],[-74.00446700000001,41.134942],[-74.004397,41.134903],[-74.004316,41.134802],[-74.004284,41.134714],[-74.004299,41.134167],[-74.004284,41.134032],[-74.004243,41.133944],[-74.00419599999999,41.133895],[-74.004144,41.133858],[-74.004012,41.133797],[-74.00343599999999,41.133631],[-74.00334100000001,41.133609],[-74.002647,41.13345],[-74.002174,41.133316],[-74.002188,41.133154],[-74.00217000000001,41.132987],[-74.001975,41.13209],[-74.001931,41.131821],[-74.001903,41.131533],[-74.001893,41.131081],[-74.00189899999999,41.13091],[-74.001925,41.130696],[-74.00197300000001,41.130469],[-74.00205699999999,41.129997],[-74.00213599999999,41.129721],[-74.00219300000001,41.129563],[-74.002285,41.129384],[-74.002455,41.129136],[-74.0026,41.12897],[-74.00280600000001,41.128768],[-74.00306500000001,41.128582],[-74.00320600000001,41.128502],[-74.00333000000001,41.12843],[-74.004623,41.127809],[-74.00494500000001,41.127662],[-74.00511899999999,41.127573],[-74.00548999999999,41.127385],[-74.00566499999999,41.127285],[-74.005844,41.127161],[-74.006067,41.126973],[-74.006281,41.126726],[-74.00636900000001,41.126591],[-74.006478,41.126365],[-74.006576,41.126117],[-74.006711,41.125691],[-74.006767,41.1255],[-74.006878,41.125121],[-74.007126,41.124411],[-74.007244,41.124012],[-74.007363,41.123576],[-74.007571,41.122735],[-74.007644,41.122266],[-74.007701,41.121706],[-74.007712,41.121557],[-74.007733,41.121329],[-74.00805099999999,41.121551],[-74.008349,41.121764],[-74.008657,41.122001],[-74.009514,41.122623],[-74.009778,41.122804],[-74.01114699999999,41.123776],[-74.01144600000001,41.124015],[-74.01179,41.124337],[-74.012387,41.124847],[-74.01303299999999,41.125504],[-74.01369200000001,41.126271],[-74.01390000000001,41.126529],[-74.01426499999999,41.127026],[-74.01460400000001,41.127514],[-74.01468300000001,41.127644],[-74.014894,41.127988],[-74.01515999999999,41.128461],[-74.015401,41.128948],[-74.015755,41.129774],[-74.01593,41.130222],[-74.01596600000001,41.130345],[-74.01617400000001,41.131084],[-74.016278,41.131533],[-74.01631500000001,41.131694],[-74.01634199999999,41.131809],[-74.016519,41.132767],[-74.016723,41.133771],[-74.016853,41.134269],[-74.016982,41.134764],[-74.01725399999999,41.135669],[-74.01745,41.136236],[-74.017725,41.136929],[-74.017842,41.137225],[-74.018067,41.137727]]],"type":"Polygon"}
}