{
  "id": "360810142011",
  "type": "Feature",
  "properties": {
    "area_land":94037,
    "area_water":0,
    "geoid":"360810142011",
    "name":"Block Group 1",
    "state":"ny"
},
  "bbox": [
    -73.827953,
    40.700677,
    -73.822112,
    40.703656
],
  "geometry": {"coordinates":[[[-73.82795299999999,40.70229],[-73.827066,40.702515],[-73.826072,40.702772],[-73.825176,40.702992],[-73.82427,40.703219],[-73.82387199999999,40.703324],[-73.82338900000001,40.703443],[-73.82269700000001,40.70362],[-73.82245899999999,40.703656],[-73.822112,40.701847],[-73.822275,40.701792],[-73.82250500000001,40.701757],[-73.82270800000001,40.70171],[-73.82307900000001,40.701624],[-73.823401,40.701532],[-73.82391200000001,40.701408],[-73.82476699999999,40.701189],[-73.825666,40.700956],[-73.826336,40.700829],[-73.82656299999999,40.700789],[-73.827252,40.700677],[-73.82795299999999,40.70229]]],"type":"Polygon"}
}