{
  "id": "360470149005",
  "type": "Feature",
  "properties": {
    "area_land":53838,
    "area_water":0,
    "geoid":"360470149005",
    "name":"Block Group 5",
    "state":"ny"
},
  "bbox": [
    -73.988335,
    40.661469,
    -73.984591,
    40.664425
],
  "geometry": {"coordinates":[[[-73.98833500000001,40.662805],[-73.987453,40.663823],[-73.986951,40.664425],[-73.98459099999999,40.663284],[-73.985094,40.662681],[-73.985596,40.662081],[-73.98612300000001,40.661469],[-73.986856,40.661914],[-73.98722100000001,40.66213],[-73.98756899999999,40.662339],[-73.98833500000001,40.662805]]],"type":"Polygon"}
}