{
  "id": "360810577001",
  "type": "Feature",
  "properties": {
    "area_land":52959,
    "area_water":0,
    "geoid":"360810577001",
    "name":"Block Group 1",
    "state":"ny"
},
  "bbox": [
    -73.892744,
    40.701104,
    -73.887401,
    40.702972
],
  "geometry": {"coordinates":[[[-73.89274399999999,40.701851],[-73.891628,40.702127],[-73.890727,40.702335],[-73.88983,40.702549],[-73.888935,40.702761],[-73.888043,40.702972],[-73.887401,40.701401],[-73.88793099999999,40.701354],[-73.888352,40.70132],[-73.888862,40.701276],[-73.889296,40.701232],[-73.890246,40.701149],[-73.89086500000001,40.701104],[-73.891654,40.701429],[-73.89274399999999,40.701851]]],"type":"Polygon"}
}