{
  "id": "360470274002",
  "type": "Feature",
  "properties": {
    "area_land":88060,
    "area_water":0,
    "geoid":"360470274002",
    "name":"Block Group 2",
    "state":"ny"
},
  "bbox": [
    -73.998313,
    40.609894,
    -73.993343,
    40.613996
],
  "geometry": {"coordinates":[[[-73.997739,40.611649],[-73.99717099999999,40.612215],[-73.99659800000001,40.612781],[-73.99603500000001,40.613336],[-73.995983,40.613388],[-73.99536999999999,40.613996],[-73.993343,40.612772],[-73.993968,40.612173],[-73.994179,40.61197],[-73.994597,40.611571],[-73.995177,40.61101],[-73.99575400000001,40.610456],[-73.99633799999999,40.609894],[-73.998313,40.611084],[-73.997739,40.611649]]],"type":"Polygon"}
}