{
  "id": "361031463001",
  "type": "Feature",
  "properties": {
    "area_land":1508274,
    "area_water":0,
    "geoid":"361031463001",
    "name":"Block Group 1",
    "state":"ny"
},
  "bbox": [
    -73.206361,
    40.757305,
    -73.191193,
    40.782827
],
  "geometry": {"coordinates":[[[-73.206361,40.77405],[-73.202918,40.774782],[-73.200489,40.775369],[-73.200641,40.775763],[-73.200811,40.776439],[-73.201009,40.77712],[-73.20119200000001,40.777747],[-73.201385,40.77841],[-73.201584,40.779092],[-73.201761,40.7797],[-73.20178199999999,40.779718],[-73.201774,40.779746],[-73.20195,40.780348],[-73.201973,40.780374],[-73.201966,40.780403],[-73.202155,40.781051],[-73.20029100000001,40.781473],[-73.20004,40.781505],[-73.199861,40.781535],[-73.197309,40.782109],[-73.19412800000001,40.782827],[-73.193826,40.782458],[-73.193381,40.782605],[-73.19297899999999,40.78243],[-73.19278199999999,40.782389],[-73.192424,40.782244],[-73.191998,40.782094],[-73.19146600000001,40.78184],[-73.19125,40.781328],[-73.191193,40.780961],[-73.1913,40.780577],[-73.191385,40.780358],[-73.191416,40.780018],[-73.191562,40.779715],[-73.191579,40.779528],[-73.19148199999999,40.779201],[-73.192835,40.778727],[-73.19293,40.778696],[-73.19313,40.778634],[-73.19342399999999,40.77854],[-73.193834,40.778418],[-73.197006,40.777481],[-73.19714399999999,40.777453],[-73.197329,40.777442],[-73.197383,40.777446],[-73.19751599999999,40.777457],[-73.197659,40.777485],[-73.19782499999999,40.777537],[-73.197878,40.777561],[-73.198031,40.77763],[-73.198222,40.777702],[-73.198408,40.777747],[-73.198572,40.777767],[-73.198711,40.777767],[-73.19887799999999,40.77775],[-73.199325,40.777703],[-73.198981,40.775758],[-73.198673,40.774084],[-73.19846200000001,40.772983],[-73.198026,40.770636],[-73.19783,40.769443],[-73.197688,40.76877],[-73.19761,40.768402],[-73.197382,40.767203],[-73.19736899999999,40.767132],[-73.19713299999999,40.765851],[-73.19710000000001,40.765675],[-73.197076,40.76554],[-73.197031,40.765346],[-73.197002,40.764989],[-73.196941,40.764662],[-73.196819,40.764001],[-73.19599700000001,40.759497],[-73.195977,40.759363],[-73.195859,40.75858],[-73.195851,40.75853],[-73.195837,40.758477],[-73.195795,40.758258],[-73.19577099999999,40.758123],[-73.196332,40.758052],[-73.196507,40.75803],[-73.197086,40.757957],[-73.197582,40.757863],[-73.198381,40.757695],[-73.199068,40.757556],[-73.200322,40.757305],[-73.200141,40.75777],[-73.20009400000001,40.758277],[-73.20156799999999,40.75976],[-73.20289699999999,40.760719],[-73.20287999999999,40.760792],[-73.20262099999999,40.761936],[-73.20270600000001,40.762056],[-73.20343,40.763075],[-73.203391,40.763274],[-73.20332399999999,40.763616],[-73.20426399999999,40.766563],[-73.206361,40.77405]]],"type":"Polygon"}
}