{
  "id": "361190039001",
  "type": "Feature",
  "properties": {
    "area_land":176493,
    "area_water":0,
    "geoid":"361190039001",
    "name":"Block Group 1",
    "state":"ny"
},
  "bbox": [
    -73.836167,
    40.921114,
    -73.830795,
    40.926612
],
  "geometry": {"coordinates":[[[-73.835781,40.925898],[-73.835629,40.926227],[-73.835578,40.926351],[-73.835521,40.926485],[-73.835491,40.926553],[-73.83546699999999,40.926612],[-73.83466799999999,40.926435],[-73.83313,40.926077],[-73.833001,40.926046],[-73.83273199999999,40.92601],[-73.83207400000001,40.925993],[-73.831176,40.925975],[-73.831174,40.925786],[-73.831174,40.925726],[-73.831181,40.92559],[-73.831175,40.925145],[-73.83115599999999,40.924101],[-73.831052,40.923274],[-73.830969,40.922877],[-73.830888,40.922337],[-73.83085199999999,40.921975],[-73.83079499999999,40.92159],[-73.831687,40.921462],[-73.831919,40.921429],[-73.83261,40.921358],[-73.83329500000001,40.921288],[-73.83532099999999,40.921114],[-73.835066,40.921722],[-73.835016,40.921842],[-73.834825,40.922298],[-73.834605,40.922765],[-73.834197,40.923657],[-73.833843,40.924455],[-73.836167,40.925043],[-73.835781,40.925898]]],"type":"Polygon"}
}