{
  "id": "360830520021",
  "type": "Feature",
  "properties": {
    "area_land":51020834,
    "area_water":282017,
    "geoid":"360830520021",
    "name":"Block Group 1",
    "state":"ny"
},
  "bbox": [
    -73.600249,
    42.706688,
    -73.506023,
    42.811159
],
  "geometry": {"coordinates":[[[-73.60024900000001,42.729284],[-73.598743,42.729698],[-73.59737199999999,42.730089],[-73.59576300000001,42.730538],[-73.594054,42.731029],[-73.593603,42.731168],[-73.593124,42.731339],[-73.592862,42.731448],[-73.592476,42.73162],[-73.592242,42.73173],[-73.592006,42.731865],[-73.59162600000001,42.732084],[-73.590644,42.732709],[-73.590417,42.732844],[-73.589913,42.733098],[-73.589209,42.733384],[-73.588804,42.733526],[-73.58854599999999,42.733607],[-73.587881,42.733772],[-73.587676,42.733824],[-73.587366,42.733886],[-73.58703800000001,42.733951],[-73.58630700000001,42.734097],[-73.585227,42.734303],[-73.584023,42.734532],[-73.583348,42.734665],[-73.581844,42.734961],[-73.58177000000001,42.73498],[-73.58119499999999,42.735147],[-73.580718,42.735327],[-73.58028899999999,42.735537],[-73.579802,42.73584],[-73.579373,42.736181],[-73.57914100000001,42.736418],[-73.578917,42.736716],[-73.57879,42.736896],[-73.578619,42.737207],[-73.57847099999999,42.737563],[-73.578402,42.737855],[-73.57829099999999,42.738459],[-73.578264,42.738575],[-73.578183,42.738827],[-73.578025,42.739219],[-73.577623,42.740044],[-73.577471,42.740367],[-73.577355,42.740615],[-73.577155,42.741115],[-73.577043,42.741567],[-73.57698600000001,42.741883],[-73.576728,42.743092],[-73.576562,42.743733],[-73.576177,42.744812],[-73.576008,42.745223],[-73.57553799999999,42.746164],[-73.57530300000001,42.746578],[-73.575237,42.746692],[-73.57500400000001,42.747062],[-73.57467200000001,42.74756],[-73.57426700000001,42.748108],[-73.573232,42.74941],[-73.573126,42.749529],[-73.573024,42.749641],[-73.572801,42.74982],[-73.57264000000001,42.749924],[-73.572531,42.749989],[-73.572361,42.750063],[-73.572626,42.750338],[-73.572835,42.750547],[-73.573065,42.750708],[-73.57349499999999,42.750932],[-73.573984,42.751161],[-73.57450300000001,42.751382],[-73.57454,42.751394],[-73.576449,42.752108],[-73.576793,42.752255],[-73.57717100000001,42.752444],[-73.577269,42.752502],[-73.577547,42.752689],[-73.577853,42.752933],[-73.578048,42.753114],[-73.57851599999999,42.753604],[-73.57937200000001,42.754585],[-73.579669,42.7549],[-73.579882,42.755102],[-73.57997,42.755178],[-73.580386,42.755471],[-73.58065000000001,42.755639],[-73.582605,42.756768],[-73.583078,42.756996],[-73.583439,42.757134],[-73.58391399999999,42.757296],[-73.58434699999999,42.757416],[-73.584721,42.757491],[-73.586641,42.757842],[-73.586917,42.757912],[-73.587363,42.758058],[-73.587512,42.758116],[-73.589376,42.758875],[-73.58977299999999,42.759031],[-73.59001499999999,42.759108],[-73.590227,42.759175],[-73.590549,42.759254],[-73.59196799999999,42.759537],[-73.592468,42.759669],[-73.59293,42.759832],[-73.59325699999999,42.759971],[-73.593963,42.760297],[-73.594644,42.760556],[-73.59521100000001,42.760735],[-73.596576,42.761144],[-73.596665,42.761176],[-73.59705200000001,42.761318],[-73.596591,42.761848],[-73.596172,42.762333],[-73.595067,42.763585],[-73.59482300000001,42.763869],[-73.594115,42.764654],[-73.593811,42.765],[-73.593406,42.765473],[-73.592984,42.766023],[-73.592535,42.766716],[-73.592119,42.767455],[-73.591551,42.768399],[-73.59092200000001,42.769577],[-73.590688,42.769946],[-73.59018399999999,42.77081],[-73.58993599999999,42.771306],[-73.589494,42.772275],[-73.589108,42.773183],[-73.588812,42.773882],[-73.588697,42.774128],[-73.588441,42.774549],[-73.588069,42.775074],[-73.587915,42.775266],[-73.58731899999999,42.775882],[-73.58699300000001,42.776172],[-73.586366,42.776668],[-73.585324,42.777463],[-73.584422,42.778164],[-73.583744,42.778676],[-73.58003100000001,42.781543],[-73.57932099999999,42.782111],[-73.577758,42.783334],[-73.576936,42.784009],[-73.576075,42.784872],[-73.57278599999999,42.788397],[-73.57226,42.78894],[-73.572022,42.789193],[-73.57149200000001,42.789755],[-73.570859,42.790484],[-73.57063100000001,42.7908],[-73.570565,42.790897],[-73.570457,42.791105],[-73.57033699999999,42.791374],[-73.56989299999999,42.792634],[-73.569759,42.793033],[-73.569579,42.79357],[-73.56932500000001,42.794128],[-73.56908799999999,42.794599],[-73.568911,42.794915],[-73.568172,42.796045],[-73.567711,42.796697],[-73.567616,42.796831],[-73.567294,42.797261],[-73.56637000000001,42.798253],[-73.56456300000001,42.79983],[-73.564272,42.800084],[-73.56378100000001,42.800482],[-73.563473,42.800705],[-73.56294800000001,42.801057],[-73.56226599999999,42.801439],[-73.561504,42.801801],[-73.560913,42.802041],[-73.5598,42.802442],[-73.55891800000001,42.802733],[-73.558469,42.802887],[-73.557463,42.803197],[-73.556552,42.803433],[-73.55495999999999,42.803854],[-73.554351,42.804013],[-73.55354699999999,42.804223],[-73.552809,42.804434],[-73.552171,42.804646],[-73.551919,42.80474],[-73.551438,42.804939],[-73.54903899999999,42.805921],[-73.548168,42.806293],[-73.539782,42.807247],[-73.52309,42.809185],[-73.512184,42.81044],[-73.512069,42.810453],[-73.51175499999999,42.810493],[-73.50855199999999,42.810862],[-73.50850199999999,42.810868],[-73.508276,42.810895],[-73.50776500000001,42.810954],[-73.507042,42.81104],[-73.50672400000001,42.811074],[-73.506289,42.811128],[-73.506023,42.811159],[-73.509894,42.800242],[-73.510756,42.797882],[-73.511994,42.794379],[-73.520635,42.770603],[-73.520779,42.77018],[-73.520854,42.769975],[-73.521199,42.768996],[-73.521264,42.768765],[-73.521433,42.768155],[-73.52283,42.764301],[-73.526205,42.755027],[-73.52801599999999,42.75009],[-73.529212,42.747772],[-73.52986900000001,42.746401],[-73.535304,42.731301],[-73.53995500000001,42.718382],[-73.54003299999999,42.718238],[-73.54009000000001,42.718072],[-73.542359,42.711678],[-73.54892700000001,42.710753],[-73.560393,42.709287],[-73.567331,42.708509],[-73.57391699999999,42.707766],[-73.577804,42.707211],[-73.582791,42.706688],[-73.582825,42.706712],[-73.584097,42.707298],[-73.585506,42.707898],[-73.585703,42.707994],[-73.585866,42.708086],[-73.585992,42.708174],[-73.586088,42.708254],[-73.58687999999999,42.709026],[-73.587131,42.709314],[-73.587324,42.709553],[-73.587475,42.709783],[-73.587751,42.710247],[-73.587919,42.710634],[-73.587998,42.710871],[-73.588086,42.711057],[-73.588229,42.711271],[-73.58858499999999,42.711689],[-73.58879399999999,42.711907],[-73.588999,42.712082],[-73.592258,42.714444],[-73.59308299999999,42.715026],[-73.593349,42.715223],[-73.593388,42.715264],[-73.593492,42.715385],[-73.593625,42.715562],[-73.59389400000001,42.716081],[-73.594026,42.716336],[-73.594449,42.717089],[-73.59454100000001,42.717227],[-73.59458600000001,42.717285],[-73.59470399999999,42.717436],[-73.59483,42.71758],[-73.59496,42.717693],[-73.595765,42.718203],[-73.595913,42.71831],[-73.596259,42.718594],[-73.596413,42.718753],[-73.596948,42.719343],[-73.597156,42.719637],[-73.597399,42.720087],[-73.597521,42.720386],[-73.597568,42.720569],[-73.597635,42.721028],[-73.597694,42.721199],[-73.59779,42.7214],[-73.59819,42.722036],[-73.59826099999999,42.722176],[-73.598275,42.72225],[-73.598281,42.722396],[-73.598257,42.722518],[-73.598212,42.722631],[-73.597347,42.724288],[-73.59702900000001,42.724922],[-73.59692099999999,42.725085],[-73.59650600000001,42.725567],[-73.59639300000001,42.725736],[-73.59635900000001,42.725844],[-73.596355,42.725918],[-73.596389,42.726085],[-73.596642,42.726663],[-73.596842,42.727146],[-73.59702299999999,42.727639],[-73.597095,42.727726],[-73.597201,42.727806],[-73.597266,42.727838],[-73.59741699999999,42.727881],[-73.598585,42.728046],[-73.598866,42.728109],[-73.599087,42.728191],[-73.59936399999999,42.728323],[-73.599563,42.728441],[-73.59983699999999,42.728653],[-73.599943,42.728756],[-73.60008500000001,42.72893],[-73.600138,42.729024],[-73.60024900000001,42.729284]]],"type":"Polygon"}
}