{
  "id": "360290137011",
  "type": "Feature",
  "properties": {
    "area_land":1795366,
    "area_water":0,
    "geoid":"360290137011",
    "name":"Block Group 1",
    "state":"ny"
},
  "bbox": [
    -78.779376,
    42.79634,
    -78.751553,
    42.804049
],
  "geometry": {"coordinates":[[[-78.779376,42.804026],[-78.778267,42.804042],[-78.778178,42.804031],[-78.775369,42.804031],[-78.77171199999999,42.804019],[-78.76954600000001,42.804001],[-78.769302,42.804015],[-78.76873000000001,42.804049],[-78.767455,42.804021],[-78.76644,42.803965],[-78.766052,42.803958],[-78.76482799999999,42.803961],[-78.761861,42.803989],[-78.755376,42.803941],[-78.75343599999999,42.803919],[-78.75175299999999,42.80391],[-78.75167,42.80245],[-78.751625,42.801811],[-78.751603,42.801228],[-78.751586,42.800797],[-78.75158399999999,42.800742],[-78.751581,42.800671],[-78.751553,42.799652],[-78.751592,42.799228],[-78.751645,42.797106],[-78.751643,42.796405],[-78.751644,42.796357],[-78.751679,42.79634],[-78.75288500000001,42.796349],[-78.755174,42.796365],[-78.755533,42.796367],[-78.756557,42.796371],[-78.760369,42.79638],[-78.760957,42.796382],[-78.762119,42.796395],[-78.765653,42.796419],[-78.767273,42.796431],[-78.767484,42.796433],[-78.768124,42.796438],[-78.76873399999999,42.796439],[-78.76934799999999,42.796447],[-78.77168500000001,42.796464],[-78.77504,42.796501],[-78.775367,42.796502],[-78.775486,42.796503],[-78.77586700000001,42.796507],[-78.77672200000001,42.796517],[-78.77695799999999,42.797512],[-78.77725,42.798731],[-78.777506,42.799843],[-78.77760600000001,42.800213],[-78.777727,42.800655],[-78.777863,42.801168],[-78.77822500000001,42.802151],[-78.778352,42.80241],[-78.77845000000001,42.802601],[-78.778592,42.802875],[-78.778739,42.803106],[-78.778925,42.803419],[-78.779072,42.803625],[-78.779376,42.804026]]],"type":"Polygon"}
}