{
  "id": "360810630002",
  "type": "Feature",
  "properties": {
    "area_land":74596,
    "area_water":0,
    "geoid":"360810630002",
    "name":"Block Group 2",
    "state":"ny"
},
  "bbox": [
    -73.74458,
    40.680751,
    -73.739545,
    40.684123
],
  "geometry": {"coordinates":[[[-73.74458,40.681591],[-73.743443,40.683625],[-73.743268,40.68392],[-73.740948,40.683232],[-73.740381,40.684123],[-73.73954500000001,40.683835],[-73.73973700000001,40.683531],[-73.73990499999999,40.683262],[-73.740365,40.68344],[-73.740787,40.682763],[-73.740858,40.682786],[-73.740904,40.682736],[-73.74139099999999,40.681862],[-73.741991,40.680751],[-73.742852,40.68103],[-73.743719,40.681312],[-73.74458,40.681591]]],"type":"Polygon"}
}