{
  "id": "360050115022",
  "type": "Feature",
  "properties": {
    "area_land":43100,
    "area_water":0,
    "geoid":"360050115022",
    "name":"Block Group 2",
    "state":"ny"
},
  "bbox": [
    -73.889167,
    40.816664,
    -73.886161,
    40.818991
],
  "geometry": {"coordinates":[[[-73.889167,40.818618],[-73.88852799999999,40.818714],[-73.887623,40.818849],[-73.8867,40.818991],[-73.886161,40.81693],[-73.887084,40.81679],[-73.887996,40.816664],[-73.888656,40.817755],[-73.889167,40.818618]]],"type":"Polygon"}
}