{
  "id": "360810517002",
  "type": "Feature",
  "properties": {
    "area_land":83699,
    "area_water":0,
    "geoid":"360810517002",
    "name":"Block Group 2",
    "state":"ny"
},
  "bbox": [
    -73.904571,
    40.722802,
    -73.899609,
    40.725428
],
  "geometry": {"coordinates":[[[-73.904448,40.723707],[-73.90436800000001,40.72439],[-73.90428799999999,40.725072],[-73.901802,40.724902],[-73.901794,40.725106],[-73.901158,40.725428],[-73.90065199999999,40.724858],[-73.90014600000001,40.724288],[-73.899609,40.723682],[-73.900577,40.723186],[-73.90181200000001,40.722802],[-73.904571,40.723009],[-73.904448,40.723707]]],"type":"Polygon"}
}