{
  "id": "360999501002",
  "type": "Feature",
  "properties": {
    "area_land":69175548,
    "area_water":376126,
    "geoid":"360999501002",
    "name":"Block Group 2",
    "state":"ny"
},
  "bbox": [
    -76.963929,
    42.941896,
    -76.854254,
    43.018434
],
  "geometry": {"coordinates":[[[-76.963928,43.012836],[-76.963928,43.012921],[-76.963928,43.01295],[-76.963927,43.012992],[-76.963926,43.013117],[-76.963926,43.013157],[-76.955623,43.013577],[-76.94969500000001,43.01388],[-76.940573,43.014347],[-76.938282,43.01447],[-76.93803200000001,43.014495],[-76.929767,43.014959],[-76.92754499999999,43.015086],[-76.926053,43.01517],[-76.92206,43.015395],[-76.91927,43.015554],[-76.915446,43.015772],[-76.91221,43.015953],[-76.912189,43.015914],[-76.90545400000001,43.016256],[-76.905372,43.01626],[-76.905249,43.016267],[-76.90494,43.016284],[-76.903496,43.016365],[-76.902542,43.016422],[-76.902361,43.016435],[-76.902299,43.01644],[-76.902214,43.016444],[-76.894949,43.016812],[-76.89490000000001,43.016814],[-76.894851,43.016816],[-76.890929,43.017016],[-76.882904,43.017439],[-76.882571,43.017455],[-76.882497,43.017458],[-76.882424,43.01746],[-76.87908400000001,43.017588],[-76.878562,43.017629],[-76.87454700000001,43.017721],[-76.871606,43.017879],[-76.871364,43.017891],[-76.868846,43.018014],[-76.868786,43.018017],[-76.86339700000001,43.018228],[-76.863247,43.018235],[-76.85951799999999,43.018402],[-76.858773,43.018434],[-76.858538,43.014649],[-76.85808299999999,43.008037],[-76.857952,43.006721],[-76.857936,43.006468],[-76.85781299999999,43.004548],[-76.85782,43.004344],[-76.857613,43.000501],[-76.857598,43.000301],[-76.85691799999999,42.989424],[-76.85554999999999,42.967146],[-76.85553299999999,42.966867],[-76.85552800000001,42.966778],[-76.855149,42.960578],[-76.85434600000001,42.947654],[-76.854254,42.946112],[-76.858064,42.945968],[-76.87121500000001,42.945481],[-76.874408,42.945386],[-76.875424,42.945354],[-76.87771100000001,42.945276],[-76.879667,42.945215],[-76.88692399999999,42.944905],[-76.88945,42.944797],[-76.901381,42.944249],[-76.906807,42.943998],[-76.918053,42.943466],[-76.923179,42.943223],[-76.923451,42.943213],[-76.94231600000001,42.942331],[-76.94241599999999,42.942341],[-76.942689,42.942341],[-76.943167,42.94232],[-76.94577099999999,42.942172],[-76.948527,42.942078],[-76.950402,42.942026],[-76.95091600000001,42.941985],[-76.951038,42.941952],[-76.951137,42.941896],[-76.951424,42.946898],[-76.952105,42.946875],[-76.952575,42.946844],[-76.95519,42.946768],[-76.963562,42.946502],[-76.963565,42.946681],[-76.963566,42.946756],[-76.96360300000001,42.948795],[-76.963534,42.950752],[-76.96350700000001,42.95127],[-76.963684,42.955431],[-76.96368699999999,42.955699],[-76.96369199999999,42.957602],[-76.96369300000001,42.9581],[-76.963697,42.959595],[-76.96369900000001,42.960094],[-76.963702,42.961407],[-76.963712,42.965349],[-76.96371600000001,42.966663],[-76.963712,42.967211],[-76.96370400000001,42.968857],[-76.963702,42.969406],[-76.963701,42.969444],[-76.963701,42.969561],[-76.963701,42.9696],[-76.963673,42.970262],[-76.96359,42.972252],[-76.96356299999999,42.972915],[-76.96356299999999,42.972977],[-76.96356400000001,42.973163],[-76.963565,42.973225],[-76.96356900000001,42.973847],[-76.963577,42.974812],[-76.96360300000001,42.975556],[-76.963605,42.975715],[-76.963616,42.976338],[-76.963621,42.976761],[-76.96363599999999,42.978031],[-76.963641,42.978455],[-76.963641,42.97849],[-76.96364199999999,42.978595],[-76.963643,42.97863],[-76.96364800000001,42.979097],[-76.963638,42.979791],[-76.96363700000001,42.979891],[-76.963677,42.983274],[-76.96369,42.984331],[-76.96369199999999,42.984436],[-76.96371600000001,42.98546],[-76.96373199999999,42.986106],[-76.963734,42.987644],[-76.96373,42.988534],[-76.96372599999999,42.989559],[-76.963729,42.989799],[-76.963741,42.990519],[-76.963745,42.99076],[-76.96376100000001,42.993681],[-76.963784,42.994646],[-76.96378799999999,42.996555],[-76.963812,42.998177],[-76.963818,43.000003],[-76.96386,43.002827],[-76.963869,43.003194],[-76.963876,43.003459],[-76.963877,43.003487],[-76.96387799999999,43.003608],[-76.96388,43.003955],[-76.96388,43.004014],[-76.96388,43.004192],[-76.96388,43.004252],[-76.96388,43.004296],[-76.963881,43.004429],[-76.963882,43.004474],[-76.96388399999999,43.004521],[-76.96388899999999,43.004662],[-76.963892,43.004709],[-76.963892,43.004754],[-76.963892,43.00489],[-76.963892,43.004936],[-76.963894,43.005062],[-76.963903,43.00544],[-76.96390599999999,43.005567],[-76.96390599999999,43.00563],[-76.96390599999999,43.005819],[-76.96390599999999,43.005883],[-76.96390599999999,43.005912],[-76.96390599999999,43.006],[-76.96390599999999,43.00603],[-76.96390599999999,43.006087],[-76.96390599999999,43.00626],[-76.96390599999999,43.006318],[-76.96390599999999,43.006422],[-76.96390599999999,43.006737],[-76.96390700000001,43.006842],[-76.96391,43.007636],[-76.96392,43.010018],[-76.96392400000001,43.010813],[-76.963925,43.011212],[-76.963927,43.012409],[-76.96392899999999,43.012808],[-76.963928,43.012836]]],"type":"Polygon"}
}