{
  "id": "360594103004",
  "type": "Feature",
  "properties": {
    "area_land":201570,
    "area_water":0,
    "geoid":"360594103004",
    "name":"Block Group 4",
    "state":"ny"
},
  "bbox": [
    -73.726198,
    40.675312,
    -73.714388,
    40.679494
],
  "geometry": {"coordinates":[[[-73.726011,40.678078],[-73.725903,40.678507],[-73.725841,40.678753],[-73.724943,40.678631],[-73.72488300000001,40.678591],[-73.724149,40.678442],[-73.724036,40.678561],[-73.72249600000001,40.678433],[-73.72235999999999,40.67844],[-73.722005,40.678215],[-73.721806,40.678403],[-73.721566,40.678263],[-73.72024,40.678279],[-73.719303,40.678149],[-73.718374,40.679494],[-73.717789,40.679121],[-73.71823000000001,40.67828],[-73.71774499999999,40.678255],[-73.71630999999999,40.677882],[-73.715828,40.677802],[-73.714887,40.677565],[-73.71472199999999,40.677694],[-73.714388,40.677677],[-73.714479,40.677634],[-73.71484100000001,40.67747],[-73.71603899999999,40.676891],[-73.71617999999999,40.676818],[-73.716336,40.676709],[-73.71656,40.676492],[-73.717186,40.675882],[-73.71722800000001,40.675811],[-73.717331,40.675731],[-73.717764,40.675312],[-73.719523,40.675784],[-73.721597,40.676339],[-73.72244999999999,40.676567],[-73.723298,40.676794],[-73.723923,40.676948],[-73.724276,40.676965],[-73.726198,40.677381],[-73.726011,40.678078]]],"type":"Polygon"}
}