{
  "id": "360050160002",
  "type": "Feature",
  "properties": {
    "area_land":145171,
    "area_water":0,
    "geoid":"360050160002",
    "name":"Block Group 2",
    "state":"ny"
},
  "bbox": [
    -73.823816,
    40.827835,
    -73.817337,
    40.835133
],
  "geometry": {"coordinates":[[[-73.823335,40.834415],[-73.82308,40.834448],[-73.822636,40.834508],[-73.82247700000001,40.834495],[-73.822232,40.834556],[-73.82150900000001,40.834734],[-73.820627,40.834922],[-73.81977500000001,40.835133],[-73.81921199999999,40.83376],[-73.81899799999999,40.833141],[-73.818709,40.832597],[-73.819554,40.832297],[-73.820421,40.831986],[-73.818887,40.830159],[-73.818786,40.83004],[-73.81733699999999,40.828318],[-73.817716,40.828132],[-73.81790599999999,40.828039],[-73.81832199999999,40.827835],[-73.819546,40.829288],[-73.819884,40.829688],[-73.821482,40.831573],[-73.82262299999999,40.832914],[-73.82381599999999,40.83433],[-73.823335,40.834415]]],"type":"Polygon"}
}