{
  "id": "361031240022",
  "type": "Feature",
  "properties": {
    "area_land":725843,
    "area_water":0,
    "geoid":"361031240022",
    "name":"Block Group 2",
    "state":"ny"
},
  "bbox": [
    -73.375428,
    40.686926,
    -73.355206,
    40.699433
],
  "geometry": {"coordinates":[[[-73.37524999999999,40.68882],[-73.372755,40.68955],[-73.372395,40.68963],[-73.371977,40.689699],[-73.371644,40.689719],[-73.37146300000001,40.689727],[-73.37090499999999,40.6898],[-73.37042099999999,40.68986],[-73.369619,40.689957],[-73.36944699999999,40.689994],[-73.36924500000001,40.690058],[-73.368566,40.690507],[-73.367884,40.690969],[-73.36721,40.691418],[-73.366528,40.691857],[-73.365855,40.692316],[-73.36518,40.692771],[-73.364487,40.693233],[-73.36380699999999,40.693683],[-73.363107,40.694136],[-73.36243399999999,40.694593],[-73.362478,40.694658],[-73.362087,40.695332],[-73.36164599999999,40.695995],[-73.361231,40.696668],[-73.360827,40.697291],[-73.36055,40.69776],[-73.359815,40.698875],[-73.359466,40.699018],[-73.35836,40.699433],[-73.356341,40.696985],[-73.35612500000001,40.696774],[-73.356031,40.696284],[-73.355884,40.695838],[-73.35586600000001,40.69526],[-73.35582599999999,40.695089],[-73.35571,40.694579],[-73.355206,40.692551],[-73.35526,40.692165],[-73.355869,40.692011],[-73.356606,40.691825],[-73.35674,40.691786],[-73.35767,40.691543],[-73.36022800000001,40.69085],[-73.361514,40.690496],[-73.36414499999999,40.689709],[-73.365135,40.689413],[-73.366744,40.688931],[-73.368965,40.688302],[-73.37362899999999,40.686926],[-73.373749,40.687063],[-73.374302,40.687637],[-73.374855,40.688202],[-73.375428,40.688793],[-73.37524999999999,40.68882]]],"type":"Polygon"}
}