{
  "id": "360010142035",
  "type": "Feature",
  "properties": {
    "area_land":7655004,
    "area_water":4325,
    "geoid":"360010142035",
    "name":"Block Group 5",
    "state":"ny"
},
  "bbox": [
    -73.881902,
    42.58849,
    -73.818158,
    42.615338
],
  "geometry": {"coordinates":[[[-73.881902,42.602961],[-73.881395,42.603309],[-73.88090699999999,42.603623],[-73.879932,42.604182],[-73.879856,42.604226],[-73.87832299999999,42.605129],[-73.876328,42.606274],[-73.876034,42.606439],[-73.87560999999999,42.606656],[-73.87517099999999,42.606851],[-73.87456299999999,42.607087],[-73.873858,42.607336],[-73.87134,42.608245],[-73.87024599999999,42.608664],[-73.869022,42.609112],[-73.867868,42.609542],[-73.865252,42.610527],[-73.86398699999999,42.610987],[-73.862483,42.611533],[-73.86154000000001,42.611869],[-73.85886000000001,42.612819],[-73.85766700000001,42.613255],[-73.856836,42.613535],[-73.8556,42.613995],[-73.85506599999999,42.614191],[-73.854285,42.61445],[-73.85185300000001,42.615338],[-73.851592,42.614995],[-73.851221,42.614356],[-73.850545,42.613269],[-73.850302,42.612984],[-73.849841,42.612588],[-73.849313,42.612213],[-73.848642,42.611778],[-73.848285,42.611575],[-73.84812700000001,42.611512],[-73.847785,42.611449],[-73.847123,42.611382],[-73.84668000000001,42.611326],[-73.846475,42.611291],[-73.84627500000001,42.611246],[-73.84611700000001,42.611194],[-73.84599300000001,42.611257],[-73.845968,42.611266],[-73.84576800000001,42.611282],[-73.845523,42.611291],[-73.845269,42.611288],[-73.845045,42.61126],[-73.844922,42.611235],[-73.844757,42.611182],[-73.844114,42.610874],[-73.843975,42.610818],[-73.843886,42.61079],[-73.843772,42.610765],[-73.84355600000001,42.610753],[-73.84343699999999,42.610765],[-73.842809,42.610872],[-73.84253200000001,42.610917],[-73.842113,42.610973],[-73.841599,42.610996],[-73.840632,42.610994],[-73.840504,42.61099],[-73.8403,42.610983],[-73.83984100000001,42.610908],[-73.83971099999999,42.610877],[-73.839433,42.610751],[-73.839097,42.610562],[-73.83874400000001,42.610239],[-73.83829,42.609741],[-73.837491,42.608782],[-73.837082,42.608309],[-73.83651999999999,42.607665],[-73.83592299999999,42.606974],[-73.835472,42.606451],[-73.83520799999999,42.606159],[-73.83501699999999,42.605974],[-73.834931,42.605902],[-73.834908,42.605881],[-73.834756,42.605741],[-73.834603,42.605602],[-73.834425,42.605594],[-73.833867,42.605579],[-73.83029500000001,42.605463],[-73.829832,42.605445],[-73.82886000000001,42.605417],[-73.82870800000001,42.605414],[-73.826483,42.605343],[-73.826092,42.605342],[-73.825671,42.605359],[-73.82545500000001,42.605377],[-73.824884,42.605457],[-73.824245,42.605584],[-73.82378,42.60572],[-73.823578,42.605785],[-73.82339,42.60586],[-73.823095,42.605986],[-73.82271,42.606168],[-73.82193700000001,42.606566],[-73.820466,42.607333],[-73.819191,42.608015],[-73.819147,42.607934],[-73.81907699999999,42.607791],[-73.81883000000001,42.60734],[-73.818335,42.606378],[-73.81824899999999,42.606143],[-73.81823,42.606063],[-73.818226,42.60593],[-73.818245,42.605615],[-73.81832300000001,42.605159],[-73.818333,42.605101],[-73.818416,42.604628],[-73.818461,42.604422],[-73.818518,42.604039],[-73.818533,42.603864],[-73.818533,42.603761],[-73.81850300000001,42.603489],[-73.818468,42.603291],[-73.818321,42.602354],[-73.81831099999999,42.60229],[-73.818158,42.60127],[-73.818856,42.601248],[-73.819332,42.601198],[-73.819704,42.601105],[-73.819886,42.601059],[-73.82042800000001,42.600902],[-73.820896,42.600746],[-73.821029,42.600702],[-73.82166100000001,42.600437],[-73.822907,42.599845],[-73.823044,42.599775],[-73.82326,42.599676],[-73.824348,42.599145],[-73.82487399999999,42.598907],[-73.82522400000001,42.598764],[-73.825698,42.59859],[-73.826719,42.598199],[-73.82722800000001,42.598012],[-73.827726,42.597819],[-73.828069,42.597718],[-73.82856,42.597602],[-73.831063,42.597024],[-73.831366,42.596942],[-73.83175300000001,42.596828],[-73.832043,42.596737],[-73.83288,42.596425],[-73.833961,42.596032],[-73.834335,42.595908],[-73.834734,42.595767],[-73.835247,42.595586],[-73.83571600000001,42.595432],[-73.837056,42.594994],[-73.83752,42.594831],[-73.838116,42.594615],[-73.838644,42.594434],[-73.838869,42.59437],[-73.83904099999999,42.594337],[-73.839204,42.594315],[-73.83943600000001,42.594309],[-73.839674,42.594315],[-73.839793,42.594326],[-73.839969,42.594353],[-73.840436,42.593656],[-73.84067400000001,42.593338],[-73.840987,42.592965],[-73.84124300000001,42.592687],[-73.841459,42.592479],[-73.841645,42.592315],[-73.842218,42.59186],[-73.842517,42.591648],[-73.842765,42.59148],[-73.843076,42.591281],[-73.84330799999999,42.591146],[-73.843475,42.591052],[-73.84417000000001,42.590708],[-73.844521,42.590549],[-73.844944,42.590379],[-73.845766,42.590108],[-73.846248,42.58997],[-73.846413,42.589928],[-73.846936,42.589809],[-73.84763599999999,42.589677],[-73.847825,42.589649],[-73.848062,42.589621],[-73.84877899999999,42.589549],[-73.849912,42.589463],[-73.85113800000001,42.58935],[-73.851275,42.589336],[-73.851319,42.589331],[-73.851699,42.589278],[-73.85208900000001,42.589214],[-73.852503,42.589139],[-73.85303999999999,42.589018],[-73.854473,42.588683],[-73.855271,42.58849],[-73.855473,42.588579],[-73.855735,42.588706],[-73.85629,42.58901],[-73.85632,42.58904],[-73.85633,42.58907],[-73.85632,42.589255],[-73.85625,42.589352],[-73.856179,42.589397],[-73.85600700000001,42.589397],[-73.855957,42.589345],[-73.85592699999999,42.589293],[-73.85587599999999,42.589233],[-73.855785,42.589196],[-73.855695,42.589196],[-73.85563399999999,42.589203],[-73.855614,42.589233],[-73.85557300000001,42.589337],[-73.855543,42.589382],[-73.855462,42.589434],[-73.855422,42.589478],[-73.855402,42.589545],[-73.855402,42.589619],[-73.855422,42.589642],[-73.855462,42.589657],[-73.855644,42.589664],[-73.85572500000001,42.589642],[-73.85582599999999,42.589597],[-73.855907,42.589597],[-73.855947,42.589619],[-73.855997,42.589686],[-73.85602799999999,42.58979],[-73.856129,42.590006],[-73.856129,42.59005],[-73.85610800000001,42.59014],[-73.85602799999999,42.590229],[-73.85600700000001,42.590281],[-73.855997,42.590333],[-73.855997,42.590452],[-73.85602799999999,42.590504],[-73.85610800000001,42.590526],[-73.856189,42.590511],[-73.8563,42.590504],[-73.856351,42.590526],[-73.856431,42.590608],[-73.856492,42.590622],[-73.856583,42.59063],[-73.856734,42.5906],[-73.85688500000001,42.590526],[-73.856926,42.590511],[-73.857007,42.590511],[-73.857067,42.590548],[-73.85708700000001,42.590593],[-73.857108,42.590853],[-73.85713800000001,42.590875],[-73.857168,42.59089],[-73.85728899999999,42.59089],[-73.857319,42.590905],[-73.85733999999999,42.590927],[-73.857319,42.591024],[-73.85723900000001,42.591165],[-73.85723900000001,42.591261],[-73.85727900000001,42.591306],[-73.85742,42.591388],[-73.857784,42.591566],[-73.857832,42.591632],[-73.857846,42.591679],[-73.857856,42.591711],[-73.85786,42.591823],[-73.85786,42.592206],[-73.857888,42.592281],[-73.85795899999999,42.59236],[-73.858024,42.592378],[-73.858169,42.592378],[-73.858216,42.592369],[-73.85829,42.592322],[-73.858366,42.592243],[-73.85839799999999,42.592168],[-73.85844899999999,42.592094],[-73.858482,42.59208],[-73.858603,42.592075],[-73.85867399999999,42.592098],[-73.85872500000001,42.592131],[-73.85874800000001,42.592168],[-73.85874800000001,42.592225],[-73.85872500000001,42.592411],[-73.85874800000001,42.592453],[-73.85878099999999,42.592472],[-73.859089,42.592481],[-73.859178,42.592504],[-73.859267,42.592514],[-73.859337,42.592509],[-73.85944000000001,42.592476],[-73.85951,42.592481],[-73.859566,42.592495],[-73.85960799999999,42.592532],[-73.85963099999999,42.592598],[-73.859652,42.592736],[-73.859684,42.592802],[-73.859703,42.592872],[-73.859703,42.592919],[-73.859624,42.593054],[-73.859596,42.593124],[-73.8596,42.593199],[-73.859628,42.593245],[-73.85968,42.593301],[-73.859759,42.593479],[-73.859769,42.593591],[-73.859792,42.59367],[-73.859848,42.593736],[-73.859937,42.593792],[-73.860077,42.593848],[-73.86022199999999,42.593885],[-73.860432,42.593918],[-73.86062800000001,42.593927],[-73.860694,42.593918],[-73.86074499999999,42.593894],[-73.860769,42.593866],[-73.860801,42.593764],[-73.86089,42.593586],[-73.860918,42.593568],[-73.860997,42.593549],[-73.861054,42.593563],[-73.861096,42.593619],[-73.861152,42.593652],[-73.861301,42.593652],[-73.861395,42.593694],[-73.861474,42.593806],[-73.861526,42.593834],[-73.86156800000001,42.593843],[-73.861722,42.593852],[-73.861825,42.593834],[-73.861963,42.593825],[-73.862149,42.593852],[-73.86224199999999,42.593885],[-73.86228,42.593912],[-73.862397,42.594182],[-73.862449,42.594245],[-73.862495,42.594275],[-73.86264,42.594327],[-73.862804,42.594343],[-73.863068,42.59436],[-73.863142,42.594376],[-73.86316100000001,42.594392],[-73.863169,42.594442],[-73.863156,42.594461],[-73.863028,42.594545],[-73.863011,42.594594],[-73.86301400000001,42.594635],[-73.86306,42.594673],[-73.86321,42.594714],[-73.86332,42.594722],[-73.863665,42.594784],[-73.863714,42.594806],[-73.86378499999999,42.594866],[-73.863788,42.594891],[-73.863747,42.594932],[-73.863654,42.594948],[-73.863327,42.594937],[-73.86324999999999,42.59497],[-73.86322800000001,42.595041],[-73.86324999999999,42.595103],[-73.863277,42.595117],[-73.86349300000001,42.595139],[-73.86350899999999,42.595153],[-73.86351500000001,42.595193],[-73.86349300000001,42.595204],[-73.8634,42.595218],[-73.863362,42.595237],[-73.863348,42.595327],[-73.863378,42.595384],[-73.86341899999999,42.595417],[-73.86349,42.595428],[-73.863523,42.595409],[-73.86362699999999,42.595283],[-73.86371699999999,42.595218],[-73.863962,42.595133],[-73.864121,42.595098],[-73.86417299999999,42.595098],[-73.864306,42.595123],[-73.864344,42.595144],[-73.86436399999999,42.595177],[-73.864372,42.5953],[-73.864355,42.59536],[-73.864358,42.595412],[-73.864383,42.595458],[-73.864424,42.595493],[-73.864593,42.595543],[-73.864642,42.595594],[-73.864645,42.595624],[-73.864582,42.595826],[-73.864576,42.595848],[-73.86458399999999,42.595934],[-73.864616,42.595959],[-73.864666,42.595972],[-73.86476399999999,42.595967],[-73.86497,42.595836],[-73.865025,42.595819],[-73.865156,42.595814],[-73.865235,42.595828],[-73.865268,42.595849],[-73.865281,42.595912],[-73.865262,42.595959],[-73.865189,42.595999],[-73.86494,42.5961],[-73.864907,42.596136],[-73.864891,42.596179],[-73.86489400000001,42.596218],[-73.864913,42.59625],[-73.864943,42.596261],[-73.864987,42.596261],[-73.86503,42.596245],[-73.865118,42.596169],[-73.865161,42.596158],[-73.865213,42.596158],[-73.865268,42.596188],[-73.865289,42.596231],[-73.8653,42.596343],[-73.865273,42.5964],[-73.865145,42.596528],[-73.865126,42.59659],[-73.86513100000001,42.596642],[-73.86515,42.596683],[-73.865199,42.596721],[-73.865319,42.596762],[-73.86558599999999,42.596768],[-73.86567599999999,42.596751],[-73.86583400000001,42.596675],[-73.86605,42.596529],[-73.866181,42.596398],[-73.866229,42.596376],[-73.86639,42.596373],[-73.866894,42.596494],[-73.866992,42.596489],[-73.86712,42.596429],[-73.867188,42.596415],[-73.867251,42.596415],[-73.867316,42.596437],[-73.86733599999999,42.596464],[-73.867349,42.596513],[-73.86733599999999,42.596751],[-73.867363,42.59683],[-73.867412,42.596879],[-73.867886,42.597165],[-73.867943,42.597212],[-73.86797900000001,42.597261],[-73.867993,42.597354],[-73.867987,42.597542],[-73.867976,42.597616],[-73.867957,42.59763],[-73.867829,42.597652],[-73.867785,42.597695],[-73.867788,42.597763],[-73.86781499999999,42.597788],[-73.86790000000001,42.597802],[-73.868036,42.597834],[-73.86808499999999,42.59787],[-73.868126,42.597922],[-73.868137,42.597965],[-73.86813100000001,42.598022],[-73.868066,42.598098],[-73.86805699999999,42.59815],[-73.868202,42.598204],[-73.86823200000001,42.59824],[-73.868235,42.598283],[-73.868213,42.598327],[-73.868177,42.598346],[-73.868126,42.598357],[-73.868093,42.598381],[-73.86807899999999,42.598501],[-73.86809,42.598553],[-73.868123,42.598611],[-73.868156,42.598646],[-73.868268,42.598695],[-73.868323,42.598735],[-73.868357,42.598842],[-73.868453,42.59895],[-73.868532,42.598996],[-73.86868800000001,42.599059],[-73.868769,42.599132],[-73.868976,42.599206],[-73.86909300000001,42.59928],[-73.86914,42.599323],[-73.86920499999999,42.599427],[-73.86925100000001,42.599473],[-73.869421,42.599582],[-73.869514,42.59965],[-73.86962699999999,42.599768],[-73.86978999999999,42.600015],[-73.86982500000001,42.600042],[-73.869891,42.600058],[-73.87,42.600061],[-73.870198,42.60002],[-73.87034800000001,42.599968],[-73.870436,42.599914],[-73.870586,42.599857],[-73.87064599999999,42.599805],[-73.870722,42.599718],[-73.870771,42.599696],[-73.870834,42.599683],[-73.870991,42.599683],[-73.87107899999999,42.5997],[-73.87125899999999,42.599751],[-73.871376,42.599754],[-73.87150200000001,42.59977],[-73.871696,42.599817],[-73.871709,42.599834],[-73.871718,42.60001],[-73.871769,42.600155],[-73.871887,42.600285],[-73.87195199999999,42.600326],[-73.87209199999999,42.600455],[-73.872111,42.600504],[-73.872108,42.600555],[-73.872078,42.600596],[-73.87203700000001,42.600624],[-73.87196900000001,42.600643],[-73.871917,42.600673],[-73.871909,42.600714],[-73.871925,42.60076],[-73.87195199999999,42.600792],[-73.872134,42.600895],[-73.872249,42.600996],[-73.872381,42.601091],[-73.87261599999999,42.601161],[-73.872675,42.601202],[-73.872795,42.601314],[-73.872902,42.601377],[-73.872975,42.601393],[-73.873098,42.601393],[-73.873199,42.601363],[-73.873232,42.60133],[-73.87330799999999,42.601179],[-73.873357,42.60113],[-73.873411,42.601121],[-73.87346599999999,42.601127],[-73.873575,42.601179],[-73.87370799999999,42.601271],[-73.87380899999999,42.601386],[-73.873845,42.601411],[-73.873897,42.601413],[-73.873935,42.601405],[-73.873968,42.601386],[-73.87399000000001,42.601348],[-73.874033,42.601173],[-73.874112,42.600952],[-73.87411400000001,42.600845],[-73.874027,42.600777],[-73.874019,42.600735],[-73.874062,42.600677],[-73.874112,42.600664],[-73.874229,42.600653],[-73.874343,42.600631],[-73.874506,42.600541],[-73.874602,42.600424],[-73.87464799999999,42.60041],[-73.87472699999999,42.600405],[-73.874897,42.600418],[-73.874954,42.600437],[-73.87497,42.600451],[-73.874973,42.600497],[-73.874954,42.600522],[-73.874921,42.600538],[-73.87463700000001,42.600587],[-73.874596,42.600609],[-73.874577,42.600656],[-73.87457999999999,42.600743],[-73.874607,42.600776],[-73.87464799999999,42.600797],[-73.874711,42.600814],[-73.87491799999999,42.600846],[-73.87504199999999,42.600834],[-73.875191,42.600898],[-73.875249,42.600961],[-73.87531199999999,42.601008],[-73.87540300000001,42.601035],[-73.87559899999999,42.601051],[-73.875669,42.601063],[-73.875747,42.601094],[-73.875884,42.6012],[-73.87627999999999,42.601435],[-73.876347,42.601483],[-73.87639,42.60149],[-73.87644899999999,42.601487],[-73.87651099999999,42.601463],[-73.876704,42.60131],[-73.87674699999999,42.601298],[-73.876786,42.601302],[-73.876818,42.601326],[-73.876884,42.601432],[-73.87700700000001,42.601558],[-73.877078,42.601581],[-73.877172,42.601593],[-73.877298,42.601585],[-73.877431,42.601522],[-73.877608,42.601452],[-73.877713,42.601432],[-73.87787400000001,42.60142],[-73.877972,42.601448],[-73.878125,42.60153],[-73.87820000000001,42.601534],[-73.878263,42.601511],[-73.87830599999999,42.601483],[-73.87832899999999,42.601456],[-73.87832899999999,42.601428],[-73.878247,42.601335],[-73.878243,42.601304],[-73.87825100000001,42.601264],[-73.87827799999999,42.601253],[-73.878497,42.601225],[-73.87893699999999,42.601202],[-73.879015,42.601213],[-73.879043,42.601229],[-73.879051,42.601264],[-73.878929,42.601543],[-73.878941,42.601687],[-73.879046,42.601758],[-73.879289,42.60184],[-73.879542,42.601955],[-73.88006,42.602128],[-73.880201,42.60219],[-73.880303,42.602249],[-73.880557,42.602422],[-73.88061999999999,42.602437],[-73.880773,42.602406],[-73.88081200000001,42.602414],[-73.880848,42.602453],[-73.880903,42.602594],[-73.88094100000001,42.602661],[-73.88099200000001,42.602685],[-73.881094,42.602692],[-73.881345,42.602673],[-73.881443,42.602677],[-73.881483,42.602692],[-73.881603,42.602802],[-73.881902,42.602961]]],"type":"Polygon"}
}