{
  "id": "360810863003",
  "type": "Feature",
  "properties": {
    "area_land":16716,
    "area_water":0,
    "geoid":"360810863003",
    "name":"Block Group 3",
    "state":"ny"
},
  "bbox": [
    -73.821767,
    40.760534,
    -73.818078,
    40.761936
],
  "geometry": {"coordinates":[[[-73.82176699999999,40.76098],[-73.818293,40.761936],[-73.818078,40.761473],[-73.818664,40.761314],[-73.821558,40.760534],[-73.82176699999999,40.76098]]],"type":"Polygon"}
}