{
  "id": "361119519003",
  "type": "Feature",
  "properties": {
    "area_land":307277,
    "area_water":0,
    "geoid":"361119519003",
    "name":"Block Group 3",
    "state":"ny"
},
  "bbox": [
    -74.00203,
    41.925588,
    -73.991378,
    41.934862
],
  "geometry": {"coordinates":[[[-74.00203,41.928609],[-74.00161900000001,41.928826],[-74.00133,41.929002],[-74.001182,41.929091],[-74.000979,41.929221],[-74.000584,41.929504],[-74.000226,41.929795],[-74.00015999999999,41.929852],[-73.99997500000001,41.930019],[-73.999892,41.930094],[-73.999514,41.930478],[-73.999206,41.930836],[-73.998904,41.931254],[-73.998659,41.931651],[-73.998445,41.932052],[-73.998238,41.93254],[-73.99813,41.932862],[-73.998048,41.933174],[-73.997935,41.933757],[-73.997799,41.934862],[-73.997737,41.934762],[-73.997637,41.934601],[-73.997145,41.933798],[-73.996713,41.933129],[-73.996272,41.932386],[-73.996216,41.932292],[-73.99563000000001,41.931328],[-73.995501,41.931117],[-73.995193,41.930608],[-73.994918,41.929816],[-73.99476199999999,41.929281],[-73.994629,41.928849],[-73.99458,41.928689],[-73.99432899999999,41.927836],[-73.99431199999999,41.927545],[-73.992048,41.927065],[-73.991378,41.92693],[-73.99172799999999,41.926236],[-73.992054,41.925588],[-73.993008,41.925785],[-73.99387400000001,41.925964],[-73.994359,41.926064],[-73.99478499999999,41.926156],[-73.995397,41.926344],[-73.996058,41.926558],[-73.99637800000001,41.926661],[-73.997123,41.926894],[-73.997615,41.927055],[-73.998295,41.927264],[-73.99848,41.927324],[-73.999582,41.927685],[-73.99984499999999,41.927773],[-73.999983,41.927825],[-74.00013199999999,41.927881],[-74.000523,41.92803],[-74.001282,41.928319],[-74.00199499999999,41.928596],[-74.00203,41.928609]]],"type":"Polygon"}
}