{
  "id": "361031110012",
  "type": "Feature",
  "properties": {
    "area_land":545920,
    "area_water":0,
    "geoid":"361031110012",
    "name":"Block Group 2",
    "state":"ny"
},
  "bbox": [
    -73.42395,
    40.858356,
    -73.404846,
    40.873362
],
  "geometry": {"coordinates":[[[-73.42395,40.872245],[-73.423675,40.87244],[-73.42318,40.872634],[-73.42227200000001,40.872897],[-73.421989,40.872997],[-73.421646,40.873131],[-73.42126399999999,40.873362],[-73.420798,40.872477],[-73.420646,40.872252],[-73.42040900000001,40.872017],[-73.42012699999999,40.871764],[-73.41989,40.871562],[-73.419254,40.871073],[-73.41852400000001,40.870562],[-73.41828099999999,40.870357],[-73.418121,40.870192],[-73.41798300000001,40.870009],[-73.41779200000001,40.869712],[-73.417618,40.869342],[-73.417502,40.869037],[-73.41742600000001,40.868748],[-73.417357,40.868412],[-73.417327,40.868121],[-73.417281,40.867877],[-73.417197,40.867698],[-73.416633,40.866709],[-73.41629,40.866134],[-73.416236,40.866053],[-73.415744,40.865486],[-73.415132,40.865589],[-73.414655,40.865672],[-73.41444,40.86573],[-73.41423500000001,40.865805],[-73.413336,40.866246],[-73.41283900000001,40.866495],[-73.412201,40.866768],[-73.411888,40.866886],[-73.411773,40.86661],[-73.411636,40.866248],[-73.411537,40.86589],[-73.41152200000001,40.86568],[-73.411537,40.865516],[-73.411674,40.864783],[-73.411715,40.86452],[-73.41175800000001,40.864325],[-73.411833,40.864035],[-73.40946099999999,40.864081],[-73.408613,40.864101],[-73.408401,40.864142],[-73.40821099999999,40.864253],[-73.408095,40.864406],[-73.408072,40.864581],[-73.408081,40.864848],[-73.408103,40.865337],[-73.408126,40.865447],[-73.40821,40.865588],[-73.407911,40.865593],[-73.40755299999999,40.865607],[-73.407295,40.865783],[-73.40690499999999,40.866111],[-73.406408,40.866598],[-73.40629199999999,40.866712],[-73.40597099999999,40.866941],[-73.40549900000001,40.867287],[-73.405368,40.867129],[-73.40484600000001,40.866645],[-73.405394,40.866168],[-73.4057,40.865867],[-73.40660800000001,40.865],[-73.406837,40.86476],[-73.40692799999999,40.86454],[-73.40701199999999,40.864234],[-73.40705800000001,40.864096],[-73.40741,40.863785],[-73.407614,40.863628],[-73.407805,40.863552],[-73.408522,40.863353],[-73.40924699999999,40.862526],[-73.40907199999999,40.861884],[-73.409781,40.861603],[-73.410225,40.861442],[-73.410805,40.861254],[-73.41107,40.861205],[-73.411293,40.861205],[-73.411483,40.86119],[-73.412482,40.861178],[-73.412719,40.861193],[-73.412824,40.861079],[-73.413561,40.860363],[-73.413741,40.860105],[-73.41382400000001,40.859929],[-73.413999,40.859453],[-73.414019,40.859383],[-73.41408800000001,40.859039],[-73.414085,40.858928],[-73.41407700000001,40.858805],[-73.414016,40.858356],[-73.414253,40.858633],[-73.414399,40.858763],[-73.41482600000001,40.859062],[-73.415166,40.85932],[-73.415256,40.85941],[-73.415359,40.859548],[-73.41541700000001,40.859667],[-73.415458,40.859811],[-73.415465,40.859955],[-73.415463,40.860045],[-73.415361,40.860229],[-73.415378,40.860669],[-73.415496,40.861277],[-73.41559599999999,40.861666],[-73.41570900000001,40.862162],[-73.415862,40.862593],[-73.416571,40.863865],[-73.417044,40.864712],[-73.417168,40.864878],[-73.41737000000001,40.86518],[-73.41747100000001,40.865325],[-73.41758,40.865592],[-73.418021,40.866497],[-73.418648,40.867378],[-73.41918800000001,40.868106],[-73.419319,40.868247],[-73.419471,40.868403],[-73.41973,40.868647],[-73.420044,40.868903],[-73.420303,40.869078],[-73.420616,40.869239],[-73.42081399999999,40.869357],[-73.420929,40.869442],[-73.421531,40.86978],[-73.42169199999999,40.869849],[-73.42242299999999,40.870254],[-73.422546,40.870349],[-73.422652,40.870479],[-73.422691,40.870639],[-73.422737,40.870829],[-73.422768,40.871005],[-73.42292,40.871536],[-73.42308,40.871845],[-73.423163,40.871962],[-73.423278,40.872077],[-73.42340799999999,40.87215],[-73.423546,40.872203],[-73.423714,40.872233],[-73.42395,40.872245]]],"type":"Polygon"}
}