{
  "id": "360050267022",
  "type": "Feature",
  "properties": {
    "area_land":16046,
    "area_water":0,
    "geoid":"360050267022",
    "name":"Block Group 2",
    "state":"ny"
},
  "bbox": [
    -73.899686,
    40.869658,
    -73.89779,
    40.871244
],
  "geometry": {"coordinates":[[[-73.899303,40.871244],[-73.898284,40.871054],[-73.89779,40.870857],[-73.89891799999999,40.869658],[-73.899686,40.870041],[-73.899303,40.871244]]],"type":"Polygon"}
}