{
  "id": "361199850001",
  "type": "Feature",
  "properties": {
    "area_land":1849175,
    "area_water":0,
    "geoid":"361199850001",
    "name":"Block Group 1",
    "state":"ny"
},
  "bbox": [
    -73.709912,
    41.037877,
    -73.690261,
    41.056538
],
  "geometry": {"coordinates":[[[-73.708618,41.047716],[-73.708404,41.048179],[-73.70860500000001,41.049223],[-73.707618,41.051231],[-73.707232,41.051343],[-73.70675300000001,41.051481],[-73.705828,41.051676],[-73.705409,41.051768],[-73.70550900000001,41.052043],[-73.705759,41.052733],[-73.70665,41.054718],[-73.707089,41.056022],[-73.705659,41.056538],[-73.704993,41.055979],[-73.70389,41.055179],[-73.703636,41.054858],[-73.703497,41.054775],[-73.70336500000001,41.054734],[-73.70322,41.054713],[-73.703067,41.05472],[-73.702749,41.054803],[-73.702451,41.054948],[-73.702299,41.054983],[-73.702153,41.054969],[-73.701752,41.054845],[-73.701502,41.054824],[-73.700148,41.054897],[-73.69982299999999,41.054876],[-73.699608,41.054841],[-73.699567,41.054834],[-73.699241,41.05473],[-73.698992,41.054606],[-73.698791,41.054474],[-73.69863100000001,41.054336],[-73.69845100000001,41.054253],[-73.69823700000001,41.054197],[-73.69802199999999,41.054128],[-73.697897,41.054024],[-73.697863,41.053934],[-73.697863,41.053824],[-73.69795999999999,41.053042],[-73.697956,41.052914],[-73.69792099999999,41.052838],[-73.697818,41.052748],[-73.697734,41.052706],[-73.697548,41.052433],[-73.697475,41.052189],[-73.697481,41.052061],[-73.69776400000001,41.051845],[-73.697755,41.051767],[-73.69759000000001,41.051645],[-73.69752,41.051558],[-73.69747599999999,41.051532],[-73.69739800000001,41.051549],[-73.69728499999999,41.051549],[-73.69718899999999,41.051514],[-73.69714500000001,41.051479],[-73.697119,41.05134],[-73.697023,41.051236],[-73.69691,41.051157],[-73.69677900000001,41.051122],[-73.69671,41.051079],[-73.696692,41.050974],[-73.69671,41.050913],[-73.69671,41.050826],[-73.696684,41.050757],[-73.69652499999999,41.050596],[-73.69646400000001,41.050483],[-73.696377,41.050265],[-73.696316,41.050186],[-73.696124,41.050108],[-73.696011,41.049969],[-73.69595,41.049864],[-73.69590700000001,41.049734],[-73.69588899999999,41.04962],[-73.695846,41.049551],[-73.695697,41.049455],[-73.695654,41.049394],[-73.695637,41.04922],[-73.695584,41.049159],[-73.695453,41.049054],[-73.695419,41.048959],[-73.695419,41.048898],[-73.695401,41.048828],[-73.69528800000001,41.048724],[-73.694957,41.048488],[-73.694722,41.048044],[-73.694565,41.047809],[-73.69444300000001,41.047801],[-73.694181,41.047801],[-73.694068,41.047766],[-73.694016,41.047696],[-73.693934,41.047235],[-73.693651,41.046845],[-73.693489,41.046675],[-73.69337299999999,41.046511],[-73.69309,41.046382],[-73.692592,41.046266],[-73.692578,41.046172],[-73.69256900000001,41.046059],[-73.692592,41.045927],[-73.69270299999999,41.04565],[-73.692741,41.045363],[-73.692741,41.045239],[-73.692706,41.044983],[-73.692637,41.044713],[-73.69251300000001,41.044415],[-73.69238799999999,41.044214],[-73.692256,41.043937],[-73.692215,41.043716],[-73.692184,41.043138],[-73.692128,41.043007],[-73.691879,41.042723],[-73.691789,41.04255],[-73.691754,41.042328],[-73.691754,41.042169],[-73.69180299999999,41.041809],[-73.691782,41.041623],[-73.691723,41.041391],[-73.691626,41.041225],[-73.691384,41.040885],[-73.691141,41.040616],[-73.690819,41.040314],[-73.690755,41.040253],[-73.69055899999999,41.04009],[-73.6904,41.03993],[-73.69026100000001,41.039739],[-73.690502,41.039557],[-73.69069399999999,41.039442],[-73.690986,41.03932],[-73.69113400000001,41.039281],[-73.6913,41.039236],[-73.691407,41.039211],[-73.691518,41.039191],[-73.69327699999999,41.039003],[-73.693524,41.039],[-73.693736,41.039003],[-73.693935,41.038996],[-73.69436399999999,41.038981],[-73.695009,41.03894],[-73.69618699999999,41.038799],[-73.69640800000001,41.038767],[-73.698335,41.038555],[-73.699371,41.038389],[-73.699653,41.038365],[-73.700569,41.03825],[-73.70232,41.038041],[-73.703512,41.037877],[-73.703377,41.038149],[-73.70405599999999,41.041086],[-73.704104,41.042114],[-73.70423,41.042686],[-73.70430500000001,41.043054],[-73.704694,41.044663],[-73.704756,41.044985],[-73.704818,41.045132],[-73.70489600000001,41.045272],[-73.70507499999999,41.045524],[-73.705214,41.045659],[-73.70654999999999,41.045668],[-73.709912,41.045402],[-73.708618,41.047716]]],"type":"Polygon"}
}