{
  "id": "361190077003",
  "type": "Feature",
  "properties": {
    "area_land":1012580,
    "area_water":0,
    "geoid":"361190077003",
    "name":"Block Group 3",
    "state":"ny"
},
  "bbox": [
    -73.709241,
    40.970209,
    -73.687738,
    40.984079
],
  "geometry": {"coordinates":[[[-73.70892000000001,40.970885],[-73.70891,40.970945],[-73.708832,40.971032],[-73.70882400000001,40.971108],[-73.707747,40.972301],[-73.70645500000001,40.973534],[-73.70603699999999,40.974541],[-73.705934,40.974675],[-73.70493500000001,40.976213],[-73.701876,40.980696],[-73.701818,40.980857],[-73.70179899999999,40.980907],[-73.701723,40.980806],[-73.70090500000001,40.983416],[-73.70057799999999,40.983894],[-73.700428,40.983922],[-73.70006100000001,40.983971],[-73.699894,40.983993],[-73.698798,40.98404],[-73.69827100000001,40.98405],[-73.697976,40.984054],[-73.696196,40.984077],[-73.695902,40.984079],[-73.695193,40.984036],[-73.694388,40.983987],[-73.692549,40.983892],[-73.691636,40.983813],[-73.691213,40.983754],[-73.6909,40.983697],[-73.690487,40.983565],[-73.689842,40.983344],[-73.689319,40.983136],[-73.689153,40.983067],[-73.688804,40.982931],[-73.68875800000001,40.982921],[-73.68834,40.982826],[-73.687738,40.982754],[-73.688393,40.981943],[-73.68862799999999,40.981614],[-73.68872399999999,40.9815],[-73.68914599999999,40.980991],[-73.689392,40.980784],[-73.68961400000001,40.980628],[-73.689871,40.980474],[-73.69015400000001,40.980313],[-73.690488,40.980113],[-73.69076699999999,40.97993],[-73.690916,40.979824],[-73.691276,40.979569],[-73.69155000000001,40.979337],[-73.69170800000001,40.979164],[-73.69205700000001,40.978706],[-73.692286,40.978432],[-73.692391,40.978338],[-73.692565,40.978246],[-73.69273,40.977499],[-73.69276600000001,40.977296],[-73.69278199999999,40.977202],[-73.693038,40.976309],[-73.693141,40.976432],[-73.693225,40.976495],[-73.693342,40.976563],[-73.693718,40.976744],[-73.694236,40.976965],[-73.69518600000001,40.977347],[-73.695521,40.977482],[-73.695986,40.977685],[-73.696172,40.97779],[-73.696299,40.977886],[-73.69644599999999,40.97777],[-73.69845599999999,40.976425],[-73.698531,40.976375],[-73.699381,40.9758],[-73.700875,40.974817],[-73.70325099999999,40.973211],[-73.70501899999999,40.972041],[-73.705241,40.971876],[-73.706135,40.971343],[-73.706648,40.971081],[-73.70731499999999,40.970795],[-73.70745599999999,40.970735],[-73.707945,40.970564],[-73.70802399999999,40.970536],[-73.708415,40.970417],[-73.708538,40.970379],[-73.70924100000001,40.970209],[-73.70892000000001,40.970885]]],"type":"Polygon"}
}