{
  "id": "360870131004",
  "type": "Feature",
  "properties": {
    "area_land":195272,
    "area_water":0,
    "geoid":"360870131004",
    "name":"Block Group 4",
    "state":"ny"
},
  "bbox": [
    -73.921944,
    41.087323,
    -73.917771,
    41.094372
],
  "geometry": {"coordinates":[[[-73.92194000000001,41.08969],[-73.921916,41.089846],[-73.921818,41.090418],[-73.92178,41.090632],[-73.92173099999999,41.090908],[-73.921716,41.091006],[-73.921678,41.091256],[-73.92161299999999,41.091545],[-73.921358,41.092544],[-73.92133200000001,41.092643],[-73.921207,41.093069],[-73.921143,41.093243],[-73.920984,41.093657],[-73.920715,41.094372],[-73.919691,41.094124],[-73.918655,41.093912],[-73.917771,41.09372],[-73.91780799999999,41.093175],[-73.91789799999999,41.09255],[-73.917946,41.092265],[-73.918009,41.091977],[-73.91811300000001,41.091523],[-73.918164,41.09131],[-73.918254,41.090959],[-73.918397,41.090443],[-73.918493,41.09011],[-73.918548,41.089941],[-73.918779,41.089199],[-73.918909,41.088815],[-73.918997,41.088495],[-73.919037,41.088348],[-73.919254,41.087323],[-73.921091,41.087776],[-73.92172100000001,41.087941],[-73.92192300000001,41.087994],[-73.921944,41.088879],[-73.92194000000001,41.08969]]],"type":"Polygon"}
}