{
  "id": "360595215002",
  "type": "Feature",
  "properties": {
    "area_land":267567,
    "area_water":0,
    "geoid":"360595215002",
    "name":"Block Group 2",
    "state":"ny"
},
  "bbox": [
    -73.446387,
    40.69436,
    -73.436619,
    40.699653
],
  "geometry": {"coordinates":[[[-73.446262,40.695394],[-73.44611999999999,40.696076],[-73.445978,40.696752],[-73.44592799999999,40.696925],[-73.44583900000001,40.697429],[-73.44569799999999,40.698107],[-73.44555699999999,40.698784],[-73.44537099999999,40.699653],[-73.444507,40.699524],[-73.443744,40.699411],[-73.44365999999999,40.699398],[-73.442775,40.699271],[-73.44288,40.698755],[-73.441954,40.698644],[-73.441,40.698529],[-73.440048,40.698414],[-73.439121,40.698302],[-73.438196,40.698191],[-73.43727,40.698079],[-73.436674,40.698015],[-73.43661899999999,40.697909],[-73.436752,40.697049],[-73.437038,40.697125],[-73.437145,40.696478],[-73.437273,40.695885],[-73.43771599999999,40.695938],[-73.438641,40.696048],[-73.43956799999999,40.69616],[-73.44049200000001,40.696272],[-73.441445,40.696387],[-73.44239899999999,40.696502],[-73.442842,40.69436],[-73.443769,40.694471],[-73.44466300000001,40.694579],[-73.445515,40.694682],[-73.446387,40.694786],[-73.446262,40.695394]]],"type":"Polygon"}
}