{
  "id": "360550071003",
  "type": "Feature",
  "properties": {
    "area_land":114057,
    "area_water":0,
    "geoid":"360550071003",
    "name":"Block Group 3",
    "state":"ny"
},
  "bbox": [
    -77.650954,
    43.130942,
    -77.647687,
    43.135001
],
  "geometry": {"coordinates":[[[-77.650954,43.134992],[-77.647926,43.135001],[-77.647903,43.134221],[-77.647903,43.133466],[-77.647903,43.132806],[-77.64789500000001,43.132742],[-77.64787800000001,43.132693],[-77.647713,43.132489],[-77.647693,43.132452],[-77.647687,43.132415],[-77.647687,43.130975],[-77.64861999999999,43.130965],[-77.649788,43.130953],[-77.650918,43.130942],[-77.650931,43.131711],[-77.65093899999999,43.132058],[-77.650942,43.132433],[-77.650947,43.132779],[-77.650947,43.133165],[-77.650947,43.133466],[-77.65095100000001,43.133897],[-77.650947,43.134218],[-77.650954,43.13463],[-77.650954,43.134992]]],"type":"Polygon"}
}