{
  "id": "360272210012",
  "type": "Feature",
  "properties": {
    "area_land":1758635,
    "area_water":13287,
    "geoid":"360272210012",
    "name":"Block Group 2",
    "state":"ny"
},
  "bbox": [
    -73.914087,
    41.670266,
    -73.89066,
    41.683749
],
  "geometry": {"coordinates":[[[-73.91407700000001,41.67167],[-73.914061,41.671756],[-73.914035,41.671888],[-73.913995,41.672187],[-73.91396899999999,41.67238],[-73.913932,41.672653],[-73.913873,41.672913],[-73.913719,41.673358],[-73.913375,41.674449],[-73.912925,41.67574],[-73.91284,41.675931],[-73.912707,41.676164],[-73.91257299999999,41.67637],[-73.912504,41.676477],[-73.912149,41.676982],[-73.912015,41.677146],[-73.911885,41.677273],[-73.911683,41.677421],[-73.911326,41.677649],[-73.91105399999999,41.677829],[-73.91065,41.678078],[-73.910318,41.678315],[-73.91006,41.678193],[-73.90953399999999,41.677995],[-73.90875699999999,41.677734],[-73.90792,41.677483],[-73.907214,41.677288],[-73.90706400000001,41.677236],[-73.90693400000001,41.677175],[-73.90641599999999,41.67685],[-73.90617399999999,41.676722],[-73.905907,41.676598],[-73.90575200000001,41.676559],[-73.905162,41.676672],[-73.904886,41.676676],[-73.904689,41.676755],[-73.904466,41.677358],[-73.90430000000001,41.677811],[-73.904174,41.678148],[-73.903935,41.678697],[-73.903873,41.67882],[-73.903744,41.679068],[-73.90357899999999,41.67938],[-73.903358,41.679864],[-73.90329300000001,41.680044],[-73.903228,41.680288],[-73.903195,41.680544],[-73.90315200000001,41.680858],[-73.90311699999999,41.681122],[-73.903109,41.681332],[-73.903143,41.68195],[-73.903244,41.682907],[-73.903271,41.683126],[-73.90330400000001,41.683749],[-73.903014,41.683659],[-73.902221,41.68338],[-73.901323,41.683077],[-73.90077599999999,41.682885],[-73.900361,41.68274],[-73.89860400000001,41.682138],[-73.89676900000001,41.681528],[-73.89642499999999,41.681422],[-73.896186,41.68135],[-73.894809,41.680922],[-73.894488,41.680834],[-73.89381,41.680625],[-73.893711,41.680596],[-73.892459,41.680201],[-73.891223,41.679751],[-73.89080199999999,41.679579],[-73.890862,41.679082],[-73.890947,41.678721],[-73.890959,41.678651],[-73.890936,41.678624],[-73.890856,41.678582],[-73.89084,41.67854],[-73.890852,41.678482],[-73.890973,41.678367],[-73.891004,41.678292],[-73.89100000000001,41.678248],[-73.890969,41.678208],[-73.890897,41.678158],[-73.890866,41.678105],[-73.890857,41.67803],[-73.890968,41.677691],[-73.890992,41.677605],[-73.89097599999999,41.677407],[-73.89101100000001,41.677252],[-73.89101100000001,41.677199],[-73.890962,41.677066],[-73.890962,41.676951],[-73.891046,41.676814],[-73.891093,41.676626],[-73.891137,41.676272],[-73.891077,41.676101],[-73.891093,41.676048],[-73.891226,41.675987],[-73.891261,41.675931],[-73.891277,41.67581],[-73.89125300000001,41.675506],[-73.891273,41.675459],[-73.891402,41.675371],[-73.891535,41.675315],[-73.891575,41.675236],[-73.89154600000001,41.675187],[-73.89147699999999,41.675114],[-73.891319,41.674783],[-73.891193,41.6746],[-73.891193,41.674533],[-73.891369,41.674244],[-73.89143900000001,41.674103],[-73.891479,41.673988],[-73.891488,41.673917],[-73.891541,41.673846],[-73.891603,41.67378],[-73.891626,41.673683],[-73.891626,41.673576],[-73.891561,41.67311],[-73.891508,41.672822],[-73.89145499999999,41.672632],[-73.891373,41.672147],[-73.891364,41.672028],[-73.891324,41.671952],[-73.891217,41.671802],[-73.891144,41.671725],[-73.89115099999999,41.671607],[-73.891251,41.671581],[-73.89141100000001,41.671551],[-73.89144,41.671494],[-73.89141600000001,41.67145],[-73.891276,41.671446],[-73.891154,41.671437],[-73.891127,41.671395],[-73.891158,41.671266],[-73.891144,41.671216],[-73.891091,41.671187],[-73.89103799999999,41.671204],[-73.89099299999999,41.671244],[-73.890978,41.671368],[-73.89094,41.67143],[-73.890879,41.671453],[-73.890811,41.671419],[-73.890743,41.671347],[-73.89066,41.671154],[-73.89069000000001,41.671035],[-73.890759,41.670918],[-73.890789,41.670832],[-73.890871,41.67081],[-73.890978,41.670815],[-73.891111,41.670882],[-73.89125,41.670939],[-73.89135,41.670918],[-73.89139400000001,41.670815],[-73.891409,41.67073],[-73.89139400000001,41.670617],[-73.89135,41.670572],[-73.891273,41.670555],[-73.891175,41.670596],[-73.891076,41.670583],[-73.891008,41.670549],[-73.890985,41.670481],[-73.89102699999999,41.670481],[-73.89101100000001,41.67045],[-73.891158,41.670295],[-73.89128100000001,41.670266],[-73.89237300000001,41.670306],[-73.893709,41.670367],[-73.898347,41.670973],[-73.901695,41.671405],[-73.902171,41.671425],[-73.903465,41.671448],[-73.904335,41.671464],[-73.90468300000001,41.67147],[-73.90595399999999,41.671494],[-73.90915099999999,41.671547],[-73.910881,41.671581],[-73.911158,41.671585],[-73.91408699999999,41.671636],[-73.91407700000001,41.67167]]],"type":"Polygon"}
}