{
  "id": "360550135062",
  "type": "Feature",
  "properties": {
    "area_land":5557544,
    "area_water":0,
    "geoid":"360550135062",
    "name":"Block Group 2",
    "state":"ny"
},
  "bbox": [
    -77.752693,
    43.214484,
    -77.719393,
    43.244367
],
  "geometry": {"coordinates":[[[-77.752578,43.221119],[-77.752494,43.222944],[-77.75228199999999,43.227954],[-77.752127,43.231054],[-77.75208499999999,43.231931],[-77.75200700000001,43.233505],[-77.75182100000001,43.237378],[-77.751805,43.237728],[-77.75176999999999,43.238448],[-77.751696,43.240039],[-77.751694,43.240072],[-77.751643,43.241119],[-77.751486,43.244367],[-77.746101,43.24428],[-77.74555599999999,43.244258],[-77.74514600000001,43.244226],[-77.744556,43.244166],[-77.742088,43.243885],[-77.741114,43.243765],[-77.740178,43.243664],[-77.73897599999999,43.243517],[-77.736295,43.243458],[-77.733577,43.243403],[-77.73322899999999,43.243396],[-77.733284,43.241441],[-77.733335,43.239611],[-77.733352,43.239013],[-77.72845700000001,43.23894],[-77.726403,43.238907],[-77.724985,43.238886],[-77.72475,43.238883],[-77.723816,43.238869],[-77.71986699999999,43.238813],[-77.719622,43.238809],[-77.719393,43.238807],[-77.719937,43.234528],[-77.721045,43.231464],[-77.723595,43.231516],[-77.725696,43.231551],[-77.72631199999999,43.231559],[-77.72887299999999,43.231595],[-77.730189,43.231611],[-77.733571,43.231656],[-77.73364599999999,43.228857],[-77.733649,43.228625],[-77.733664,43.228061],[-77.733687,43.227202],[-77.733721,43.225725],[-77.733728,43.225419],[-77.733743,43.22486],[-77.73376500000001,43.223947],[-77.733805,43.22236],[-77.733836,43.221248],[-77.733842,43.22089],[-77.733856,43.220138],[-77.73385,43.218245],[-77.733592,43.217716],[-77.733316,43.217367],[-77.732777,43.216896],[-77.732696,43.21685],[-77.73215399999999,43.216415],[-77.73180600000001,43.215611],[-77.731786,43.215407],[-77.731784,43.215231],[-77.73178299999999,43.215177],[-77.731797,43.214484],[-77.733878,43.214994],[-77.73532400000001,43.215279],[-77.736232,43.215451],[-77.73746800000001,43.215653],[-77.73890400000001,43.215825],[-77.741415,43.216117],[-77.74166200000001,43.216145],[-77.743201,43.216321],[-77.744141,43.216428],[-77.747004,43.216755],[-77.74805000000001,43.216873],[-77.75269299999999,43.217396],[-77.752578,43.221119]]],"type":"Polygon"}
}