{
  "id": "360470896001",
  "type": "Feature",
  "properties": {
    "area_land":41857,
    "area_water":0,
    "geoid":"360470896001",
    "name":"Block Group 1",
    "state":"ny"
},
  "bbox": [
    -73.914131,
    40.658645,
    -73.910943,
    40.660597
],
  "geometry": {"coordinates":[[[-73.914131,40.660181],[-73.91321000000001,40.660319],[-73.91229199999999,40.660455],[-73.91133499999999,40.660597],[-73.910943,40.659061],[-73.911897,40.658918],[-73.912817,40.658783],[-73.913736,40.658645],[-73.914131,40.660181]]],"type":"Polygon"}
}