{
  "id": "360594086002",
  "type": "Feature",
  "properties": {
    "area_land":658039,
    "area_water":0,
    "geoid":"360594086002",
    "name":"Block Group 2",
    "state":"ny"
},
  "bbox": [
    -73.54569,
    40.733229,
    -73.535495,
    40.743601
],
  "geometry": {"coordinates":[[[-73.545564,40.743583],[-73.54441799999999,40.743593],[-73.54322000000001,40.743601],[-73.54003400000001,40.743496],[-73.536573,40.743404],[-73.535495,40.743332],[-73.535518,40.743273],[-73.535977,40.741948],[-73.536199,40.74128],[-73.536382,40.740798],[-73.536624,40.740175],[-73.536846,40.739567],[-73.537036,40.739053],[-73.537267,40.738444],[-73.53752900000001,40.737739],[-73.53766299999999,40.737395],[-73.53820399999999,40.735957],[-73.538883,40.734265],[-73.539117,40.733696],[-73.539136,40.733632],[-73.53917199999999,40.73354],[-73.53927299999999,40.733276],[-73.542646,40.73323],[-73.542698,40.73323],[-73.542749,40.733229],[-73.54295500000001,40.733793],[-73.543336,40.734853],[-73.543492,40.735391],[-73.54365900000001,40.736064],[-73.543815,40.736781],[-73.54396800000001,40.737695],[-73.54400099999999,40.737894],[-73.54421000000001,40.73888],[-73.544389,40.73978],[-73.54448499999999,40.740165],[-73.54460400000001,40.740594],[-73.54475499999999,40.741088],[-73.545075,40.74204],[-73.545214,40.742412],[-73.54533600000001,40.742738],[-73.54568999999999,40.743582],[-73.545564,40.743583]]],"type":"Polygon"}
}