{
  "id": "360290112004",
  "type": "Feature",
  "properties": {
    "area_land":2970145,
    "area_water":0,
    "geoid":"360290112004",
    "name":"Block Group 4",
    "state":"ny"
},
  "bbox": [
    -78.712056,
    42.838421,
    -78.696898,
    42.863664
],
  "geometry": {"coordinates":[[[-78.712056,42.842707],[-78.712048,42.843257],[-78.712052,42.844984],[-78.71204,42.847874],[-78.712045,42.848793],[-78.71204899999999,42.850772],[-78.70990999999999,42.851224],[-78.70953900000001,42.851304],[-78.708583,42.85151],[-78.708609,42.85469],[-78.708619,42.856936],[-78.708687,42.857422],[-78.708787,42.85807],[-78.708935,42.858588],[-78.708894,42.858591],[-78.708904,42.861041],[-78.708934,42.863559],[-78.70122000000001,42.863619],[-78.69694699999999,42.863664],[-78.69694699999999,42.863644],[-78.696962,42.862089],[-78.696956,42.860034],[-78.696963,42.859497],[-78.696963,42.85945],[-78.696961,42.859133],[-78.69696,42.858494],[-78.696956,42.857223],[-78.696946,42.855591],[-78.696939,42.854413],[-78.696933,42.853572],[-78.696932,42.85346],[-78.696924,42.852033],[-78.696921,42.851598],[-78.69692000000001,42.851427],[-78.696917,42.85088],[-78.696916,42.85054],[-78.696913,42.849012],[-78.69690300000001,42.846135],[-78.69690300000001,42.846101],[-78.6969,42.844568],[-78.696898,42.843582],[-78.69690199999999,42.842957],[-78.69691,42.841834],[-78.69691400000001,42.839552],[-78.69691400000001,42.839304],[-78.69691400000001,42.839164],[-78.696915,42.838421],[-78.697057,42.838435],[-78.697307,42.83846],[-78.711591,42.839959],[-78.71159400000001,42.840034],[-78.71163,42.840357],[-78.711658,42.840518],[-78.711688,42.840653],[-78.711693,42.840678],[-78.71176199999999,42.840936],[-78.71179600000001,42.841095],[-78.71202,42.842124],[-78.71205500000001,42.842285],[-78.712056,42.842707]]],"type":"Polygon"}
}