{
  "id": "360790115002",
  "type": "Feature",
  "properties": {
    "area_land":6221477,
    "area_water":4232008,
    "geoid":"360790115002",
    "name":"Block Group 2",
    "state":"ny"
},
  "bbox": [
    -73.728563,
    41.397801,
    -73.678332,
    41.437161
],
  "geometry": {"coordinates":[[[-73.728556,41.433025],[-73.71954100000001,41.43373],[-73.71519000000001,41.434148],[-73.714967,41.434185],[-73.70065200000001,41.43538],[-73.69651399999999,41.435777],[-73.690675,41.436252],[-73.686956,41.436646],[-73.683296,41.437038],[-73.683072,41.437061],[-73.682081,41.437161],[-73.682087,41.437133],[-73.68214500000001,41.436746],[-73.68213799999999,41.436537],[-73.682098,41.436371],[-73.681197,41.43364],[-73.681146,41.433495],[-73.680761,41.432357],[-73.68065300000001,41.432057],[-73.680459,41.43158],[-73.680415,41.431483],[-73.679855,41.430401],[-73.679709,41.430041],[-73.679543,41.429513],[-73.67932,41.428623],[-73.679221,41.428122],[-73.679203,41.42803],[-73.679034,41.427031],[-73.678937,41.42625],[-73.67891899999999,41.426092],[-73.67860899999999,41.424175],[-73.678355,41.42245],[-73.678332,41.422159],[-73.678344,41.422025],[-73.678369,41.421928],[-73.678425,41.421778],[-73.67901999999999,41.420488],[-73.679542,41.419359],[-73.68051199999999,41.417385],[-73.68078800000001,41.416902],[-73.681124,41.416429],[-73.68131700000001,41.416193],[-73.681451,41.416051],[-73.68172,41.415823],[-73.68203200000001,41.41563],[-73.682259,41.415528],[-73.682481,41.415443],[-73.683801,41.415107],[-73.684921,41.414844],[-73.685232,41.414785],[-73.685553,41.414745],[-73.68601700000001,41.414736],[-73.686986,41.414746],[-73.6875,41.414738],[-73.68771599999999,41.414716],[-73.687887,41.414689],[-73.68816700000001,41.414628],[-73.688498,41.414527],[-73.688867,41.414368],[-73.689042,41.414272],[-73.689311,41.414092],[-73.689502,41.413937],[-73.689993,41.413425],[-73.690341,41.413074],[-73.690691,41.41281],[-73.69099799999999,41.412616],[-73.69189900000001,41.41213],[-73.69228200000001,41.411931],[-73.69245600000001,41.411841],[-73.692592,41.411774],[-73.693169,41.411463],[-73.69365999999999,41.411217],[-73.693775,41.411162],[-73.694081,41.411039],[-73.69416,41.41101],[-73.694473,41.410923],[-73.694822,41.410848],[-73.69606899999999,41.410677],[-73.696777,41.410573],[-73.697125,41.410486],[-73.69753,41.410349],[-73.697883,41.410191],[-73.698228,41.409996],[-73.698517,41.40979],[-73.69875999999999,41.409579],[-73.699867,41.408495],[-73.700011,41.408388],[-73.70018,41.408294],[-73.700472,41.408183],[-73.701042,41.408032],[-73.70164200000001,41.407862],[-73.702297,41.407639],[-73.703536,41.4072],[-73.7038,41.407093],[-73.704007,41.406981],[-73.70417399999999,41.406849],[-73.704347,41.40666],[-73.704381,41.406615],[-73.7045,41.406389],[-73.70454599999999,41.406205],[-73.704543,41.40591],[-73.704447,41.405242],[-73.704424,41.404938],[-73.704442,41.404718],[-73.704464,41.404599],[-73.704537,41.404365],[-73.704652,41.404151],[-73.705158,41.403436],[-73.705528,41.402912],[-73.705562,41.402865],[-73.705611,41.402793],[-73.705799,41.402475],[-73.705894,41.402218],[-73.70593,41.40198],[-73.705921,41.401744],[-73.70589099999999,41.401438],[-73.70586299999999,41.401204],[-73.705851,41.400913],[-73.70593700000001,41.400507],[-73.706068,41.399931],[-73.706177,41.399439],[-73.70635,41.398971],[-73.707526,41.398142],[-73.707759,41.398003],[-73.708043,41.397894],[-73.70830599999999,41.397832],[-73.708573,41.397801],[-73.708867,41.397806],[-73.709041,41.397824],[-73.709334,41.397891],[-73.709459,41.397931],[-73.709639,41.398013],[-73.70992099999999,41.398191],[-73.71010800000001,41.398341],[-73.710566,41.398713],[-73.71086,41.398912],[-73.711198,41.399082],[-73.71151999999999,41.399202],[-73.711614,41.39929],[-73.71173,41.399263],[-73.711626,41.399503],[-73.71093500000001,41.401142],[-73.710835,41.401685],[-73.71081,41.401797],[-73.710483,41.402485],[-73.710469,41.402664],[-73.710522,41.402904],[-73.710678,41.403351],[-73.71095,41.4043],[-73.71126700000001,41.405293],[-73.71128899999999,41.405493],[-73.711275,41.405699],[-73.71104099999999,41.40662],[-73.71095699999999,41.406934],[-73.710852,41.407433],[-73.710735,41.407903],[-73.710531,41.408912],[-73.71024199999999,41.410673],[-73.710159,41.41118],[-73.710162,41.411308],[-73.71017500000001,41.411375],[-73.710303,41.411787],[-73.710307,41.411997],[-73.71028099999999,41.412126],[-73.710162,41.412498],[-73.71014599999999,41.41259],[-73.71011300000001,41.413193],[-73.710122,41.413306],[-73.71018599999999,41.413456],[-73.71025,41.413529],[-73.710414,41.413656],[-73.710875,41.413924],[-73.711123,41.414039],[-73.711298,41.414097],[-73.71162099999999,41.41415],[-73.71202,41.414204],[-73.71217900000001,41.414241],[-73.712243,41.414272],[-73.712538,41.414498],[-73.712659,41.414554],[-73.712762,41.414591],[-73.713514,41.414764],[-73.713897,41.41488],[-73.714145,41.414968],[-73.71477899999999,41.415228],[-73.714872,41.415259],[-73.714994,41.415279],[-73.71505999999999,41.415281],[-73.715231,41.415258],[-73.715333,41.415212],[-73.716132,41.414606],[-73.71634,41.414481],[-73.716385,41.414461],[-73.71663100000001,41.414354],[-73.716947,41.414245],[-73.718236,41.413959],[-73.719729,41.413649],[-73.720007,41.413585],[-73.720315,41.413509],[-73.720426,41.41343],[-73.72053099999999,41.413472],[-73.72064899999999,41.413482],[-73.720755,41.413482],[-73.721191,41.41345],[-73.72233,41.41332],[-73.722522,41.413311],[-73.72349800000001,41.413389],[-73.724199,41.413429],[-73.724829,41.413438],[-73.724982,41.413466],[-73.725121,41.413523],[-73.725256,41.413607],[-73.72548399999999,41.4138],[-73.72586800000001,41.414152],[-73.72595200000001,41.414247],[-73.72601400000001,41.414318],[-73.72618799999999,41.41461],[-73.726358,41.414957],[-73.726617,41.415694],[-73.726685,41.415795],[-73.7268,41.415898],[-73.72675599999999,41.416025],[-73.726647,41.416534],[-73.726547,41.41684],[-73.726309,41.417359],[-73.72622,41.417647],[-73.726212,41.417784],[-73.726215,41.418462],[-73.72619400000001,41.419911],[-73.726167,41.420295],[-73.726184,41.420607],[-73.72629499999999,41.421511],[-73.726316,41.421728],[-73.726348,41.422049],[-73.726387,41.422451],[-73.72639100000001,41.422539],[-73.72639100000001,41.422559],[-73.726399,41.423432],[-73.726373,41.423715],[-73.726316,41.423968],[-73.726219,41.424234],[-73.72614400000001,41.424382],[-73.725965,41.424698],[-73.725859,41.424847],[-73.725714,41.424995],[-73.725628,41.425128],[-73.725617,41.425159],[-73.72559699999999,41.425654],[-73.725606,41.426316],[-73.72563,41.426454],[-73.725666,41.426568],[-73.725703,41.426688],[-73.726152,41.427741],[-73.726924,41.429701],[-73.727046,41.430111],[-73.727107,41.43044],[-73.727144,41.430661],[-73.727161,41.430765],[-73.727166,41.430795],[-73.727273,41.43143],[-73.72727,41.431721],[-73.727324,41.431822],[-73.727389,41.431894],[-73.727566,41.431999],[-73.727816,41.432114],[-73.72797300000001,41.4322],[-73.728101,41.432299],[-73.72838,41.432596],[-73.72848500000001,41.432726],[-73.728534,41.432818],[-73.72856299999999,41.432979],[-73.728556,41.433025]]],"type":"Polygon"}
}