{
  "id": "360470626002",
  "type": "Feature",
  "properties": {
    "area_land":256625,
    "area_water":0,
    "geoid":"360470626002",
    "name":"Block Group 2",
    "state":"ny"
},
  "bbox": [
    -73.93778,
    40.587827,
    -73.931784,
    40.594639
],
  "geometry": {"coordinates":[[[-73.93778,40.594126],[-73.93589900000001,40.594335],[-73.934949,40.594429],[-73.934006,40.594527],[-73.93301099999999,40.594639],[-73.932614,40.592517],[-73.932225,40.590479],[-73.93178399999999,40.588141],[-73.93252200000001,40.588061],[-73.933705,40.587931],[-73.934668,40.587827],[-73.93476099999999,40.588322],[-73.935091,40.590077],[-73.936061,40.58997],[-73.93698500000001,40.589871],[-73.937375,40.591995],[-73.937512,40.592755],[-73.93778,40.594126]]],"type":"Polygon"}
}