{
  "id": "360810381001",
  "type": "Feature",
  "properties": {
    "area_land":83062,
    "area_water":0,
    "geoid":"360810381001",
    "name":"Block Group 1",
    "state":"ny"
},
  "bbox": [
    -73.861906,
    40.756193,
    -73.855049,
    40.758305
],
  "geometry": {"coordinates":[[[-73.861906,40.757795],[-73.86099900000001,40.757825],[-73.860462,40.757844],[-73.859927,40.757864],[-73.85951300000001,40.757879],[-73.858889,40.7579],[-73.85856099999999,40.757912],[-73.857753,40.758027],[-73.85695200000001,40.758133],[-73.855608,40.758305],[-73.85504899999999,40.757182],[-73.85603999999999,40.757072],[-73.857055,40.756868],[-73.857928,40.756685],[-73.858805,40.756503],[-73.859719,40.756391],[-73.860719,40.756287],[-73.86161199999999,40.756193],[-73.861906,40.757795]]],"type":"Polygon"}
}