{
  "id": "360010025002",
  "type": "Feature",
  "properties": {
    "area_land":95810,
    "area_water":0,
    "geoid":"360010025002",
    "name":"Block Group 2",
    "state":"ny"
},
  "bbox": [
    -73.757569,
    42.642375,
    -73.75103,
    42.646239
],
  "geometry": {"coordinates":[[[-73.757167,42.64528],[-73.7569,42.645662],[-73.756496,42.646239],[-73.755785,42.646004],[-73.75547,42.645905],[-73.75477600000001,42.645753],[-73.754352,42.645681],[-73.753699,42.645561],[-73.75355399999999,42.645527],[-73.75352100000001,42.645458],[-73.75327900000001,42.645379],[-73.75308699999999,42.645321],[-73.75294700000001,42.645262],[-73.752876,42.645226],[-73.75269,42.645098],[-73.75260299999999,42.645024],[-73.75256,42.644996],[-73.752467,42.644918],[-73.752239,42.644872],[-73.752168,42.644958],[-73.75201300000001,42.64483],[-73.751835,42.644791],[-73.751644,42.644754],[-73.75156699999999,42.644685],[-73.751136,42.644422],[-73.75103,42.644338],[-73.751079,42.64429],[-73.75113,42.644244],[-73.75127000000001,42.644094],[-73.75136999999999,42.643956],[-73.751532,42.643788],[-73.751863,42.64349],[-73.75203,42.64352],[-73.752207,42.643334],[-73.75234399999999,42.643206],[-73.752455,42.643048],[-73.75247400000001,42.64296],[-73.75246799999999,42.64282],[-73.752411,42.642671],[-73.752357,42.64258],[-73.75232200000001,42.642513],[-73.75236,42.642378],[-73.75249700000001,42.642375],[-73.752627,42.64261],[-73.752656,42.642664],[-73.752745,42.642687],[-73.75259800000001,42.642925],[-73.752567,42.643105],[-73.753553,42.643423],[-73.75479,42.643828],[-73.755617,42.644104],[-73.756224,42.644296],[-73.75654400000001,42.644392],[-73.757569,42.644691],[-73.757167,42.64528]]],"type":"Polygon"}
}