{
  "id": "360610081002",
  "type": "Feature",
  "properties": {
    "area_land":40874,
    "area_water":0,
    "geoid":"360610081002",
    "name":"Block Group 2",
    "state":"ny"
},
  "bbox": [
    -74.001555,
    40.739881,
    -73.997862,
    40.742254
],
  "geometry": {"coordinates":[[[-74.00112900000001,40.741668],[-74.000703,40.742254],[-73.99814600000001,40.741176],[-73.997862,40.741056],[-73.998287,40.74047],[-73.998713,40.739881],[-74.00111800000001,40.740896],[-74.001555,40.74108],[-74.00112900000001,40.741668]]],"type":"Polygon"}
}