{
  "id": "360150111004",
  "type": "Feature",
  "properties": {
    "area_land":507708,
    "area_water":0,
    "geoid":"360150111004",
    "name":"Block Group 4",
    "state":"ny"
},
  "bbox": [
    -76.819672,
    42.055341,
    -76.809966,
    42.069372
],
  "geometry": {"coordinates":[[[-76.819672,42.055341],[-76.819007,42.057237],[-76.818061,42.059755],[-76.817458,42.061365],[-76.816756,42.063421],[-76.816726,42.06349],[-76.81655000000001,42.063982],[-76.816154,42.065145],[-76.816024,42.065363],[-76.81549699999999,42.066862],[-76.8152,42.067739],[-76.81506400000001,42.068159],[-76.815073,42.06833],[-76.814666,42.069177],[-76.81459700000001,42.069372],[-76.81410099999999,42.06843],[-76.81382600000001,42.067907],[-76.813643,42.067961],[-76.812285,42.065408],[-76.812156,42.065157],[-76.812011,42.064905],[-76.81188299999999,42.064651],[-76.811194,42.063288],[-76.809966,42.060995],[-76.810767,42.060511],[-76.81130899999999,42.06019],[-76.81182,42.059889],[-76.812682,42.05937],[-76.813644,42.058759],[-76.813697,42.058729],[-76.814712,42.05813],[-76.816108,42.057291],[-76.81774799999999,42.056303],[-76.818922,42.055599],[-76.819344,42.05545],[-76.819672,42.055341]]],"type":"Polygon"}
}