{
  "id": "361031702024",
  "type": "Feature",
  "properties": {
    "area_land":16750097,
    "area_water":39844847,
    "geoid":"361031702024",
    "name":"Block Group 4",
    "state":"ny"
},
  "bbox": [
    -72.324742,
    41.103086,
    -72.093679,
    41.21581
],
  "geometry": {"coordinates":[[[-72.324742,41.147298],[-72.31248600000001,41.157154],[-72.276597,41.167618],[-72.265897,41.168358],[-72.249284,41.169505],[-72.236307,41.168417],[-72.23536199999999,41.168162],[-72.224493,41.175405],[-72.221971,41.180498],[-72.202866,41.18765],[-72.18661,41.197586],[-72.177042,41.194978],[-72.163297,41.19933],[-72.162942,41.19911],[-72.13552,41.20461],[-72.10915199999999,41.21581],[-72.099194,41.211279],[-72.09367899999999,41.20877],[-72.111756,41.193998],[-72.112106,41.193566],[-72.15684299999999,41.182767],[-72.17912800000001,41.176502],[-72.184179,41.171356],[-72.192796,41.160616],[-72.199927,41.15905],[-72.209732,41.161958],[-72.22013099999999,41.15905],[-72.232017,41.152337],[-72.243307,41.141597],[-72.24509,41.133542],[-72.24954700000001,41.127054],[-72.264404,41.120789],[-72.293522,41.106693],[-72.30198900000001,41.103086],[-72.31022299999999,41.106331],[-72.311302,41.106756],[-72.30710000000001,41.108821],[-72.30049099999999,41.112068],[-72.300292,41.112215],[-72.299543,41.112769],[-72.29415,41.116561],[-72.28939699999999,41.120627],[-72.287673,41.122721],[-72.285094,41.12466],[-72.284232,41.125106],[-72.283401,41.125412],[-72.283278,41.125392],[-72.28326300000001,41.126696],[-72.28423100000001,41.12722],[-72.286056,41.127506],[-72.287993,41.12765],[-72.29325799999999,41.130161],[-72.29531,41.130698],[-72.298438,41.131363],[-72.299964,41.132109],[-72.30122299999999,41.132724],[-72.302999,41.134338],[-72.30440400000001,41.136101],[-72.30474100000001,41.136276],[-72.305305,41.136721],[-72.305747,41.137794],[-72.30618200000001,41.138195],[-72.30688000000001,41.138664],[-72.307006,41.139569],[-72.30786000000001,41.139892],[-72.308601,41.139843],[-72.31200200000001,41.14061],[-72.315162,41.140448],[-72.317436,41.139205],[-72.317519,41.139302],[-72.318431,41.140017],[-72.31959500000001,41.140823],[-72.324742,41.147298]]],"type":"Polygon"}
}