{
  "id": "360470690001",
  "type": "Feature",
  "properties": {
    "area_land":87370,
    "area_water":0,
    "geoid":"360470690001",
    "name":"Block Group 1",
    "state":"ny"
},
  "bbox": [
    -73.921359,
    40.619309,
    -73.917265,
    40.621941
],
  "geometry": {"coordinates":[[[-73.921359,40.621718],[-73.92039,40.621777],[-73.919456,40.621834],[-73.918522,40.621893],[-73.91751499999999,40.621941],[-73.91746999999999,40.621513],[-73.917413,40.620958],[-73.917265,40.619548],[-73.918266,40.619485],[-73.919201,40.619426],[-73.920134,40.61937],[-73.921102,40.619309],[-73.921359,40.621718]]],"type":"Polygon"}
}