{
  "id": "360870119011",
  "type": "Feature",
  "properties": {
    "area_land":426716,
    "area_water":1963,
    "geoid":"360870119011",
    "name":"Block Group 1",
    "state":"ny"
},
  "bbox": [
    -74.15829,
    41.107295,
    -74.145438,
    41.115502
],
  "geometry": {"coordinates":[[[-74.158289,41.110996],[-74.158204,41.111238],[-74.157241,41.11155],[-74.15650100000001,41.11175],[-74.15615699999999,41.111857],[-74.15498100000001,41.11221],[-74.153993,41.11249],[-74.153774,41.112544],[-74.153195,41.11271],[-74.15316199999999,41.112734],[-74.153052,41.112751],[-74.152877,41.112799],[-74.153401,41.11381],[-74.152998,41.113955],[-74.152557,41.114086],[-74.15219999999999,41.11417],[-74.15209400000001,41.114184],[-74.151951,41.114182],[-74.151875,41.114766],[-74.151798,41.115086],[-74.151729,41.115257],[-74.151595,41.115502],[-74.15118099999999,41.115349],[-74.150485,41.115116],[-74.150346,41.115075],[-74.149964,41.114975],[-74.149699,41.114924],[-74.149548,41.114917],[-74.149473,41.114913],[-74.149308,41.114927],[-74.14800700000001,41.115057],[-74.146801,41.115167],[-74.146495,41.115187],[-74.145751,41.115193],[-74.145726,41.115064],[-74.145624,41.114827],[-74.145529,41.114671],[-74.14546300000001,41.114507],[-74.145438,41.114354],[-74.14545200000001,41.114237],[-74.145518,41.114099],[-74.145589,41.11401],[-74.145675,41.113917],[-74.145723,41.113803],[-74.145768,41.113662],[-74.145774,41.113605],[-74.14578,41.113532],[-74.14578899999999,41.11349],[-74.145807,41.113421],[-74.145822,41.11337],[-74.145849,41.113289],[-74.14589100000001,41.113166],[-74.145933,41.113082],[-74.145957,41.11298],[-74.14596899999999,41.112929],[-74.14600799999999,41.112842],[-74.146023,41.112803],[-74.14605899999999,41.112764],[-74.146107,41.112701],[-74.14646500000001,41.112233],[-74.14653199999999,41.112234],[-74.148096,41.112267],[-74.148717,41.112273],[-74.14878899999999,41.111305],[-74.148884,41.110343],[-74.149974,41.110381],[-74.149981,41.110293],[-74.150119,41.108744],[-74.15015699999999,41.108216],[-74.15020800000001,41.107808],[-74.150002,41.107444],[-74.14998,41.107406],[-74.14990400000001,41.107295],[-74.150203,41.107425],[-74.150333,41.107484],[-74.151318,41.107923],[-74.15173799999999,41.10811],[-74.152011,41.10823],[-74.152169,41.108299],[-74.152598,41.108488],[-74.152727,41.108544],[-74.153403,41.108841],[-74.153672,41.108958],[-74.154652,41.109389],[-74.15517199999999,41.109617],[-74.15548200000001,41.109754],[-74.15608899999999,41.109996],[-74.156183,41.110048],[-74.156296,41.110111],[-74.156998,41.110419],[-74.157107,41.110467],[-74.158207,41.110949],[-74.15828999999999,41.110985],[-74.158289,41.110996]]],"type":"Polygon"}
}