{
  "id": "360191018003",
  "type": "Feature",
  "properties": {
    "area_land":174246482,
    "area_water":855415,
    "geoid":"360191018003",
    "name":"Block Group 3",
    "state":"ny"
},
  "bbox": [
    -73.964411,
    44.583425,
    -73.735989,
    44.712164
],
  "geometry": {"coordinates":[[[-73.964411,44.697204],[-73.963257,44.697346],[-73.95863,44.697801],[-73.95040899999999,44.698645],[-73.912372,44.702602],[-73.91224699999999,44.702616],[-73.885583,44.705459],[-73.885383,44.705481],[-73.874658,44.706589],[-73.836341,44.71046],[-73.82130600000001,44.711991],[-73.820885,44.712035],[-73.819412,44.712164],[-73.819361,44.712042],[-73.819255,44.711714],[-73.819214,44.711447],[-73.81920700000001,44.711138],[-73.81934800000001,44.708451],[-73.819391,44.707624],[-73.81949899999999,44.706208],[-73.819571,44.705255],[-73.81957300000001,44.704843],[-73.819524,44.704364],[-73.819439,44.704041],[-73.819058,44.7029],[-73.818361,44.700909],[-73.81799599999999,44.699867],[-73.81781599999999,44.699437],[-73.81760300000001,44.699058],[-73.817392,44.69875],[-73.816688,44.697875],[-73.816436,44.697518],[-73.816208,44.697136],[-73.81594800000001,44.696586],[-73.815809,44.696203],[-73.81541900000001,44.695254],[-73.815252,44.694907],[-73.814556,44.693696],[-73.812884,44.69083],[-73.812499,44.690251],[-73.81209200000001,44.689758],[-73.80923300000001,44.68654],[-73.807587,44.684695],[-73.80402599999999,44.680694],[-73.803411,44.680023],[-73.80287199999999,44.679483],[-73.80236600000001,44.678995],[-73.80211,44.678759],[-73.80010799999999,44.676868],[-73.799943,44.676717],[-73.79963499999999,44.676437],[-73.799261,44.676141],[-73.79910599999999,44.67604],[-73.798131,44.675427],[-73.796772,44.674598],[-73.795075,44.67357],[-73.79432199999999,44.673114],[-73.78952200000001,44.670184],[-73.789334,44.670086],[-73.789107,44.669984],[-73.78903099999999,44.669956],[-73.78859199999999,44.669816],[-73.788195,44.669726],[-73.787752,44.669667],[-73.783264,44.669239],[-73.782652,44.669155],[-73.78178800000001,44.668996],[-73.781367,44.668893],[-73.778791,44.668153],[-73.778289,44.667965],[-73.778128,44.667878],[-73.77786,44.667698],[-73.777641,44.66752],[-73.77751600000001,44.667386],[-73.777339,44.667153],[-73.777209,44.666917],[-73.777163,44.666797],[-73.777134,44.666683],[-73.777102,44.666567],[-73.776675,44.664513],[-73.776121,44.661135],[-73.77606299999999,44.660918],[-73.77624400000001,44.660909],[-73.77676200000001,44.660904],[-73.77958700000001,44.660751],[-73.782539,44.660594],[-73.783851,44.660525],[-73.785211,44.660511],[-73.786618,44.660552],[-73.787086,44.660566],[-73.78734799999999,44.660555],[-73.78752,44.660534],[-73.788054,44.660453],[-73.788549,44.66035],[-73.789558,44.660117],[-73.791572,44.659668],[-73.79195300000001,44.659593],[-73.792225,44.659559],[-73.79467699999999,44.65919],[-73.795153,44.659099],[-73.796052,44.65888],[-73.797416,44.658523],[-73.797647,44.658456],[-73.797861,44.658394],[-73.798304,44.658301],[-73.79847599999999,44.658276],[-73.79877399999999,44.658245],[-73.799097,44.658255],[-73.799572,44.658278],[-73.800483,44.658348],[-73.800952,44.658376],[-73.801423,44.658392],[-73.80168500000001,44.658381],[-73.80199399999999,44.658339],[-73.802312,44.658263],[-73.803476,44.657912],[-73.80345199999999,44.657804],[-73.803443,44.657683],[-73.80345199999999,44.656036],[-73.803459,44.655565],[-73.803498,44.655098],[-73.803573,44.654594],[-73.80363199999999,44.654359],[-73.80382299999999,44.653662],[-73.80390300000001,44.653496],[-73.803995,44.653376],[-73.80417799999999,44.653199],[-73.80448199999999,44.652961],[-73.804756,44.652797],[-73.805262,44.652558],[-73.80561299999999,44.652363],[-73.80574900000001,44.652245],[-73.805922,44.652012],[-73.806088,44.651652],[-73.80615299999999,44.65142],[-73.806175,44.651276],[-73.806172,44.651184],[-73.806117,44.651035],[-73.805921,44.650697],[-73.805269,44.649754],[-73.80497,44.649271],[-73.804863,44.649059],[-73.80437499999999,44.649052],[-73.80398,44.649028],[-73.80368199999999,44.648983],[-73.80276000000001,44.648715],[-73.802331,44.648628],[-73.80216799999999,44.648605],[-73.801761,44.648581],[-73.801604,44.648593],[-73.801458,44.648615],[-73.801106,44.648723],[-73.800749,44.648856],[-73.800346,44.648985],[-73.800273,44.648999],[-73.799722,44.649035],[-73.79949499999999,44.649018],[-73.799216,44.648952],[-73.799091,44.648893],[-73.79889900000001,44.648745],[-73.798858,44.648702],[-73.79880300000001,44.648623],[-73.79876899999999,44.648508],[-73.79873499999999,44.648213],[-73.798728,44.647804],[-73.79871199999999,44.647537],[-73.798709,44.647477],[-73.798652,44.647016],[-73.798587,44.646746],[-73.798525,44.646457],[-73.798509,44.645805],[-73.798498,44.645694],[-73.798433,44.64551],[-73.798185,44.644668],[-73.798162,44.644589],[-73.798137,44.644362],[-73.79815600000001,44.644029],[-73.79816099999999,44.643791],[-73.798143,44.643691],[-73.798097,44.643539],[-73.79778899999999,44.643026],[-73.797549,44.642614],[-73.79742,44.642322],[-73.79727200000001,44.642043],[-73.797225,44.641992],[-73.797005,44.641833],[-73.796334,44.641509],[-73.795801,44.64136],[-73.794726,44.641022],[-73.794584,44.640986],[-73.794386,44.640949],[-73.793684,44.640878],[-73.793294,44.64086],[-73.79302800000001,44.64087],[-73.792934,44.640879],[-73.79262900000001,44.640929],[-73.792355,44.641021],[-73.791932,44.641197],[-73.79168799999999,44.641276],[-73.791607,44.641292],[-73.79145200000001,44.641311],[-73.79122700000001,44.641305],[-73.790994,44.641265],[-73.790829,44.641209],[-73.790487,44.641037],[-73.79017899999999,44.640902],[-73.789851,44.640816],[-73.789759,44.640805],[-73.789323,44.640803],[-73.789096,44.640819],[-73.788751,44.64089],[-73.788394,44.640958],[-73.787907,44.640972],[-73.787449,44.640956],[-73.787265,44.640936],[-73.786928,44.640879],[-73.78644300000001,44.640736],[-73.78623,44.640657],[-73.786017,44.640591],[-73.78553700000001,44.640472],[-73.78488400000001,44.640346],[-73.784316,44.640254],[-73.784097,44.64024],[-73.783844,44.640242],[-73.783509,44.640284],[-73.78319500000001,44.640361],[-73.782813,44.64048],[-73.782093,44.640755],[-73.781837,44.640828],[-73.781486,44.640896],[-73.78136600000001,44.640907],[-73.78096499999999,44.640902],[-73.780643,44.640876],[-73.780492,44.640848],[-73.77998599999999,44.6407],[-73.77941,44.6405],[-73.778752,44.640235],[-73.778578,44.64015],[-73.778403,44.640036],[-73.778167,44.639824],[-73.77801700000001,44.639632],[-73.777653,44.639059],[-73.777466,44.63888],[-73.777264,44.638714],[-73.776937,44.638498],[-73.776847,44.638441],[-73.775397,44.637624],[-73.77503400000001,44.637471],[-73.77466099999999,44.637354],[-73.77428999999999,44.637275],[-73.773926,44.637225],[-73.771986,44.637],[-73.77182500000001,44.636989],[-73.771314,44.636966],[-73.770955,44.636986],[-73.770651,44.637023],[-73.770111,44.637127],[-73.769789,44.637182],[-73.769249,44.637272],[-73.76832400000001,44.637368],[-73.76706900000001,44.637487],[-73.76676999999999,44.637484],[-73.766537,44.63745],[-73.766158,44.637361],[-73.76593200000001,44.637324],[-73.76561599999999,44.637298],[-73.76512200000001,44.637324],[-73.76485700000001,44.637313],[-73.764223,44.637242],[-73.764039,44.637236],[-73.763638,44.637262],[-73.763322,44.637328],[-73.763013,44.637427],[-73.762119,44.63777],[-73.761201,44.638088],[-73.760891,44.638178],[-73.760688,44.638222],[-73.76030799999999,44.638305],[-73.760222,44.638322],[-73.759322,44.638487],[-73.758551,44.63867],[-73.757779,44.638843],[-73.757384,44.63892],[-73.75676900000001,44.639018],[-73.75646399999999,44.639035],[-73.756208,44.639033],[-73.755989,44.639012],[-73.755831,44.638977],[-73.755509,44.638854],[-73.755539,44.638843],[-73.755774,44.638751],[-73.755827,44.638728],[-73.75626099999999,44.638504],[-73.756539,44.638337],[-73.756985,44.638014],[-73.75680699999999,44.637898],[-73.75669600000001,44.637839],[-73.756351,44.637713],[-73.75614299999999,44.637637],[-73.755697,44.637483],[-73.75557000000001,44.637456],[-73.755377,44.637441],[-73.755219,44.637455],[-73.754994,44.637517],[-73.754392,44.637721],[-73.752695,44.638294],[-73.752396,44.638369],[-73.752245,44.638388],[-73.752002,44.638399],[-73.751733,44.638396],[-73.751565,44.638346],[-73.751127,44.638206],[-73.750647,44.63801],[-73.749048,44.637303],[-73.74847800000001,44.637075],[-73.747039,44.636614],[-73.746409,44.636439],[-73.74518,44.636192],[-73.744917,44.636116],[-73.744726,44.636043],[-73.74439,44.635861],[-73.743505,44.635313],[-73.74329299999999,44.635213],[-73.743036,44.635116],[-73.74251099999999,44.634974],[-73.742223,44.634916],[-73.74187000000001,44.634868],[-73.7409,44.634776],[-73.740775,44.634753],[-73.74043500000001,44.634678],[-73.74006,44.634556],[-73.73932600000001,44.634237],[-73.73867799999999,44.633927],[-73.738377,44.633767],[-73.73826800000001,44.633696],[-73.73793999999999,44.633451],[-73.737447,44.633005],[-73.737195,44.632798],[-73.73632000000001,44.632162],[-73.736135,44.63197],[-73.736051,44.631838],[-73.73602700000001,44.631777],[-73.735997,44.631655],[-73.735989,44.63159],[-73.736001,44.631409],[-73.736065,44.631212],[-73.736152,44.631081],[-73.736424,44.630756],[-73.73724199999999,44.629843],[-73.737587,44.629484],[-73.738101,44.629053],[-73.73866099999999,44.628643],[-73.739588,44.627933],[-73.73993400000001,44.627613],[-73.740388,44.627063],[-73.74063200000001,44.626781],[-73.740787,44.626618],[-73.74149300000001,44.625958],[-73.741783,44.625669],[-73.74199900000001,44.625412],[-73.742283,44.624999],[-73.742451,44.624722],[-73.742651,44.624427],[-73.743002,44.623963],[-73.74324900000001,44.623703],[-73.743431,44.623548],[-73.743826,44.623246],[-73.744156,44.622957],[-73.744248,44.622855],[-73.744316,44.622759],[-73.744452,44.622506],[-73.74453,44.622276],[-73.74455399999999,44.622127],[-73.74456499999999,44.621915],[-73.744547,44.621538],[-73.744428,44.620891],[-73.74424500000001,44.619798],[-73.74422,44.61955],[-73.743982,44.617291],[-73.743844,44.616559],[-73.743746,44.6158],[-73.74365899999999,44.615372],[-73.743365,44.61424],[-73.743281,44.613849],[-73.742953,44.612068],[-73.74267999999999,44.610889],[-73.74252300000001,44.609838],[-73.74254000000001,44.609715],[-73.742574,44.609668],[-73.742634,44.609614],[-73.742959,44.609412],[-73.743021,44.609319],[-73.743055,44.609151],[-73.74305699999999,44.608917],[-73.743005,44.60838],[-73.743008,44.608145],[-73.743036,44.607953],[-73.74302,44.607745],[-73.742884,44.606555],[-73.742767,44.604846],[-73.750128,44.604008],[-73.754148,44.603641],[-73.769836,44.602003],[-73.80812899999999,44.598118],[-73.808553,44.598069],[-73.810789,44.597842],[-73.810874,44.597834],[-73.815718,44.597324],[-73.81628000000001,44.597244],[-73.81687599999999,44.597161],[-73.817008,44.59714],[-73.817324,44.596982],[-73.81753,44.596937],[-73.817744,44.596839],[-73.817887,44.596797],[-73.81802399999999,44.596783],[-73.81819,44.596793],[-73.81840099999999,44.596825],[-73.818738,44.596887],[-73.818783,44.596891],[-73.818912,44.596923],[-73.81899900000001,44.596982],[-73.822529,44.596608],[-73.82919099999999,44.595962],[-73.82968,44.595918],[-73.83508999999999,44.595324],[-73.836253,44.595187],[-73.838127,44.594979],[-73.838943,44.594889],[-73.839304,44.594855],[-73.842975,44.594482],[-73.843761,44.594393],[-73.84442199999999,44.594339],[-73.84613899999999,44.594156],[-73.849542,44.593807],[-73.85051900000001,44.593886],[-73.851079,44.59391],[-73.851105,44.593874],[-73.851142,44.593794],[-73.85147600000001,44.59376],[-73.851681,44.593656],[-73.85301200000001,44.593509],[-73.85478999999999,44.593237],[-73.856005,44.593058],[-73.858148,44.592904],[-73.869992,44.591736],[-73.87489100000001,44.591174],[-73.879913,44.590599],[-73.884668,44.590088],[-73.891188,44.589388],[-73.89404999999999,44.589135],[-73.895777,44.588889],[-73.89759100000001,44.588697],[-73.900256,44.588631],[-73.902823,44.588193],[-73.90751899999999,44.587692],[-73.90808199999999,44.58763],[-73.91222999999999,44.587201],[-73.947346,44.583425],[-73.94776899999999,44.586236],[-73.95208100000001,44.61488],[-73.95353900000001,44.625045],[-73.954578,44.632385],[-73.954922,44.634648],[-73.955237,44.636738],[-73.959255,44.663219],[-73.95970199999999,44.666166],[-73.96328800000001,44.689803],[-73.963536,44.691437],[-73.96354599999999,44.691504],[-73.963629,44.692039],[-73.964061,44.694899],[-73.964411,44.697204]]],"type":"Polygon"}
}