{
  "id": "360810493021",
  "type": "Feature",
  "properties": {
    "area_land":101579,
    "area_water":0,
    "geoid":"360810493021",
    "name":"Block Group 1",
    "state":"ny"
},
  "bbox": [
    -73.895589,
    40.725921,
    -73.891518,
    40.731159
],
  "geometry": {"coordinates":[[[-73.895589,40.728965],[-73.894612,40.729086],[-73.894503,40.729098],[-73.893693,40.729208],[-73.89375800000001,40.729779],[-73.89381400000001,40.730465],[-73.893869,40.731147],[-73.89296899999999,40.731149],[-73.89233400000001,40.731159],[-73.892342,40.730873],[-73.892364,40.730399],[-73.892403,40.729559],[-73.891518,40.728162],[-73.892285,40.727758],[-73.89327400000001,40.727192],[-73.893866,40.726804],[-73.894409,40.726479],[-73.894643,40.726338],[-73.895341,40.725921],[-73.89541199999999,40.726771],[-73.895499,40.727789],[-73.895589,40.728965]]],"type":"Polygon"}
}