{
  "id": "360910606011",
  "type": "Feature",
  "properties": {
    "area_land":38122692,
    "area_water":304247,
    "geoid":"360910606011",
    "name":"Block Group 1",
    "state":"ny"
},
  "bbox": [
    -73.864716,
    43.128112,
    -73.778452,
    43.193
],
  "geometry": {"coordinates":[[[-73.86469700000001,43.177288],[-73.86462899999999,43.177745],[-73.86450600000001,43.178251],[-73.864357,43.178766],[-73.86425699999999,43.17905],[-73.86394199999999,43.179782],[-73.86375200000001,43.180186],[-73.863196,43.181464],[-73.863035,43.18194],[-73.86298600000001,43.182084],[-73.862748,43.183133],[-73.862731,43.183243],[-73.862686,43.183538],[-73.862656,43.184296],[-73.86265299999999,43.184795],[-73.862621,43.185549],[-73.862685,43.186249],[-73.862731,43.186478],[-73.86279999999999,43.186733],[-73.86292899999999,43.187086],[-73.86317099999999,43.18754],[-73.86353699999999,43.188118],[-73.86399299999999,43.188776],[-73.864133,43.189014],[-73.863659,43.189039],[-73.856295,43.189414],[-73.856127,43.189421],[-73.84988300000001,43.189782],[-73.847464,43.189895],[-73.831328,43.190728],[-73.82683,43.190985],[-73.819778,43.191295],[-73.81867099999999,43.191357],[-73.818032,43.19139],[-73.81283999999999,43.19176],[-73.808283,43.191896],[-73.794687,43.192557],[-73.79081499999999,43.192773],[-73.790423,43.192663],[-73.789883,43.192825],[-73.78797900000001,43.192932],[-73.786902,43.193],[-73.78171,43.184003],[-73.778452,43.178358],[-73.78394900000001,43.174982],[-73.783917,43.174768],[-73.783845,43.17445],[-73.78063899999999,43.155711],[-73.780591,43.155373],[-73.779421,43.148598],[-73.779742,43.148562],[-73.780052,43.148512],[-73.780734,43.148419],[-73.78277799999999,43.148171],[-73.783866,43.147997],[-73.784823,43.147844],[-73.78564299999999,43.147727],[-73.78695,43.147552],[-73.78815899999999,43.147347],[-73.78832,43.147314],[-73.78861999999999,43.147254],[-73.79089,43.146752],[-73.791357,43.146662],[-73.79250500000001,43.146405],[-73.792996,43.146295],[-73.79357,43.146147],[-73.79395700000001,43.146036],[-73.79433299999999,43.145901],[-73.794535,43.145815],[-73.794684,43.145742],[-73.794921,43.145595],[-73.795046,43.145492],[-73.795132,43.145421],[-73.795525,43.145035],[-73.795789,43.144776],[-73.79585299999999,43.144714],[-73.79637,43.144303],[-73.796806,43.144022],[-73.79717599999999,43.143817],[-73.79794,43.143447],[-73.799331,43.142816],[-73.80014799999999,43.142418],[-73.800511,43.142207],[-73.80075100000001,43.142067],[-73.80176,43.141419],[-73.80235399999999,43.141037],[-73.802999,43.140623],[-73.803983,43.139975],[-73.80511300000001,43.139217],[-73.805482,43.138969],[-73.805774,43.138787],[-73.808358,43.137068],[-73.80889500000001,43.136711],[-73.809871,43.136015],[-73.810292,43.135656],[-73.810778,43.135208],[-73.81144,43.134573],[-73.811784,43.134219],[-73.81267,43.133195],[-73.81277300000001,43.133089],[-73.813153,43.132719],[-73.81408999999999,43.131845],[-73.814536,43.13146],[-73.814903,43.131174],[-73.815209,43.13095],[-73.815708,43.13064],[-73.816103,43.13043],[-73.81653300000001,43.130239],[-73.81696100000001,43.130079],[-73.817429,43.129946],[-73.817593,43.129907],[-73.817842,43.129847],[-73.818369,43.129771],[-73.82106899999999,43.129526],[-73.82130600000001,43.129505],[-73.823251,43.129387],[-73.82477799999999,43.129282],[-73.826685,43.129122],[-73.826925,43.129114],[-73.82777900000001,43.129085],[-73.82937200000001,43.129065],[-73.830322,43.129013],[-73.83229799999999,43.128824],[-73.83597399999999,43.128505],[-73.83998800000001,43.128181],[-73.840509,43.12815],[-73.840895,43.128125],[-73.841307,43.128112],[-73.84167600000001,43.128112],[-73.842356,43.128131],[-73.843592,43.128212],[-73.84467100000001,43.128273],[-73.84535700000001,43.128341],[-73.845714,43.128365],[-73.846,43.128374],[-73.846266,43.128395],[-73.846592,43.128396],[-73.84675799999999,43.129349],[-73.84708500000001,43.131533],[-73.847469,43.134302],[-73.847469,43.134531],[-73.847421,43.13468],[-73.847397,43.13488],[-73.84733799999999,43.135134],[-73.847312,43.1358],[-73.847331,43.136061],[-73.847401,43.136428],[-73.847618,43.136973],[-73.848645,43.138728],[-73.848753,43.138918],[-73.84915599999999,43.13963],[-73.851299,43.143293],[-73.852001,43.144549],[-73.852856,43.146033],[-73.852926,43.146156],[-73.853303,43.146815],[-73.853516,43.147225],[-73.853673,43.147527],[-73.85389000000001,43.147997],[-73.85399200000001,43.148304],[-73.85407600000001,43.148896],[-73.854102,43.14917],[-73.854159,43.150225],[-73.854198,43.150485],[-73.854302,43.151055],[-73.85442500000001,43.151445],[-73.854581,43.151698],[-73.854866,43.152209],[-73.854968,43.152412],[-73.855137,43.152749],[-73.85556,43.153463],[-73.855823,43.153897],[-73.856708,43.155434],[-73.85781,43.157392],[-73.858289,43.158205],[-73.858555,43.158687],[-73.858946,43.159377],[-73.859382,43.160423],[-73.859757,43.161559],[-73.86024500000001,43.16282],[-73.8609,43.164348],[-73.86154399999999,43.165701],[-73.862314,43.167266],[-73.862774,43.168136],[-73.862847,43.1683],[-73.862979,43.168662],[-73.863069,43.169031],[-73.863173,43.169664],[-73.86342999999999,43.171233],[-73.86350299999999,43.171697],[-73.863726,43.172711],[-73.863889,43.173301],[-73.864334,43.175188],[-73.864642,43.176466],[-73.864678,43.176682],[-73.864716,43.177017],[-73.86469700000001,43.177288]]],"type":"Polygon"}
}