{
  "id": "361031585023",
  "type": "Feature",
  "properties": {
    "area_land":1590872,
    "area_water":0,
    "geoid":"361031585023",
    "name":"Block Group 3",
    "state":"ny"
},
  "bbox": [
    -73.107091,
    40.828601,
    -73.081805,
    40.839652
],
  "geometry": {"coordinates":[[[-73.107091,40.8385],[-73.106145,40.838923],[-73.106123,40.838932],[-73.105825,40.839057],[-73.10564100000001,40.839148],[-73.10525199999999,40.839313],[-73.105023,40.839362],[-73.10467199999999,40.839405],[-73.104315,40.839442],[-73.104009,40.839461],[-73.10310800000001,40.839591],[-73.10274099999999,40.839637],[-73.102101,40.839652],[-73.101158,40.839623],[-73.100227,40.839623],[-73.100092,40.839582],[-73.10000700000001,40.839556],[-73.099858,40.839493],[-73.099773,40.839443],[-73.09963999999999,40.839345],[-73.09941600000001,40.839162],[-73.099243,40.83901],[-73.099104,40.838916],[-73.09902200000001,40.838871],[-73.098883,40.838817],[-73.09878399999999,40.83878],[-73.098675,40.838757],[-73.09826700000001,40.838723],[-73.097585,40.838702],[-73.09711799999999,40.838661],[-73.09660700000001,40.838569],[-73.09594300000001,40.838431],[-73.095203,40.83836],[-73.09445700000001,40.838298],[-73.093647,40.838309],[-73.09207499999999,40.838379],[-73.091616,40.838362],[-73.091427,40.838317],[-73.09130500000001,40.838279],[-73.091167,40.83823],[-73.091016,40.838141],[-73.090458,40.83779],[-73.09007699999999,40.837558],[-73.089671,40.837409],[-73.089153,40.837443],[-73.088421,40.837566],[-73.088031,40.837622],[-73.08762,40.837658],[-73.087154,40.837696],[-73.08649800000001,40.837738],[-73.085994,40.837783],[-73.08589600000001,40.837489],[-73.08574299999999,40.837142],[-73.08559700000001,40.836901],[-73.08543,40.836726],[-73.08537099999999,40.836692],[-73.08511,40.836544],[-73.084774,40.836391],[-73.08379100000001,40.836203],[-73.083733,40.836197],[-73.08366599999999,40.836192],[-73.08252299999999,40.836098],[-73.082402,40.835476],[-73.082194,40.834372],[-73.08203399999999,40.833636],[-73.081951,40.832928],[-73.081805,40.832317],[-73.082284,40.832207],[-73.082905,40.832065],[-73.08473600000001,40.831759],[-73.085598,40.831641],[-73.08645300000001,40.831519],[-73.087276,40.831408],[-73.088741,40.831216],[-73.089139,40.831164],[-73.090024,40.830954],[-73.090892,40.830707],[-73.091504,40.830536],[-73.092099,40.830356],[-73.09319000000001,40.830043],[-73.094579,40.829596],[-73.095448,40.829345],[-73.09631,40.82909],[-73.09715,40.828845],[-73.09743899999999,40.828761],[-73.097902,40.82862],[-73.097966,40.828601],[-73.09809799999999,40.829189],[-73.098119,40.82931],[-73.098124,40.829404],[-73.09811000000001,40.829576],[-73.098105,40.82962],[-73.098073,40.829732],[-73.09801899999999,40.829863],[-73.097928,40.830026],[-73.097846,40.830169],[-73.097786,40.830287],[-73.097756,40.830374],[-73.097739,40.830451],[-73.09774400000001,40.83068],[-73.09785100000001,40.831355],[-73.09795,40.831984],[-73.09808,40.832648],[-73.09863,40.832512],[-73.099018,40.832451],[-73.09965200000001,40.832443],[-73.100674,40.832153],[-73.10185,40.832004],[-73.10272000000001,40.831889],[-73.103055,40.831885],[-73.105367,40.832045],[-73.10580400000001,40.832748],[-73.106015,40.833087],[-73.10656899999999,40.834099],[-73.106786,40.834494],[-73.10699200000001,40.834838],[-73.105915,40.835032],[-73.105374,40.835135],[-73.105649,40.835838],[-73.105695,40.83594],[-73.105801,40.836222],[-73.10596099999999,40.836609],[-73.10599999999999,40.836665],[-73.10604499999999,40.836711],[-73.1061,40.836749],[-73.106184,40.836795],[-73.106121,40.836909],[-73.106106,40.836986],[-73.106123,40.837069],[-73.106183,40.837265],[-73.10626000000001,40.837565],[-73.10629,40.837638],[-73.10638899999999,40.837748],[-73.10654100000001,40.837871],[-73.106678,40.837971],[-73.10673199999999,40.838023],[-73.106785,40.838084],[-73.107091,40.8385]]],"type":"Polygon"}
}