{
  "id": "360593024001",
  "type": "Feature",
  "properties": {
    "area_land":422596,
    "area_water":0,
    "geoid":"360593024001",
    "name":"Block Group 1",
    "state":"ny"
},
  "bbox": [
    -73.653103,
    40.76299,
    -73.647123,
    40.778886
],
  "geometry": {"coordinates":[[[-73.653103,40.768384],[-73.65221200000001,40.768492],[-73.652598,40.770318],[-73.651709,40.77043],[-73.651233,40.770489],[-73.65145699999999,40.770837],[-73.651647,40.771134],[-73.651856,40.77146],[-73.65200299999999,40.771784],[-73.652001,40.772056],[-73.651967,40.772198],[-73.65180100000001,40.772514],[-73.65168300000001,40.772692],[-73.651588,40.772878],[-73.65152999999999,40.773075],[-73.651509,40.773234],[-73.651405,40.77394],[-73.651303,40.77465],[-73.651275,40.774809],[-73.651263,40.775029],[-73.651312,40.775345],[-73.651354,40.775584],[-73.651449,40.77599],[-73.6515,40.776136],[-73.651578,40.776359],[-73.651691,40.776661],[-73.65172,40.77677],[-73.651741,40.776924],[-73.65173900000001,40.77714],[-73.651659,40.777319],[-73.65160400000001,40.777407],[-73.65152399999999,40.777505],[-73.650998,40.778075],[-73.65082700000001,40.778327],[-73.650746,40.778535],[-73.65073099999999,40.778656],[-73.65072600000001,40.778868],[-73.650492,40.778886],[-73.64999299999999,40.778884],[-73.650063,40.778636],[-73.65015099999999,40.778335],[-73.650257,40.777955],[-73.650361,40.777566],[-73.650402,40.777414],[-73.650425,40.77725],[-73.650452,40.776865],[-73.650442,40.776624],[-73.65042200000001,40.77644],[-73.650369,40.776173],[-73.650329,40.776043],[-73.650229,40.775717],[-73.650122,40.775489],[-73.649916,40.775043],[-73.649822,40.774842],[-73.649581,40.774308],[-73.649552,40.774206],[-73.649529,40.774171],[-73.64942000000001,40.773881],[-73.649311,40.773506],[-73.64922900000001,40.773195],[-73.649163,40.772826],[-73.649064,40.772239],[-73.649046,40.772135],[-73.649027,40.772022],[-73.649012,40.77197],[-73.64890699999999,40.771469],[-73.648813,40.771103],[-73.648717,40.770785],[-73.648584,40.770344],[-73.64850199999999,40.770071],[-73.648375,40.769658],[-73.648297,40.769396],[-73.648166,40.768986],[-73.64808499999999,40.768729],[-73.64795599999999,40.768322],[-73.647876,40.768064],[-73.647745,40.76765],[-73.64766299999999,40.767392],[-73.647536,40.766982],[-73.647457,40.766727],[-73.64734,40.76631],[-73.647273,40.766048],[-73.64719700000001,40.765715],[-73.647165,40.765574],[-73.64712299999999,40.765343],[-73.647811,40.765105],[-73.648078,40.765024],[-73.648521,40.764758],[-73.64857000000001,40.764546],[-73.649022,40.764369],[-73.649424,40.764211],[-73.649688,40.763984],[-73.650975,40.762999],[-73.651247,40.76299],[-73.651493,40.763582],[-73.65175499999999,40.764239],[-73.652018,40.764897],[-73.652281,40.765552],[-73.652546,40.76621],[-73.652761,40.766761],[-73.653103,40.768384]]],"type":"Polygon"}
}