{
  "id": "360811257002",
  "type": "Feature",
  "properties": {
    "area_land":111280,
    "area_water":0,
    "geoid":"360811257002",
    "name":"Block Group 2",
    "state":"ny"
},
  "bbox": [
    -73.810626,
    40.722343,
    -73.804668,
    40.725056
],
  "geometry": {"coordinates":[[[-73.810626,40.72442],[-73.808306,40.724676],[-73.806521,40.724873],[-73.80488,40.725056],[-73.80480900000001,40.724354],[-73.804739,40.723628],[-73.80466800000001,40.722915],[-73.806117,40.722755],[-73.807911,40.722556],[-73.809854,40.722343],[-73.810131,40.723032],[-73.810399,40.723724],[-73.810626,40.72442]]],"type":"Polygon"}
}