{
  "id": "360894913001",
  "type": "Feature",
  "properties": {
    "area_land":163377011,
    "area_water":203393,
    "geoid":"360894913001",
    "name":"Block Group 1",
    "state":"ny"
},
  "bbox": [
    -75.412447,
    44.601419,
    -75.170452,
    44.779788
],
  "geometry": {"coordinates":[[[-75.41209000000001,44.674253],[-75.410281,44.674384],[-75.40607300000001,44.674685],[-75.40544,44.674717],[-75.40481,44.674727],[-75.403954,44.674703],[-75.40327000000001,44.674641],[-75.402553,44.67454],[-75.401702,44.674388],[-75.40088299999999,44.674228],[-75.398358,44.673741],[-75.39334700000001,44.672755],[-75.391885,44.672474],[-75.390456,44.672233],[-75.38904599999999,44.671981],[-75.386223,44.671495],[-75.385473,44.67135],[-75.38502099999999,44.671252],[-75.384196,44.671022],[-75.382468,44.670458],[-75.381176,44.670023],[-75.38014099999999,44.669678],[-75.37932499999999,44.669419],[-75.37872900000001,44.669249],[-75.37800900000001,44.669059],[-75.37560000000001,44.668478],[-75.371797,44.667569],[-75.371426,44.66748],[-75.369373,44.666987],[-75.36821399999999,44.666689],[-75.36751700000001,44.666485],[-75.36663799999999,44.66624],[-75.366255,44.666148],[-75.36577,44.666059],[-75.365184,44.665978],[-75.364836,44.665938],[-75.364384,44.665911],[-75.362803,44.665865],[-75.362121,44.665837],[-75.35926000000001,44.665617],[-75.357527,44.665466],[-75.356199,44.665307],[-75.353137,44.664884],[-75.35275900000001,44.664832],[-75.352062,44.664744],[-75.35136900000001,44.664642],[-75.349965,44.664462],[-75.34857,44.664253],[-75.347875,44.664126],[-75.34687599999999,44.663925],[-75.34593599999999,44.663729],[-75.344317,44.663321],[-75.342783,44.662903],[-75.341554,44.662543],[-75.339259,44.661857],[-75.33782600000001,44.661454],[-75.33638999999999,44.661082],[-75.335464,44.660852],[-75.334942,44.660713],[-75.334239,44.660539],[-75.332137,44.659989],[-75.330619,44.659551],[-75.329399,44.659191],[-75.32689999999999,44.658362],[-75.32579200000001,44.65804],[-75.325062,44.657849],[-75.324341,44.657673],[-75.32302300000001,44.657362],[-75.32127,44.656988],[-75.320778,44.656883],[-75.320224,44.656746],[-75.315535,44.655502],[-75.314949,44.656525],[-75.314722,44.65694],[-75.31412400000001,44.657954],[-75.312797,44.660336],[-75.31182699999999,44.66203],[-75.31113499999999,44.663118],[-75.310515,44.664078],[-75.310137,44.664698],[-75.30868599999999,44.666885],[-75.307079,44.669286],[-75.306341,44.670326],[-75.304129,44.673643],[-75.303803,44.674106],[-75.303189,44.675051],[-75.302997,44.675328],[-75.305393,44.676099],[-75.306285,44.676397],[-75.308374,44.677066],[-75.310012,44.677618],[-75.310176,44.677705],[-75.310357,44.67783],[-75.31056100000001,44.678018],[-75.310864,44.678356],[-75.31142199999999,44.679048],[-75.312059,44.679849],[-75.3125,44.680345],[-75.313586,44.681653],[-75.31400600000001,44.682193],[-75.313776,44.682317],[-75.313492,44.682448],[-75.313405,44.682509],[-75.31335300000001,44.682581],[-75.31335,44.682666],[-75.313391,44.682747],[-75.313399,44.682757],[-75.31360100000001,44.683013],[-75.314376,44.683938],[-75.315555,44.685364],[-75.31595799999999,44.685838],[-75.316827,44.686791],[-75.317491,44.687561],[-75.31795,44.688046],[-75.31949,44.689776],[-75.319614,44.689916],[-75.31984799999999,44.690192],[-75.320493,44.690908],[-75.321022,44.691441],[-75.321214,44.691595],[-75.32140800000001,44.691732],[-75.32173400000001,44.692011],[-75.322259,44.692578],[-75.322706,44.693086],[-75.3229,44.693321],[-75.324054,44.694594],[-75.324468,44.695067],[-75.32534200000001,44.696004],[-75.326588,44.697416],[-75.327192,44.698071],[-75.32540299999999,44.698921],[-75.324671,44.699274],[-75.32314,44.699998],[-75.321742,44.700629],[-75.319532,44.701662],[-75.318786,44.701998],[-75.318068,44.702334],[-75.317086,44.702781],[-75.316799,44.70292],[-75.31671799999999,44.702972],[-75.316624,44.703071],[-75.316588,44.703134],[-75.316571,44.703282],[-75.31659500000001,44.703367],[-75.316731,44.703567],[-75.317947,44.704911],[-75.319315,44.706422],[-75.319756,44.706892],[-75.321167,44.708486],[-75.321882,44.709266],[-75.32332599999999,44.710899],[-75.32356299999999,44.711153],[-75.323702,44.711317],[-75.323965,44.711627],[-75.32418199999999,44.711866],[-75.32555000000001,44.713433],[-75.326455,44.714461],[-75.326854,44.714943],[-75.32727800000001,44.715414],[-75.327659,44.715871],[-75.328108,44.716385],[-75.32897199999999,44.717352],[-75.329398,44.717863],[-75.33018,44.718746],[-75.330555,44.719198],[-75.331079,44.719801],[-75.331311,44.720078],[-75.334311,44.723472],[-75.335527,44.724876],[-75.33634000000001,44.725794],[-75.337144,44.726722],[-75.33784,44.727504],[-75.34005999999999,44.729977],[-75.341793,44.73187],[-75.344262,44.734648],[-75.34510400000001,44.735579],[-75.346762,44.737435],[-75.347188,44.737897],[-75.348231,44.739081],[-75.348405,44.739279],[-75.350098,44.741156],[-75.35142,44.742596],[-75.35193099999999,44.743142],[-75.349479,44.744267],[-75.34921900000001,44.744384],[-75.34861100000001,44.744654],[-75.34526099999999,44.746148],[-75.343158,44.747117],[-75.341419,44.747904],[-75.34114700000001,44.748029],[-75.335319,44.750703],[-75.333851,44.751409],[-75.331508,44.752484],[-75.330533,44.752942],[-75.32993399999999,44.753216],[-75.329133,44.753599],[-75.326092,44.755011],[-75.325339,44.755367],[-75.32461000000001,44.755694],[-75.32234200000001,44.756777],[-75.320774,44.75751],[-75.319191,44.75827],[-75.31759700000001,44.758998],[-75.31623999999999,44.759628],[-75.31513099999999,44.760148],[-75.313675,44.760826],[-75.31249699999999,44.761361],[-75.308643,44.763151],[-75.307813,44.763522],[-75.305352,44.764665],[-75.302886,44.765804],[-75.302054,44.766193],[-75.30042,44.766938],[-75.297867,44.768114],[-75.296369,44.768816],[-75.295562,44.769166],[-75.293396,44.770166],[-75.290035,44.771739],[-75.288402,44.772482],[-75.28758000000001,44.772846],[-75.28682499999999,44.773194],[-75.285765,44.773731],[-75.285517,44.773868],[-75.285393,44.773951],[-75.28518099999999,44.774109],[-75.285037,44.774239],[-75.28500200000001,44.774271],[-75.284813,44.774485],[-75.28471500000001,44.774617],[-75.28454000000001,44.774915],[-75.28430299999999,44.775433],[-75.284102,44.775945],[-75.28392700000001,44.775917],[-75.282135,44.775496],[-75.281721,44.775398],[-75.28090899999999,44.7752],[-75.280141,44.775028],[-75.27790299999999,44.774496],[-75.277331,44.774367],[-75.27703099999999,44.774324],[-75.27688000000001,44.774309],[-75.27631599999999,44.774289],[-75.27459,44.774307],[-75.272442,44.774374],[-75.27045200000001,44.774428],[-75.270129,44.774449],[-75.27003999999999,44.774459],[-75.26973,44.774535],[-75.269468,44.774622],[-75.26915700000001,44.774778],[-75.268559,44.775126],[-75.266508,44.776263],[-75.26613500000001,44.776479],[-75.265919,44.776645],[-75.265747,44.776831],[-75.265534,44.777101],[-75.264636,44.778316],[-75.26448600000001,44.778573],[-75.264382,44.778886],[-75.26426600000001,44.779312],[-75.264117,44.779788],[-75.26401199999999,44.77975],[-75.263901,44.779686],[-75.261994,44.777678],[-75.261821,44.777496],[-75.259992,44.775529],[-75.25751099999999,44.772935],[-75.257205,44.772619],[-75.25538299999999,44.770676],[-75.253878,44.769093],[-75.252214,44.767293],[-75.251734,44.766799],[-75.25084200000001,44.765856],[-75.249756,44.764678],[-75.249465,44.764361],[-75.24862,44.763464],[-75.246827,44.761559],[-75.246756,44.761485],[-75.24581000000001,44.760492],[-75.24530799999999,44.759999],[-75.24390699999999,44.758574],[-75.242724,44.757397],[-75.242047,44.756735],[-75.240021,44.754725],[-75.238675,44.753334],[-75.238152,44.752811],[-75.236856,44.751484],[-75.236304,44.750902],[-75.235844,44.750436],[-75.235433,44.749997],[-75.23405,44.748585],[-75.23380400000001,44.74835],[-75.23332600000001,44.747843],[-75.232567,44.747067],[-75.23154100000001,44.746045],[-75.23108499999999,44.745601],[-75.22930100000001,44.743817],[-75.228443,44.742925],[-75.225927,44.740381],[-75.224434,44.73882],[-75.22418399999999,44.73858],[-75.223389,44.737777],[-75.222129,44.73651],[-75.221273,44.735626],[-75.220398,44.734735],[-75.215594,44.729739],[-75.209575,44.723033],[-75.206024,44.719083],[-75.205352,44.718337],[-75.197624,44.710822],[-75.19588899999999,44.709136],[-75.191503,44.70483],[-75.18937200000001,44.702786],[-75.18829700000001,44.701768],[-75.185033,44.698559],[-75.184732,44.698282],[-75.18424,44.697744],[-75.184186,44.697681],[-75.18305599999999,44.696556],[-75.177133,44.690238],[-75.174902,44.687812],[-75.17349299999999,44.686276],[-75.17299199999999,44.685731],[-75.172445,44.685141],[-75.170452,44.682968],[-75.170835,44.682791],[-75.184118,44.676661],[-75.18428900000001,44.676581],[-75.18455899999999,44.676435],[-75.18524600000001,44.676067],[-75.18624800000001,44.675607],[-75.188323,44.674675],[-75.18893799999999,44.674399],[-75.193316,44.672354],[-75.19636300000001,44.670943],[-75.202045,44.668292],[-75.205619,44.666635],[-75.229079,44.655584],[-75.23625,44.652069],[-75.24066000000001,44.649973],[-75.240713,44.649849],[-75.24091199999999,44.649656],[-75.24260599999999,44.648918],[-75.24972200000001,44.645451],[-75.269063,44.63599],[-75.280047,44.630626],[-75.29145200000001,44.625066],[-75.29373200000001,44.623981],[-75.29560499999999,44.623096],[-75.308705,44.616887],[-75.308757,44.616835],[-75.309054,44.616559],[-75.309237,44.616424],[-75.30953,44.616249],[-75.310772,44.615647],[-75.312265,44.614914],[-75.31425299999999,44.613966],[-75.314722,44.613743],[-75.31528400000001,44.613472],[-75.31689799999999,44.612719],[-75.31768099999999,44.612345],[-75.31922400000001,44.611623],[-75.320284,44.611141],[-75.32149200000001,44.61066],[-75.321967,44.610486],[-75.322371,44.610323],[-75.322812,44.610158],[-75.32478,44.609394],[-75.325391,44.609165],[-75.325703,44.60903],[-75.326426,44.608718],[-75.329694,44.607247],[-75.33298000000001,44.605733],[-75.33507899999999,44.604786],[-75.335444,44.604623],[-75.33707699999999,44.60386],[-75.337867,44.60351],[-75.33864699999999,44.603139],[-75.34019499999999,44.602422],[-75.341717,44.601732],[-75.342465,44.601419],[-75.342556,44.601535],[-75.34419699999999,44.603258],[-75.344598,44.603705],[-75.345061,44.604193],[-75.34554199999999,44.604674],[-75.34613299999999,44.605321],[-75.346458,44.605659],[-75.34872799999999,44.608109],[-75.34927500000001,44.608719],[-75.349525,44.608992],[-75.34967,44.609149],[-75.351451,44.611055],[-75.352692,44.612337],[-75.35516200000001,44.614916],[-75.356099,44.615904],[-75.357077,44.616892],[-75.360219,44.620211],[-75.360502,44.620509],[-75.361677,44.621729],[-75.36301899999999,44.623143],[-75.36347000000001,44.623599],[-75.364099,44.624264],[-75.36480899999999,44.624997],[-75.36512999999999,44.625352],[-75.36606,44.626338],[-75.36651500000001,44.626798],[-75.36977899999999,44.630228],[-75.370322,44.630821],[-75.37161399999999,44.632159],[-75.37253699999999,44.63313],[-75.37397199999999,44.634621],[-75.374887,44.635574],[-75.37499699999999,44.635714],[-75.376051,44.636816],[-75.378311,44.639213],[-75.378972,44.639938],[-75.381792,44.643063],[-75.383529,44.645015],[-75.384497,44.646085],[-75.387613,44.649144],[-75.396125,44.657741],[-75.396693,44.658314],[-75.401822,44.663721],[-75.402136,44.664037],[-75.40314100000001,44.66484],[-75.405405,44.667117],[-75.412447,44.67421],[-75.41209000000001,44.674253]]],"type":"Polygon"}
}