{
  "id": "360810287003",
  "type": "Feature",
  "properties": {
    "area_land":73024,
    "area_water":0,
    "geoid":"360810287003",
    "name":"Block Group 3",
    "state":"ny"
},
  "bbox": [
    -73.891189,
    40.746942,
    -73.888678,
    40.751297
],
  "geometry": {"coordinates":[[[-73.891189,40.751101],[-73.89026200000001,40.7512],[-73.889332,40.751297],[-73.888976,40.749257],[-73.88907399999999,40.749247],[-73.888756,40.747543],[-73.888678,40.747134],[-73.889571,40.747039],[-73.890501,40.746942],[-73.890576,40.747343],[-73.890901,40.749009],[-73.89086500000001,40.749057],[-73.89082399999999,40.749061],[-73.891189,40.751101]]],"type":"Polygon"}
}