{
  "id": "360810407005",
  "type": "Feature",
  "properties": {
    "area_land":37725,
    "area_water":0,
    "geoid":"360810407005",
    "name":"Block Group 5",
    "state":"ny"
},
  "bbox": [
    -73.865627,
    40.746074,
    -73.862531,
    40.748491
],
  "geometry": {"coordinates":[[[-73.865627,40.747869],[-73.86474,40.748136],[-73.863545,40.748491],[-73.863326,40.748071],[-73.863101,40.747631],[-73.862859,40.747157],[-73.862531,40.746534],[-73.86407199999999,40.746074],[-73.863703,40.746906],[-73.864903,40.74655],[-73.86524900000001,40.747214],[-73.865627,40.747869]]],"type":"Polygon"}
}