{
  "id": "360810606001",
  "type": "Feature",
  "properties": {
    "area_land":100241,
    "area_water":0,
    "geoid":"360810606001",
    "name":"Block Group 1",
    "state":"ny"
},
  "bbox": [
    -73.738319,
    40.690934,
    -73.731445,
    40.694318
],
  "geometry": {"coordinates":[[[-73.737517,40.694318],[-73.736642,40.694044],[-73.73577400000001,40.693774],[-73.7349,40.693497],[-73.734031,40.693227],[-73.733164,40.692955],[-73.732297,40.692683],[-73.73144499999999,40.692386],[-73.732201,40.690934],[-73.733076,40.691195],[-73.73394999999999,40.691455],[-73.73482300000001,40.691719],[-73.735685,40.691982],[-73.73656,40.692253],[-73.737432,40.69251],[-73.738319,40.692782],[-73.737517,40.694318]]],"type":"Polygon"}
}