{
  "id": "360470814001",
  "type": "Feature",
  "properties": {
    "area_land":86909,
    "area_water":0,
    "geoid":"360470814001",
    "name":"Block Group 1",
    "state":"ny"
},
  "bbox": [
    -73.940532,
    40.651276,
    -73.938081,
    40.656123
],
  "geometry": {"coordinates":[[[-73.940532,40.656002],[-73.939559,40.656063],[-73.938593,40.656123],[-73.93845399999999,40.654858],[-73.93828999999999,40.653327],[-73.938081,40.651376],[-73.93905100000001,40.651326],[-73.94002500000001,40.651276],[-73.94023,40.653207],[-73.94039600000001,40.654741],[-73.940532,40.656002]]],"type":"Polygon"}
}