{
  "id": "360530311001",
  "type": "Feature",
  "properties": {
    "area_land":90753241,
    "area_water":189166,
    "geoid":"360530311001",
    "name":"Block Group 1",
    "state":"ny"
},
  "bbox": [
    -75.437167,
    42.807765,
    -75.239541,
    42.871669
],
  "geometry": {"coordinates":[[[-75.437167,42.863319],[-75.424857,42.863922],[-75.42484399999999,42.863923],[-75.424117,42.863931],[-75.423619,42.863937],[-75.411417,42.864559],[-75.411315,42.864564],[-75.411185,42.864571],[-75.40361900000001,42.864956],[-75.403452,42.864964],[-75.39972899999999,42.865154],[-75.39948,42.865167],[-75.390165,42.865638],[-75.39008,42.865642],[-75.389928,42.86565],[-75.389884,42.865652],[-75.37461399999999,42.866424],[-75.354477,42.867313],[-75.354091,42.86733],[-75.35391,42.867338],[-75.33654300000001,42.868149],[-75.33629000000001,42.86816],[-75.33592899999999,42.868178],[-75.33552,42.868196],[-75.323819,42.868743],[-75.32369,42.868749],[-75.31332,42.869163],[-75.313277,42.869165],[-75.310441,42.869275],[-75.31032399999999,42.86928],[-75.30798299999999,42.869372],[-75.30785400000001,42.869378],[-75.307104,42.869441],[-75.30695,42.869456],[-75.305435,42.869517],[-75.30508399999999,42.869535],[-75.304829,42.869556],[-75.304553,42.869584],[-75.30452699999999,42.869587],[-75.304492,42.869593],[-75.304428,42.869604],[-75.294938,42.86989],[-75.29479000000001,42.869894],[-75.29146,42.869977],[-75.291318,42.869983],[-75.290721,42.870009],[-75.28799600000001,42.870126],[-75.287792,42.870134],[-75.286502,42.87019],[-75.283162,42.870334],[-75.276466,42.870624],[-75.27051899999999,42.870856],[-75.267673,42.870968],[-75.26463,42.871082],[-75.26395599999999,42.871106],[-75.25897000000001,42.871291],[-75.25850699999999,42.871308],[-75.250389,42.871612],[-75.25032899999999,42.871616],[-75.24960799999999,42.871669],[-75.249342,42.871658],[-75.247991,42.871604],[-75.247963,42.871604],[-75.247951,42.871561],[-75.247947,42.871512],[-75.24796600000001,42.871427],[-75.24803199999999,42.871263],[-75.248098,42.87114],[-75.248122,42.871034],[-75.24812799999999,42.87091],[-75.24806,42.870584],[-75.24805600000001,42.870515],[-75.248069,42.870433],[-75.248074,42.870319],[-75.24803799999999,42.870248],[-75.247978,42.870191],[-75.247809,42.870094],[-75.247562,42.869789],[-75.24743599999999,42.869714],[-75.247394,42.869643],[-75.247291,42.869405],[-75.247201,42.86933],[-75.247111,42.869312],[-75.24701399999999,42.869325],[-75.24683400000001,42.869392],[-75.246756,42.869445],[-75.246629,42.869559],[-75.246528,42.869609],[-75.246444,42.869657],[-75.24639000000001,42.869737],[-75.246324,42.869785],[-75.246233,42.869816],[-75.24613100000001,42.86982],[-75.24603399999999,42.869781],[-75.24595600000001,42.869732],[-75.245896,42.869675],[-75.245878,42.869631],[-75.245896,42.869578],[-75.245938,42.869511],[-75.24596200000001,42.869432],[-75.24594399999999,42.86937],[-75.245926,42.869273],[-75.24586600000001,42.869163],[-75.245757,42.869044],[-75.245673,42.868986],[-75.245577,42.86896],[-75.245456,42.868955],[-75.245143,42.868999],[-75.245053,42.869008],[-75.244957,42.869004],[-75.24486,42.868986],[-75.244776,42.868942],[-75.24472799999999,42.868863],[-75.244716,42.868779],[-75.24473999999999,42.868704],[-75.2448,42.868633],[-75.244854,42.868549],[-75.244939,42.868439],[-75.244992,42.868262],[-75.24498699999999,42.868183],[-75.244939,42.868108],[-75.244866,42.868042],[-75.244776,42.867975],[-75.244721,42.8679],[-75.244704,42.867812],[-75.244722,42.867719],[-75.244818,42.867499],[-75.244878,42.867419],[-75.244957,42.867366],[-75.245065,42.867353],[-75.245282,42.867371],[-75.245463,42.867371],[-75.245571,42.867349],[-75.24569200000001,42.8673],[-75.24578200000001,42.867243],[-75.245836,42.867181],[-75.24585999999999,42.867119],[-75.24583,42.867079],[-75.24578200000001,42.867044],[-75.245704,42.86696],[-75.245656,42.866898],[-75.24567999999999,42.866823],[-75.245734,42.866784],[-75.245794,42.866722],[-75.245842,42.866629],[-75.24585999999999,42.866514],[-75.245879,42.866461],[-75.24593900000001,42.866404],[-75.246065,42.86636],[-75.246174,42.866369],[-75.24624,42.8664],[-75.246439,42.86643],[-75.246577,42.866426],[-75.246644,42.866395],[-75.24670999999999,42.866338],[-75.246746,42.866245],[-75.246758,42.866192],[-75.246752,42.866148],[-75.24670999999999,42.866108],[-75.246613,42.866073],[-75.246565,42.866038],[-75.246529,42.866002],[-75.24646300000001,42.865954],[-75.24637800000001,42.865927],[-75.246138,42.865936],[-75.246053,42.86591],[-75.245963,42.865857],[-75.245915,42.865746],[-75.245903,42.865645],[-75.245903,42.865592],[-75.24593299999999,42.865543],[-75.246031,42.86547],[-75.246058,42.865438],[-75.246076,42.865405],[-75.246071,42.865367],[-75.24604100000001,42.865247],[-75.24603500000001,42.865181],[-75.246071,42.865106],[-75.24611400000001,42.864991],[-75.246138,42.864943],[-75.24618100000001,42.864912],[-75.24625899999999,42.864898],[-75.24635499999999,42.864925],[-75.24647,42.864982],[-75.24653600000001,42.865053],[-75.246602,42.865181],[-75.24661999999999,42.865305],[-75.246662,42.865419],[-75.246717,42.865455],[-75.24678900000001,42.865477],[-75.24686699999999,42.865463],[-75.246927,42.865428],[-75.24695800000001,42.865371],[-75.247006,42.865079],[-75.247035,42.864992],[-75.247114,42.864938],[-75.24739099999999,42.864863],[-75.247445,42.864837],[-75.247494,42.864775],[-75.247524,42.864713],[-75.247524,42.864612],[-75.247518,42.864519],[-75.24747600000001,42.864431],[-75.247421,42.864369],[-75.247343,42.864307],[-75.247319,42.864236],[-75.247343,42.86413],[-75.247192,42.863936],[-75.247108,42.863888],[-75.247024,42.863874],[-75.24694599999999,42.863883],[-75.24625399999999,42.864062],[-75.246132,42.864104],[-75.245518,42.864369],[-75.245301,42.864439],[-75.245,42.86455],[-75.24490299999999,42.864563],[-75.244837,42.864554],[-75.24473500000001,42.864569],[-75.24463299999999,42.864609],[-75.244573,42.8646],[-75.24453099999999,42.864561],[-75.244501,42.864512],[-75.244488,42.864358],[-75.24447000000001,42.864287],[-75.244404,42.864172],[-75.244332,42.864093],[-75.24429000000001,42.864031],[-75.24426,42.863951],[-75.24427799999999,42.863854],[-75.244326,42.863793],[-75.24438600000001,42.86374],[-75.244452,42.863647],[-75.244525,42.863612],[-75.24463299999999,42.863598],[-75.244741,42.863576],[-75.24480200000001,42.863537],[-75.24480800000001,42.863479],[-75.244754,42.863435],[-75.244585,42.863382],[-75.244404,42.86336],[-75.244356,42.863316],[-75.244332,42.863201],[-75.244356,42.863161],[-75.244452,42.863148],[-75.244525,42.863104],[-75.244561,42.863038],[-75.244585,42.862945],[-75.244585,42.862848],[-75.244561,42.862768],[-75.24447600000001,42.862738],[-75.24438600000001,42.862729],[-75.24426,42.862738],[-75.244187,42.862724],[-75.244169,42.862689],[-75.24417,42.862561],[-75.24420600000001,42.862512],[-75.244291,42.862477],[-75.244381,42.862451],[-75.244477,42.862473],[-75.244598,42.862495],[-75.244784,42.862495],[-75.24495899999999,42.862486],[-75.24508,42.862433],[-75.245158,42.862389],[-75.245254,42.862309],[-75.24530300000001,42.862252],[-75.245278,42.862173],[-75.24521799999999,42.862124],[-75.244845,42.862009],[-75.24473500000001,42.861952],[-75.24460999999999,42.861908],[-75.244429,42.861908],[-75.24420600000001,42.861974],[-75.244134,42.861974],[-75.244086,42.861943],[-75.244044,42.861877],[-75.243922,42.861731],[-75.243893,42.861621],[-75.243903,42.861456],[-75.243971,42.861374],[-75.244062,42.861299],[-75.244224,42.861219],[-75.244399,42.861166],[-75.244574,42.861144],[-75.24467,42.861122],[-75.244754,42.861082],[-75.24479700000001,42.861034],[-75.24479100000001,42.860923],[-75.244736,42.860831],[-75.24462200000001,42.860764],[-75.244489,42.860725],[-75.244399,42.860694],[-75.24435099999999,42.860628],[-75.244321,42.860557],[-75.244345,42.860478],[-75.24445900000001,42.860416],[-75.24451999999999,42.860332],[-75.24453200000001,42.86027],[-75.244502,42.860222],[-75.24445900000001,42.860182],[-75.24437500000001,42.860124],[-75.244333,42.860085],[-75.244321,42.860032],[-75.24435099999999,42.859939],[-75.244598,42.859661],[-75.244623,42.859598],[-75.24464,42.859507],[-75.244634,42.859437],[-75.244604,42.859308],[-75.244604,42.859238],[-75.24462800000001,42.85918],[-75.244664,42.859132],[-75.244821,42.859061],[-75.244893,42.859039],[-75.244923,42.858982],[-75.244911,42.858889],[-75.244857,42.858787],[-75.244851,42.858734],[-75.24488700000001,42.858672],[-75.244899,42.858588],[-75.24488700000001,42.858465],[-75.244851,42.858354],[-75.244815,42.858275],[-75.244737,42.858178],[-75.24461599999999,42.858098],[-75.244435,42.85801],[-75.244401,42.857967],[-75.24436300000001,42.857864],[-75.244285,42.857763],[-75.244243,42.857683],[-75.244243,42.857595],[-75.24427900000001,42.857533],[-75.244417,42.857334],[-75.24453200000001,42.857255],[-75.24462800000001,42.857144],[-75.244676,42.857118],[-75.244755,42.857126],[-75.24487499999999,42.857175],[-75.24502,42.857157],[-75.245098,42.857126],[-75.245339,42.857078],[-75.245459,42.857091],[-75.245532,42.857069],[-75.24556200000001,42.857025],[-75.24555599999999,42.856954],[-75.245418,42.856619],[-75.245351,42.856571],[-75.245225,42.85654],[-75.24508,42.856452],[-75.24502,42.856372],[-75.24499,42.856262],[-75.245002,42.856147],[-75.245026,42.856085],[-75.245062,42.856054],[-75.245135,42.856036],[-75.245225,42.856036],[-75.24530300000001,42.856041],[-75.245333,42.856067],[-75.245357,42.856182],[-75.24538800000001,42.856204],[-75.24547800000001,42.856213],[-75.24564100000001,42.856182],[-75.245785,42.856195],[-75.24590000000001,42.856182],[-75.246002,42.856156],[-75.24606300000001,42.85612],[-75.246087,42.85605],[-75.246093,42.855944],[-75.246081,42.855829],[-75.246123,42.855493],[-75.246177,42.855431],[-75.246219,42.855392],[-75.24630399999999,42.855369],[-75.246394,42.855378],[-75.246442,42.855449],[-75.24646,42.855564],[-75.24649700000001,42.855612],[-75.24657500000001,42.855617],[-75.24667100000001,42.855604],[-75.24678,42.855564],[-75.24684000000001,42.855493],[-75.24687,42.855431],[-75.246894,42.855356],[-75.24687,42.855268],[-75.24673199999999,42.855096],[-75.246623,42.854755],[-75.246509,42.854605],[-75.24643,42.854574],[-75.246358,42.85457],[-75.24614099999999,42.85453],[-75.245918,42.854455],[-75.245828,42.854407],[-75.245546,42.854243],[-75.24535299999999,42.854097],[-75.24526899999999,42.853991],[-75.24522,42.85396],[-75.245154,42.853943],[-75.24502699999999,42.853934],[-75.24494300000001,42.853916],[-75.244877,42.853863],[-75.244877,42.853766],[-75.244865,42.853651],[-75.244871,42.853503],[-75.244901,42.85336],[-75.244967,42.853236],[-75.245058,42.853148],[-75.245244,42.852989],[-75.245467,42.852852],[-75.24554000000001,42.852843],[-75.24563000000001,42.852865],[-75.245678,42.852896],[-75.24587699999999,42.853055],[-75.245986,42.853081],[-75.246058,42.853059],[-75.24614800000001,42.852989],[-75.246239,42.8529],[-75.246257,42.85283],[-75.246263,42.852746],[-75.246251,42.852693],[-75.246185,42.852618],[-75.246106,42.852587],[-75.24603999999999,42.852516],[-75.245925,42.85237],[-75.245853,42.852331],[-75.24577499999999,42.852313],[-75.24561199999999,42.852353],[-75.24553400000001,42.852353],[-75.245437,42.852335],[-75.245335,42.852308],[-75.245287,42.852269],[-75.245257,42.852176],[-75.24520800000001,42.852149],[-75.245136,42.852123],[-75.245058,42.852087],[-75.24502699999999,42.852025],[-75.245082,42.851915],[-75.245142,42.85184],[-75.24509399999999,42.851752],[-75.24502099999999,42.851663],[-75.24493099999999,42.851597],[-75.244889,42.851534],[-75.244865,42.851407],[-75.244889,42.851217],[-75.244871,42.851085],[-75.24484099999999,42.850948],[-75.244696,42.850718],[-75.244666,42.850638],[-75.24466,42.850594],[-75.24467799999999,42.850546],[-75.244756,42.850502],[-75.24483499999999,42.850466],[-75.244913,42.850444],[-75.245009,42.850449],[-75.245088,42.850475],[-75.245293,42.850568],[-75.245383,42.850585],[-75.24545500000001,42.850577],[-75.245564,42.850532],[-75.245654,42.850488],[-75.245745,42.850462],[-75.245847,42.850471],[-75.245938,42.850502],[-75.246028,42.85051],[-75.246323,42.850488],[-75.24646199999999,42.850459],[-75.24655300000001,42.850424],[-75.246607,42.850371],[-75.246613,42.850309],[-75.246571,42.850221],[-75.246492,42.850146],[-75.246426,42.850062],[-75.246354,42.849929],[-75.246306,42.849854],[-75.246227,42.849797],[-75.246143,42.849744],[-75.246101,42.849682],[-75.246101,42.849629],[-75.24612500000001,42.84958],[-75.24622100000001,42.849536],[-75.246306,42.84951],[-75.24636599999999,42.849497],[-75.246444,42.849519],[-75.246523,42.849611],[-75.246661,42.849647],[-75.24688399999999,42.84966],[-75.247041,42.849753],[-75.247246,42.849859],[-75.24733000000001,42.849872],[-75.247445,42.849859],[-75.247625,42.849806],[-75.247668,42.849766],[-75.247698,42.849717],[-75.247698,42.849647],[-75.24766200000001,42.849572],[-75.247505,42.849426],[-75.24739599999999,42.849373],[-75.247264,42.849342],[-75.24705299999999,42.849329],[-75.24695,42.849311],[-75.246854,42.849271],[-75.24679399999999,42.849201],[-75.24662499999999,42.848953],[-75.246529,42.848878],[-75.24648000000001,42.84883],[-75.24647400000001,42.848785],[-75.246498,42.848728],[-75.24654099999999,42.848693],[-75.246613,42.848666],[-75.246854,42.848675],[-75.247185,42.848697],[-75.247613,42.848675],[-75.247716,42.848644],[-75.247776,42.848582],[-75.247806,42.848498],[-75.247818,42.848423],[-75.2478,42.848366],[-75.247764,42.848317],[-75.247668,42.848277],[-75.247428,42.848212],[-75.247241,42.848132],[-75.24696299999999,42.848083],[-75.246831,42.848079],[-75.24662600000001,42.848132],[-75.246487,42.848198],[-75.246397,42.848216],[-75.246331,42.848207],[-75.246258,42.848172],[-75.246216,42.84811],[-75.246156,42.847986],[-75.24601699999999,42.847765],[-75.24592699999999,42.847677],[-75.24583,42.84765],[-75.24577600000001,42.847611],[-75.245746,42.847549],[-75.24574,42.847509],[-75.24574,42.84746],[-75.24576399999999,42.847412],[-75.245848,42.847354],[-75.246228,42.847173],[-75.24636099999999,42.847124],[-75.246421,42.84712],[-75.246499,42.847129],[-75.24660799999999,42.847133],[-75.246753,42.847093],[-75.24695699999999,42.847018],[-75.247006,42.846983],[-75.247012,42.846925],[-75.247006,42.846877],[-75.24703,42.846824],[-75.24712599999999,42.846757],[-75.247608,42.846576],[-75.247675,42.846545],[-75.24771699999999,42.846475],[-75.247711,42.846355],[-75.247693,42.846249],[-75.247657,42.84617],[-75.24764500000001,42.846095],[-75.247669,42.845931],[-75.247651,42.845874],[-75.247596,42.845799],[-75.24754799999999,42.845785],[-75.247434,42.845776],[-75.247355,42.845745],[-75.24729499999999,42.845684],[-75.247241,42.845604],[-75.24713199999999,42.845458],[-75.24712,42.84537],[-75.247156,42.845242],[-75.247235,42.845193],[-75.247337,42.845166],[-75.24744,42.845171],[-75.247602,42.845171],[-75.24772900000001,42.845166],[-75.247777,42.845144],[-75.24781900000001,42.845082],[-75.24781299999999,42.845016],[-75.247753,42.844963],[-75.24764500000001,42.844932],[-75.24754799999999,42.844897],[-75.247434,42.844844],[-75.24713199999999,42.844831],[-75.247005,42.844808],[-75.246933,42.84476],[-75.246843,42.844658],[-75.246746,42.844592],[-75.24661399999999,42.844521],[-75.246499,42.844481],[-75.246336,42.84445],[-75.246161,42.844442],[-75.245848,42.844419],[-75.245667,42.844371],[-75.245378,42.844265],[-75.245154,42.844229],[-75.24501600000001,42.844234],[-75.24492499999999,42.84426],[-75.24484699999999,42.844291],[-75.24476300000001,42.844344],[-75.24467199999999,42.844362],[-75.244606,42.844349],[-75.244479,42.8443],[-75.244401,42.844221],[-75.244392,42.844084],[-75.244372,42.843894],[-75.244342,42.843828],[-75.244294,42.843779],[-75.24423299999999,42.843757],[-75.24414299999999,42.843717],[-75.244107,42.843598],[-75.24414899999999,42.843501],[-75.24416100000001,42.843412],[-75.244167,42.84331],[-75.244257,42.843151],[-75.244257,42.843059],[-75.244227,42.84297],[-75.244197,42.842913],[-75.244107,42.842891],[-75.24395,42.842891],[-75.24381700000001,42.842926],[-75.243703,42.842992],[-75.243522,42.843107],[-75.243323,42.843226],[-75.243027,42.843346],[-75.242822,42.84339],[-75.242587,42.84343],[-75.242406,42.84343],[-75.24227999999999,42.843408],[-75.242165,42.843346],[-75.242031,42.84318],[-75.24196600000001,42.842957],[-75.241981,42.842888],[-75.242043,42.842843],[-75.24216699999999,42.842804],[-75.24235299999999,42.842765],[-75.242591,42.842666],[-75.242729,42.842584],[-75.24287,42.842481],[-75.24294399999999,42.842399],[-75.243015,42.842293],[-75.24308000000001,42.842154],[-75.24312,42.842018],[-75.24310199999999,42.84189],[-75.24304100000001,42.841646],[-75.242987,42.841496],[-75.242885,42.841346],[-75.24277600000001,42.841196],[-75.242662,42.840957],[-75.242589,42.840749],[-75.242577,42.840577],[-75.24259499999999,42.840356],[-75.242637,42.84017],[-75.242842,42.83975],[-75.242963,42.839459],[-75.24303500000001,42.839224],[-75.243078,42.839003],[-75.24309599999999,42.838742],[-75.24310199999999,42.838552],[-75.243066,42.838438],[-75.242969,42.838305],[-75.24275799999999,42.838194],[-75.242547,42.838097],[-75.24233,42.837982],[-75.242203,42.837956],[-75.242113,42.837956],[-75.241866,42.838018],[-75.241685,42.838053],[-75.241546,42.838053],[-75.241474,42.83804],[-75.241347,42.837996],[-75.241287,42.837947],[-75.24113,42.837832],[-75.240871,42.837695],[-75.24073799999999,42.837615],[-75.240696,42.83754],[-75.240696,42.837421],[-75.240756,42.837279],[-75.24081099999999,42.837218],[-75.240883,42.837182],[-75.241004,42.837169],[-75.24115399999999,42.8372],[-75.241395,42.837262],[-75.24149800000001,42.83724],[-75.241546,42.837218],[-75.241606,42.837165],[-75.24165499999999,42.837076],[-75.241679,42.836988],[-75.24165499999999,42.836891],[-75.241564,42.836807],[-75.241426,42.836714],[-75.241317,42.836612],[-75.241107,42.836313],[-75.241077,42.836207],[-75.240951,42.836114],[-75.240818,42.836057],[-75.24063099999999,42.836039],[-75.240432,42.83603],[-75.240318,42.835973],[-75.24029299999999,42.835924],[-75.2403,42.835845],[-75.240324,42.835805],[-75.240523,42.835756],[-75.240607,42.835703],[-75.240697,42.835624],[-75.240764,42.835531],[-75.24078799999999,42.835438],[-75.240746,42.83531],[-75.240685,42.835261],[-75.240577,42.835208],[-75.240137,42.835093],[-75.240004,42.835031],[-75.23994399999999,42.834956],[-75.23994399999999,42.834824],[-75.239992,42.834731],[-75.240101,42.83463],[-75.24018100000001,42.834556],[-75.240223,42.834503],[-75.240241,42.834441],[-75.240217,42.834383],[-75.240151,42.834339],[-75.240042,42.834317],[-75.23985500000001,42.834344],[-75.239698,42.834348],[-75.23959000000001,42.834321],[-75.239541,42.834282],[-75.239547,42.834233],[-75.239572,42.834193],[-75.239614,42.834145],[-75.239861,42.834047],[-75.23994,42.83399],[-75.24009,42.833777],[-75.240133,42.833733],[-75.24018100000001,42.833693],[-75.24025899999999,42.833667],[-75.240362,42.833667],[-75.240495,42.833689],[-75.240694,42.833733],[-75.240808,42.833716],[-75.240953,42.833667],[-75.24126699999999,42.833477],[-75.241327,42.833424],[-75.241411,42.833379],[-75.241755,42.833278],[-75.241894,42.833225],[-75.24196600000001,42.833172],[-75.242081,42.833039],[-75.24257,42.832513],[-75.242648,42.832411],[-75.24269,42.832336],[-75.24271400000001,42.83226],[-75.24269,42.832163],[-75.24262400000001,42.832053],[-75.242509,42.831968],[-75.242401,42.831907],[-75.242232,42.831898],[-75.24203900000001,42.831938],[-75.241333,42.832128],[-75.24117,42.83215],[-75.24103100000001,42.832145],[-75.240905,42.832119],[-75.240844,42.832053],[-75.240802,42.831929],[-75.240802,42.831845],[-75.240844,42.831761],[-75.240905,42.831699],[-75.24103700000001,42.831646],[-75.24118199999999,42.831615],[-75.241393,42.831615],[-75.241604,42.831593],[-75.24185799999999,42.831539],[-75.24211099999999,42.831455],[-75.242582,42.831252],[-75.24287699999999,42.831172],[-75.243185,42.831137],[-75.24337800000001,42.831128],[-75.24383,42.831194],[-75.244011,42.831212],[-75.244192,42.83119],[-75.244373,42.831141],[-75.244512,42.831057],[-75.244614,42.830942],[-75.244675,42.830845],[-75.244693,42.830717],[-75.244675,42.830606],[-75.24455399999999,42.830376],[-75.244536,42.830275],[-75.24457200000001,42.830186],[-75.244657,42.830124],[-75.245212,42.829947],[-75.24539900000001,42.829881],[-75.245598,42.829766],[-75.245755,42.829646],[-75.245893,42.829474],[-75.246593,42.828346],[-75.247311,42.827493],[-75.247643,42.827156],[-75.247956,42.826882],[-75.249,42.826104],[-75.24926499999999,42.825887],[-75.24951900000001,42.825653],[-75.249748,42.825409],[-75.250001,42.825051],[-75.250224,42.824653],[-75.250303,42.824379],[-75.250309,42.824158],[-75.25027900000001,42.823969],[-75.250225,42.823837],[-75.25011600000001,42.82368],[-75.249905,42.823408],[-75.24976599999999,42.823315],[-75.249652,42.823284],[-75.249404,42.823266],[-75.24918099999999,42.823235],[-75.249078,42.823173],[-75.249042,42.823085],[-75.249078,42.822992],[-75.24909100000001,42.822912],[-75.249072,42.822837],[-75.24901800000001,42.822802],[-75.24891599999999,42.822762],[-75.24865,42.822753],[-75.24851099999999,42.822775],[-75.2483,42.82289],[-75.248198,42.822934],[-75.248065,42.822979],[-75.247957,42.822992],[-75.247866,42.822965],[-75.2478,42.822921],[-75.24775099999999,42.822855],[-75.247739,42.822771],[-75.247739,42.82266],[-75.247782,42.822563],[-75.247872,42.822399],[-75.248085,42.822147],[-75.248693,42.821984],[-75.24883699999999,42.821843],[-75.249134,42.821755],[-75.249583,42.82162],[-75.250041,42.821486],[-75.252404,42.820823],[-75.25317,42.82062],[-75.25331,42.820599],[-75.253354,42.820154],[-75.25357200000001,42.820177],[-75.25378600000001,42.82023],[-75.254001,42.820294],[-75.254184,42.820321],[-75.25444400000001,42.820339],[-75.25475299999999,42.820339],[-75.255189,42.820314],[-75.255585,42.820328],[-75.256265,42.820386],[-75.256805,42.820469],[-75.257666,42.820653],[-75.257972,42.820732],[-75.25830000000001,42.820836],[-75.25936400000001,42.821255],[-75.26013500000001,42.821536],[-75.261022,42.821847],[-75.262783,42.822451],[-75.263486,42.822707],[-75.26457600000001,42.823212],[-75.26640399999999,42.824038],[-75.26704100000001,42.824304],[-75.267405,42.82447],[-75.267763,42.824619],[-75.268016,42.824709],[-75.26829600000001,42.824788],[-75.268567,42.824846],[-75.269643,42.825022],[-75.270455,42.825147],[-75.270824,42.825207],[-75.271349,42.825292],[-75.271905,42.825366],[-75.27265,42.825476],[-75.27304599999999,42.825516],[-75.273428,42.825537],[-75.274857,42.825581],[-75.275549,42.825602],[-75.27621499999999,42.825638],[-75.2766,42.825631],[-75.276903,42.825609],[-75.277148,42.825566],[-75.277548,42.825462],[-75.27778499999999,42.825386],[-75.278357,42.825147],[-75.27870299999999,42.825014],[-75.279196,42.824801],[-75.279376,42.824744],[-75.279754,42.82465],[-75.28185999999999,42.824261],[-75.282867,42.824084],[-75.2834,42.823973],[-75.284716,42.823735],[-75.285556,42.823579],[-75.28651000000001,42.823414],[-75.287424,42.823243],[-75.29037099999999,42.822699],[-75.292187,42.822387],[-75.292518,42.822354],[-75.294095,42.822224],[-75.294696,42.822188],[-75.296043,42.822066],[-75.297473,42.821926],[-75.297735,42.821879],[-75.298412,42.821745],[-75.29930400000001,42.821543],[-75.299887,42.821381],[-75.300172,42.821283],[-75.300406,42.821186],[-75.300658,42.821057],[-75.30098099999999,42.820832],[-75.30122900000001,42.820629],[-75.301455,42.820392],[-75.301739,42.820046],[-75.301908,42.819771],[-75.302122,42.819239],[-75.302232,42.819023],[-75.302375,42.8187],[-75.302864,42.817516],[-75.303003,42.817224],[-75.30326100000001,42.816774],[-75.303607,42.816247],[-75.303856,42.815927],[-75.304108,42.81566],[-75.30445,42.815369],[-75.30477399999999,42.815117],[-75.305244,42.814841],[-75.30685,42.813956],[-75.307158,42.813817],[-75.307655,42.81354],[-75.30797200000001,42.813389],[-75.30813000000001,42.813346],[-75.30841100000001,42.813302],[-75.308691,42.813286],[-75.30909200000001,42.813274],[-75.312484,42.813132],[-75.31384300000001,42.813091],[-75.31456799999999,42.813051],[-75.315166,42.813042],[-75.31531099999999,42.813032],[-75.315917,42.81299],[-75.316766,42.812957],[-75.31747300000001,42.812943],[-75.317747,42.812937],[-75.318584,42.812893],[-75.319535,42.81287],[-75.31988800000001,42.812847],[-75.32042199999999,42.812823],[-75.32124399999999,42.812797],[-75.32159,42.812778],[-75.321883,42.812749],[-75.32223500000001,42.812698],[-75.32299999999999,42.812549],[-75.32442899999999,42.81226],[-75.325872,42.811984],[-75.327893,42.811635],[-75.331947,42.810935],[-75.33236100000001,42.81085],[-75.332548,42.810823],[-75.33305300000001,42.810728],[-75.335168,42.810353],[-75.33771299999999,42.809945],[-75.33849600000001,42.809821],[-75.33884399999999,42.809801],[-75.339146,42.809793],[-75.339484,42.809805],[-75.34092699999999,42.809912],[-75.34129,42.809951],[-75.34215500000001,42.809987],[-75.342479,42.809983],[-75.34318,42.809923],[-75.345653,42.809632],[-75.346287,42.809545],[-75.34683,42.80943],[-75.347683,42.809257],[-75.348161,42.809194],[-75.34851399999999,42.80917],[-75.348921,42.80917],[-75.351668,42.80933],[-75.352889,42.809378],[-75.35380000000001,42.809422],[-75.35504299999999,42.809473],[-75.355628,42.809481],[-75.356116,42.809461],[-75.35624799999999,42.809441],[-75.35693999999999,42.809279],[-75.357432,42.809173],[-75.35821799999999,42.809035],[-75.35937699999999,42.808912],[-75.360643,42.808806],[-75.361806,42.808704],[-75.36204600000001,42.8087],[-75.362205,42.808711],[-75.362374,42.808739],[-75.36277699999999,42.808857],[-75.362994,42.80894],[-75.36345,42.809157],[-75.363585,42.809232],[-75.365075,42.810171],[-75.365296,42.810325],[-75.365774,42.810716],[-75.366023,42.810952],[-75.366726,42.811704],[-75.36718399999999,42.812205],[-75.367515,42.8125],[-75.367791,42.812657],[-75.367902,42.812707],[-75.36815900000001,42.81279],[-75.368899,42.812971],[-75.369439,42.813082],[-75.36981900000001,42.813186],[-75.37101199999999,42.813584],[-75.371295,42.813669],[-75.37154200000001,42.813725],[-75.37199699999999,42.813791],[-75.373104,42.813902],[-75.373638,42.813976],[-75.37486,42.814268],[-75.37500300000001,42.814293],[-75.375472,42.814333],[-75.37614600000001,42.814353],[-75.377208,42.814365],[-75.37796400000001,42.814326],[-75.37948799999999,42.814192],[-75.37982599999999,42.814156],[-75.38045,42.814065],[-75.38136799999999,42.813896],[-75.38281499999999,42.813651],[-75.383865,42.813513],[-75.384274,42.813467],[-75.38603500000001,42.813288],[-75.387834,42.813172],[-75.38827000000001,42.813111],[-75.38857,42.813051],[-75.38887,42.812972],[-75.38945099999999,42.812756],[-75.389763,42.812614],[-75.39036900000001,42.812296],[-75.390688,42.812141],[-75.39131,42.811872],[-75.39181499999999,42.811683],[-75.392315,42.811534],[-75.395337,42.8107],[-75.39688700000001,42.810395],[-75.397316,42.810283],[-75.397896,42.810021],[-75.398264,42.809863],[-75.398708,42.809729],[-75.39952,42.809528],[-75.40210399999999,42.808942],[-75.402734,42.808765],[-75.403167,42.808625],[-75.40349500000001,42.808508],[-75.403941,42.808297],[-75.40425500000001,42.808102],[-75.40445800000001,42.80795],[-75.40452999999999,42.807868],[-75.40470500000001,42.80789],[-75.405197,42.807843],[-75.406879,42.807783],[-75.40808699999999,42.807765],[-75.408286,42.807771],[-75.408592,42.807798],[-75.40894299999999,42.807844],[-75.409975,42.807891],[-75.41033400000001,42.807923],[-75.41049599999999,42.807971],[-75.41051400000001,42.807981],[-75.410704,42.808098],[-75.410793,42.808195],[-75.411028,42.808569],[-75.41132,42.808908],[-75.411559,42.809136],[-75.411874,42.809399],[-75.412182,42.809666],[-75.412606,42.810108],[-75.413374,42.810813],[-75.413759,42.811117],[-75.41426800000001,42.81144],[-75.414552,42.811594],[-75.41569,42.812071],[-75.41635599999999,42.81232],[-75.41688600000001,42.812498],[-75.417114,42.812605],[-75.417264,42.812716],[-75.417366,42.812806],[-75.417655,42.81313],[-75.41771799999999,42.813185],[-75.417884,42.813288],[-75.418064,42.813369],[-75.418446,42.813501],[-75.41876999999999,42.813576],[-75.41905800000001,42.813619],[-75.419406,42.813651],[-75.42022900000001,42.813706],[-75.422399,42.813978],[-75.423191,42.814084],[-75.42344799999999,42.814147],[-75.42374,42.814266],[-75.424342,42.814578],[-75.424543,42.814668],[-75.424891,42.814787],[-75.42562700000001,42.814984],[-75.42603,42.815102],[-75.427116,42.815481],[-75.42734400000001,42.815549],[-75.427449,42.81558],[-75.42767000000001,42.815615],[-75.427983,42.815623],[-75.42872199999999,42.815584],[-75.42971900000001,42.815458],[-75.430376,42.815324],[-75.431956,42.814902],[-75.432909,42.814641],[-75.433263,42.814596],[-75.43331999999999,42.815369],[-75.433538,42.81831],[-75.43382200000001,42.822137],[-75.434404,42.830345],[-75.434538,42.831808],[-75.435096,42.839878],[-75.435113,42.840129],[-75.435282,42.842638],[-75.435346,42.842858],[-75.435456,42.843472],[-75.43557699999999,42.844247],[-75.43563399999999,42.844716],[-75.43567299999999,42.845559],[-75.435686,42.845848],[-75.435714,42.846224],[-75.435822,42.847687],[-75.43594899999999,42.848979],[-75.435986,42.849677],[-75.43610099999999,42.850481],[-75.43617999999999,42.851155],[-75.436227,42.851439],[-75.436267,42.851571],[-75.436508,42.85518],[-75.43651199999999,42.855534],[-75.437167,42.863319]]],"type":"Polygon"}
}