{
  "id": "360470928001",
  "type": "Feature",
  "properties": {
    "area_land":60809,
    "area_water":0,
    "geoid":"360470928001",
    "name":"Block Group 1",
    "state":"ny"
},
  "bbox": [
    -73.915226,
    40.651407,
    -73.911016,
    40.654169
],
  "geometry": {"coordinates":[[[-73.914511,40.653501],[-73.913815,40.653963],[-73.91374500000001,40.654004],[-73.913568,40.653998],[-73.91374399999999,40.654169],[-73.913524,40.654161],[-73.912329,40.654135],[-73.91213,40.653955],[-73.911016,40.652951],[-73.911815,40.652437],[-73.91269200000001,40.651867],[-73.91340700000001,40.651407],[-73.915226,40.653039],[-73.914511,40.653501]]],"type":"Polygon"}
}