{
  "id": "360811010020",
  "type": "Feature",
  "properties": {
    "area_land":0,
    "area_water":99332,
    "geoid":"360811010020",
    "name":"Block Group 0",
    "state":"ny"
},
  "bbox": [
    -73.743591,
    40.592839,
    -73.737185,
    40.594906
],
  "geometry": {"coordinates":[[[-73.74353499999999,40.594651],[-73.743516,40.594627],[-73.743503,40.594603],[-73.74345599999999,40.594612],[-73.743454,40.594636],[-73.74347,40.594711],[-73.743469,40.594735],[-73.74342799999999,40.594774],[-73.743396,40.594804],[-73.74335000000001,40.594795],[-73.743286,40.594797],[-73.74322100000001,40.594795],[-73.743166,40.594789],[-73.743099,40.594792],[-73.743067,40.594804],[-73.74301,40.594828],[-73.742974,40.594832],[-73.742914,40.594832],[-73.742875,40.594826],[-73.742796,40.594805],[-73.74277499999999,40.594791],[-73.74276,40.594744],[-73.74261799999999,40.594737],[-73.74238699999999,40.594729],[-73.742429,40.594869],[-73.742322,40.594895],[-73.74226,40.594905],[-73.742226,40.594906],[-73.742147,40.594895],[-73.742085,40.594879],[-73.74202200000001,40.594859],[-73.741968,40.594838],[-73.74191500000001,40.594818],[-73.741849,40.594794],[-73.74180200000001,40.594772],[-73.74175,40.594743],[-73.741738,40.594728],[-73.74173999999999,40.594681],[-73.741727,40.59466],[-73.741698,40.594642],[-73.74166200000001,40.594654],[-73.741658,40.594675],[-73.74165000000001,40.594755],[-73.741634,40.594777],[-73.74162099999999,40.594786],[-73.741592,40.594796],[-73.741561,40.594801],[-73.741501,40.594806],[-73.741473,40.594808],[-73.741362,40.594805],[-73.74129499999999,40.594783],[-73.741175,40.594727],[-73.741152,40.594715],[-73.74112599999999,40.594706],[-73.741078,40.594693],[-73.74102999999999,40.594677],[-73.740967,40.594652],[-73.74093999999999,40.594637],[-73.74089499999999,40.594612],[-73.740889,40.594597],[-73.740905,40.594555],[-73.740916,40.594518],[-73.74092400000001,40.594502],[-73.740899,40.594481],[-73.740866,40.594491],[-73.74085100000001,40.594511],[-73.740841,40.594547],[-73.740838,40.594574],[-73.74083899999999,40.594598],[-73.740827,40.594614],[-73.740793,40.59465],[-73.740739,40.594671],[-73.740708,40.594672],[-73.74069799999999,40.594696],[-73.74068200000001,40.594707],[-73.74064300000001,40.594721],[-73.740594,40.594715],[-73.740492,40.594696],[-73.740419,40.594679],[-73.740392,40.594675],[-73.740364,40.59467],[-73.74033,40.594661],[-73.740274,40.594647],[-73.740213,40.59463],[-73.740184,40.594612],[-73.740143,40.594582],[-73.740134,40.594566],[-73.74014099999999,40.594518],[-73.74010800000001,40.594511],[-73.740089,40.594531],[-73.740073,40.59458],[-73.740061,40.594601],[-73.740047,40.594615],[-73.74001699999999,40.594625],[-73.739987,40.594633],[-73.739953,40.594637],[-73.73994999999999,40.594501],[-73.739681,40.594504],[-73.739695,40.594589],[-73.73967500000001,40.594586],[-73.73964100000001,40.594582],[-73.73962,40.59458],[-73.739589,40.594569],[-73.739577,40.594565],[-73.73957799999999,40.594515],[-73.739591,40.594518],[-73.739588,40.594427],[-73.739552,40.594426],[-73.739547,40.594519],[-73.739559,40.594519],[-73.73956099999999,40.594562],[-73.73952800000001,40.59455],[-73.73949500000001,40.594545],[-73.739459,40.594542],[-73.73942700000001,40.594537],[-73.739397,40.594531],[-73.73936500000001,40.594523],[-73.739349,40.594512],[-73.739334,40.594486],[-73.739327,40.594474],[-73.73931899999999,40.594462],[-73.739294,40.594453],[-73.73928100000001,40.594465],[-73.739278,40.594483],[-73.739285,40.594507],[-73.739287,40.594533],[-73.739277,40.594546],[-73.739248,40.594561],[-73.739195,40.594586],[-73.73916800000001,40.594593],[-73.739107,40.594597],[-73.73907199999999,40.594596],[-73.739002,40.594586],[-73.738893,40.594557],[-73.738834,40.594543],[-73.738786,40.59453],[-73.73879100000001,40.594449],[-73.73879700000001,40.594414],[-73.738811,40.594416],[-73.738817,40.59436],[-73.738778,40.594355],[-73.73877,40.594412],[-73.738784,40.594413],[-73.738778,40.594449],[-73.73876199999999,40.594522],[-73.738749,40.594517],[-73.738677,40.594485],[-73.738657,40.594475],[-73.738567,40.594445],[-73.738534,40.594438],[-73.73852100000001,40.594425],[-73.73851999999999,40.594401],[-73.738507,40.594379],[-73.73848700000001,40.594352],[-73.738472,40.594359],[-73.73846,40.594376],[-73.738461,40.594428],[-73.73844800000001,40.594453],[-73.738429,40.594474],[-73.73840199999999,40.594484],[-73.738367,40.594495],[-73.738294,40.594519],[-73.73824999999999,40.594529],[-73.73817,40.59454],[-73.738061,40.594546],[-73.73787400000001,40.59454],[-73.737846,40.594537],[-73.737804,40.594528],[-73.737769,40.594518],[-73.737739,40.594507],[-73.737712,40.594495],[-73.737685,40.594473],[-73.737674,40.594458],[-73.73766500000001,40.594433],[-73.73763700000001,40.594415],[-73.737604,40.594209],[-73.737521,40.59392],[-73.73745099999999,40.593604],[-73.737414,40.593425],[-73.73722600000001,40.593048],[-73.737185,40.592965],[-73.73723200000001,40.592964],[-73.73839,40.592939],[-73.738468,40.592937],[-73.740019,40.592906],[-73.74162800000001,40.592872],[-73.74323699999999,40.592839],[-73.74338,40.592847],[-73.743591,40.594665],[-73.74353499999999,40.594651]]],"type":"Polygon"}
}