{
  "id": "361031115051",
  "type": "Feature",
  "properties": {
    "area_land":1936923,
    "area_water":0,
    "geoid":"361031115051",
    "name":"Block Group 1",
    "state":"ny"
},
  "bbox": [
    -73.390593,
    40.850505,
    -73.36437,
    40.863641
],
  "geometry": {"coordinates":[[[-73.390593,40.8563],[-73.389247,40.856962],[-73.388457,40.857352],[-73.38761100000001,40.85762],[-73.384817,40.8586],[-73.38351299999999,40.859072],[-73.382651,40.859389],[-73.377546,40.861205],[-73.37705800000001,40.861338],[-73.37553200000001,40.861725],[-73.372563,40.862441],[-73.37133799999999,40.862737],[-73.37015700000001,40.863016],[-73.369426,40.863195],[-73.369015,40.863308],[-73.368679,40.863428],[-73.36815199999999,40.863641],[-73.36726299999999,40.863158],[-73.365904,40.862433],[-73.365025,40.861956],[-73.364744,40.861762],[-73.364553,40.861613],[-73.364492,40.861148],[-73.36436999999999,40.860034],[-73.36439300000001,40.859786],[-73.36461300000001,40.858344],[-73.364797,40.857166],[-73.364813,40.857074],[-73.36489,40.856643],[-73.365009,40.855872],[-73.365087,40.855353],[-73.365217,40.854491],[-73.365278,40.854102],[-73.365393,40.853419],[-73.367063,40.853599],[-73.36864300000001,40.85377],[-73.36885599999999,40.853801],[-73.369528,40.853878],[-73.369856,40.853911],[-73.369918,40.853461],[-73.369956,40.853247],[-73.37007,40.852592],[-73.370175,40.851935],[-73.37029200000001,40.851261],[-73.371984,40.851424],[-73.37317400000001,40.85155],[-73.373887,40.851626],[-73.37396099999999,40.851634],[-73.374263,40.851658],[-73.37535,40.851748],[-73.377493,40.851935],[-73.377646,40.851955],[-73.37779,40.851962],[-73.377982,40.851924],[-73.378135,40.851859],[-73.378783,40.851275],[-73.379653,40.850505],[-73.381974,40.851551],[-73.382749,40.851871],[-73.38452700000001,40.852662],[-73.385583,40.853098],[-73.386015,40.85332],[-73.386968,40.853845],[-73.387877,40.854404],[-73.389106,40.855156],[-73.38958599999999,40.855472],[-73.390006,40.855834],[-73.390593,40.8563]]],"type":"Polygon"}
}