{
  "id": "360810283005",
  "type": "Feature",
  "properties": {
    "area_land":36881,
    "area_water":0,
    "geoid":"360810283005",
    "name":"Block Group 5",
    "state":"ny"
},
  "bbox": [
    -73.886543,
    40.74744,
    -73.884855,
    40.75169
],
  "geometry": {"coordinates":[[[-73.886543,40.751592],[-73.88561300000001,40.75169],[-73.88524099999999,40.749651],[-73.884855,40.747535],[-73.88578699999999,40.74744],[-73.886168,40.749552],[-73.886543,40.751592]]],"type":"Polygon"}
}