{
  "id": "360810330003",
  "type": "Feature",
  "properties": {
    "area_land":150092,
    "area_water":0,
    "geoid":"360810330003",
    "name":"Block Group 3",
    "state":"ny"
},
  "bbox": [
    -73.766754,
    40.666929,
    -73.761543,
    40.671651
],
  "geometry": {"coordinates":[[[-73.766559,40.66786],[-73.766249,40.66851],[-73.765899,40.669146],[-73.76560499999999,40.669666],[-73.76525700000001,40.670279],[-73.765085,40.670588],[-73.76466000000001,40.671318],[-73.764546,40.671512],[-73.763814,40.671651],[-73.76354600000001,40.670765],[-73.762762,40.670796],[-73.762615,40.670803],[-73.761691,40.670847],[-73.761657,40.670771],[-73.761922,40.669612],[-73.762045,40.669071],[-73.761543,40.668986],[-73.7619,40.667772],[-73.761686,40.66774],[-73.761871,40.666929],[-73.762049,40.666948],[-73.76277899999999,40.667017],[-73.76376,40.667098],[-73.764071,40.66713],[-73.76490099999999,40.667224],[-73.76675400000001,40.667433],[-73.766559,40.66786]]],"type":"Polygon"}
}