{
  "id": "360050050024",
  "type": "Feature",
  "properties": {
    "area_land":22469,
    "area_water":0,
    "geoid":"360050050024",
    "name":"Block Group 4",
    "state":"ny"
},
  "bbox": [
    -73.877299,
    40.826278,
    -73.875802,
    40.828977
],
  "geometry": {"coordinates":[[[-73.87729899999999,40.828742],[-73.876402,40.828977],[-73.875871,40.826698],[-73.87580199999999,40.826402],[-73.87672499999999,40.826278],[-73.8768,40.826598],[-73.87729899999999,40.828742]]],"type":"Polygon"}
}