{
  "id": "360339509004",
  "type": "Feature",
  "properties": {
    "area_land":353181141,
    "area_water":16250714,
    "geoid":"360339509004",
    "name":"Block Group 4",
    "state":"ny"
},
  "bbox": [
    -74.409161,
    44.111567,
    -74.09349,
    44.323993
],
  "geometry": {"coordinates":[[[-74.409161,44.252872],[-74.40879200000001,44.252926],[-74.408754,44.252929],[-74.39870000000001,44.253919],[-74.391597,44.254639],[-74.38412700000001,44.255354],[-74.37718599999999,44.256032],[-74.37464199999999,44.256261],[-74.36684099999999,44.257099],[-74.364982,44.257295],[-74.362472,44.257552],[-74.354461,44.258402],[-74.348428,44.258996],[-74.34822200000001,44.258766],[-74.348163,44.258696],[-74.34804699999999,44.258586],[-74.34576,44.256699],[-74.345215,44.256234],[-74.34484399999999,44.255932],[-74.34442199999999,44.255571],[-74.343558,44.254833],[-74.342956,44.254338],[-74.342614,44.254074],[-74.34194100000001,44.253616],[-74.341745,44.253463],[-74.341587,44.253302],[-74.341537,44.253229],[-74.341492,44.253128],[-74.341452,44.252976],[-74.34146,44.25284],[-74.34128699999999,44.252819],[-74.34095600000001,44.252767],[-74.340648,44.252691],[-74.34008300000001,44.252526],[-74.339468,44.252323],[-74.339178,44.252187],[-74.33890100000001,44.252009],[-74.338638,44.25179],[-74.338454,44.251597],[-74.338157,44.251242],[-74.33790999999999,44.250966],[-74.337802,44.250869],[-74.337538,44.250672],[-74.337118,44.250437],[-74.33685199999999,44.250272],[-74.336731,44.250163],[-74.33662200000001,44.250032],[-74.336584,44.24997],[-74.336529,44.249829],[-74.336292,44.248624],[-74.33618800000001,44.248238],[-74.336051,44.247842],[-74.33597,44.24767],[-74.33591699999999,44.247586],[-74.335733,44.247363],[-74.335309,44.246913],[-74.33520300000001,44.246833],[-74.33502,44.246752],[-74.33477000000001,44.246711],[-74.334419,44.246664],[-74.334227,44.246607],[-74.334074,44.246553],[-74.333679,44.246368],[-74.33339700000001,44.246195],[-74.33332299999999,44.246131],[-74.333282,44.246078],[-74.333253,44.246018],[-74.333202,44.24579],[-74.33315,44.245598],[-74.33309,44.24546],[-74.332719,44.244694],[-74.332317,44.244139],[-74.332205,44.244028],[-74.331929,44.243815],[-74.33152699999999,44.243577],[-74.331293,44.243436],[-74.331267,44.24342],[-74.331177,44.24336],[-74.331052,44.243277],[-74.330592,44.24299],[-74.330455,44.242928],[-74.329904,44.242796],[-74.329728,44.242731],[-74.32962000000001,44.242667],[-74.32956799999999,44.242623],[-74.329235,44.242209],[-74.329168,44.242152],[-74.328991,44.242036],[-74.328906,44.241999],[-74.328688,44.241958],[-74.328579,44.241959],[-74.32835300000001,44.241984],[-74.328154,44.241989],[-74.328005,44.241973],[-74.32784100000001,44.241913],[-74.327552,44.241747],[-74.327344,44.241606],[-74.32711,44.241432],[-74.32696,44.241289],[-74.326655,44.240903],[-74.326572,44.240765],[-74.32647900000001,44.240509],[-74.326449,44.23998],[-74.326398,44.239838],[-74.326252,44.239561],[-74.32594,44.238868],[-74.32561099999999,44.238415],[-74.32558400000001,44.23829],[-74.325585,44.238182],[-74.32561200000001,44.238079],[-74.325654,44.238015],[-74.325942,44.237686],[-74.326278,44.237205],[-74.326335,44.237142],[-74.326392,44.237096],[-74.326549,44.236999],[-74.326921,44.236833],[-74.327068,44.236747],[-74.327112,44.236701],[-74.32713699999999,44.236648],[-74.327128,44.236458],[-74.327083,44.236347],[-74.326926,44.236181],[-74.32684,44.236111],[-74.326764,44.236064],[-74.326247,44.235812],[-74.326162,44.235758],[-74.326027,44.235649],[-74.325952,44.235549],[-74.325906,44.235462],[-74.32588800000001,44.235377],[-74.32590999999999,44.235123],[-74.325908,44.234914],[-74.32583,44.234443],[-74.325807,44.234208],[-74.325828,44.233691],[-74.325807,44.23359],[-74.325784,44.233555],[-74.325709,44.233457],[-74.325523,44.233309],[-74.32532399999999,44.233191],[-74.325142,44.233109],[-74.32483499999999,44.23299],[-74.324641,44.232937],[-74.324433,44.232911],[-74.324254,44.23291],[-74.324004,44.232921],[-74.323852,44.232943],[-74.323694,44.232974],[-74.323499,44.233013],[-74.32322499999999,44.233055],[-74.322838,44.233059],[-74.322337,44.233066],[-74.32188499999999,44.233057],[-74.32174500000001,44.233047],[-74.321563,44.233032],[-74.321487,44.233009],[-74.321337,44.232953],[-74.321258,44.232902],[-74.321162,44.232798],[-74.32104200000001,44.232584],[-74.32100199999999,44.232454],[-74.320992,44.232106],[-74.32102999999999,44.231931],[-74.32138399999999,44.23113],[-74.321442,44.230975],[-74.32144,44.230913],[-74.321387,44.230778],[-74.321343,44.230718],[-74.321089,44.230449],[-74.320325,44.229746],[-74.32024699999999,44.229665],[-74.320148,44.229541],[-74.320075,44.229406],[-74.31999999999999,44.229134],[-74.319872,44.228868],[-74.319819,44.228796],[-74.319682,44.228657],[-74.319419,44.228495],[-74.318926,44.228236],[-74.318752,44.228159],[-74.318073,44.228212],[-74.317972,44.228228],[-74.317626,44.228317],[-74.317369,44.228395],[-74.31705100000001,44.228517],[-74.31664499999999,44.228708],[-74.316194,44.228979],[-74.315775,44.229269],[-74.315136,44.229745],[-74.314635,44.230106],[-74.31427499999999,44.23042],[-74.314059,44.230625],[-74.313823,44.230883],[-74.313165,44.231683],[-74.312881,44.232029],[-74.312506,44.232521],[-74.31162,44.233636],[-74.311312,44.233989],[-74.311184,44.234153],[-74.31086999999999,44.234496],[-74.31032,44.235001],[-74.30968900000001,44.235521],[-74.30864800000001,44.236356],[-74.30776299999999,44.237054],[-74.307326,44.237385],[-74.307149,44.237496],[-74.30695,44.237617],[-74.306544,44.237813],[-74.306286,44.237927],[-74.30579299999999,44.238103],[-74.30546200000001,44.238196],[-74.305003,44.238295],[-74.304134,44.238443],[-74.300949,44.238962],[-74.30018,44.239124],[-74.29953500000001,44.239311],[-74.29885400000001,44.239555],[-74.298366,44.239769],[-74.297489,44.240191],[-74.29639400000001,44.240744],[-74.295131,44.241357],[-74.294814,44.241521],[-74.294791,44.241532],[-74.291405,44.243237],[-74.290222,44.243891],[-74.288573,44.244836],[-74.28809200000001,44.24512],[-74.286011,44.246314],[-74.285431,44.246633],[-74.285045,44.24682],[-74.284605,44.246956],[-74.284176,44.247057],[-74.283867,44.247109],[-74.283576,44.247135],[-74.283113,44.24716],[-74.282668,44.247146],[-74.281238,44.247011],[-74.27920399999999,44.246779],[-74.278614,44.246696],[-74.27832100000001,44.24664],[-74.277778,44.246514],[-74.276235,44.246045],[-74.275105,44.245741],[-74.271108,44.244771],[-74.270611,44.244684],[-74.270196,44.244654],[-74.269661,44.244654],[-74.269195,44.244694],[-74.268992,44.244714],[-74.268665,44.244763],[-74.268433,44.244817],[-74.26814299999999,44.244904],[-74.26784000000001,44.245016],[-74.26744100000001,44.245182],[-74.266256,44.245726],[-74.265756,44.245946],[-74.264915,44.246356],[-74.26459,44.246487],[-74.264274,44.246599],[-74.263739,44.246753],[-74.263473,44.246801],[-74.262807,44.246871],[-74.262463,44.24688],[-74.26205899999999,44.246868],[-74.261646,44.246825],[-74.26131700000001,44.246773],[-74.260803,44.246655],[-74.260481,44.246565],[-74.26013399999999,44.246456],[-74.25941,44.24626],[-74.259086,44.246168],[-74.25873300000001,44.246098],[-74.258319,44.246051],[-74.257656,44.246035],[-74.257227,44.246047],[-74.257001,44.246077],[-74.256486,44.246179],[-74.25599,44.246313],[-74.25522100000001,44.246582],[-74.254188,44.246961],[-74.250726,44.248249],[-74.248852,44.248957],[-74.24787999999999,44.249314],[-74.246894,44.24967],[-74.24647400000001,44.249802],[-74.246106,44.249901],[-74.245924,44.24994],[-74.24534800000001,44.25004],[-74.24485199999999,44.250095],[-74.24371600000001,44.25024],[-74.242813,44.250349],[-74.242127,44.250463],[-74.241788,44.250541],[-74.24132899999999,44.250677],[-74.24105299999999,44.250769],[-74.239785,44.251278],[-74.23868899999999,44.251739],[-74.236946,44.252466],[-74.23557,44.253053],[-74.23527,44.253155],[-74.23472099999999,44.253293],[-74.234381,44.253361],[-74.23378,44.253429],[-74.233586,44.253439],[-74.233017,44.253431],[-74.232437,44.253366],[-74.231978,44.25328],[-74.23028499999999,44.252868],[-74.22969399999999,44.252746],[-74.229238,44.252679],[-74.228872,44.25265],[-74.228407,44.25264],[-74.22422299999999,44.252646],[-74.223563,44.252683],[-74.22303599999999,44.252751],[-74.222639,44.252816],[-74.22218599999999,44.252916],[-74.221761,44.253025],[-74.22138699999999,44.253139],[-74.220957,44.253286],[-74.220456,44.253426],[-74.220114,44.253512],[-74.21987300000001,44.253583],[-74.219275,44.253792],[-74.21878100000001,44.254033],[-74.21864100000001,44.254114],[-74.21836999999999,44.254296],[-74.21798800000001,44.254615],[-74.217772,44.25484],[-74.21690099999999,44.255937],[-74.216677,44.256242],[-74.216482,44.256562],[-74.216368,44.256779],[-74.216251,44.257098],[-74.21619099999999,44.257329],[-74.21609599999999,44.257809],[-74.21594,44.258765],[-74.215857,44.259232],[-74.21579,44.259696],[-74.215456,44.261611],[-74.215317,44.261999],[-74.215136,44.262356],[-74.214932,44.262639],[-74.21472,44.262886],[-74.21445900000001,44.263122],[-74.214294,44.263254],[-74.212834,44.264207],[-74.211489,44.265089],[-74.210792,44.265552],[-74.210399,44.265835],[-74.210149,44.266053],[-74.209811,44.266391],[-74.209621,44.266609],[-74.209239,44.267115],[-74.208679,44.267846],[-74.20809,44.268559],[-74.20719099999999,44.26967],[-74.206576,44.270433],[-74.206244,44.270868],[-74.205701,44.271572],[-74.205215,44.272155],[-74.20482800000001,44.272535],[-74.204266,44.27298],[-74.20370200000001,44.273353],[-74.202493,44.274082],[-74.201123,44.274903],[-74.200755,44.27514],[-74.20023399999999,44.275535],[-74.199707,44.275983],[-74.198972,44.276713],[-74.198362,44.277372],[-74.197856,44.27784],[-74.19658099999999,44.279109],[-74.196111,44.279576],[-74.194896,44.280812],[-74.19370000000001,44.2821],[-74.192627,44.283216],[-74.19150500000001,44.284398],[-74.190448,44.285466],[-74.189255,44.286702],[-74.188819,44.2871],[-74.188514,44.28735],[-74.188193,44.287574],[-74.18779499999999,44.287802],[-74.18744100000001,44.287949],[-74.18697299999999,44.288118],[-74.186368,44.288254],[-74.185192,44.288429],[-74.18441300000001,44.28851],[-74.184279,44.288557],[-74.184006,44.288599],[-74.18387800000001,44.2886],[-74.182841,44.28876],[-74.18164299999999,44.288971],[-74.18136800000001,44.289023],[-74.18093399999999,44.289128],[-74.180544,44.289242],[-74.18020799999999,44.289368],[-74.179677,44.289607],[-74.179468,44.289719],[-74.17902599999999,44.28999],[-74.178436,44.290393],[-74.177868,44.290792],[-74.17576099999999,44.292255],[-74.17541,44.292531],[-74.175065,44.292839],[-74.17483300000001,44.293089],[-74.174673,44.293294],[-74.17449000000001,44.293593],[-74.174301,44.293952],[-74.17422999999999,44.294135],[-74.173502,44.296438],[-74.17329100000001,44.297067],[-74.173168,44.297373],[-74.172938,44.297792],[-74.172557,44.298348],[-74.172189,44.298768],[-74.17194600000001,44.299007],[-74.171689,44.299298],[-74.169844,44.301194],[-74.169535,44.301554],[-74.169033,44.302235],[-74.168876,44.302473],[-74.168446,44.303132],[-74.167148,44.305052],[-74.165762,44.306987],[-74.165218,44.307592],[-74.16456100000001,44.308235],[-74.16423399999999,44.308572],[-74.164089,44.308716],[-74.16323199999999,44.309477],[-74.162414,44.310247],[-74.161697,44.310925],[-74.16155000000001,44.311033],[-74.16122300000001,44.311273],[-74.16008100000001,44.312035],[-74.159381,44.312462],[-74.158931,44.312703],[-74.157331,44.313448],[-74.154501,44.314752],[-74.15412600000001,44.31496],[-74.15394499999999,44.315086],[-74.153688,44.315309],[-74.153496,44.315518],[-74.152888,44.31637],[-74.152708,44.316627],[-74.152181,44.317389],[-74.152158,44.317421],[-74.152112,44.317488],[-74.151944,44.317726],[-74.151274,44.318682],[-74.151141,44.318848],[-74.151087,44.31891],[-74.15088,44.319152],[-74.150575,44.319477],[-74.150381,44.31974],[-74.150199,44.320057],[-74.15012,44.320244],[-74.150052,44.320407],[-74.149631,44.321595],[-74.149477,44.321594],[-74.149248,44.321613],[-74.14887400000001,44.321675],[-74.148629,44.321743],[-74.14830499999999,44.321871],[-74.14754600000001,44.322223],[-74.14721900000001,44.322322],[-74.146466,44.322512],[-74.14581099999999,44.322659],[-74.14521999999999,44.322756],[-74.14506799999999,44.322772],[-74.14417299999999,44.322792],[-74.143423,44.322779],[-74.142646,44.322721],[-74.14206299999999,44.322708],[-74.141847,44.322703],[-74.141392,44.322679],[-74.141076,44.32261],[-74.14081,44.322532],[-74.14048699999999,44.322385],[-74.14027900000001,44.322302],[-74.14010399999999,44.322258],[-74.13996,44.322249],[-74.13985,44.322258],[-74.13937,44.322379],[-74.13864700000001,44.322525],[-74.138479,44.322575],[-74.13789300000001,44.322853],[-74.13721700000001,44.323176],[-74.137032,44.323249],[-74.136449,44.323412],[-74.136028,44.323501],[-74.134446,44.323766],[-74.134033,44.323872],[-74.133877,44.323891],[-74.133673,44.323895],[-74.13330999999999,44.323887],[-74.133015,44.323893],[-74.13228100000001,44.323934],[-74.13221299999999,44.323943],[-74.131998,44.323993],[-74.131865,44.323991],[-74.131793,44.323972],[-74.13152700000001,44.32384],[-74.13121599999999,44.323732],[-74.130522,44.323662],[-74.13031599999999,44.323626],[-74.13003399999999,44.323543],[-74.129645,44.323372],[-74.12943,44.323245],[-74.129025,44.322928],[-74.128792,44.32271],[-74.128423,44.322318],[-74.128286,44.322137],[-74.12814,44.321932],[-74.12796899999999,44.321581],[-74.127886,44.321318],[-74.12785,44.321121],[-74.127871,44.321014],[-74.127925,44.320893],[-74.128168,44.320488],[-74.12829000000001,44.320316],[-74.128649,44.319748],[-74.12876900000001,44.319597],[-74.12891500000001,44.319455],[-74.12923600000001,44.319206],[-74.129485,44.319006],[-74.129819,44.318757],[-74.13002299999999,44.318637],[-74.130606,44.318339],[-74.13086,44.318217],[-74.13080100000001,44.317783],[-74.130657,44.316969],[-74.130545,44.316252],[-74.13052,44.316151],[-74.130492,44.316087],[-74.130433,44.316044],[-74.130363,44.315846],[-74.13030999999999,44.315742],[-74.130297,44.31422],[-74.130289,44.313125],[-74.130326,44.312788],[-74.13052500000001,44.311506],[-74.12861100000001,44.309244],[-74.12787400000001,44.30824],[-74.128435,44.306073],[-74.127318,44.304292],[-74.126744,44.303159],[-74.125232,44.301327],[-74.124599,44.300807],[-74.12437199999999,44.30062],[-74.123091,44.300217],[-74.122252,44.299974],[-74.12112,44.299675],[-74.120919,44.298356],[-74.120898,44.298105],[-74.12087099999999,44.297775],[-74.120328,44.294261],[-74.120307,44.294116],[-74.11952599999999,44.288773],[-74.119489,44.288513],[-74.119011,44.285638],[-74.119006,44.285607],[-74.119004,44.285597],[-74.118999,44.28557],[-74.118995,44.285544],[-74.118898,44.28496],[-74.118641,44.28315],[-74.118639,44.283135],[-74.11863700000001,44.28312],[-74.11856899999999,44.282643],[-74.118515,44.282352],[-74.118511,44.282331],[-74.118498,44.282259],[-74.118343,44.281355],[-74.118335,44.281308],[-74.11833300000001,44.281293],[-74.11832800000001,44.281263],[-74.11830999999999,44.281158],[-74.118274,44.280949],[-74.118235,44.280724],[-74.116783,44.269245],[-74.116759,44.269053],[-74.116741,44.268912],[-74.116726,44.268794],[-74.115775,44.261279],[-74.11443300000001,44.250674],[-74.11433700000001,44.250051],[-74.11319,44.243117],[-74.113175,44.243027],[-74.112882,44.24137],[-74.11077400000001,44.229793],[-74.109545,44.223513],[-74.108367,44.217512],[-74.106402,44.206578],[-74.106391,44.20652],[-74.10635000000001,44.206291],[-74.106167,44.205271],[-74.10601,44.204447],[-74.10401400000001,44.193945],[-74.103672,44.19216],[-74.103577,44.191665],[-74.10357399999999,44.191648],[-74.10357,44.191629],[-74.10356299999999,44.191593],[-74.10355300000001,44.191541],[-74.10352399999999,44.19139],[-74.103514,44.191337],[-74.10333799999999,44.19042],[-74.10237499999999,44.185394],[-74.100762,44.176699],[-74.099194,44.168534],[-74.098805,44.166511],[-74.098364,44.164216],[-74.098213,44.16343],[-74.09819899999999,44.163358],[-74.098178,44.16325],[-74.098163,44.16317],[-74.09815999999999,44.163156],[-74.098156,44.163135],[-74.098009,44.162367],[-74.097351,44.158935],[-74.09707,44.157397],[-74.097037,44.157212],[-74.097019,44.157115],[-74.096991,44.156962],[-74.096958,44.156782],[-74.09572799999999,44.150039],[-74.095654,44.149659],[-74.09562699999999,44.149518],[-74.09441,44.143219],[-74.094401,44.143174],[-74.093597,44.138266],[-74.09355100000001,44.137988],[-74.09349,44.137615],[-74.097058,44.137304],[-74.09711,44.1373],[-74.098009,44.137237],[-74.098259,44.137214],[-74.09850900000001,44.137192],[-74.09853,44.13719],[-74.09875700000001,44.13717],[-74.099186,44.137131],[-74.099615,44.137093],[-74.09979,44.137077],[-74.09986600000001,44.13707],[-74.09988199999999,44.137069],[-74.09990500000001,44.137067],[-74.100872,44.136973],[-74.101839,44.136879],[-74.101944,44.136869],[-74.103435,44.136751],[-74.109238,44.13632],[-74.110236,44.136246],[-74.110679,44.136213],[-74.11073500000001,44.136209],[-74.110769,44.136206],[-74.110783,44.136205],[-74.11086400000001,44.136199],[-74.110946,44.136193],[-74.11208600000001,44.136108],[-74.112927,44.136046],[-74.120645,44.135295],[-74.12459699999999,44.134936],[-74.143063,44.133164],[-74.144324,44.133044],[-74.158179,44.131713],[-74.158299,44.131702],[-74.158338,44.131698],[-74.165888,44.130973],[-74.165958,44.130967],[-74.166132,44.130951],[-74.166197,44.130945],[-74.16623,44.130942],[-74.16625999999999,44.130939],[-74.16630000000001,44.130935],[-74.168049,44.130776],[-74.191816,44.128614],[-74.19213000000001,44.128586],[-74.192691,44.128535],[-74.22004,44.126015],[-74.226618,44.125197],[-74.227688,44.125059],[-74.230717,44.124814],[-74.23109700000001,44.124783],[-74.24960299999999,44.123422],[-74.249955,44.123362],[-74.250945,44.12329],[-74.251964,44.123201],[-74.25345799999999,44.123073],[-74.261466,44.122371],[-74.268524,44.12174],[-74.269666,44.121638],[-74.27728,44.120963],[-74.28187,44.120552],[-74.292557,44.119596],[-74.29337700000001,44.119525],[-74.294895,44.119394],[-74.29518400000001,44.119369],[-74.295289,44.11936],[-74.29532500000001,44.119357],[-74.295338,44.119356],[-74.295354,44.119355],[-74.29558299999999,44.119335],[-74.29622000000001,44.11928],[-74.29706,44.119207],[-74.297237,44.119192],[-74.297545,44.119166],[-74.298778,44.11906],[-74.299352,44.119007],[-74.299496,44.118994],[-74.29962399999999,44.118985],[-74.302105,44.118809],[-74.30249999999999,44.118769],[-74.302689,44.11875],[-74.303363,44.118682],[-74.303605,44.118657],[-74.304179,44.118599],[-74.306483,44.118367],[-74.320352,44.117128],[-74.321825,44.117013],[-74.323261,44.116882],[-74.323398,44.116869],[-74.323888,44.116827],[-74.324282,44.116794],[-74.328113,44.116435],[-74.33240000000001,44.116064],[-74.332764,44.116031],[-74.33337400000001,44.115976],[-74.33365000000001,44.115951],[-74.335571,44.115779],[-74.337879,44.115579],[-74.3416,44.115263],[-74.34168,44.115255],[-74.35795899999999,44.113784],[-74.374607,44.112252],[-74.38162800000001,44.111777],[-74.381798,44.111765],[-74.382414,44.111725],[-74.384865,44.111567],[-74.386229,44.119402],[-74.386613,44.121566],[-74.386809,44.122718],[-74.38698100000001,44.124996],[-74.38739200000001,44.127456],[-74.388575,44.134328],[-74.388792,44.135538],[-74.39151,44.150656],[-74.394603,44.168795],[-74.39578299999999,44.175607],[-74.396837,44.181553],[-74.39712,44.183126],[-74.39758999999999,44.185821],[-74.398438,44.190544],[-74.39854800000001,44.191257],[-74.398583,44.191461],[-74.399702,44.197846],[-74.401821,44.210084],[-74.40328599999999,44.218482],[-74.405008,44.228308],[-74.405062,44.228614],[-74.40612400000001,44.23461],[-74.406398,44.23574],[-74.408101,44.245758],[-74.40824600000001,44.246566],[-74.409083,44.252335],[-74.409161,44.252872]]],"type":"Polygon"}
}