{
  "id": "360259714001",
  "type": "Feature",
  "properties": {
    "area_land":231134985,
    "area_water":5078984,
    "geoid":"360259714001",
    "name":"Block Group 1",
    "state":"ny"
},
  "bbox": [
    -75.277175,
    41.857456,
    -74.997252,
    42.075451
],
  "geometry": {"coordinates":[[[-75.277036,41.932494],[-75.276563,41.932324],[-75.276354,41.932217],[-75.275943,41.932008],[-75.27409900000001,41.931066],[-75.273392,41.930794],[-75.27301199999999,41.930454],[-75.272406,41.930306],[-75.272333,41.930388],[-75.27230299999999,41.930498],[-75.272318,41.93063],[-75.272296,41.930915],[-75.27225900000001,41.931053],[-75.272317,41.931399],[-75.272464,41.931816],[-75.27252300000001,41.932025],[-75.272611,41.932167],[-75.272706,41.932403],[-75.272809,41.93259],[-75.27290499999999,41.932804],[-75.273066,41.932991],[-75.273177,41.933183],[-75.27325,41.93337],[-75.27338899999999,41.933606],[-75.27353599999999,41.933947],[-75.273617,41.934078],[-75.273669,41.934188],[-75.27363200000001,41.934441],[-75.273521,41.934677],[-75.273484,41.93488],[-75.273565,41.935094],[-75.27366000000001,41.935467],[-75.273719,41.935588],[-75.273741,41.935687],[-75.273815,41.93583],[-75.273844,41.935918],[-75.273859,41.935973],[-75.27405899999999,41.9367],[-75.274057,41.93672],[-75.274057,41.936901],[-75.274086,41.937054],[-75.274152,41.937164],[-75.27418900000001,41.937269],[-75.274247,41.937598],[-75.274232,41.937933],[-75.27406999999999,41.938279],[-75.27396,41.938471],[-75.273791,41.938663],[-75.27357000000001,41.938817],[-75.27347399999999,41.93891],[-75.273386,41.93902],[-75.273335,41.939141],[-75.27330499999999,41.939294],[-75.273312,41.939552],[-75.27328799999999,41.939634],[-75.273202,41.939634],[-75.27298500000001,41.93963],[-75.27297900000001,41.940166],[-75.272982,41.940878],[-75.272998,41.941233],[-75.273026,41.941585],[-75.273065,41.941927],[-75.273141,41.942444],[-75.273155,41.942524],[-75.273228,41.942931],[-75.27333,41.943399],[-75.273363,41.943515],[-75.273461,41.943858],[-75.273714,41.944627],[-75.273933,41.945392],[-75.274036,41.945842],[-75.27417,41.946581],[-75.2743,41.947166],[-75.274407,41.947593],[-75.274789,41.949029],[-75.274874,41.949317],[-75.27497,41.949596],[-75.27507799999999,41.94987],[-75.275132,41.950023],[-75.27519599999999,41.950113],[-75.275255,41.950262],[-75.27538800000001,41.950509],[-75.27561,41.95086],[-75.27591099999999,41.95126],[-75.27620400000001,41.951624],[-75.276511,41.952013],[-75.276647,41.952191],[-75.276775,41.952398],[-75.27695,41.952592],[-75.275091,41.952916],[-75.27347399999999,41.953142],[-75.270425,41.953495],[-75.2698,41.953677],[-75.26921900000001,41.953845],[-75.26893800000001,41.954188],[-75.268123,41.955185],[-75.267808,41.955534],[-75.26713100000001,41.956271],[-75.265647,41.957888],[-75.263987,41.960775],[-75.261816,41.962489],[-75.261984,41.962636],[-75.26220000000001,41.962825],[-75.262579,41.963158],[-75.26262199999999,41.963224],[-75.262682,41.963317],[-75.2628,41.963449],[-75.26285300000001,41.963568],[-75.262873,41.963614],[-75.262889,41.963665],[-75.262917,41.963751],[-75.26293200000001,41.963888],[-75.262888,41.964207],[-75.26283100000001,41.964414],[-75.262799,41.964475],[-75.26274100000001,41.964571],[-75.262506,41.964627],[-75.262502,41.964711],[-75.26247600000001,41.964874],[-75.262473,41.964896],[-75.262444,41.965012],[-75.262426,41.965085],[-75.262362,41.965261],[-75.262277,41.965432],[-75.26217200000001,41.965595],[-75.262051,41.965744],[-75.26191900000001,41.965884],[-75.26177300000001,41.96601],[-75.261616,41.966127],[-75.26157600000001,41.966151],[-75.26145099999999,41.966227],[-75.26128,41.966317],[-75.261101,41.966394],[-75.260915,41.966462],[-75.260721,41.966517],[-75.260659,41.96653],[-75.260653,41.96658],[-75.260661,41.96662],[-75.260707,41.966724],[-75.260783,41.966859],[-75.26091700000001,41.967052],[-75.26101800000001,41.967196],[-75.26137900000001,41.967682],[-75.26255999999999,41.96927],[-75.26293699999999,41.969777],[-75.263266,41.970231],[-75.26384400000001,41.970999],[-75.264067,41.971319],[-75.264216,41.971549],[-75.26427700000001,41.971642],[-75.264387,41.971831],[-75.264415,41.971885],[-75.26446300000001,41.971975],[-75.264528,41.972111],[-75.264545,41.972146],[-75.264691,41.972493],[-75.264814,41.972848],[-75.264866,41.973028],[-75.264909,41.973208],[-75.264976,41.973568],[-75.265004,41.973783],[-75.265023,41.973933],[-75.26509299999999,41.97468],[-75.265298,41.976625],[-75.265311,41.976819],[-75.265316,41.977017],[-75.265308,41.977215],[-75.265287,41.977409],[-75.265219,41.977805],[-75.264822,41.979752],[-75.264516,41.980982],[-75.264467,41.981173],[-75.264398,41.981441],[-75.264241,41.982018],[-75.264154,41.982406],[-75.264123,41.982595],[-75.264104,41.982789],[-75.264101,41.982982],[-75.264111,41.983171],[-75.264151,41.98355],[-75.264273,41.984495],[-75.264287,41.984684],[-75.264291,41.984873],[-75.26428,41.985058],[-75.264252,41.985247],[-75.26421000000001,41.985427],[-75.26415900000001,41.985612],[-75.264042,41.985938],[-75.26402899999999,41.985973],[-75.263812,41.986514],[-75.263747,41.986698],[-75.263693,41.986883],[-75.263685,41.986919],[-75.26365300000001,41.987068],[-75.26363000000001,41.987257],[-75.263623,41.987446],[-75.263626,41.988267],[-75.263632,41.99013],[-75.26363600000001,41.990237],[-75.26364700000001,41.990517],[-75.26367,41.990761],[-75.263689,41.990905],[-75.263723,41.991098],[-75.263768,41.991292],[-75.26382,41.991485],[-75.26417499999999,41.992624],[-75.264302,41.993012],[-75.264481,41.99356],[-75.26467700000001,41.994113],[-75.26504799999999,41.995022],[-75.26542600000001,41.995908],[-75.26542999999999,41.995919],[-75.265494,41.996088],[-75.265551,41.996268],[-75.265596,41.996453],[-75.26562699999999,41.996637],[-75.26564,41.996827],[-75.26563899999999,41.99685],[-75.265635,41.997011],[-75.26561,41.997196],[-75.265569,41.997381],[-75.265467,41.997746],[-75.265255,41.998448],[-75.265019,41.999228],[-75.264898,41.999598],[-75.264831,41.999783],[-75.264757,41.999967],[-75.26467700000001,42.000148],[-75.264501,42.000508],[-75.264304,42.00086],[-75.264083,42.001203],[-75.263614,42.001884],[-75.262773,42.003088],[-75.262468,42.003518],[-75.262114,42.004017],[-75.261385,42.005046],[-75.261172,42.005384],[-75.261079,42.00556],[-75.26099600000001,42.005736],[-75.260965,42.005814],[-75.260924,42.005916],[-75.260797,42.006282],[-75.260735,42.00647],[-75.260554,42.007034],[-75.26048,42.007219],[-75.260389,42.007399],[-75.26027999999999,42.007575],[-75.26015099999999,42.007746],[-75.26000999999999,42.007913],[-75.259507,42.008457],[-75.25909900000001,42.008897],[-75.25902600000001,42.008983],[-75.258957,42.009064],[-75.25882799999999,42.009231],[-75.258718,42.009411],[-75.258627,42.009591],[-75.258472,42.009961],[-75.258127,42.010814],[-75.257811,42.011593],[-75.257383,42.012661],[-75.257205,42.013049],[-75.25710599999999,42.013238],[-75.25700000000001,42.013427],[-75.25688700000001,42.013612],[-75.256643,42.013973],[-75.256381,42.014316],[-75.25611000000001,42.014654],[-75.255427,42.015457],[-75.255315,42.015597],[-75.255296,42.01562],[-75.25517600000001,42.015782],[-75.255067,42.015949],[-75.25497799999999,42.01612],[-75.254909,42.016296],[-75.254865,42.016476],[-75.25484299999999,42.016657],[-75.254831,42.016841],[-75.254819,42.017216],[-75.254755,42.018922],[-75.254722,42.020057],[-75.254712,42.020242],[-75.254695,42.020431],[-75.254668,42.020615],[-75.254631,42.0208],[-75.25444,42.021548],[-75.254394,42.021729],[-75.25429800000001,42.022107],[-75.254243,42.022288],[-75.254175,42.022485],[-75.25410100000001,42.022675],[-75.254069,42.022745],[-75.249672,42.02421],[-75.239302,42.027625],[-75.238715,42.02787],[-75.233469,42.029644],[-75.22908099999999,42.031128],[-75.217538,42.034968],[-75.210751,42.037226],[-75.20429799999999,42.039376],[-75.193123,42.043056],[-75.192374,42.043308],[-75.187195,42.045062],[-75.18492000000001,42.045833],[-75.17759599999999,42.048257],[-75.168587,42.051237],[-75.162499,42.053254],[-75.15919599999999,42.054355],[-75.153769,42.056222],[-75.150114,42.057393],[-75.14964000000001,42.05755],[-75.14885200000001,42.057807],[-75.142022,42.060209],[-75.133898,42.062843],[-75.130258,42.064019],[-75.12425,42.066026],[-75.12371,42.066307],[-75.123372,42.066482],[-75.123166,42.066546],[-75.11587400000001,42.068927],[-75.10927599999999,42.071084],[-75.109077,42.071145],[-75.095941,42.075451],[-75.09443,42.072958],[-75.079189,42.047773],[-75.07386099999999,42.03897],[-75.073616,42.038549],[-75.07355,42.038435],[-75.073482,42.038243],[-75.073307,42.037741],[-75.072644,42.036812],[-75.067725,42.028723],[-75.06567699999999,42.025312],[-75.065645,42.025258],[-75.064351,42.023103],[-75.064269,42.023036],[-75.063745,42.022156],[-75.061206,42.017905],[-75.06108399999999,42.017701],[-75.060918,42.017423],[-75.057732,42.012086],[-75.05166800000001,42.001928],[-75.051241,42.001218],[-75.05056500000001,42.000087],[-75.049722,41.998891],[-75.047347,41.995437],[-75.045272,41.991992],[-75.045238,41.991936],[-75.044552,41.990795],[-75.04258400000001,41.987954],[-75.042147,41.987322],[-75.038966,41.982733],[-75.03888499999999,41.982609],[-75.038038,41.981316],[-75.031638,41.971349],[-75.03115099999999,41.970722],[-75.03106699999999,41.97061],[-75.03101100000001,41.970481],[-75.03097200000001,41.97039],[-75.030895,41.970213],[-75.030833,41.970068],[-75.030579,41.969693],[-75.030466,41.969528],[-75.030354,41.969362],[-75.030157,41.969034],[-75.030081,41.968907],[-75.027323,41.964613],[-75.016305,41.947794],[-75.01426600000001,41.944671],[-75.01425500000001,41.944654],[-75.00957699999999,41.937365],[-75.0091,41.936962],[-75.002956,41.927305],[-75.00209599999999,41.925989],[-75.001864,41.925634],[-75.001633,41.925278],[-75.00127999999999,41.924736],[-75.00124099999999,41.924675],[-74.999622,41.922164],[-74.998977,41.921139],[-74.998943,41.921084],[-74.99889400000001,41.921007],[-74.998245,41.919975],[-74.997252,41.918485],[-74.99904100000001,41.917632],[-74.999188,41.917562],[-74.999393,41.917465],[-74.99960900000001,41.917361],[-74.999672,41.917332],[-74.999734,41.917302],[-74.99982199999999,41.917261],[-74.999909,41.91722],[-75.00143799999999,41.916501],[-75.001548,41.916449],[-75.001668,41.916393],[-75.00329499999999,41.915655],[-75.003469,41.915708],[-75.003619,41.915753],[-75.003764,41.915816],[-75.0039,41.915889],[-75.004031,41.91597],[-75.004154,41.916064],[-75.004266,41.916159],[-75.004372,41.916258],[-75.00447,41.916361],[-75.004758,41.916686],[-75.005168,41.917127],[-75.00539000000001,41.917343],[-75.00550699999999,41.917442],[-75.005629,41.917537],[-75.00575600000001,41.917627],[-75.006035,41.917798],[-75.00632299999999,41.917955],[-75.006467,41.918028],[-75.00675200000001,41.918181],[-75.00689199999999,41.918262],[-75.00702800000001,41.918347],[-75.007525,41.918703],[-75.007651,41.918784],[-75.008049,41.919018],[-75.008301,41.919189],[-75.008539,41.919365],[-75.008669,41.919432],[-75.008809,41.919473],[-75.008959,41.919491],[-75.009114,41.919495],[-75.009587,41.919477],[-75.009748,41.919486],[-75.009908,41.9195],[-75.010064,41.919527],[-75.010214,41.919567],[-75.010358,41.919617],[-75.01050499999999,41.919662],[-75.010803,41.919743],[-75.010953,41.919779],[-75.011523,41.919883],[-75.011567,41.919894],[-75.011652,41.919914],[-75.012027,41.920045],[-75.012288,41.920155],[-75.01250899999999,41.92027],[-75.012722,41.920409],[-75.012924,41.920558],[-75.013036,41.920625],[-75.013323,41.920851],[-75.01351200000001,41.921053],[-75.01342099999999,41.92135],[-75.013397,41.92145],[-75.013324,41.921661],[-75.01317299999999,41.922769],[-75.013205,41.922882],[-75.013274,41.92308],[-75.01333099999999,41.923174],[-75.01339299999999,41.923264],[-75.013808,41.923755],[-75.014014,41.923971],[-75.014161,41.924097],[-75.01431599999999,41.924201],[-75.014622,41.924363],[-75.015027,41.924566],[-75.01525700000001,41.924692],[-75.015371,41.924764],[-75.015474,41.92484],[-75.015567,41.924926],[-75.015736,41.92511],[-75.01581400000001,41.925214],[-75.01595500000001,41.925426],[-75.016211,41.925853],[-75.016273,41.925935],[-75.01634199999999,41.926061],[-75.016408,41.92616],[-75.016469,41.926241],[-75.01654499999999,41.926367],[-75.016745,41.926668],[-75.016802,41.926741],[-75.01684299999999,41.92681],[-75.016869,41.926853],[-75.01692,41.926952],[-75.016987,41.927056],[-75.01705,41.927168],[-75.01711400000001,41.927303],[-75.01735600000001,41.927722],[-75.017652,41.928209],[-75.017734,41.928312],[-75.017906,41.92851],[-75.017995,41.928578],[-75.018207,41.928776],[-75.018333,41.928843],[-75.018467,41.928902],[-75.018612,41.928947],[-75.018761,41.928983],[-75.018916,41.929001],[-75.019212,41.929014],[-75.01952900000001,41.929046],[-75.019689,41.929082],[-75.02000200000001,41.929118],[-75.02142600000001,41.929365],[-75.021582,41.929379],[-75.021744,41.929406],[-75.021911,41.929446],[-75.02236000000001,41.929523],[-75.022807,41.929572],[-75.022961,41.929595],[-75.02325,41.929581],[-75.023404,41.929577],[-75.02356,41.929586],[-75.023709,41.929567],[-75.02385200000001,41.929554],[-75.02398700000001,41.929536],[-75.02440900000001,41.929513],[-75.024548,41.9295],[-75.024692,41.929495],[-75.02498,41.929473],[-75.02526899999999,41.929459],[-75.02540999999999,41.929464],[-75.02555,41.929477],[-75.025684,41.929508],[-75.025809,41.929563],[-75.025926,41.929621],[-75.026247,41.929842],[-75.02667700000001,41.930098],[-75.026791,41.930161],[-75.02690200000001,41.930229],[-75.027022,41.930292],[-75.02739099999999,41.930467],[-75.027647,41.930562],[-75.02804,41.930679],[-75.02817400000001,41.930715],[-75.028305,41.930737],[-75.029742,41.930786],[-75.03003099999999,41.930836],[-75.030153,41.930863],[-75.030199,41.930881],[-75.03027,41.930908],[-75.03082999999999,41.931291],[-75.030874,41.931372],[-75.031054,41.931615],[-75.031192,41.931781],[-75.031265,41.931862],[-75.03206400000001,41.932463],[-75.032391,41.933182],[-75.03244599999999,41.933272],[-75.032535,41.933447],[-75.033407,41.934411],[-75.03365100000001,41.93464],[-75.033742,41.934708],[-75.033942,41.934825],[-75.034171,41.934924],[-75.034419,41.935041],[-75.034791,41.93523],[-75.035033,41.935365],[-75.03514699999999,41.935441],[-75.035275,41.935504],[-75.03601399999999,41.935837],[-75.036126,41.9359],[-75.036438,41.936099],[-75.036665,41.936198],[-75.036779,41.936256],[-75.03691000000001,41.936292],[-75.03704,41.936337],[-75.03745600000001,41.936431],[-75.03773099999999,41.936503],[-75.037865,41.936544],[-75.038118,41.936643],[-75.038234,41.936697],[-75.03844100000001,41.936823],[-75.038944,41.937219],[-75.03918,41.937354],[-75.039304,41.937417],[-75.039435,41.937467],[-75.03956100000001,41.937525],[-75.03967900000001,41.937588],[-75.04012400000001,41.937712],[-75.040457,41.937701],[-75.04066400000001,41.937628],[-75.04098999999999,41.937567],[-75.04132199999999,41.937558],[-75.04173400000001,41.937593],[-75.041883,41.937643],[-75.042022,41.937715],[-75.042188,41.937948],[-75.042506,41.938461],[-75.042575,41.938555],[-75.043126,41.939104],[-75.043367,41.93937],[-75.04345600000001,41.939456],[-75.043515,41.939555],[-75.043582,41.939649],[-75.04368599999999,41.939847],[-75.043756,41.939951],[-75.043841,41.940054],[-75.043998,41.940262],[-75.044391,41.940761],[-75.04469899999999,41.941166],[-75.044838,41.941365],[-75.044935,41.94145],[-75.04503099999999,41.941545],[-75.045355,41.94177],[-75.04557,41.94195],[-75.045973,41.94231],[-75.046263,41.942553],[-75.04656,41.942778],[-75.04668100000001,41.942854],[-75.046763,41.942913],[-75.046967,41.943033],[-75.047085,41.943102],[-75.04719799999999,41.94316],[-75.047319,41.943214],[-75.04767200000001,41.943385],[-75.048164,41.943601],[-75.048383,41.943709],[-75.048917,41.944047],[-75.04902800000001,41.944096],[-75.04926,41.944186],[-75.049628,41.944227],[-75.04975,41.944222],[-75.049885,41.944254],[-75.050012,41.944276],[-75.050251,41.944326],[-75.050369,41.944361],[-75.05060899999999,41.944442],[-75.050732,41.944474],[-75.050853,41.944514],[-75.05097600000001,41.944546],[-75.051231,41.944609],[-75.051356,41.944636],[-75.051481,41.944672],[-75.052232,41.944865],[-75.052487,41.944923],[-75.052734,41.944968],[-75.052986,41.945],[-75.05351400000001,41.945009],[-75.054396,41.944963],[-75.054896,41.944949],[-75.055138,41.944927],[-75.055252,41.944904],[-75.055468,41.94485],[-75.05557399999999,41.944814],[-75.056144,41.944683],[-75.05624400000001,41.94466],[-75.056371,41.944647],[-75.05767,41.944561],[-75.05781399999999,41.944556],[-75.058232,41.944569],[-75.05864200000001,41.944605],[-75.058758,41.944628],[-75.058966,41.944677],[-75.059051,41.9447],[-75.059119,41.944722],[-75.059166,41.944731],[-75.059207,41.94474],[-75.05922700000001,41.94474],[-75.059281,41.944772],[-75.059337,41.944808],[-75.059406,41.944862],[-75.059487,41.944934],[-75.059573,41.945024],[-75.059651,41.945123],[-75.05972199999999,41.945231],[-75.059787,41.945343],[-75.060047,41.945901],[-75.06016200000001,41.946122],[-75.06023,41.946226],[-75.06027400000001,41.946334],[-75.060399,41.946563],[-75.060452,41.946676],[-75.06049299999999,41.946788],[-75.060524,41.946901],[-75.06054399999999,41.947018],[-75.060541,41.947243],[-75.06050399999999,41.947598],[-75.060508,41.947829],[-75.060609,41.948707],[-75.06067899999999,41.948932],[-75.06070099999999,41.949044],[-75.060813,41.949472],[-75.060849,41.949567],[-75.060947,41.949742],[-75.061032,41.949819],[-75.061126,41.949882],[-75.061232,41.949936],[-75.061339,41.949976],[-75.06144,41.950008],[-75.06173200000001,41.950084],[-75.061825,41.950116],[-75.06191200000001,41.950156],[-75.061994,41.950201],[-75.062072,41.950255],[-75.062291,41.950444],[-75.062511,41.950665],[-75.06271700000001,41.950885],[-75.062772,41.950957],[-75.062878,41.951115],[-75.064002,41.952713],[-75.064054,41.952826],[-75.06411300000001,41.952898],[-75.064297,41.953154],[-75.064314,41.953176],[-75.064438,41.953334],[-75.064599,41.953528],[-75.06478300000001,41.953699],[-75.06488899999999,41.95378],[-75.065005,41.953847],[-75.065128,41.953906],[-75.065258,41.953955],[-75.06539100000001,41.954],[-75.06592000000001,41.954148],[-75.066316,41.954266],[-75.066571,41.954373],[-75.066829,41.954495],[-75.067387,41.95485],[-75.067577,41.955012],[-75.068045,41.955431],[-75.068437,41.955899],[-75.06866599999999,41.956182],[-75.06882899999999,41.956358],[-75.068956,41.956551],[-75.069031,41.956646],[-75.069227,41.956916],[-75.069301,41.957002],[-75.069383,41.957083],[-75.069568,41.957236],[-75.069666,41.957303],[-75.06987700000001,41.957429],[-75.069988,41.957479],[-75.07010699999999,41.957519],[-75.070346,41.957573],[-75.07049000000001,41.957601],[-75.070601,41.957622],[-75.070868,41.957658],[-75.071004,41.957667],[-75.071578,41.957653],[-75.07219600000001,41.957599],[-75.072515,41.957567],[-75.07267400000001,41.957544],[-75.07283200000001,41.957526],[-75.073307,41.95749],[-75.07346800000001,41.95749],[-75.073627,41.957503],[-75.073781,41.957526],[-75.07393,41.957562],[-75.074068,41.957607],[-75.074196,41.957665],[-75.07431800000001,41.957732],[-75.074546,41.957885],[-75.07474999999999,41.958065],[-75.07514,41.958434],[-75.075248,41.95852],[-75.07545,41.958695],[-75.075661,41.958857],[-75.075774,41.958925],[-75.076007,41.959042],[-75.076133,41.959087],[-75.076392,41.959163],[-75.077556,41.959811],[-75.07767,41.959869],[-75.077752,41.959941],[-75.078068,41.960162],[-75.078288,41.960301],[-75.078408,41.960351],[-75.078532,41.960396],[-75.07866199999999,41.960436],[-75.07892200000001,41.96049],[-75.079184,41.960517],[-75.07944999999999,41.960521],[-75.079582,41.960512],[-75.079742,41.960516],[-75.08007600000001,41.960435],[-75.08029500000001,41.960403],[-75.080406,41.960417],[-75.08051500000001,41.960448],[-75.08062,41.960489],[-75.080715,41.960543],[-75.08105999999999,41.960813],[-75.081326,41.961033],[-75.08163500000001,41.96133],[-75.081811,41.961519],[-75.08191100000001,41.961641],[-75.08195600000001,41.961686],[-75.082005,41.961744],[-75.08210800000001,41.961848],[-75.082261,41.96205],[-75.082365,41.962212],[-75.08259099999999,41.96252],[-75.08271499999999,41.962697],[-75.08283900000001,41.962921],[-75.082965,41.963222],[-75.082975,41.963581],[-75.08291800000001,41.964252],[-75.08301,41.964378],[-75.083433,41.964634],[-75.083541,41.964684],[-75.083652,41.96476],[-75.08377299999999,41.96485],[-75.084147,41.965071],[-75.084425,41.965219],[-75.084551,41.965291],[-75.084681,41.965377],[-75.084808,41.965453],[-75.08494,41.965525],[-75.085061,41.965601],[-75.085449,41.965804],[-75.085582,41.965862],[-75.085714,41.965925],[-75.08584500000001,41.965979],[-75.08615500000001,41.966116],[-75.086501,41.966258],[-75.086647,41.966307],[-75.086949,41.966393],[-75.08710000000001,41.966424],[-75.087406,41.966505],[-75.088329,41.967027],[-75.088448,41.967112],[-75.089628,41.968048],[-75.089658,41.968192],[-75.089654,41.968327],[-75.089637,41.968453],[-75.089602,41.968579],[-75.089552,41.96884],[-75.089551,41.96898],[-75.089501,41.969187],[-75.089507,41.969376],[-75.08949800000001,41.969507],[-75.089502,41.969642],[-75.089538,41.969764],[-75.089597,41.969876],[-75.08967800000001,41.96998],[-75.08978399999999,41.970079],[-75.089894,41.970164],[-75.090017,41.970245],[-75.090152,41.970317],[-75.090287,41.970398],[-75.090451,41.970461],[-75.090886,41.970686],[-75.09101699999999,41.970762],[-75.09115199999999,41.970834],[-75.09128800000001,41.970893],[-75.091432,41.970969],[-75.09157999999999,41.970996],[-75.091736,41.971018],[-75.092056,41.97105],[-75.092337,41.971049],[-75.09239700000001,41.971049],[-75.092583,41.971054],[-75.09290900000001,41.971017],[-75.093067,41.971008],[-75.093216,41.971013],[-75.09336500000001,41.971031],[-75.093508,41.971066],[-75.09364600000001,41.97112],[-75.09377000000001,41.971192],[-75.093918,41.971293],[-75.094047,41.971381],[-75.094331,41.971561],[-75.0947,41.971813],[-75.094803,41.971912],[-75.09488899999999,41.971988],[-75.094982,41.972105],[-75.095055,41.972209],[-75.095241,41.972533],[-75.09529999999999,41.972646],[-75.095387,41.972749],[-75.095483,41.972848],[-75.09558800000001,41.972934],[-75.095885,41.973156],[-75.095907,41.973172],[-75.096002,41.973258],[-75.09608299999999,41.973357],[-75.09615700000001,41.97346],[-75.096363,41.973771],[-75.096401,41.973865],[-75.09641000000001,41.973875],[-75.096851,41.974509],[-75.09714,41.975099],[-75.097386,41.975711],[-75.097448,41.976031],[-75.097601,41.976614],[-75.097651,41.976818],[-75.09769799999999,41.977131],[-75.09772100000001,41.977343],[-75.09773300000001,41.977596],[-75.097759,41.977802],[-75.097813,41.978378],[-75.09778799999999,41.978771],[-75.097795,41.979152],[-75.09840699999999,41.979776],[-75.098287,41.979835],[-75.09842500000001,41.979943],[-75.098439,41.979965],[-75.09847600000001,41.979998],[-75.098491,41.980025],[-75.098528,41.980052],[-75.098528,41.980074],[-75.09856499999999,41.980107],[-75.098572,41.980135],[-75.098601,41.980157],[-75.09860399999999,41.980175],[-75.098623,41.98019],[-75.098646,41.980234],[-75.098675,41.980256],[-75.098676,41.980274],[-75.09873399999999,41.980338],[-75.09883499999999,41.980436],[-75.098889,41.980413],[-75.09907699999999,41.980331],[-75.099097,41.98033],[-75.099795,41.979844],[-75.100493,41.979423],[-75.101321,41.979129],[-75.102341,41.979046],[-75.103308,41.979129],[-75.104573,41.979351],[-75.105335,41.979754],[-75.105744,41.979919],[-75.105805,41.979944],[-75.106086,41.980058],[-75.107028,41.980439],[-75.10754300000001,41.980505],[-75.108394,41.98063],[-75.112185,41.981184],[-75.113274,41.981477],[-75.11382999999999,41.981627],[-75.11438699999999,41.981776],[-75.11518100000001,41.98199],[-75.11534899999999,41.982078],[-75.116938,41.982911],[-75.117807,41.983627],[-75.118865,41.98468],[-75.12044400000001,41.985565],[-75.121972,41.986423],[-75.12208200000001,41.986484],[-75.122191,41.986546],[-75.122406,41.986666],[-75.122803,41.98679],[-75.12432,41.987266],[-75.124501,41.987401],[-75.124612,41.987401],[-75.124836,41.987381],[-75.125017,41.987516],[-75.125379,41.987606],[-75.1255,41.987696],[-75.125621,41.987696],[-75.12597100000001,41.987831],[-75.127252,41.988324],[-75.127554,41.988549],[-75.127735,41.988549],[-75.128823,41.988998],[-75.129125,41.989223],[-75.129306,41.989223],[-75.129492,41.989333],[-75.129608,41.989402],[-75.129729,41.989402],[-75.130334,41.989897],[-75.130409,41.989908],[-75.13150400000001,41.990502],[-75.131837,41.990677],[-75.13224,41.990726],[-75.135463,41.991118],[-75.13739200000001,41.991234],[-75.137821,41.991349],[-75.13925,41.991733],[-75.139291,41.991744],[-75.140343,41.992027],[-75.14146100000001,41.992327],[-75.14233900000001,41.992563],[-75.142763,41.992629],[-75.144547,41.992908],[-75.144761,41.992942],[-75.145534,41.993063],[-75.14567,41.993084],[-75.145695,41.993101],[-75.145915,41.993256],[-75.146278,41.993514],[-75.146899,41.993953],[-75.14722999999999,41.994187],[-75.148053,41.995072],[-75.14850300000001,41.995691],[-75.15028,41.997265],[-75.150797,41.997752],[-75.152209,41.999082],[-75.152429,41.999265],[-75.152449,41.999282],[-75.15253199999999,41.999353],[-75.153104,42.000089],[-75.153167,42.000159],[-75.153981,42.000825],[-75.15493600000001,42.001105],[-75.15605499999999,42.001206],[-75.156856,42.001075],[-75.15727699999999,42.001099],[-75.15761000000001,42.001194],[-75.157751,42.001152],[-75.158193,42.00102],[-75.15863400000001,42.000887],[-75.15870200000001,42.000869],[-75.158744,42.000858],[-75.15942699999999,42.000383],[-75.15948400000001,42.000221],[-75.15953,42.000092],[-75.15960200000001,41.999882],[-75.159677,41.999662],[-75.160706,41.998734],[-75.16228599999999,41.997692],[-75.16331,41.997015],[-75.16374999999999,41.996725],[-75.163892,41.996631],[-75.164664,41.995494],[-75.16498300000001,41.994239],[-75.164556,41.99203],[-75.163077,41.987445],[-75.16266400000001,41.987293],[-75.162514,41.987238],[-75.160168,41.986377],[-75.159288,41.985603],[-75.159098,41.985436],[-75.159071,41.98514],[-75.159023,41.984614],[-75.159105,41.984442],[-75.159764,41.983062],[-75.16005,41.98266],[-75.162302,41.980592],[-75.163991,41.979721],[-75.164329,41.979547],[-75.16467799999999,41.979396],[-75.16659799999999,41.978568],[-75.168031,41.977838],[-75.168622,41.977669],[-75.170975,41.976797],[-75.174926,41.973324],[-75.177154,41.970029],[-75.177915,41.968904],[-75.17931799999999,41.96683],[-75.17983700000001,41.966451],[-75.180026,41.966314],[-75.18021400000001,41.966176],[-75.180154,41.966176],[-75.179951,41.966176],[-75.179783,41.966181],[-75.179535,41.966181],[-75.17913799999999,41.966182],[-75.178646,41.966196],[-75.17790100000001,41.966207],[-75.177526,41.966207],[-75.177463,41.9662],[-75.177437,41.966189],[-75.177403,41.966191],[-75.177311,41.966167],[-75.177218,41.966122],[-75.177058,41.965998],[-75.176981,41.965938],[-75.17642499999999,41.96556],[-75.176334,41.965484],[-75.176213,41.96543],[-75.176115,41.965363],[-75.175997,41.965304],[-75.17558699999999,41.965174],[-75.175309,41.965094],[-75.174981,41.965006],[-75.174745,41.964942],[-75.174618,41.964892],[-75.174466,41.964865],[-75.174249,41.964803],[-75.173811,41.964678],[-75.173321,41.964538],[-75.173187,41.964485],[-75.17304,41.96444],[-75.172876,41.964413],[-75.17273,41.964373],[-75.17259900000001,41.96431],[-75.17245,41.964269],[-75.17228299999999,41.964243],[-75.171876,41.964126],[-75.171695,41.964077],[-75.171609,41.964034],[-75.17156900000001,41.964014],[-75.171424,41.963969],[-75.171138,41.963884],[-75.17099899999999,41.96383],[-75.170816,41.963768],[-75.17071199999999,41.963673],[-75.170633,41.963565],[-75.17057200000001,41.963453],[-75.170466,41.963219],[-75.170402,41.963102],[-75.17033000000001,41.962994],[-75.170247,41.962886],[-75.17017800000001,41.962778],[-75.170078,41.962674],[-75.16996399999999,41.96258],[-75.16983399999999,41.96249],[-75.169686,41.962414],[-75.16952000000001,41.962346],[-75.169332,41.962288],[-75.16912600000001,41.962234],[-75.16799899999999,41.96197],[-75.167064,41.961742],[-75.166596,41.961635],[-75.16636200000001,41.961576],[-75.166128,41.961523],[-75.16566400000001,41.961406],[-75.165437,41.961339],[-75.16521400000001,41.961267],[-75.164996,41.961191],[-75.16465100000001,41.961059],[-75.164373,41.960953],[-75.164175,41.960873],[-75.163985,41.960787],[-75.163805,41.960693],[-75.163639,41.960585],[-75.163493,41.960468],[-75.16336200000001,41.960333],[-75.163005,41.959915],[-75.16287800000001,41.95978],[-75.16274300000001,41.959654],[-75.16260200000001,41.959533],[-75.16231399999999,41.959308],[-75.162181,41.959191],[-75.162065,41.959074],[-75.161967,41.958953],[-75.16190400000001,41.958856],[-75.161801,41.958696],[-75.16167900000001,41.958431],[-75.161609,41.9583],[-75.16153199999999,41.958174],[-75.16143700000001,41.958038],[-75.161356,41.957922],[-75.161267,41.957805],[-75.161204,41.957679],[-75.161036,41.957459],[-75.160949,41.957356],[-75.16085,41.957261],[-75.16072699999999,41.957176],[-75.160571,41.957113],[-75.160388,41.957077],[-75.160191,41.957059],[-75.15979900000001,41.957051],[-75.15941599999999,41.957069],[-75.159228,41.957088],[-75.159057,41.957119],[-75.158873,41.957142],[-75.158692,41.95717],[-75.158518,41.95721],[-75.158185,41.957328],[-75.158024,41.957391],[-75.157861,41.957436],[-75.157695,41.957468],[-75.15751299999999,41.957464],[-75.157338,41.957451],[-75.157168,41.957415],[-75.157006,41.957352],[-75.15685499999999,41.95728],[-75.156713,41.957199],[-75.156578,41.957109],[-75.15644899999999,41.957015],[-75.156205,41.956799],[-75.155863,41.956453],[-75.155243,41.955886],[-75.155128,41.955774],[-75.15502600000001,41.955657],[-75.154938,41.95554],[-75.15486900000001,41.955409],[-75.154816,41.955274],[-75.154721,41.954991],[-75.15466000000001,41.954851],[-75.15458700000001,41.954712],[-75.15442299999999,41.954455],[-75.15433299999999,41.954334],[-75.15423199999999,41.954217],[-75.154111,41.954118],[-75.153969,41.954033],[-75.15380999999999,41.953965],[-75.153638,41.953911],[-75.153274,41.953835],[-75.15289300000001,41.953768],[-75.15250899999999,41.953688],[-75.15193499999999,41.953553],[-75.151887,41.953541],[-75.15174500000001,41.953504],[-75.151366,41.953397],[-75.15117600000001,41.953338],[-75.15098399999999,41.953285],[-75.150401,41.953155],[-75.15021,41.953101],[-75.149839,41.952984],[-75.149659,41.952921],[-75.149479,41.952863],[-75.149308,41.952796],[-75.149147,41.952719],[-75.149134,41.952712],[-75.148995,41.952634],[-75.14885200000001,41.952535],[-75.148582,41.952319],[-75.148326,41.952095],[-75.148208,41.951978],[-75.148121,41.951883],[-75.14809700000001,41.951856],[-75.147966,41.951735],[-75.147777,41.951478],[-75.14770300000001,41.951352],[-75.14758500000001,41.951235],[-75.147448,41.951132],[-75.14729800000001,41.951038],[-75.146975,41.950876],[-75.146812,41.9508],[-75.146655,41.950719],[-75.14650899999999,41.950624],[-75.14637399999999,41.950525],[-75.14625100000001,41.950422],[-75.146137,41.95031],[-75.14603,41.950197],[-75.14590200000001,41.950085],[-75.14549100000001,41.949594],[-75.145415,41.949459],[-75.14519799999999,41.949198],[-75.145081,41.949072],[-75.14495599999999,41.948951],[-75.14482099999999,41.948834],[-75.14462399999999,41.948688],[-75.14453,41.948618],[-75.14326699999999,41.947832],[-75.142821,41.947562],[-75.142419,41.947331],[-75.142274,41.947248],[-75.14213700000001,41.94718],[-75.142016,41.947086],[-75.141892,41.947],[-75.141773,41.946906],[-75.141549,41.946699],[-75.141336,41.946474],[-75.14131,41.946443],[-75.14103299999999,41.946105],[-75.140739,41.9457],[-75.14063299999999,41.945565],[-75.140517,41.94543],[-75.140388,41.945304],[-75.140246,41.945183],[-75.140094,41.945066],[-75.139135,41.944419],[-75.138981,41.944324],[-75.138823,41.944235],[-75.138659,41.944154],[-75.138485,41.944091],[-75.13830400000001,41.944042],[-75.13793,41.943961],[-75.13773999999999,41.943916],[-75.13736299999999,41.943808],[-75.137179,41.94375],[-75.13700300000001,41.943687],[-75.13683399999999,41.943611],[-75.136674,41.94353],[-75.136517,41.943445],[-75.13635600000001,41.943368],[-75.13619,41.943297],[-75.136015,41.943234],[-75.135836,41.943184],[-75.13547,41.943099],[-75.13510100000001,41.943023],[-75.134978,41.942999],[-75.134913,41.942987],[-75.13472299999999,41.942947],[-75.13452599999999,41.942911],[-75.134152,41.942799],[-75.133971,41.942732],[-75.133792,41.942655],[-75.133263,41.942404],[-75.133092,41.942318],[-75.132766,41.942134],[-75.13197599999999,41.941626],[-75.131805,41.941545],[-75.13167199999999,41.941424],[-75.131383,41.94124],[-75.131248,41.941141],[-75.13100900000001,41.940929],[-75.130948,41.94079],[-75.130903,41.94065],[-75.130866,41.940515],[-75.130838,41.940371],[-75.13076599999999,41.940096],[-75.130663,41.939737],[-75.130617,41.939565],[-75.130588,41.939444],[-75.130522,41.939331],[-75.130492,41.939223],[-75.130498,41.93911],[-75.130466,41.939011],[-75.130413,41.938926],[-75.13033799999999,41.938845],[-75.13023800000001,41.938782],[-75.130118,41.938737],[-75.129982,41.938715],[-75.129858,41.938742],[-75.129713,41.938756],[-75.12924599999999,41.938846],[-75.12907800000001,41.938882],[-75.128906,41.938914],[-75.128714,41.938914],[-75.12836299999999,41.938978],[-75.128187,41.939014],[-75.128012,41.939059],[-75.127844,41.939113],[-75.127692,41.939204],[-75.127528,41.939271],[-75.12735600000001,41.93933],[-75.127177,41.93938],[-75.126993,41.939421],[-75.12662400000001,41.939493],[-75.126426,41.939502],[-75.126367,41.939515],[-75.126086,41.939579],[-75.12560999999999,41.939724],[-75.125463,41.93976],[-75.125321,41.939787],[-75.125182,41.939796],[-75.125047,41.939788],[-75.124917,41.939756],[-75.124798,41.939707],[-75.124689,41.939639],[-75.124568,41.939585],[-75.124504,41.93954],[-75.124461,41.939506],[-75.124413,41.939481],[-75.12434,41.939437],[-75.124205,41.939379],[-75.12405800000001,41.939325],[-75.123902,41.939275],[-75.123743,41.939231],[-75.12358399999999,41.939181],[-75.12343199999999,41.939118],[-75.12329099999999,41.939042],[-75.12316300000001,41.938961],[-75.12304899999999,41.938862],[-75.12294,41.938772],[-75.12274499999999,41.938574],[-75.122657,41.938466],[-75.12258799999999,41.938345],[-75.122512,41.938237],[-75.122445,41.938129],[-75.12239099999999,41.938016],[-75.122348,41.937908],[-75.122311,41.937805],[-75.12227900000001,41.937701],[-75.12222,41.937611],[-75.122184,41.937521],[-75.122167,41.937431],[-75.122114,41.937359],[-75.122051,41.937291],[-75.121976,41.937233],[-75.121888,41.937183],[-75.121787,41.937098],[-75.1217,41.937008],[-75.121668,41.936977],[-75.12162499999999,41.936941],[-75.121585,41.936909],[-75.121574,41.9369],[-75.121517,41.93686],[-75.121172,41.936639],[-75.120969,41.9365],[-75.120901,41.936446],[-75.12068499999999,41.936289],[-75.120475,41.936145],[-75.120411,41.936095],[-75.12017899999999,41.935938],[-75.12007699999999,41.935857],[-75.12003199999999,41.935812],[-75.12,41.935762],[-75.11994900000001,41.935708],[-75.119916,41.93565],[-75.119889,41.935587],[-75.119874,41.935519],[-75.11986899999999,41.935443],[-75.11987499999999,41.935366],[-75.11993200000001,41.935051],[-75.12012199999999,41.934209],[-75.120195,41.933844],[-75.120257,41.933569],[-75.12034800000001,41.933092],[-75.12042099999999,41.932515],[-75.12042700000001,41.932213],[-75.120419,41.931912],[-75.120424,41.931808],[-75.120418,41.931295],[-75.120366,41.930295],[-75.120366,41.930205],[-75.12037599999999,41.930127],[-75.120413,41.92993],[-75.120447,41.929799],[-75.120464,41.929736],[-75.12056800000001,41.929426],[-75.12067999999999,41.929128],[-75.120811,41.928849],[-75.121121,41.928281],[-75.121313,41.927912],[-75.121393,41.927731],[-75.121488,41.927457],[-75.12154099999999,41.927272],[-75.12156,41.927177],[-75.121877,41.92647],[-75.121903,41.926375],[-75.121934,41.926312],[-75.12198100000001,41.926164],[-75.12203,41.926033],[-75.12204800000001,41.925956],[-75.12211000000001,41.925857],[-75.122139,41.925799],[-75.12219399999999,41.92565],[-75.122229,41.925582],[-75.12227,41.925519],[-75.12239599999999,41.92528],[-75.12244800000001,41.925163],[-75.122455,41.925142],[-75.122491,41.92504],[-75.122495,41.925028],[-75.12263799999999,41.92474],[-75.122775,41.924438],[-75.12309999999999,41.923622],[-75.123256,41.923262],[-75.1233,41.923145],[-75.123559,41.922532],[-75.124228,41.921077],[-75.124461,41.920523],[-75.12458700000001,41.920207],[-75.12465400000001,41.919996],[-75.124681,41.919928],[-75.124703,41.919851],[-75.12475499999999,41.919604],[-75.124759,41.919518],[-75.12477800000001,41.919437],[-75.12477699999999,41.919356],[-75.12476599999999,41.919275],[-75.124763,41.919203],[-75.124768,41.919081],[-75.12476599999999,41.918955],[-75.12475499999999,41.918897],[-75.124754,41.918757],[-75.124764,41.918726],[-75.124773,41.918667],[-75.12523299999999,41.919209],[-75.12559899999999,41.919536],[-75.125872,41.919688],[-75.12647,41.919882],[-75.127166,41.92011],[-75.127555,41.920166],[-75.127666,41.920164],[-75.127853,41.920132],[-75.12807599999999,41.920087],[-75.12818900000001,41.919985],[-75.12840799999999,41.919847],[-75.128693,41.919781],[-75.129103,41.919725],[-75.129222,41.919729],[-75.12936000000001,41.919743],[-75.129627,41.919751],[-75.12981000000001,41.919765],[-75.129993,41.919773],[-75.13020299999999,41.919796],[-75.130264,41.919809],[-75.130484,41.919809],[-75.130571,41.919827],[-75.130644,41.919827],[-75.130707,41.91984],[-75.13086,41.919849],[-75.130934,41.919858],[-75.13100799999999,41.919862],[-75.131241,41.919885],[-75.131326,41.919889],[-75.131585,41.91992],[-75.131675,41.919934],[-75.131764,41.919956],[-75.13184099999999,41.919963],[-75.131958,41.919974],[-75.13224700000001,41.920014],[-75.13315799999999,41.920184],[-75.133258,41.920207],[-75.133454,41.920242],[-75.133549,41.920265],[-75.13388999999999,41.920332],[-75.13455500000001,41.92048],[-75.134612,41.920489],[-75.134834,41.920538],[-75.135137,41.920619],[-75.135183,41.920628],[-75.135391,41.92069],[-75.135639,41.920771],[-75.13570799999999,41.920789],[-75.136556,41.921144],[-75.13673799999999,41.921283],[-75.13676,41.921306],[-75.13732,41.922346],[-75.137578,41.922825],[-75.13788700000001,41.923264],[-75.13843,41.923731],[-75.139529,41.924353],[-75.140303,41.924883],[-75.141572,41.925765],[-75.14220299999999,41.926176],[-75.142433,41.926447],[-75.143862,41.928436],[-75.144037,41.928538],[-75.144212,41.928582],[-75.144447,41.928568],[-75.14455599999999,41.928578],[-75.144991,41.9286],[-75.14528799999999,41.928604],[-75.145433,41.9286],[-75.14585099999999,41.928608],[-75.146103,41.928581],[-75.14621699999999,41.928558],[-75.146322,41.928522],[-75.14642000000001,41.928477],[-75.146591,41.928378],[-75.146748,41.92826],[-75.14722500000001,41.927971],[-75.14748400000001,41.927831],[-75.147638,41.92775],[-75.148144,41.927556],[-75.148466,41.927438],[-75.148777,41.927316],[-75.148876,41.927267],[-75.148977,41.927226],[-75.149175,41.927136],[-75.14927900000001,41.927113],[-75.149361,41.927054],[-75.149446,41.927014],[-75.14946,41.927005],[-75.14952099999999,41.926964],[-75.14959,41.92691],[-75.149749,41.926752],[-75.149787,41.926694],[-75.149884,41.926518],[-75.14991000000001,41.92645],[-75.149941,41.926387],[-75.15002,41.926198],[-75.15004,41.926135],[-75.150239,41.925639],[-75.150396,41.925126],[-75.150452,41.92486],[-75.15053899999999,41.924594],[-75.15061,41.924427],[-75.150701,41.924256],[-75.150856,41.92404],[-75.15114199999999,41.923607],[-75.151177,41.923548],[-75.15136699999999,41.923278],[-75.15141199999999,41.923224],[-75.15151400000001,41.92312],[-75.151624,41.923025],[-75.151741,41.922931],[-75.15180599999999,41.92289],[-75.15186799999999,41.92284],[-75.15194,41.922804],[-75.153564,41.922551],[-75.15363000000001,41.922541],[-75.15370900000001,41.922514],[-75.153931,41.922419],[-75.154005,41.922378],[-75.154146,41.922288],[-75.154213,41.922238],[-75.15433299999999,41.922139],[-75.154619,41.92195],[-75.15465399999999,41.921909],[-75.155964,41.920822],[-75.156085,41.9207],[-75.156172,41.920628],[-75.156217,41.920601],[-75.156261,41.920551],[-75.15629199999999,41.920535],[-75.157847,41.920662],[-75.15840300000001,41.920711],[-75.162333,41.921034],[-75.16260200000001,41.921051],[-75.163955,41.921162],[-75.16422900000001,41.921189],[-75.164778,41.921233],[-75.165075,41.921262],[-75.16576999999999,41.921319],[-75.16604,41.921341],[-75.16877599999999,41.921567],[-75.169252,41.921609],[-75.17358299999999,41.921954],[-75.173829,41.921976],[-75.17407799999999,41.922003],[-75.17433,41.92202],[-75.174819,41.922062],[-75.17536800000001,41.922109],[-75.175635,41.922136],[-75.176186,41.922184],[-75.177943,41.922308],[-75.178235,41.922321],[-75.179147,41.922322],[-75.17936400000001,41.922323],[-75.179637,41.922314],[-75.18017500000001,41.922282],[-75.182016,41.922126],[-75.18227899999999,41.922098],[-75.18389500000001,41.921961],[-75.18443000000001,41.921919],[-75.18615200000001,41.921774],[-75.186746,41.921724],[-75.186806,41.921721],[-75.18683799999999,41.921716],[-75.18714799999999,41.921685],[-75.187758,41.921635],[-75.188541,41.92157],[-75.18911300000001,41.921515],[-75.19027199999999,41.921423],[-75.19113900000001,41.92135],[-75.19142600000001,41.921322],[-75.19282800000001,41.921203],[-75.193102,41.921175],[-75.194441,41.92106],[-75.194965,41.92101],[-75.19628400000001,41.920895],[-75.197367,41.920821],[-75.198199,41.920743],[-75.19877200000001,41.920697],[-75.200149,41.920578],[-75.20049899999999,41.920538],[-75.202647,41.920281],[-75.203159,41.920172],[-75.20366300000001,41.92004],[-75.204159,41.919886],[-75.204651,41.919714],[-75.20513800000001,41.919524],[-75.207083,41.918706],[-75.20732599999999,41.918597],[-75.20757,41.918498],[-75.210021,41.917457],[-75.210272,41.917357],[-75.211472,41.916844],[-75.21154799999999,41.916811],[-75.21248,41.916413],[-75.21272399999999,41.916304],[-75.213944,41.915788],[-75.214187,41.915689],[-75.21519600000001,41.915264],[-75.21609599999999,41.914885],[-75.21638900000001,41.914761],[-75.217021,41.914495],[-75.219281,41.913527],[-75.219909,41.913269],[-75.22011000000001,41.913178],[-75.220496,41.912988],[-75.22068299999999,41.912889],[-75.220866,41.912776],[-75.22104,41.912659],[-75.221363,41.912406],[-75.221799,41.911991],[-75.222042,41.911693],[-75.222151,41.91154],[-75.222251,41.911382],[-75.222324,41.911251],[-75.22242199999999,41.911053],[-75.222492,41.910881],[-75.22260799999999,41.910539],[-75.22269,41.910192],[-75.222886,41.909183],[-75.222955,41.908777],[-75.22299,41.908573],[-75.223023,41.908381],[-75.223056,41.908228],[-75.22309799999999,41.908075],[-75.223152,41.907926],[-75.22318300000001,41.907858],[-75.22321700000001,41.907782],[-75.223367,41.907498],[-75.22345,41.907362],[-75.223539,41.907232],[-75.223636,41.907101],[-75.22373899999999,41.906979],[-75.22384700000001,41.906866],[-75.22396500000001,41.906758],[-75.224091,41.90665],[-75.22415100000001,41.906637],[-75.22489899999999,41.906158],[-75.225618,41.905873],[-75.226615,41.905676],[-75.22842199999999,41.905623],[-75.228723,41.905609],[-75.229833,41.905607],[-75.23014499999999,41.905605],[-75.23078099999999,41.905625],[-75.23099000000001,41.905642],[-75.230975,41.905353],[-75.23094,41.905249],[-75.230914,41.905073],[-75.230909,41.90497],[-75.23093299999999,41.904555],[-75.230923,41.904467],[-75.230909,41.904348],[-75.23088,41.904195],[-75.230833,41.904029],[-75.230751,41.903772],[-75.230727,41.903645],[-75.230648,41.903232],[-75.230616,41.903115],[-75.230547,41.902908],[-75.23039900000001,41.902466],[-75.230361,41.902354],[-75.230345,41.902296],[-75.23030199999999,41.902048],[-75.23017299999999,41.901535],[-75.230099,41.901309],[-75.230085,41.901265],[-75.230059,41.901198],[-75.229947,41.901004],[-75.22982,41.900811],[-75.229783,41.900748],[-75.22970599999999,41.900541],[-75.229574,41.900185],[-75.229546,41.900055],[-75.22952600000001,41.899926],[-75.229513,41.899839],[-75.229449,41.899591],[-75.229355,41.899321],[-75.229224,41.89888],[-75.229134,41.898619],[-75.2291,41.898448],[-75.22895200000001,41.897566],[-75.228919,41.89726],[-75.22889600000001,41.896755],[-75.228869,41.896381],[-75.22886,41.896192],[-75.228841,41.895954],[-75.22882199999999,41.89572],[-75.228728,41.894869],[-75.22871499999999,41.894589],[-75.22870899999999,41.894234],[-75.22867599999999,41.893954],[-75.22864300000001,41.893801],[-75.22859200000001,41.893621],[-75.22848399999999,41.89332],[-75.228312,41.892991],[-75.22789899999999,41.892389],[-75.227683,41.892119],[-75.227491,41.891854],[-75.22738099999999,41.891674],[-75.22729099999999,41.891498],[-75.22725699999999,41.891408],[-75.227234,41.891318],[-75.227225,41.891228],[-75.227226,41.890823],[-75.227221,41.890724],[-75.227007,41.889459],[-75.227115,41.889162],[-75.227549,41.887974],[-75.22762400000001,41.887769],[-75.227648,41.887481],[-75.227683,41.887278],[-75.22773599999999,41.88708],[-75.227946,41.886503],[-75.22801200000001,41.886309],[-75.228061,41.886195],[-75.228093,41.88612],[-75.228194,41.885921],[-75.22825400000001,41.885822],[-75.22869900000001,41.885267],[-75.22876100000001,41.885182],[-75.228855,41.885028],[-75.228886,41.884952],[-75.228909,41.884875],[-75.228883,41.884227],[-75.228849,41.88411],[-75.22881700000001,41.884002],[-75.22875999999999,41.883763],[-75.22874899999999,41.883696],[-75.22874400000001,41.883551],[-75.22875000000001,41.883475],[-75.228786,41.883304],[-75.228859,41.883051],[-75.22887900000001,41.882966],[-75.228951,41.882722],[-75.228981,41.88247],[-75.22899200000001,41.882299],[-75.228989,41.882033],[-75.22896799999999,41.881844],[-75.22895,41.88175],[-75.228894,41.881565],[-75.228821,41.88139],[-75.22866500000001,41.881075],[-75.22853499999999,41.880778],[-75.228453,41.880625],[-75.228354,41.880467],[-75.228185,41.88022],[-75.227953,41.879865],[-75.227891,41.879779],[-75.227816,41.879698],[-75.227737,41.879622],[-75.22764599999999,41.87955],[-75.227552,41.879483],[-75.227447,41.87942],[-75.227254,41.879303],[-75.227051,41.879186],[-75.226856,41.879061],[-75.226495,41.878796],[-75.226231,41.87858],[-75.225988,41.878351],[-75.225848,41.878189],[-75.225522,41.877784],[-75.225387,41.877632],[-75.224791,41.876921],[-75.224666,41.87675],[-75.22461,41.876665],[-75.224559,41.876575],[-75.22447699999999,41.876399],[-75.224371,41.876134],[-75.224288,41.875963],[-75.224183,41.875783],[-75.224,41.875491],[-75.223586,41.874793],[-75.223536,41.874717],[-75.223479,41.874645],[-75.22335200000001,41.874506],[-75.22313,41.874317],[-75.222892,41.874146],[-75.22265400000001,41.873989],[-75.222568,41.873944],[-75.219838,41.873333],[-75.219741,41.873283],[-75.219483,41.873122],[-75.219319,41.873036],[-75.21924199999999,41.873009],[-75.218281,41.872719],[-75.21818500000001,41.87266],[-75.21809,41.872593],[-75.218008,41.87253],[-75.217969,41.872499],[-75.217758,41.872323],[-75.21758,41.872197],[-75.21695,41.871884],[-75.216617,41.871792],[-75.216301,41.871706],[-75.216123,41.87163],[-75.215931,41.87151],[-75.215744,41.871348],[-75.215569,41.871167],[-75.215412,41.87096],[-75.215363,41.870909],[-75.215306,41.870837],[-75.215259,41.870761],[-75.215234,41.870693],[-75.215208,41.869784],[-75.21521799999999,41.869707],[-75.215215,41.869626],[-75.2152,41.869549],[-75.21513400000001,41.869401],[-75.215091,41.869338],[-75.21496399999999,41.869185],[-75.214916,41.869117],[-75.214855,41.869037],[-75.21483000000001,41.869014],[-75.214797,41.868996],[-75.214732,41.868992],[-75.21471200000001,41.868992],[-75.214648,41.869003],[-75.214547,41.86901],[-75.214489,41.869006],[-75.21408700000001,41.86879],[-75.214033,41.868755],[-75.213975,41.868696],[-75.213953,41.868674],[-75.21389600000001,41.868597],[-75.213875,41.868557],[-75.21385100000001,41.868485],[-75.21384399999999,41.868131],[-75.213801,41.86778],[-75.214023,41.867717],[-75.214382,41.867616],[-75.214742,41.867514],[-75.21496999999999,41.867449],[-75.215536,41.867019],[-75.215739,41.866746],[-75.21585,41.866596],[-75.215962,41.866445],[-75.216463,41.865822],[-75.21795299999999,41.863647],[-75.218059,41.863308],[-75.219234,41.861726],[-75.219297,41.861642],[-75.219296,41.861623],[-75.219891,41.860842],[-75.219927,41.860794],[-75.220125,41.860534],[-75.220765,41.859927],[-75.22198299999999,41.858987],[-75.222421,41.858582],[-75.22299599999999,41.857765],[-75.223338,41.857554],[-75.22373399999999,41.857456],[-75.225092,41.85748],[-75.225184,41.85748],[-75.22527599999999,41.85748],[-75.22572,41.857481],[-75.22586200000001,41.857519],[-75.226676,41.857735],[-75.227136,41.857919],[-75.22743699999999,41.85804],[-75.227737,41.85816],[-75.227785,41.858188],[-75.228647,41.85897],[-75.229024,41.859231],[-75.229283,41.859411],[-75.229562,41.859402],[-75.22992600000001,41.85932],[-75.230366,41.859238],[-75.230698,41.859164],[-75.23106300000001,41.859203],[-75.231612,41.859459],[-75.23246399999999,41.860133],[-75.233681,41.860903],[-75.234565,41.861569],[-75.23605499999999,41.863096],[-75.23726600000001,41.864487],[-75.238743,41.865699],[-75.240112,41.866597],[-75.241134,41.867118],[-75.242424,41.867177],[-75.24250600000001,41.86715],[-75.242926,41.867014],[-75.24317600000001,41.866932],[-75.24334500000001,41.866877],[-75.24334899999999,41.86686],[-75.24441299999999,41.866105],[-75.245695,41.86514],[-75.247084,41.86407],[-75.248045,41.8633],[-75.248583,41.863033],[-75.2491,41.862776],[-75.249617,41.862519],[-75.24977,41.862473],[-75.249911,41.862426],[-75.249956,41.862412],[-75.251197,41.86204],[-75.252943,41.862028],[-75.25302600000001,41.86203],[-75.25463499999999,41.862065],[-75.25551900000001,41.862004],[-75.256079,41.861971],[-75.257825,41.862154],[-75.25873300000001,41.86266],[-75.259016,41.86284],[-75.260527,41.8638],[-75.261404,41.864619],[-75.261751,41.864942],[-75.261944,41.865176],[-75.26280199999999,41.866213],[-75.26355,41.867839],[-75.263673,41.868105],[-75.263972,41.869668],[-75.26381499999999,41.870757],[-75.263434,41.871436],[-75.263249,41.871765],[-75.261488,41.873277],[-75.26057,41.873814],[-75.26043,41.873896],[-75.260289,41.873978],[-75.259564,41.874402],[-75.258439,41.875087],[-75.25782100000001,41.875921],[-75.257564,41.877108],[-75.258656,41.8801],[-75.260623,41.883783],[-75.26300500000001,41.885109],[-75.263947,41.885282],[-75.26491,41.885458],[-75.265996,41.885657],[-75.26613,41.885681],[-75.267115,41.88586],[-75.26778899999999,41.885982],[-75.26869600000001,41.886339],[-75.26999000000001,41.886853],[-75.270967,41.887232],[-75.270991,41.887241],[-75.27103700000001,41.887259],[-75.271072,41.887273],[-75.271226,41.887333],[-75.271293,41.887358],[-75.271305,41.887401],[-75.271773,41.889352],[-75.272288,41.891749],[-75.27230400000001,41.891842],[-75.27232100000001,41.891935],[-75.272448,41.89254],[-75.272581,41.893168],[-75.272778,41.897112],[-75.27021499999999,41.8996],[-75.269098,41.900684],[-75.267982,41.901768],[-75.26777300000001,41.901971],[-75.267763,41.902036],[-75.267371,41.904488],[-75.267454,41.905597],[-75.267562,41.907054],[-75.268017,41.908274],[-75.26973599999999,41.911363],[-75.272659,41.915446],[-75.275368,41.919564],[-75.275611,41.920107],[-75.276552,41.922208],[-75.276602,41.922741],[-75.27668799999999,41.923648],[-75.276501,41.926679],[-75.276532,41.926868],[-75.276628,41.927463],[-75.276725,41.928057],[-75.276751,41.928218],[-75.276777,41.928379],[-75.27699200000001,41.929702],[-75.277175,41.932544],[-75.277036,41.932494]]],"type":"Polygon"}
}