{
  "id": "360610131001",
  "type": "Feature",
  "properties": {
    "area_land":108717,
    "area_water":0,
    "geoid":"360610131001",
    "name":"Block Group 1",
    "state":"ny"
},
  "bbox": [
    -73.986104,
    40.759899,
    -73.978601,
    40.763594
],
  "geometry": {"coordinates":[[[-73.985647,40.762915],[-73.983628,40.762065],[-73.98280699999999,40.761719],[-73.98235099999999,40.762343],[-73.98189499999999,40.762968],[-73.98143399999999,40.763594],[-73.980295,40.763112],[-73.978601,40.762396],[-73.979057,40.761771],[-73.979513,40.761148],[-73.979972,40.760525],[-73.98042599999999,40.759899],[-73.98326299999999,40.761094],[-73.98405,40.761424],[-73.986104,40.76229],[-73.985647,40.762915]]],"type":"Polygon"}
}