{
  "id": "361190024031",
  "type": "Feature",
  "properties": {
    "area_land":243034,
    "area_water":0,
    "geoid":"361190024031",
    "name":"Block Group 1",
    "state":"ny"
},
  "bbox": [
    -73.851469,
    40.914801,
    -73.844227,
    40.924976
],
  "geometry": {"coordinates":[[[-73.85146899999999,40.919972],[-73.850964,40.920173],[-73.850677,40.920271],[-73.85041200000001,40.920363],[-73.85032200000001,40.920402],[-73.85023200000001,40.92051],[-73.849903,40.921047],[-73.84970300000001,40.92136],[-73.84951700000001,40.92164],[-73.849445,40.921737],[-73.849344,40.921828],[-73.848885,40.922172],[-73.848794,40.922248],[-73.848716,40.922376],[-73.848675,40.922444],[-73.848443,40.922817],[-73.848035,40.923526],[-73.84757500000001,40.924276],[-73.847341,40.924628],[-73.847275,40.924769],[-73.84721500000001,40.924976],[-73.84689899999999,40.924952],[-73.846557,40.924936],[-73.846504,40.924934],[-73.84639300000001,40.924898],[-73.846332,40.924866],[-73.84625699999999,40.924741],[-73.84623999999999,40.924692],[-73.84648300000001,40.924375],[-73.845894,40.924111],[-73.845665,40.924009],[-73.845378,40.923898],[-73.84487799999999,40.923698],[-73.844578,40.923898],[-73.844497,40.923671],[-73.844477,40.923594],[-73.844662,40.923334],[-73.84483400000001,40.92309],[-73.84518199999999,40.922599],[-73.845083,40.922199],[-73.84448399999999,40.922299],[-73.844227,40.922197],[-73.846175,40.921114],[-73.84628600000001,40.92109],[-73.846486,40.921048],[-73.84687599999999,40.920999],[-73.846783,40.920052],[-73.846734,40.919583],[-73.846683,40.919101],[-73.846604,40.918634],[-73.846456,40.917601],[-73.84777800000001,40.916326],[-73.84809300000001,40.916385],[-73.848187,40.916248],[-73.847731,40.916046],[-73.846778,40.916184],[-73.846878,40.915999],[-73.847166,40.915518],[-73.84758600000001,40.915043],[-73.847797,40.914906],[-73.84819899999999,40.914827],[-73.848313,40.914801],[-73.848658,40.914958],[-73.84891500000001,40.915056],[-73.849084,40.915126],[-73.84920200000001,40.915163],[-73.849324,40.915194],[-73.849515,40.915233],[-73.84898800000001,40.915923],[-73.848491,40.916638],[-73.848461,40.916674],[-73.848208,40.917048],[-73.848073,40.917262],[-73.84794599999999,40.91747],[-73.84844699999999,40.917365],[-73.848263,40.917663],[-73.848095,40.91797],[-73.847808,40.918498],[-73.848733,40.918891],[-73.849039,40.919013],[-73.85002,40.919302],[-73.85111000000001,40.919558],[-73.85118199999999,40.91959],[-73.851229,40.919633],[-73.851344,40.919769],[-73.85146899999999,40.919972]]],"type":"Polygon"}
}