{
  "id": "360470932001",
  "type": "Feature",
  "properties": {
    "area_land":280436,
    "area_water":0,
    "geoid":"360470932001",
    "name":"Block Group 1",
    "state":"ny"
},
  "bbox": [
    -73.932984,
    40.634947,
    -73.925743,
    40.640014
],
  "geometry": {"coordinates":[[[-73.932984,40.639555],[-73.932013,40.639616],[-73.93104200000001,40.639676],[-73.930111,40.639734],[-73.929106,40.639795],[-73.92809800000001,40.639857],[-73.927165,40.639916],[-73.926198,40.639976],[-73.925934,40.639998],[-73.925743,40.640014],[-73.926033,40.638543],[-73.92608199999999,40.638163],[-73.926146,40.637568],[-73.926362,40.636909],[-73.926513,40.63654],[-73.926788,40.636108],[-73.927448,40.635259],[-73.928612,40.635187],[-73.929625,40.635121],[-73.930553,40.635063],[-73.93153100000001,40.635006],[-73.93223500000001,40.634963],[-73.9325,40.634947],[-73.932734,40.637217],[-73.932984,40.639555]]],"type":"Polygon"}
}