{
  "id": "361031477021",
  "type": "Feature",
  "properties": {
    "area_land":888544,
    "area_water":0,
    "geoid":"361031477021",
    "name":"Block Group 1",
    "state":"ny"
},
  "bbox": [
    -73.109291,
    40.734485,
    -73.09158,
    40.741153
],
  "geometry": {"coordinates":[[[-73.109291,40.736704],[-73.10927100000001,40.736837],[-73.109212,40.737028],[-73.109095,40.737484],[-73.10908000000001,40.73804],[-73.10906900000001,40.738642],[-73.109054,40.738835],[-73.108937,40.738889],[-73.10885500000001,40.738941],[-73.108756,40.739029],[-73.108692,40.739109],[-73.108654,40.739183],[-73.108626,40.739259],[-73.108609,40.739376],[-73.10862,40.739731],[-73.108656,40.740661],[-73.108662,40.740893],[-73.10869099999999,40.741153],[-73.106742,40.7411],[-73.104829,40.741047],[-73.099628,40.740906],[-73.09808099999999,40.740826],[-73.095518,40.740714],[-73.09276699999999,40.740568],[-73.092517,40.738831],[-73.092421,40.738162],[-73.09217,40.738061],[-73.092101,40.738033],[-73.091679,40.736995],[-73.09157999999999,40.736547],[-73.09361699999999,40.736183],[-73.09538499999999,40.735872],[-73.097486,40.735483],[-73.097582,40.735465],[-73.09904400000001,40.735211],[-73.100371,40.735058],[-73.101451,40.734993],[-73.101607,40.734982],[-73.10360900000001,40.734843],[-73.106128,40.734691],[-73.106692,40.734654],[-73.107208,40.734621],[-73.10789200000001,40.734568],[-73.108858,40.734506],[-73.109189,40.734485],[-73.10916899999999,40.735526],[-73.10914699999999,40.735941],[-73.109154,40.73607],[-73.10917499999999,40.736201],[-73.10922600000001,40.736338],[-73.109264,40.736456],[-73.109283,40.736574],[-73.109291,40.736704]]],"type":"Polygon"}
}