{
  "id": "360470065007",
  "type": "Feature",
  "properties": {
    "area_land":39226,
    "area_water":0,
    "geoid":"360470065007",
    "name":"Block Group 7",
    "state":"ny"
},
  "bbox": [
    -74.001539,
    40.674004,
    -73.998728,
    40.677268
],
  "geometry": {"coordinates":[[[-74.00153899999999,40.677268],[-74.00071800000001,40.677044],[-73.998728,40.676489],[-73.99903999999999,40.675844],[-73.999352,40.6752],[-73.999661,40.674555],[-73.999831,40.674198],[-73.99988999999999,40.674079],[-73.999898,40.674064],[-73.99991,40.674037],[-73.99992399999999,40.674004],[-74.000439,40.674808],[-74.00121300000001,40.67587],[-74.00090400000001,40.675637],[-74.000699,40.675571],[-74.00094199999999,40.676031],[-74.001031,40.676227],[-74.00105499999999,40.676375],[-74.00153899999999,40.677268]]],"type":"Polygon"}
}