{
  "id": "360810972031",
  "type": "Feature",
  "properties": {
    "area_land":216153,
    "area_water":0,
    "geoid":"360810972031",
    "name":"Block Group 1",
    "state":"ny"
},
  "bbox": [
    -73.782135,
    40.595267,
    -73.774771,
    40.601658
],
  "geometry": {"coordinates":[[[-73.782135,40.599022],[-73.78201900000001,40.599347],[-73.781659,40.599256],[-73.781907,40.599114],[-73.78200200000001,40.598943],[-73.781991,40.598682],[-73.78189399999999,40.598436],[-73.78175899999999,40.59828],[-73.78155700000001,40.598091],[-73.78141100000001,40.597999],[-73.78134,40.597913],[-73.781342,40.597779],[-73.781105,40.597598],[-73.780596,40.597313],[-73.780366,40.597274],[-73.78018299999999,40.597213],[-73.78015000000001,40.597058],[-73.780171,40.596929],[-73.780055,40.596861],[-73.78000400000001,40.597041],[-73.779884,40.597179],[-73.779752,40.597276],[-73.779681,40.597372],[-73.779443,40.597485],[-73.77931700000001,40.59754],[-73.779155,40.597601],[-73.779044,40.597649],[-73.778999,40.597781],[-73.778768,40.597966],[-73.778616,40.597979],[-73.77851200000001,40.598086],[-73.778266,40.598165],[-73.77811,40.598312],[-73.777961,40.598407],[-73.77784200000001,40.598458],[-73.777732,40.598568],[-73.777624,40.598661],[-73.777473,40.598762],[-73.777399,40.598777],[-73.77736899999999,40.598931],[-73.77735199999999,40.599165],[-73.77731,40.599274],[-73.777295,40.599376],[-73.77713,40.599654],[-73.777064,40.599691],[-73.77703700000001,40.599718],[-73.776985,40.599737],[-73.776946,40.599883],[-73.776785,40.600167],[-73.77663,40.600488],[-73.776522,40.600642],[-73.776354,40.600948],[-73.77634999999999,40.600985],[-73.776325,40.601046],[-73.77628199999999,40.601079],[-73.77625999999999,40.60109],[-73.776217,40.601098],[-73.77618099999999,40.601124],[-73.776174,40.601161],[-73.776117,40.601212],[-73.776095,40.601231],[-73.776044,40.601282],[-73.776031,40.601314],[-73.77601,40.601323],[-73.776014,40.601354],[-73.77601900000001,40.601371],[-73.77601300000001,40.601397],[-73.77598399999999,40.601409],[-73.775963,40.601424],[-73.77593899999999,40.60144],[-73.77591,40.601457],[-73.775808,40.601513],[-73.77575299999999,40.601557],[-73.77567999999999,40.601607],[-73.7756,40.601648],[-73.775559,40.601658],[-73.77545499999999,40.601651],[-73.77538300000001,40.60104],[-73.775245,40.59985],[-73.774771,40.595735],[-73.775724,40.595669],[-73.776552,40.595611],[-73.777393,40.595554],[-73.77821900000001,40.595498],[-73.779036,40.595444],[-73.779939,40.595382],[-73.780916,40.595325],[-73.781836,40.595267],[-73.781952,40.596457],[-73.78209,40.597837],[-73.781916,40.597825],[-73.781783,40.597874],[-73.781916,40.597966],[-73.782096,40.598417],[-73.782135,40.598841],[-73.782135,40.599022]]],"type":"Polygon"}
}