{
  "id": "360050246002",
  "type": "Feature",
  "properties": {
    "area_land":80625,
    "area_water":0,
    "geoid":"360050246002",
    "name":"Block Group 2",
    "state":"ny"
},
  "bbox": [
    -73.86304,
    40.848362,
    -73.858617,
    40.851627
],
  "geometry": {"coordinates":[[[-73.86304,40.850611],[-73.86211900000001,40.850806],[-73.861745,40.850896],[-73.861133,40.851172],[-73.86093700000001,40.85126],[-73.86012100000001,40.851627],[-73.858617,40.849687],[-73.859425,40.849324],[-73.86023400000001,40.84896],[-73.861193,40.848603],[-73.861603,40.848547],[-73.862509,40.848362],[-73.86278900000001,40.849238],[-73.86304,40.850611]]],"type":"Polygon"}
}