{
  "id": "360259707003",
  "type": "Feature",
  "properties": {
    "area_land":201856239,
    "area_water":9538282,
    "geoid":"360259707003",
    "name":"Block Group 3",
    "state":"ny"
},
  "bbox": [
    -74.896433,
    42.016375,
    -74.669689,
    42.225908
],
  "geometry": {"coordinates":[[[-74.896433,42.135833],[-74.894659,42.153301],[-74.894369,42.157974],[-74.894319,42.15883],[-74.893934,42.165109],[-74.89257499999999,42.178514],[-74.892099,42.185224],[-74.891975,42.186185],[-74.8907,42.196083],[-74.890281,42.199332],[-74.888114,42.199399],[-74.882971,42.199559],[-74.874605,42.19982],[-74.869871,42.20005],[-74.865081,42.206928],[-74.863074,42.209843],[-74.856829,42.218779],[-74.851867,42.225908],[-74.834975,42.219796],[-74.83414999999999,42.219497],[-74.833798,42.21937],[-74.831773,42.218638],[-74.831661,42.211724],[-74.831565,42.209566],[-74.83095,42.195764],[-74.830946,42.195257],[-74.830882,42.195157],[-74.83102,42.190891],[-74.8293,42.19238],[-74.819558,42.200379],[-74.81937600000001,42.200291],[-74.819039,42.200065],[-74.81874000000001,42.19979],[-74.81851399999999,42.199538],[-74.818229,42.199204],[-74.81792900000001,42.198852],[-74.817819,42.198698],[-74.817729,42.198573],[-74.81754599999999,42.198262],[-74.81717999999999,42.197599],[-74.81695499999999,42.197275],[-74.816699,42.196946],[-74.81642600000001,42.196612],[-74.816098,42.196301],[-74.815682,42.196048],[-74.815422,42.195951],[-74.81536699999999,42.195933],[-74.815314,42.195911],[-74.81522099999999,42.195876],[-74.815152,42.19586],[-74.814751,42.195767],[-74.814273,42.195726],[-74.81330199999999,42.19567],[-74.812819,42.195629],[-74.812348,42.195552],[-74.81190700000001,42.195398],[-74.8115,42.195185],[-74.811106,42.194942],[-74.81071300000001,42.194689],[-74.81033100000001,42.194422],[-74.809968,42.194161],[-74.80963199999999,42.193908],[-74.80931099999999,42.193678],[-74.809135,42.193566],[-74.809043,42.19351],[-74.80895200000001,42.193465],[-74.808564,42.193307],[-74.808306,42.193212],[-74.80801599999999,42.193113],[-74.807717,42.192995],[-74.807411,42.192859],[-74.807125,42.192688],[-74.806883,42.192476],[-74.806691,42.192228],[-74.80654,42.191948],[-74.806225,42.191237],[-74.80608700000001,42.190912],[-74.805954,42.190621],[-74.80591200000001,42.190529],[-74.805716,42.190164],[-74.805446,42.189826],[-74.805272,42.18968],[-74.80509000000001,42.189528],[-74.80468500000001,42.18927],[-74.80426799999999,42.189031],[-74.803856,42.188801],[-74.80271999999999,42.188137],[-74.80239400000001,42.187897],[-74.80217500000001,42.187663],[-74.80212400000001,42.187609],[-74.80192099999999,42.187271],[-74.801883,42.18717],[-74.801789,42.186919],[-74.80168399999999,42.186554],[-74.801559,42.186189],[-74.80138100000001,42.185829],[-74.80117799999999,42.185482],[-74.80081300000001,42.184914],[-74.800685,42.184715],[-74.800315,42.184183],[-74.800147,42.183967],[-74.799716,42.183507],[-74.79959599999999,42.183388],[-74.79946700000001,42.183259],[-74.799233,42.183047],[-74.798953,42.182902],[-74.798621,42.18282],[-74.79828999999999,42.182788],[-74.79801500000001,42.182792],[-74.797738,42.182819],[-74.797676,42.182832],[-74.797439,42.182881],[-74.79677700000001,42.183083],[-74.796389,42.183217],[-74.79598,42.18337],[-74.795541,42.183522],[-74.79507700000001,42.183688],[-74.794169,42.183974],[-74.793452,42.184217],[-74.793429,42.184225],[-74.793272,42.184296],[-74.79312,42.184355],[-74.792928,42.184436],[-74.79281400000001,42.184472],[-74.792598,42.184579],[-74.79236,42.184687],[-74.792242,42.184745],[-74.792125,42.184808],[-74.792019,42.184884],[-74.791909,42.184956],[-74.79169400000001,42.185114],[-74.79159,42.185199],[-74.791477,42.185275],[-74.79137299999999,42.185361],[-74.791274,42.185455],[-74.790744,42.185891],[-74.790327,42.186241],[-74.79021899999999,42.186322],[-74.790119,42.186417],[-74.78983100000001,42.186718],[-74.789642,42.186925],[-74.789466,42.187127],[-74.789378,42.187221],[-74.789283,42.187307],[-74.789081,42.187468],[-74.78885200000001,42.187603],[-74.788731,42.187666],[-74.78835100000001,42.187823],[-74.78809,42.187912],[-74.787971,42.187962],[-74.787845,42.188002],[-74.78759599999999,42.188092],[-74.787477,42.188127],[-74.787361,42.188168],[-74.787184,42.188257],[-74.78704999999999,42.188325],[-74.786953,42.18837],[-74.78689900000001,42.188401],[-74.786923,42.188338],[-74.78700000000001,42.188082],[-74.787058,42.187902],[-74.787221,42.18751],[-74.787469,42.18688],[-74.78768100000001,42.186358],[-74.787874,42.185922],[-74.787904,42.18587],[-74.787932,42.185823],[-74.788005,42.185723],[-74.788084,42.185638],[-74.78818,42.185553],[-74.788286,42.185472],[-74.788402,42.1854],[-74.788758,42.185203],[-74.78897000000001,42.185059],[-74.78916,42.184915],[-74.789242,42.184834],[-74.78928500000001,42.184784],[-74.789315,42.184749],[-74.789378,42.184659],[-74.789424,42.18456],[-74.78945400000001,42.184456],[-74.789469,42.184353],[-74.789466,42.184245],[-74.789455,42.184173],[-74.789449,42.184137],[-74.78935300000001,42.183794],[-74.789327,42.183673],[-74.78931300000001,42.183551],[-74.78931,42.18343],[-74.789314,42.183299],[-74.789339,42.183038],[-74.78934599999999,42.182879],[-74.789367,42.182754],[-74.789377,42.18269],[-74.789389,42.182624],[-74.789424,42.182335],[-74.789486,42.181737],[-74.78959500000001,42.180841],[-74.789652,42.180539],[-74.789731,42.180233],[-74.789931,42.179625],[-74.790059,42.17918],[-74.790093,42.179031],[-74.790116,42.178878],[-74.790128,42.178721],[-74.79012899999999,42.178568],[-74.790119,42.178405],[-74.79007300000001,42.178086],[-74.789739,42.176446],[-74.789559,42.175536],[-74.789438,42.17495],[-74.789292,42.174198],[-74.789272,42.17404],[-74.789259,42.173883],[-74.789255,42.173721],[-74.789266,42.173401],[-74.789281,42.173234],[-74.789305,42.173072],[-74.789343,42.172906],[-74.789395,42.172744],[-74.78945899999999,42.172582],[-74.789531,42.17242],[-74.78983700000001,42.171776],[-74.789891,42.171614],[-74.78992100000001,42.171448],[-74.789925,42.171281],[-74.789901,42.171114],[-74.78984699999999,42.170952],[-74.789767,42.170794],[-74.78971199999999,42.17071],[-74.789666,42.170641],[-74.789556,42.170497],[-74.789441,42.170352],[-74.78940799999999,42.170312],[-74.78930099999999,42.17018],[-74.789191,42.17004],[-74.789143,42.170077],[-74.789102,42.170095],[-74.78900400000001,42.170122],[-74.788893,42.17014],[-74.788832,42.170144],[-74.78877,42.170153],[-74.788706,42.170157],[-74.78864,42.170171],[-74.788504,42.170189],[-74.788141,42.170247],[-74.787504,42.170313],[-74.78747799999999,42.170317],[-74.787396,42.170331],[-74.786019,42.17049],[-74.785659,42.170526],[-74.785534,42.170534],[-74.78527699999999,42.170561],[-74.78473099999999,42.170609],[-74.784311,42.170636],[-74.784176,42.17064],[-74.78404999999999,42.170635],[-74.78393800000001,42.170612],[-74.783838,42.170572],[-74.783753,42.170522],[-74.783686,42.170454],[-74.783638,42.170378],[-74.783598,42.170301],[-74.783556,42.170233],[-74.783422,42.169945],[-74.783242,42.169679],[-74.783187,42.169616],[-74.78313300000001,42.169544],[-74.78294699999999,42.169341],[-74.782732,42.169138],[-74.78257499999999,42.168998],[-74.78249099999999,42.16893],[-74.78222100000001,42.168736],[-74.78203000000001,42.168609],[-74.78183300000001,42.168487],[-74.781515,42.168311],[-74.7814,42.168252],[-74.781159,42.168144],[-74.780796,42.168004],[-74.780451,42.167877],[-74.78012699999999,42.16775],[-74.780022,42.167714],[-74.779726,42.167596],[-74.77963,42.167565],[-74.779444,42.167492],[-74.779257,42.167424],[-74.77915900000001,42.167397],[-74.778432,42.167103],[-74.778057,42.166972],[-74.777891,42.166931],[-74.777748,42.166889],[-74.77757699999999,42.166843],[-74.777415,42.166801],[-74.777236,42.166787],[-74.77712,42.166777],[-74.77694,42.166793],[-74.776591,42.166832],[-74.77655900000001,42.166838],[-74.776471,42.166842],[-74.776135,42.166918],[-74.776036,42.166936],[-74.775958,42.166945],[-74.775854,42.166972],[-74.77574,42.167012],[-74.775423,42.167097],[-74.775336,42.167106],[-74.77522399999999,42.167137],[-74.77487499999999,42.167222],[-74.77475699999999,42.167244],[-74.774637,42.167258],[-74.774388,42.167275],[-74.774261,42.167279],[-74.77413300000001,42.167275],[-74.77398599999999,42.167279],[-74.773875,42.167256],[-74.773617,42.167242],[-74.773472,42.167251],[-74.773223,42.167241],[-74.77298999999999,42.167245],[-74.77278099999999,42.167272],[-74.77260699999999,42.167303],[-74.772525,42.167317],[-74.77237700000001,42.167325],[-74.772217,42.167316],[-74.772041,42.167284],[-74.771952,42.167261],[-74.771666,42.167166],[-74.771558,42.167121],[-74.771102,42.166958],[-74.770884,42.166867],[-74.77078899999999,42.166809],[-74.770713,42.166741],[-74.77065899999999,42.166664],[-74.77063699999999,42.166583],[-74.770642,42.166493],[-74.77066600000001,42.166408],[-74.770703,42.166318],[-74.77079999999999,42.166133],[-74.770916,42.165935],[-74.770968,42.165832],[-74.771046,42.165634],[-74.771052,42.165512],[-74.77103,42.165093],[-74.771012,42.164882],[-74.771012,42.164769],[-74.77102499999999,42.164657],[-74.77109799999999,42.164319],[-74.771117,42.164211],[-74.771129,42.164107],[-74.771126,42.163887],[-74.771113,42.163779],[-74.77101399999999,42.163342],[-74.77103200000001,42.163121],[-74.771045,42.163018],[-74.77107100000001,42.162914],[-74.77117200000001,42.162649],[-74.771192,42.162563],[-74.77119500000001,42.162482],[-74.771182,42.162396],[-74.771151,42.16232],[-74.771108,42.162252],[-74.771044,42.162189],[-74.770965,42.16213],[-74.77088500000001,42.16209],[-74.770696,42.162017],[-74.770596,42.161985],[-74.770488,42.161958],[-74.770273,42.161895],[-74.769728,42.161768],[-74.769634,42.161749],[-74.769362,42.161708],[-74.76917,42.161667],[-74.769075,42.161636],[-74.768992,42.161586],[-74.76893,42.161532],[-74.768885,42.161469],[-74.76885799999999,42.161401],[-74.76880300000001,42.161131],[-74.76875099999999,42.160829],[-74.768725,42.160554],[-74.76872400000001,42.160297],[-74.768717,42.160149],[-74.76870700000001,42.160086],[-74.76871300000001,42.159951],[-74.76873500000001,42.159829],[-74.768759,42.159762],[-74.768828,42.159622],[-74.768868,42.159555],[-74.76897,42.15942],[-74.769024,42.159357],[-74.769115,42.159222],[-74.769153,42.15915],[-74.769178,42.159078],[-74.769203,42.158925],[-74.769189,42.158763],[-74.76913,42.158524],[-74.76898,42.158042],[-74.76890400000001,42.157772],[-74.76881400000001,42.157492],[-74.76877899999999,42.157402],[-74.768739,42.157316],[-74.76868899999999,42.157235],[-74.768626,42.157163],[-74.768551,42.157091],[-74.768466,42.157032],[-74.76837,42.156973],[-74.768067,42.156824],[-74.767864,42.156716],[-74.767459,42.156517],[-74.76719799999999,42.156395],[-74.766981,42.156264],[-74.76691700000001,42.156214],[-74.76681600000001,42.156124],[-74.766779,42.156083],[-74.766711,42.155988],[-74.766701,42.155975],[-74.766604,42.155781],[-74.766555,42.15565],[-74.766482,42.155429],[-74.76645000000001,42.155353],[-74.76640999999999,42.155281],[-74.766362,42.155209],[-74.766234,42.155082],[-74.76607799999999,42.154965],[-74.76563,42.154676],[-74.765348,42.154513],[-74.76514899999999,42.154423],[-74.76494,42.154341],[-74.76463800000001,42.154241],[-74.764487,42.154201],[-74.764433,42.154182],[-74.76419199999999,42.154123],[-74.764382,42.153795],[-74.764466,42.153674],[-74.76472200000001,42.153363],[-74.76481800000001,42.153238],[-74.765091,42.152905],[-74.765117,42.152882],[-74.765261,42.152698],[-74.76531900000001,42.15264],[-74.76533999999999,42.152599],[-74.765377,42.152563],[-74.765522,42.152365],[-74.765587,42.15223],[-74.765631,42.152082],[-74.76565600000001,42.151929],[-74.765647,42.15169],[-74.76562800000001,42.151537],[-74.76557699999999,42.151316],[-74.765463,42.150947],[-74.765349,42.150555],[-74.765333,42.150478],[-74.765325,42.150406],[-74.765328,42.150262],[-74.765373,42.149983],[-74.765378,42.149906],[-74.765372,42.149758],[-74.765356,42.149681],[-74.76531,42.149541],[-74.765118,42.149167],[-74.765033,42.14905],[-74.764824,42.148649],[-74.764791,42.148604],[-74.764753,42.148563],[-74.764608,42.148464],[-74.764473,42.148409],[-74.76396200000001,42.148228],[-74.763784,42.14816],[-74.763454,42.148015],[-74.763375,42.147984],[-74.76329800000001,42.147948],[-74.76294900000001,42.147803],[-74.762833,42.147762],[-74.762781,42.147735],[-74.762635,42.147672],[-74.76258900000001,42.147644],[-74.76251499999999,42.147586],[-74.762422,42.14745],[-74.762322,42.147185],[-74.762157,42.146779],[-74.762095,42.146653],[-74.76199099999999,42.146468],[-74.761866,42.146268],[-74.761566,42.145787],[-74.76149700000001,42.145656],[-74.76144600000001,42.145521],[-74.761263,42.144913],[-74.761228,42.144859],[-74.761149,42.144755],[-74.760976,42.144583],[-74.760081,42.143717],[-74.759942,42.143573],[-74.75917699999999,42.142834],[-74.759119,42.142778],[-74.759069,42.14272],[-74.758697,42.142228],[-74.758661,42.142169],[-74.758493,42.141939],[-74.758332,42.141754],[-74.758015,42.141312],[-74.75783800000001,42.141096],[-74.757653,42.140897],[-74.75752199999999,42.140775],[-74.757261,42.14055],[-74.75702099999999,42.140315],[-74.75697700000001,42.140247],[-74.756873,42.140108],[-74.756827,42.140031],[-74.75679100000001,42.139945],[-74.756711,42.139675],[-74.756643,42.139396],[-74.756613,42.139206],[-74.756603,42.139004],[-74.756614,42.138905],[-74.756635,42.138806],[-74.756663,42.138711],[-74.756733,42.138522],[-74.756845,42.138248],[-74.75702,42.137798],[-74.75721799999999,42.137334],[-74.757316,42.137087],[-74.75736999999999,42.136925],[-74.757408,42.136772],[-74.75743799999999,42.13656],[-74.75744,42.136425],[-74.757418,42.136222],[-74.756715,42.134965],[-74.75664500000001,42.134915],[-74.756406,42.134712],[-74.75633500000001,42.134644],[-74.756114,42.134454],[-74.756035,42.134396],[-74.75557499999999,42.134098],[-74.75540100000001,42.134003],[-74.75523099999999,42.133939],[-74.754999,42.133871],[-74.754969,42.133865],[-74.754925,42.133857],[-74.75477600000001,42.133812],[-74.75358900000001,42.133233],[-74.753479,42.13317],[-74.753249,42.133043],[-74.753179,42.132993],[-74.753092,42.132935],[-74.753015,42.132872],[-74.752948,42.132799],[-74.752892,42.132718],[-74.75284600000001,42.132637],[-74.75281099999999,42.132547],[-74.752787,42.132457],[-74.752757,42.132259],[-74.75274400000001,42.132093],[-74.752759,42.131818],[-74.752774,42.13143],[-74.75282,42.131071],[-74.752915,42.130751],[-74.753005,42.130521],[-74.753147,42.130296],[-74.753291,42.130098],[-74.753383,42.129959],[-74.753439,42.129723],[-74.753485,42.129491],[-74.75354,42.129027],[-74.753573,42.128874],[-74.753584,42.128797],[-74.753567,42.128657],[-74.753547,42.128531],[-74.75349199999999,42.128429],[-74.753367,42.128254],[-74.75308699999999,42.1279],[-74.752893,42.127616],[-74.75285599999999,42.127511],[-74.75292399999999,42.127282],[-74.753034,42.127021],[-74.752741,42.127129],[-74.750545,42.123392],[-74.750564,42.123204],[-74.75043599999999,42.123076],[-74.750137,42.122698],[-74.749899,42.122293],[-74.749835,42.122103],[-74.74975999999999,42.121798],[-74.749657,42.12128],[-74.749601,42.121179],[-74.74952500000001,42.121085],[-74.749461,42.121003],[-74.749191,42.121101],[-74.748932,42.120718],[-74.748875,42.120645],[-74.74884,42.120564],[-74.748817,42.120461],[-74.748853,42.120186],[-74.748895,42.120006],[-74.74892199999999,42.119844],[-74.748936,42.119686],[-74.748935,42.119443],[-74.748946,42.119397],[-74.74887200000001,42.119389],[-74.74861799999999,42.119343],[-74.74837100000001,42.119289],[-74.74812799999999,42.119221],[-74.747895,42.119148],[-74.747668,42.119067],[-74.747595,42.119039],[-74.74744800000001,42.118981],[-74.747236,42.118886],[-74.747034,42.118777],[-74.74684000000001,42.11866],[-74.746647,42.118551],[-74.74626600000001,42.118321],[-74.745892,42.118108],[-74.745701,42.118013],[-74.745504,42.117932],[-74.745439,42.11791],[-74.74627099999999,42.117247],[-74.748107,42.116943],[-74.748238,42.116567],[-74.748661,42.115349],[-74.748716,42.115306],[-74.749605,42.114891],[-74.752329,42.11342],[-74.754244,42.11348],[-74.76168,42.113715],[-74.763353,42.114392],[-74.763989,42.114649],[-74.765393,42.114583],[-74.76637700000001,42.113381],[-74.766403,42.113349],[-74.766132,42.112948],[-74.767419,42.11271],[-74.76737300000001,42.112358],[-74.766768,42.112096],[-74.76613999999999,42.111783],[-74.753456,42.105453],[-74.749612,42.103535],[-74.748926,42.103226],[-74.716381,42.08871],[-74.71193100000001,42.086681],[-74.71095200000001,42.08624],[-74.71012899999999,42.085865],[-74.708629,42.085186],[-74.707048,42.08448],[-74.706565,42.084264],[-74.682897,42.07371],[-74.67916700000001,42.072046],[-74.66968900000001,42.067819],[-74.67035300000001,42.067513],[-74.689213,42.058829],[-74.69215199999999,42.057477],[-74.692278,42.057419],[-74.70276800000001,42.05259],[-74.727164,42.041357],[-74.727228,42.041328],[-74.72763,42.041143],[-74.740617,42.035164],[-74.74063200000001,42.035157],[-74.742976,42.034064],[-74.74895600000001,42.031277],[-74.74905200000001,42.031233],[-74.74927,42.031131],[-74.749602,42.030977],[-74.749602,42.030893],[-74.749602,42.030755],[-74.74965400000001,42.03073],[-74.75287400000001,42.02925],[-74.76296499999999,42.024608],[-74.76414800000001,42.024065],[-74.780693,42.016375],[-74.78308,42.017389],[-74.783664,42.01764],[-74.784949,42.018162],[-74.78510799999999,42.018227],[-74.79481699999999,42.022391],[-74.795331,42.022609],[-74.796215,42.022989],[-74.797815,42.023682],[-74.799249,42.024304],[-74.800219,42.024847],[-74.800371,42.024894],[-74.800462,42.024931],[-74.80066100000001,42.025012],[-74.800848,42.025093],[-74.800939,42.025139],[-74.801243,42.02527],[-74.80136,42.02531],[-74.801676,42.025446],[-74.80187100000001,42.025536],[-74.802156,42.025677],[-74.80226,42.025713],[-74.802485,42.025773],[-74.802695,42.025808],[-74.802899,42.025858],[-74.80307500000001,42.025921],[-74.803275,42.02603],[-74.803399,42.026116],[-74.803465,42.026152],[-74.803552,42.02623],[-74.807912,42.028159],[-74.810211,42.029108],[-74.83364400000001,42.03913],[-74.83748900000001,42.040774],[-74.84426000000001,42.04367],[-74.84743899999999,42.04503],[-74.85145199999999,42.046742],[-74.867261,42.053488],[-74.869742,42.054494],[-74.87003900000001,42.054624],[-74.871273,42.055122],[-74.872044,42.055436],[-74.87198600000001,42.055875],[-74.871915,42.056482],[-74.87182799999999,42.057231],[-74.871691,42.057984],[-74.871656,42.058284],[-74.871267,42.061293],[-74.870591,42.066775],[-74.86979599999999,42.073349],[-74.86968299999999,42.073992],[-74.869046,42.079167],[-74.869028,42.07931],[-74.868714,42.081831],[-74.867797,42.089017],[-74.86779199999999,42.089082],[-74.867786,42.089146],[-74.867773,42.089287],[-74.867138,42.094468],[-74.86708,42.094731],[-74.863923,42.120382],[-74.863702,42.122135],[-74.867091,42.123559],[-74.870689,42.125116],[-74.87475499999999,42.126761],[-74.880295,42.129105],[-74.88252799999999,42.13],[-74.891473,42.133752],[-74.893717,42.134694],[-74.895499,42.135443],[-74.896433,42.135833]]],"type":"Polygon"}
}