{
  "id": "360810240002",
  "type": "Feature",
  "properties": {
    "area_land":162763,
    "area_water":0,
    "geoid":"360810240002",
    "name":"Block Group 2",
    "state":"ny"
},
  "bbox": [
    -73.807584,
    40.70146,
    -73.79992,
    40.705761
],
  "geometry": {"coordinates":[[[-73.80758400000001,40.704146],[-73.807061,40.704288],[-73.80564800000001,40.704672],[-73.803572,40.705233],[-73.802655,40.70548],[-73.80165700000001,40.705761],[-73.80110999999999,40.704848],[-73.800201,40.703341],[-73.79992,40.702474],[-73.801897,40.701969],[-73.802409,40.701852],[-73.803303,40.701639],[-73.804129,40.70146],[-73.80444199999999,40.702132],[-73.80521299999999,40.70377],[-73.80626700000001,40.703481],[-73.807159,40.703239],[-73.80758400000001,40.704146]]],"type":"Polygon"}
}