{
  "id": "360594140014",
  "type": "Feature",
  "properties": {
    "area_land":207352,
    "area_water":0,
    "geoid":"360594140014",
    "name":"Block Group 4",
    "state":"ny"
},
  "bbox": [
    -73.586077,
    40.679759,
    -73.579099,
    40.684781
],
  "geometry": {"coordinates":[[[-73.586077,40.684454],[-73.585409,40.684506],[-73.584643,40.684566],[-73.584354,40.684589],[-73.58424599999999,40.684601],[-73.583715,40.684637],[-73.582781,40.68471],[-73.582347,40.684742],[-73.582112,40.68476],[-73.581875,40.684781],[-73.581851,40.684727],[-73.581828,40.684651],[-73.58178700000001,40.684295],[-73.581729,40.683794],[-73.581684,40.683392],[-73.580726,40.683459],[-73.580403,40.683481],[-73.579645,40.683531],[-73.579556,40.682771],[-73.579476,40.682086],[-73.579396,40.681402],[-73.57938799999999,40.681285],[-73.579311,40.680829],[-73.579099,40.679759],[-73.579176,40.679766],[-73.579262,40.679775],[-73.57958499999999,40.679853],[-73.580247,40.680003],[-73.580603,40.680082],[-73.580844,40.680124],[-73.581057,40.680149],[-73.581374,40.680139],[-73.583133,40.68003],[-73.584042,40.679976],[-73.584225,40.679965],[-73.584148,40.680464],[-73.58412300000001,40.68071],[-73.584137,40.680845],[-73.58415599999999,40.68092],[-73.584169,40.680967],[-73.5842,40.681047],[-73.584323,40.681374],[-73.584621,40.682112],[-73.584886,40.682754],[-73.585137,40.683344],[-73.58521399999999,40.683489],[-73.585319,40.68364],[-73.585469,40.683827],[-73.585938,40.684301],[-73.58604099999999,40.684414],[-73.586077,40.684454]]],"type":"Polygon"}
}