{
  "id": "360050157001",
  "type": "Feature",
  "properties": {
    "area_land":150441,
    "area_water":0,
    "geoid":"360050157001",
    "name":"Block Group 1",
    "state":"ny"
},
  "bbox": [
    -73.887948,
    40.831505,
    -73.879983,
    40.835463
],
  "geometry": {"coordinates":[[[-73.88794799999999,40.833447],[-73.88696299999999,40.835096],[-73.886111,40.834806],[-73.88525199999999,40.834513],[-73.884394,40.834211],[-73.883505,40.833904],[-73.883326,40.834221],[-73.88297799999999,40.834682],[-73.882637,40.834922],[-73.882222,40.835463],[-73.882109,40.835426],[-73.882023,40.835397],[-73.88189300000001,40.835354],[-73.88126,40.835126],[-73.879983,40.83468],[-73.88235400000001,40.831505],[-73.883045,40.831706],[-73.88359,40.831899],[-73.884156,40.832121],[-73.884237,40.832153],[-73.884304,40.832179],[-73.884449,40.832228],[-73.884585,40.832281],[-73.88474100000001,40.832341],[-73.88538,40.83256],[-73.886242,40.832855],[-73.887095,40.833152],[-73.88794799999999,40.833447]]],"type":"Polygon"}
}