{
  "id": "360050239001",
  "type": "Feature",
  "properties": {
    "area_land":42079,
    "area_water":0,
    "geoid":"360050239001",
    "name":"Block Group 1",
    "state":"ny"
},
  "bbox": [
    -73.902545,
    40.859977,
    -73.899618,
    40.862756
],
  "geometry": {"coordinates":[[[-73.902034,40.861492],[-73.901614,40.862139],[-73.90107999999999,40.862756],[-73.900284,40.862472],[-73.899962,40.862351],[-73.899618,40.862159],[-73.90078800000001,40.859977],[-73.901633,40.860266],[-73.902545,40.860578],[-73.902034,40.861492]]],"type":"Polygon"}
}