{
  "id": "361031592043",
  "type": "Feature",
  "properties": {
    "area_land":5563894,
    "area_water":11572,
    "geoid":"361031592043",
    "name":"Block Group 3",
    "state":"ny"
},
  "bbox": [
    -72.938078,
    40.766125,
    -72.881948,
    40.796801
],
  "geometry": {"coordinates":[[[-72.938078,40.774682],[-72.93396799999999,40.775378],[-72.93174,40.775809],[-72.930939,40.77602],[-72.930443,40.776225],[-72.929101,40.776953],[-72.92892399999999,40.777037],[-72.928039,40.777526],[-72.916572,40.782978],[-72.916084,40.783442],[-72.911445,40.785583],[-72.90993400000001,40.786354],[-72.906272,40.788177],[-72.90491400000001,40.788849],[-72.901787,40.790386],[-72.90119799999999,40.790722],[-72.89351600000001,40.794513],[-72.892653,40.794964],[-72.891563,40.795379],[-72.890479,40.795746],[-72.89001399999999,40.795875],[-72.88937199999999,40.796001],[-72.88817400000001,40.796196],[-72.88700799999999,40.796371],[-72.885199,40.796596],[-72.88231500000001,40.796801],[-72.88194799999999,40.79661],[-72.883291,40.796275],[-72.883803,40.794674],[-72.883948,40.794601],[-72.88527499999999,40.793922],[-72.88552,40.793281],[-72.886015,40.793139],[-72.88596200000001,40.792995],[-72.885679,40.793011],[-72.88577100000001,40.79261],[-72.885389,40.792866],[-72.88523000000001,40.792643],[-72.88617499999999,40.791988],[-72.887404,40.791157],[-72.887548,40.790516],[-72.887152,40.790371],[-72.887007,40.791187],[-72.88654200000001,40.790977],[-72.88613700000001,40.789715],[-72.88651,40.789347],[-72.88798300000001,40.789268],[-72.88900599999999,40.788437],[-72.888525,40.787025],[-72.888991,40.786499],[-72.890204,40.786147],[-72.890556,40.785476],[-72.889929,40.783333],[-72.89018799999999,40.782626],[-72.891563,40.781765],[-72.892698,40.781841],[-72.89319399999999,40.782115],[-72.89383599999999,40.78218],[-72.894622,40.781986],[-72.894622,40.781505],[-72.893804,40.779747],[-72.892813,40.779074],[-72.892409,40.778915],[-72.892364,40.77866],[-72.893981,40.778178],[-72.89478200000001,40.777378],[-72.894873,40.776676],[-72.894812,40.775108],[-72.895895,40.774208],[-72.896109,40.774162],[-72.89677399999999,40.773929],[-72.898124,40.773494],[-72.89866499999999,40.773307],[-72.899207,40.77323],[-72.89936,40.773208],[-72.90104599999999,40.772964],[-72.901726,40.772968],[-72.90237399999999,40.772982],[-72.90302200000001,40.773017],[-72.903587,40.77306],[-72.904594,40.77317],[-72.906402,40.773353],[-72.907821,40.773498],[-72.90896499999999,40.773562],[-72.909819,40.77349],[-72.910239,40.773498],[-72.91063699999999,40.773513],[-72.911666,40.77362],[-72.912392,40.773719],[-72.91258999999999,40.773731],[-72.91291,40.773739],[-72.914147,40.773764],[-72.914581,40.773734],[-72.914832,40.773696],[-72.915252,40.773639],[-72.917044,40.773581],[-72.91811300000001,40.773551],[-72.92014899999999,40.773371],[-72.92025700000001,40.77293],[-72.920624,40.772013],[-72.920906,40.771609],[-72.921333,40.771213],[-72.921966,40.770656],[-72.92294200000001,40.769821],[-72.923395,40.769478],[-72.92392,40.769191],[-72.92454499999999,40.768959],[-72.926697,40.768345],[-72.927131,40.768176],[-72.92774199999999,40.767879],[-72.9281,40.767673],[-72.92849699999999,40.76734],[-72.92872699999999,40.767093],[-72.928956,40.766787],[-72.92918400000001,40.766468],[-72.929421,40.766125],[-72.92987100000001,40.766517],[-72.930351,40.766979],[-72.930894,40.767555],[-72.931076,40.767818],[-72.931946,40.768658],[-72.931985,40.768692],[-72.93234200000001,40.769062],[-72.93288800000001,40.769564],[-72.933002,40.769693],[-72.933183,40.769913],[-72.933373,40.769969],[-72.93388400000001,40.770755],[-72.934594,40.771572],[-72.93486,40.772212],[-72.934853,40.772743],[-72.936455,40.773025],[-72.93776099999999,40.773174],[-72.93791899999999,40.773178],[-72.93804900000001,40.774447],[-72.938078,40.774682]]],"type":"Polygon"}
}