{
  "id": "360810553002",
  "type": "Feature",
  "properties": {
    "area_land":53485,
    "area_water":0,
    "geoid":"360810553002",
    "name":"Block Group 2",
    "state":"ny"
},
  "bbox": [
    -73.911036,
    40.697825,
    -73.905605,
    40.700192
],
  "geometry": {"coordinates":[[[-73.911036,40.699532],[-73.909536,40.699745],[-73.908683,40.699841],[-73.908299,40.699882],[-73.906978,40.700034],[-73.906211,40.700122],[-73.90560499999999,40.700192],[-73.905879,40.699927],[-73.908022,40.697825],[-73.90877399999999,40.698255],[-73.909533,40.698675],[-73.91014300000001,40.699033],[-73.911036,40.699532]]],"type":"Polygon"}
}