{
  "id": "360470426003",
  "type": "Feature",
  "properties": {
    "area_land":40924,
    "area_water":0,
    "geoid":"360470426003",
    "name":"Block Group 3",
    "state":"ny"
},
  "bbox": [
    -73.982548,
    40.60316,
    -73.980752,
    40.607866
],
  "geometry": {"coordinates":[[[-73.98254799999999,40.607764],[-73.981624,40.607866],[-73.981217,40.605718],[-73.981134,40.60528],[-73.980752,40.603264],[-73.981679,40.60316],[-73.9821,40.605379],[-73.98214400000001,40.605615],[-73.98248,40.607402],[-73.98254799999999,40.607764]]],"type":"Polygon"}
}