{
  "id": "361190076006",
  "type": "Feature",
  "properties": {
    "area_land":682006,
    "area_water":0,
    "geoid":"361190076006",
    "name":"Block Group 6",
    "state":"ny"
},
  "bbox": [
    -73.684092,
    40.965699,
    -73.672932,
    40.982162
],
  "geometry": {"coordinates":[[[-73.684085,40.967919],[-73.684027,40.968113],[-73.683829,40.968606],[-73.68379299999999,40.968688],[-73.68367000000001,40.968972],[-73.683367,40.969726],[-73.683074,40.970458],[-73.68274599999999,40.971267],[-73.682309,40.972317],[-73.681955,40.973147],[-73.68164899999999,40.973855],[-73.681552,40.974054],[-73.68105199999999,40.975099],[-73.680942,40.975335],[-73.680819,40.975602],[-73.68064,40.976008],[-73.68043,40.976457],[-73.68032700000001,40.976642],[-73.680143,40.976909],[-73.679588,40.97771],[-73.67918400000001,40.97826],[-73.678659,40.979021],[-73.678472,40.979309],[-73.677684,40.980465],[-73.67766399999999,40.980508],[-73.67764200000001,40.980557],[-73.677622,40.980614],[-73.677538,40.980854],[-73.677252,40.980941],[-73.676213,40.981324],[-73.675364,40.981645],[-73.675207,40.981705],[-73.674582,40.981945],[-73.67437700000001,40.982007],[-73.67419700000001,40.982022],[-73.674042,40.982018],[-73.673744,40.981985],[-73.67346999999999,40.982007],[-73.672932,40.982162],[-73.67300400000001,40.981875],[-73.673171,40.981335],[-73.67331799999999,40.980851],[-73.673479,40.980295],[-73.673722,40.979551],[-73.673818,40.979563],[-73.674049,40.978881],[-73.674206,40.978498],[-73.67434,40.978205],[-73.674649,40.977554],[-73.67495,40.976897],[-73.675022,40.97675],[-73.67509200000001,40.976608],[-73.675253,40.976279],[-73.67566100000001,40.975542],[-73.675798,40.975305],[-73.67599800000001,40.974931],[-73.67607700000001,40.974755],[-73.676117,40.974665],[-73.67639200000001,40.974068],[-73.676738,40.973354],[-73.676846,40.97316],[-73.676918,40.973031],[-73.677308,40.972335],[-73.677781,40.971562],[-73.67788299999999,40.971365],[-73.67823300000001,40.970695],[-73.67851,40.970169],[-73.678659,40.96989],[-73.678922,40.969397],[-73.67900899999999,40.969235],[-73.67934099999999,40.968613],[-73.67940299999999,40.968497],[-73.679686,40.967966],[-73.679872,40.967615],[-73.680025,40.96735],[-73.680121,40.967184],[-73.680347,40.966796],[-73.680533,40.966485],[-73.680885,40.965915],[-73.680948,40.965797],[-73.68098500000001,40.965699],[-73.68369800000001,40.966354],[-73.683988,40.967219],[-73.68405300000001,40.967412],[-73.68407999999999,40.967526],[-73.68409200000001,40.967777],[-73.684085,40.967919]]],"type":"Polygon"}
}