{
  "id": "360810991004",
  "type": "Feature",
  "properties": {
    "area_land":318867,
    "area_water":0,
    "geoid":"360810991004",
    "name":"Block Group 4",
    "state":"ny"
},
  "bbox": [
    -73.807974,
    40.785846,
    -73.794767,
    40.789461
],
  "geometry": {"coordinates":[[[-73.80795500000001,40.78701],[-73.80762199999999,40.789461],[-73.806668,40.789383],[-73.805764,40.789313],[-73.804852,40.789238],[-73.80393599999999,40.789165],[-73.80304099999999,40.789095],[-73.802122,40.789021],[-73.801209,40.78895],[-73.800405,40.788915],[-73.797297,40.789372],[-73.797119,40.788667],[-73.796756,40.787232],[-73.796847,40.786286],[-73.79588800000001,40.786442],[-73.79476699999999,40.78675],[-73.79488600000001,40.786422],[-73.79494,40.786275],[-73.795805,40.786071],[-73.79593300000001,40.786052],[-73.796806,40.785925],[-73.796851,40.785911],[-73.797832,40.785846],[-73.79880300000001,40.785869],[-73.79926,40.785885],[-73.799744,40.785903],[-73.799813,40.785907],[-73.800685,40.785951],[-73.801574,40.785983],[-73.801766,40.78599],[-73.80215,40.786004],[-73.80242200000001,40.786019],[-73.804558,40.786148],[-73.80627699999999,40.786299],[-73.806387,40.786436],[-73.806646,40.78676],[-73.807399,40.786818],[-73.807974,40.786892],[-73.80795500000001,40.78701]]],"type":"Polygon"}
}