{
  "id": "361190147033",
  "type": "Feature",
  "properties": {
    "area_land":2850297,
    "area_water":33605,
    "geoid":"361190147033",
    "name":"Block Group 3",
    "state":"ny"
},
  "bbox": [
    -73.89418,
    41.300312,
    -73.875119,
    41.332785
],
  "geometry": {"coordinates":[[[-73.89418000000001,41.328508],[-73.894156,41.32858],[-73.894054,41.328704],[-73.893884,41.328848],[-73.893745,41.328937],[-73.89363299999999,41.329024],[-73.89347600000001,41.32918],[-73.89333999999999,41.329405],[-73.893218,41.329631],[-73.893097,41.329905],[-73.893075,41.330082],[-73.893034,41.330871],[-73.893029,41.330966],[-73.892926,41.330983],[-73.892256,41.330954],[-73.89142699999999,41.330993],[-73.890602,41.331071],[-73.890145,41.331124],[-73.88973900000001,41.331172],[-73.889692,41.331176],[-73.889235,41.331272],[-73.888925,41.331339],[-73.888902,41.331338],[-73.88887800000001,41.331336],[-73.888465,41.331419],[-73.88826400000001,41.331456],[-73.88818000000001,41.331472],[-73.888093,41.331476],[-73.88776300000001,41.331491],[-73.887198,41.331517],[-73.887173,41.331519],[-73.886425,41.331609],[-73.886374,41.331614],[-73.88551,41.331698],[-73.884778,41.331788],[-73.8847,41.331798],[-73.883878,41.331862],[-73.883787,41.331869],[-73.88330000000001,41.331956],[-73.882735,41.332043],[-73.88181899999999,41.332242],[-73.88118900000001,41.33238],[-73.88040100000001,41.332551],[-73.880213,41.332575],[-73.880009,41.332609],[-73.879948,41.332623],[-73.879874,41.332626],[-73.878744,41.332678],[-73.875119,41.332785],[-73.87514899999999,41.332678],[-73.87520499999999,41.332478],[-73.875235,41.332323],[-73.875275,41.332114],[-73.875331,41.33169],[-73.87535,41.331552],[-73.875353,41.331336],[-73.875893,41.331324],[-73.876099,41.331317],[-73.876503,41.331281],[-73.877104,41.331211],[-73.87726499999999,41.331184],[-73.87775499999999,41.331128],[-73.878203,41.331067],[-73.87835,41.331028],[-73.878494,41.330967],[-73.878648,41.330881],[-73.87880199999999,41.330781],[-73.878947,41.330667],[-73.879008,41.330619],[-73.879464,41.330317],[-73.879808,41.330134],[-73.88006300000001,41.330012],[-73.88011299999999,41.32998],[-73.88026000000001,41.329886],[-73.88051,41.329666],[-73.880678,41.329458],[-73.880774,41.329309],[-73.881035,41.3288],[-73.881331,41.328138],[-73.881885,41.326894],[-73.881995,41.32666],[-73.88272600000001,41.325103],[-73.882909,41.324813],[-73.88311899999999,41.324537],[-73.883154,41.324456],[-73.88293899999999,41.324141],[-73.882743,41.323875],[-73.882465,41.323462],[-73.88224200000001,41.323033],[-73.882195,41.322915],[-73.882069,41.322547],[-73.881969,41.322047],[-73.881889,41.321543],[-73.881862,41.321378],[-73.88184099999999,41.32125],[-73.881705,41.320491],[-73.881508,41.319336],[-73.881471,41.318924],[-73.881433,41.31859],[-73.88144800000001,41.318336],[-73.88149300000001,41.318042],[-73.881585,41.317804],[-73.881658,41.317578],[-73.882149,41.315678],[-73.882192,41.315431],[-73.88219599999999,41.315216],[-73.882167,41.314965],[-73.882002,41.314578],[-73.88181400000001,41.314328],[-73.881738,41.314239],[-73.881473,41.31401],[-73.881286,41.313902],[-73.88087400000001,41.313718],[-73.880743,41.313674],[-73.87997900000001,41.313506],[-73.879722,41.313429],[-73.87945000000001,41.313318],[-73.879271,41.313228],[-73.87905000000001,41.313098],[-73.87885799999999,41.312952],[-73.878535,41.312594],[-73.87846999999999,41.312497],[-73.878362,41.312242],[-73.878314,41.312052],[-73.878185,41.311351],[-73.87812700000001,41.310913],[-73.87787,41.309578],[-73.87781200000001,41.309229],[-73.87767599999999,41.308529],[-73.877557,41.30818],[-73.877469,41.308044],[-73.87736599999999,41.307916],[-73.877241,41.307802],[-73.87710199999999,41.307699],[-73.87688199999999,41.30756],[-73.87661300000001,41.307413],[-73.87639799999999,41.307319],[-73.87701800000001,41.306677],[-73.877143,41.306559],[-73.87759800000001,41.306084],[-73.877954,41.305712],[-73.878163,41.305507],[-73.879064,41.304633],[-73.879897,41.303774],[-73.880107,41.303583],[-73.880655,41.303054],[-73.88124999999999,41.302485],[-73.881957,41.301806],[-73.882396,41.301375],[-73.882549,41.301231],[-73.882999,41.300924],[-73.883691,41.300471],[-73.883956,41.300312],[-73.884097,41.301532],[-73.884106,41.301792],[-73.884158,41.301972],[-73.884192,41.302026],[-73.88436799999999,41.302188],[-73.884598,41.302337],[-73.885025,41.302432],[-73.885363,41.30252],[-73.88643399999999,41.302743],[-73.886623,41.302825],[-73.886765,41.30294],[-73.88686,41.303048],[-73.886903,41.303133],[-73.886921,41.30317],[-73.886989,41.303441],[-73.886996,41.303569],[-73.88690099999999,41.305166],[-73.886718,41.306534],[-73.886725,41.306737],[-73.886765,41.306926],[-73.88690099999999,41.307258],[-73.887158,41.307644],[-73.887849,41.308544],[-73.88813399999999,41.308848],[-73.888255,41.308916],[-73.888398,41.308963],[-73.88870199999999,41.308991],[-73.888784,41.309024],[-73.888851,41.309126],[-73.88898,41.309485],[-73.88907500000001,41.309647],[-73.889109,41.309958],[-73.889183,41.310358],[-73.88938,41.311082],[-73.889512,41.311782],[-73.88952399999999,41.311922],[-73.889535,41.31204],[-73.889617,41.312195],[-73.889617,41.312361],[-73.88994099999999,41.313313],[-73.890663,41.31556],[-73.890917,41.316452],[-73.891413,41.317963],[-73.891606,41.319172],[-73.891656,41.319342],[-73.89173099999999,41.3196],[-73.89231100000001,41.322336],[-73.89254,41.322811],[-73.892657,41.323055],[-73.893136,41.325146],[-73.893248,41.325496],[-73.893396,41.326114],[-73.893672,41.327124],[-73.893748,41.32749],[-73.893838,41.32772],[-73.894132,41.328308],[-73.894172,41.328428],[-73.89418000000001,41.328508]]],"type":"Polygon"}
}