{
  "id": "360050183013",
  "type": "Feature",
  "properties": {
    "area_land":21480,
    "area_water":0,
    "geoid":"360050183013",
    "name":"Block Group 3",
    "state":"ny"
},
  "bbox": [
    -73.921171,
    40.829114,
    -73.918944,
    40.830915
],
  "geometry": {"coordinates":[[[-73.921171,40.829628],[-73.920461,40.830915],[-73.92032,40.830861],[-73.919567,40.830576],[-73.919467,40.830538],[-73.918944,40.830335],[-73.919313,40.829702],[-73.919642,40.829114],[-73.920225,40.829309],[-73.92059500000001,40.829434],[-73.92108399999999,40.829599],[-73.921171,40.829628]]],"type":"Polygon"}
}