{
  "id": "361019608002",
  "type": "Feature",
  "properties": {
    "area_land":1102109,
    "area_water":0,
    "geoid":"361019608002",
    "name":"Block Group 2",
    "state":"ny"
},
  "bbox": [
    -77.68212,
    42.316885,
    -77.663411,
    42.337862
],
  "geometry": {"coordinates":[[[-77.68212,42.334452],[-77.678871,42.334274],[-77.674829,42.33348],[-77.67349,42.333132],[-77.673868,42.33338],[-77.6747,42.333866],[-77.674874,42.333937],[-77.675156,42.334035],[-77.675377,42.334144],[-77.676457,42.33473],[-77.676543,42.334777],[-77.67701099999999,42.335037],[-77.677182,42.335119],[-77.677453,42.335227],[-77.677429,42.335421],[-77.67745499999999,42.335941],[-77.67744999999999,42.336764],[-77.67660100000001,42.336892],[-77.675541,42.337399],[-77.675315,42.337494],[-77.675009,42.337468],[-77.673785,42.337244],[-77.673648,42.337302],[-77.673044,42.337339],[-77.67280599999999,42.337374],[-77.672757,42.337373],[-77.672611,42.337287],[-77.67253599999999,42.33729],[-77.67122500000001,42.336525],[-77.670404,42.337759],[-77.66965399999999,42.337862],[-77.669489,42.337405],[-77.66945,42.337298],[-77.668311,42.334084],[-77.667079,42.330594],[-77.667011,42.330399],[-77.666826,42.329866],[-77.66678400000001,42.329762],[-77.666651,42.329459],[-77.66655799999999,42.329276],[-77.66638500000001,42.328937],[-77.666179,42.328596],[-77.666016,42.328359],[-77.665845,42.328151],[-77.664547,42.326743],[-77.664096,42.32627],[-77.663411,42.325523],[-77.66358,42.325531],[-77.664934,42.325568],[-77.664768,42.325141],[-77.66555700000001,42.325151],[-77.666556,42.325167],[-77.666375,42.324327],[-77.666344,42.324073],[-77.666342,42.32364],[-77.66636099999999,42.32271],[-77.666499,42.321526],[-77.66652000000001,42.321434],[-77.66670999999999,42.320886],[-77.666723,42.320825],[-77.666777,42.320386],[-77.66683500000001,42.319454],[-77.666718,42.319439],[-77.665863,42.319243],[-77.66529800000001,42.319085],[-77.665297,42.318858],[-77.665656,42.318798],[-77.66737500000001,42.318478],[-77.667536,42.318423],[-77.669262,42.317652],[-77.6709,42.316885],[-77.67067,42.319078],[-77.67067,42.319307],[-77.67107,42.320759],[-77.67057699999999,42.323651],[-77.670575,42.323662],[-77.670475,42.329394],[-77.67046499999999,42.3297],[-77.670423,42.32991],[-77.670457,42.329924],[-77.671176,42.330219],[-77.67133200000001,42.33031],[-77.671442,42.330394],[-77.67152900000001,42.330474],[-77.671925,42.330904],[-77.672045,42.330998],[-77.672155,42.331068],[-77.67230000000001,42.331144],[-77.672377,42.331195],[-77.672681,42.331505],[-77.673181,42.331938],[-77.67325700000001,42.331982],[-77.673518,42.332066],[-77.673682,42.332106],[-77.673813,42.332117],[-77.67412,42.332091],[-77.674683,42.331978],[-77.67528799999999,42.33184],[-77.675551,42.331749],[-77.675642,42.331734],[-77.67609899999999,42.331753],[-77.676413,42.331791],[-77.67673600000001,42.33159],[-77.677361,42.331673],[-77.679078,42.33189],[-77.68057,42.332107],[-77.680808,42.332153],[-77.680842,42.332161],[-77.681507,42.333472],[-77.68212,42.334452]]],"type":"Polygon"}
}