{
  "id": "360379511004",
  "type": "Feature",
  "properties": {
    "area_land":41523746,
    "area_water":392972,
    "geoid":"360379511004",
    "name":"Block Group 4",
    "state":"ny"
},
  "bbox": [
    -78.133939,
    42.983988,
    -78.034914,
    43.04517
],
  "geometry": {"coordinates":[[[-78.133939,43.03721],[-78.13393000000001,43.037281],[-78.133728,43.038037],[-78.133627,43.038459],[-78.133602,43.038635],[-78.133578,43.038971],[-78.133572,43.039049],[-78.133608,43.04113],[-78.13364300000001,43.042327],[-78.133646,43.042461],[-78.133698,43.044549],[-78.133698,43.044967],[-78.12512,43.045017],[-78.12407399999999,43.044996],[-78.12385399999999,43.044988],[-78.117825,43.045121],[-78.115956,43.045162],[-78.11560900000001,43.04517],[-78.115612,43.044997],[-78.115613,43.044967],[-78.115601,43.044574],[-78.115556,43.04385],[-78.115617,43.042833],[-78.11559800000001,43.041707],[-78.11554599999999,43.040555],[-78.11556299999999,43.040185],[-78.115561,43.040112],[-78.109049,43.039895],[-78.10881000000001,43.039887],[-78.10631600000001,43.039822],[-78.098145,43.039611],[-78.09425899999999,43.039535],[-78.09418599999999,43.039534],[-78.082589,43.039186],[-78.081135,43.039149],[-78.080324,43.039129],[-78.078934,43.039096],[-78.075959,43.039047],[-78.07435,43.039019],[-78.06581300000001,43.038932],[-78.051067,43.038814],[-78.047028,43.038793],[-78.04523500000001,43.038779],[-78.039855,43.038754],[-78.034914,43.038752],[-78.03492799999999,43.037809],[-78.03500099999999,43.037537],[-78.034978,43.034043],[-78.034972,43.032794],[-78.03502400000001,43.030272],[-78.034987,43.029792],[-78.03498,43.029259],[-78.03498399999999,43.026523],[-78.034992,43.025013],[-78.03498,43.024135],[-78.035106,43.011438],[-78.03510199999999,43.010889],[-78.035077,43.009786],[-78.035065,43.008035],[-78.035061,43.007391],[-78.035079,43.00634],[-78.035112,43.004478],[-78.03524400000001,42.99989],[-78.035245,42.997406],[-78.035291,42.997495],[-78.03538399999999,42.997553],[-78.035461,42.997572],[-78.03561500000001,42.997583],[-78.038017,42.997589],[-78.03945899999999,42.997579],[-78.041646,42.997588],[-78.043824,42.997587],[-78.045085,42.997575],[-78.046631,42.997556],[-78.048017,42.997554],[-78.04948400000001,42.997545],[-78.04958000000001,42.997545],[-78.053522,42.997547],[-78.062164,42.997505],[-78.062972,42.997506],[-78.065837,42.997476],[-78.072213,42.997445],[-78.074483,42.997439],[-78.074485,42.997629],[-78.074487,42.997891],[-78.074493,42.99842],[-78.074555,42.99841],[-78.07467,42.998374],[-78.075142,42.998111],[-78.07538599999999,42.997982],[-78.07558400000001,42.997892],[-78.075734,42.997838],[-78.075892,42.9978],[-78.07621399999999,42.997731],[-78.077128,42.997585],[-78.077944,42.997447],[-78.078273,42.997408],[-78.07900100000001,42.997382],[-78.07984999999999,42.997383],[-78.083155,42.997362],[-78.08734699999999,42.997367],[-78.088994,42.997351],[-78.09064600000001,42.99735],[-78.093447,42.997337],[-78.093795,42.997322],[-78.09404000000001,42.997283],[-78.09421500000001,42.99724],[-78.094492,42.997155],[-78.095366,42.996845],[-78.09593,42.996672],[-78.095949,42.996319],[-78.09593700000001,42.994594],[-78.09593599999999,42.994479],[-78.095934,42.994362],[-78.095933,42.994277],[-78.09591399999999,42.993436],[-78.095899,42.993046],[-78.095876,42.992913],[-78.095787,42.992621],[-78.095676,42.99239],[-78.095372,42.991965],[-78.09522200000001,42.991799],[-78.095016,42.9916],[-78.094999,42.991584],[-78.09489499999999,42.991477],[-78.09456299999999,42.991136],[-78.094313,42.990828],[-78.094201,42.990663],[-78.09409599999999,42.990477],[-78.093994,42.990221],[-78.093917,42.989951],[-78.09389,42.989636],[-78.093874,42.987715],[-78.09388199999999,42.986878],[-78.09385899999999,42.983988],[-78.09604899999999,42.984239],[-78.09757,42.984412],[-78.09983699999999,42.984678],[-78.100674,42.984781],[-78.10148,42.984879],[-78.104688,42.985268],[-78.10612399999999,42.985452],[-78.107698,42.985664],[-78.110068,42.985969],[-78.110536,42.986032],[-78.111059,42.986103],[-78.112065,42.986244],[-78.11276100000001,42.986346],[-78.114694,42.98661],[-78.119314,42.987199],[-78.12109599999999,42.987448],[-78.123768,42.987808],[-78.12559899999999,42.988072],[-78.12656800000001,42.988218],[-78.12731700000001,42.988358],[-78.129357,42.988741],[-78.131011,42.98906],[-78.131219,42.9891],[-78.13135800000001,42.989127],[-78.131383,42.989132],[-78.133427,42.989532],[-78.13345700000001,42.990361],[-78.133501,42.990678],[-78.133565,42.990972],[-78.13343,42.991709],[-78.133431,42.993059],[-78.133534,42.996507],[-78.13348499999999,42.996847],[-78.133481,42.996903],[-78.133475,42.997019],[-78.13347400000001,42.997042],[-78.133456,42.997268],[-78.13340100000001,42.998261],[-78.133398,42.998431],[-78.13337799999999,42.999541],[-78.133375,43.000069],[-78.13336700000001,43.001347],[-78.133369,43.00282],[-78.133359,43.004386],[-78.13336,43.004434],[-78.133386,43.007014],[-78.13337199999999,43.008061],[-78.133371,43.008764],[-78.13337799999999,43.010469],[-78.133376,43.011091],[-78.13333900000001,43.015405],[-78.13334999999999,43.016543],[-78.133348,43.016963],[-78.13330999999999,43.017285],[-78.133273,43.017433],[-78.133162,43.017683],[-78.133049,43.017859],[-78.132924,43.018021],[-78.13332200000001,43.018238],[-78.133341,43.018272],[-78.13334500000001,43.018486],[-78.133351,43.018861],[-78.133346,43.019443],[-78.133332,43.021058],[-78.133334,43.021474],[-78.133334,43.02208],[-78.133312,43.022284],[-78.13330499999999,43.022348],[-78.13325500000001,43.023238],[-78.133269,43.024013],[-78.13321500000001,43.024803],[-78.13318200000001,43.025558],[-78.13314699999999,43.025717],[-78.133112,43.025858],[-78.133039,43.026104],[-78.13308499999999,43.026327],[-78.133146,43.026567],[-78.133223,43.026999],[-78.133274,43.027472],[-78.133319,43.028546],[-78.133324,43.030021],[-78.133313,43.032587],[-78.133337,43.033542],[-78.13338899999999,43.034359],[-78.13343,43.034703],[-78.133512,43.035114],[-78.133634,43.035663],[-78.133686,43.035895],[-78.133769,43.036257],[-78.133917,43.03688],[-78.133939,43.037016],[-78.133939,43.03721]]],"type":"Polygon"}
}