{
  "id": "360850223002",
  "type": "Feature",
  "properties": {
    "area_land":344090,
    "area_water":0,
    "geoid":"360850223002",
    "name":"Block Group 2",
    "state":"ny"
},
  "bbox": [
    -74.154774,
    40.634115,
    -74.143086,
    40.639796
],
  "geometry": {"coordinates":[[[-74.15433,40.637447],[-74.152334,40.637711],[-74.152732,40.638838],[-74.151073,40.638952],[-74.149969,40.637572],[-74.149412,40.637558],[-74.14953800000001,40.638187],[-74.149152,40.638716],[-74.148821,40.638904],[-74.146546,40.639042],[-74.14612099999999,40.639141],[-74.146141,40.639265],[-74.14485999999999,40.639398],[-74.144746,40.639314],[-74.143777,40.638755],[-74.143254,40.639796],[-74.143086,40.639784],[-74.14360000000001,40.638514],[-74.14393699999999,40.638347],[-74.144783,40.637953],[-74.14496200000001,40.637384],[-74.145565,40.635459],[-74.14563099999999,40.635246],[-74.146128,40.634972],[-74.146704,40.634657],[-74.147042,40.634517],[-74.14803000000001,40.634329],[-74.14951600000001,40.634129],[-74.149621,40.634115],[-74.15085000000001,40.634192],[-74.15186,40.634179],[-74.153268,40.634173],[-74.15325900000001,40.634223],[-74.153212,40.634504],[-74.153103,40.635162],[-74.153047,40.635565],[-74.153026,40.635711],[-74.152973,40.636081],[-74.152862,40.636864],[-74.15362,40.636808],[-74.154774,40.636796],[-74.15433,40.637447]]],"type":"Polygon"}
}