{
  "id": "360910620001",
  "type": "Feature",
  "properties": {
    "area_land":8311646,
    "area_water":627753,
    "geoid":"360910620001",
    "name":"Block Group 1",
    "state":"ny"
},
  "bbox": [
    -73.699881,
    42.909384,
    -73.659245,
    42.957119
],
  "geometry": {"coordinates":[[[-73.699881,42.935109],[-73.699838,42.935356],[-73.699726,42.935632],[-73.69896799999999,42.936742],[-73.698409,42.93764],[-73.697548,42.938997],[-73.697442,42.939212],[-73.697429,42.939264],[-73.69693100000001,42.939103],[-73.69580499999999,42.9388],[-73.69310400000001,42.938122],[-73.691164,42.937646],[-73.690117,42.937403],[-73.689695,42.937305],[-73.688991,42.937136],[-73.687629,42.936829],[-73.68489599999999,42.936198],[-73.684269,42.936069],[-73.683348,42.93586],[-73.681515,42.935343],[-73.68083,42.935096],[-73.680336,42.934902],[-73.679925,42.934767],[-73.679788,42.934728],[-73.67971799999999,42.93493],[-73.679473,42.93525],[-73.67921800000001,42.935604],[-73.678045,42.937019],[-73.677564,42.937631],[-73.67643700000001,42.938954],[-73.676316,42.939114],[-73.675274,42.940328],[-73.675,42.940677],[-73.674683,42.941158],[-73.674638,42.941259],[-73.674498,42.941603],[-73.674367,42.942102],[-73.67432700000001,42.942386],[-73.674334,42.942721],[-73.67444,42.943256],[-73.674549,42.943599],[-73.674684,42.943869],[-73.67486599999999,42.944138],[-73.675202,42.944553],[-73.676492,42.946262],[-73.676773,42.946666],[-73.677195,42.947206],[-73.678112,42.948453],[-73.67930699999999,42.949944],[-73.67922,42.950034],[-73.679036,42.950266],[-73.678726,42.950763],[-73.678467,42.951304],[-73.67688200000001,42.953268],[-73.676159,42.954184],[-73.675527,42.954895],[-73.675342,42.955082],[-73.674637,42.955723],[-73.672988,42.957119],[-73.67213,42.956437],[-73.67145499999999,42.955926],[-73.67107799999999,42.955603],[-73.67083100000001,42.95539],[-73.670653,42.95519],[-73.670289,42.954717],[-73.670056,42.954378],[-73.669808,42.954087],[-73.669563,42.953857],[-73.66927800000001,42.953716],[-73.668977,42.953594],[-73.668339,42.953426],[-73.66783100000001,42.953275],[-73.667573,42.953184],[-73.66722900000001,42.953033],[-73.667087,42.952942],[-73.66684600000001,42.952789],[-73.666545,42.952523],[-73.666314,42.952284],[-73.666015,42.951908],[-73.66565,42.951361],[-73.665494,42.951052],[-73.66541100000001,42.950834],[-73.665334,42.950455],[-73.66533,42.950058],[-73.665381,42.949417],[-73.665373,42.949293],[-73.665316,42.949001],[-73.665178,42.948604],[-73.665013,42.948279],[-73.66481899999999,42.947944],[-73.66467,42.947762],[-73.66435300000001,42.947456],[-73.663725,42.946986],[-73.663256,42.946601],[-73.663088,42.946443],[-73.662994,42.946337],[-73.66286599999999,42.946133],[-73.66279299999999,42.945977],[-73.662723,42.945707],[-73.662719,42.945577],[-73.66276999999999,42.944767],[-73.662756,42.944654],[-73.662724,42.944545],[-73.66257,42.944243],[-73.662465,42.944069],[-73.662374,42.943952],[-73.661762,42.943213],[-73.661236,42.942626],[-73.66099,42.942416],[-73.660749,42.942265],[-73.66034000000001,42.941999],[-73.659409,42.941439],[-73.65935,42.941402],[-73.659245,42.941338],[-73.659627,42.94113],[-73.659736,42.940974],[-73.659848,42.940798],[-73.659893,42.940724],[-73.66118,42.939867],[-73.66059799999999,42.939758],[-73.66053100000001,42.939751],[-73.660127,42.939706],[-73.66016,42.939645],[-73.66028,42.939283],[-73.660433,42.938879],[-73.66082,42.938193],[-73.660882,42.938034],[-73.66108699999999,42.937369],[-73.66116700000001,42.937103],[-73.661258,42.936804],[-73.662524,42.935696],[-73.66403800000001,42.934209],[-73.663444,42.933904],[-73.663147,42.933769],[-73.660433,42.932534],[-73.66051400000001,42.932443],[-73.660628,42.932294],[-73.66135199999999,42.931458],[-73.66200600000001,42.930562],[-73.662943,42.929556],[-73.662964,42.929533],[-73.663044,42.929448],[-73.663281,42.929156],[-73.66331099999999,42.929088],[-73.66332300000001,42.929061],[-73.66335100000001,42.929],[-73.663387,42.928894],[-73.66339499999999,42.928845],[-73.663402,42.928803],[-73.663398,42.928741],[-73.663369,42.928614],[-73.663369,42.928527],[-73.663371,42.928241],[-73.663372,42.927999],[-73.663374,42.927659],[-73.663374,42.927623],[-73.663375,42.9276],[-73.663375,42.927586],[-73.663375,42.927555],[-73.663375,42.927532],[-73.663375,42.927471],[-73.663376,42.927308],[-73.66337900000001,42.926811],[-73.663428,42.92669],[-73.66344700000001,42.926626],[-73.663522,42.926543],[-73.66367700000001,42.926445],[-73.663696,42.926433],[-73.663771,42.92635],[-73.66383399999999,42.926341],[-73.663935,42.92625],[-73.663983,42.926221],[-73.664033,42.926212],[-73.664145,42.926157],[-73.664283,42.92612],[-73.664345,42.926064],[-73.66443200000001,42.926046],[-73.664495,42.926],[-73.664541,42.925979],[-73.66459399999999,42.925954],[-73.66483100000001,42.925779],[-73.664931,42.925632],[-73.664956,42.925494],[-73.66506800000001,42.925337],[-73.665131,42.925181],[-73.665218,42.925107],[-73.66534299999999,42.92495],[-73.665492,42.92472],[-73.66553,42.924619],[-73.665617,42.924536],[-73.665717,42.924397],[-73.665729,42.924315],[-73.665817,42.92426],[-73.665916,42.924122],[-73.66592900000001,42.924067],[-73.666016,42.924002],[-73.666116,42.923827],[-73.66639000000001,42.923551],[-73.666526,42.92345],[-73.66696399999999,42.923091],[-73.66701399999999,42.923017],[-73.667164,42.922897],[-73.667276,42.922741],[-73.66742499999999,42.922612],[-73.667525,42.922575],[-73.667625,42.922492],[-73.66766200000001,42.922437],[-73.66775,42.922391],[-73.66782499999999,42.922382],[-73.668012,42.92228],[-73.66817399999999,42.922244],[-73.668431,42.922256],[-73.67136499999999,42.919573],[-73.671421,42.919522],[-73.671564,42.91939],[-73.671695,42.919262],[-73.671725,42.919233],[-73.67529999999999,42.915763],[-73.67887399999999,42.912293],[-73.67891299999999,42.912212],[-73.68077099999999,42.912221],[-73.681934,42.91224],[-73.68248,42.912285],[-73.68355099999999,42.911169],[-73.685044,42.909701],[-73.68522,42.909535],[-73.685377,42.909384],[-73.68668099999999,42.909734],[-73.686725,42.909745],[-73.686989,42.909811],[-73.686915,42.909901],[-73.686744,42.910178],[-73.686562,42.910512],[-73.686487,42.910685],[-73.68628200000001,42.911009],[-73.686126,42.911336],[-73.685969,42.911835],[-73.68707000000001,42.912133],[-73.689688,42.912831],[-73.69067099999999,42.913094],[-73.69108199999999,42.912317],[-73.69135,42.911691],[-73.691429,42.911864],[-73.691489,42.912021],[-73.691508,42.912098],[-73.69156099999999,42.912316],[-73.69162300000001,42.912468],[-73.691648,42.912565],[-73.69171799999999,42.9127],[-73.69187700000001,42.912899],[-73.692008,42.913043],[-73.692365,42.913285],[-73.692448,42.91333],[-73.692885,42.91347],[-73.69322699999999,42.913551],[-73.693806,42.913659],[-73.69438100000001,42.913815],[-73.694596,42.913865],[-73.69546200000001,42.914088],[-73.69586,42.914182],[-73.696342,42.914307],[-73.696697,42.914406],[-73.69700400000001,42.914533],[-73.697101,42.914578],[-73.697315,42.914704],[-73.69749299999999,42.91485],[-73.697681,42.915088],[-73.697777,42.915288],[-73.697838,42.915522],[-73.69789,42.915862],[-73.697846,42.916799],[-73.69785899999999,42.917445],[-73.697897,42.917783],[-73.697923,42.917919],[-73.698088,42.918807],[-73.69813499999999,42.919141],[-73.69815199999999,42.919248],[-73.69816899999999,42.919366],[-73.698183,42.91946],[-73.698308,42.920068],[-73.698358,42.920406],[-73.69837,42.920491],[-73.698455,42.921069],[-73.698464,42.921747],[-73.698435,42.921945],[-73.69842300000001,42.922088],[-73.698317,42.922494],[-73.697988,42.923444],[-73.697928,42.923651],[-73.697457,42.92478],[-73.697191,42.925318],[-73.696972,42.925844],[-73.696783,42.926252],[-73.69666100000001,42.926652],[-73.696647,42.926838],[-73.696647,42.927421],[-73.69671700000001,42.928532],[-73.696749,42.928788],[-73.69696,42.929911],[-73.697053,42.930452],[-73.69714,42.930927],[-73.697204,42.93119],[-73.69728499999999,42.931454],[-73.697352,42.931574],[-73.697619,42.931944],[-73.69908700000001,42.933594],[-73.699141,42.933667],[-73.69956500000001,42.934144],[-73.69972799999999,42.93444],[-73.699837,42.934695],[-73.699881,42.93491],[-73.699881,42.935109]]],"type":"Polygon"}
}