{
  "id": "360271600031",
  "type": "Feature",
  "properties": {
    "area_land":18866593,
    "area_water":5281810,
    "geoid":"360271600031",
    "name":"Block Group 1",
    "state":"ny"
},
  "bbox": [
    -73.957938,
    41.913558,
    -73.894203,
    41.981813
],
  "geometry": {"coordinates":[[[-73.95769300000001,41.923884],[-73.95754700000001,41.925331],[-73.957421,41.926572],[-73.957274,41.927366],[-73.956733,41.930284],[-73.956029,41.933676],[-73.955597,41.936188],[-73.955389,41.938924],[-73.955101,41.941036],[-73.954973,41.944044],[-73.954589,41.948092],[-73.954205,41.950812],[-73.953709,41.952748],[-73.953453,41.953564],[-73.95313299999999,41.954492],[-73.95302100000001,41.955212],[-73.95282899999999,41.957067],[-73.952369,41.958287],[-73.952365,41.958297],[-73.952246,41.958612],[-73.952096,41.959011],[-73.952093,41.95902],[-73.951542,41.960527],[-73.951533,41.960556],[-73.95087700000001,41.962428],[-73.950492,41.964092],[-73.950076,41.965756],[-73.949212,41.96822],[-73.948412,41.970076],[-73.94721199999999,41.973372],[-73.946684,41.975228],[-73.94667800000001,41.975249],[-73.946594,41.975489],[-73.946589,41.975503],[-73.946584,41.975517],[-73.94607600000001,41.976988],[-73.94586200000001,41.977597],[-73.94585499999999,41.977616],[-73.94584500000001,41.977646],[-73.945834,41.977678],[-73.945823,41.97771],[-73.94566,41.978172],[-73.945459,41.978693],[-73.94506800000001,41.979708],[-73.944636,41.981276],[-73.944478,41.981813],[-73.93704099999999,41.980249],[-73.93655,41.980147],[-73.93631600000001,41.980102],[-73.93622499999999,41.980081],[-73.936066,41.980048],[-73.936053,41.980046],[-73.932523,41.979328],[-73.928909,41.978587],[-73.92836800000001,41.978476],[-73.92565500000001,41.977912],[-73.920225,41.976787],[-73.920154,41.976772],[-73.920041,41.976747],[-73.92002100000001,41.976743],[-73.919873,41.976714],[-73.9143,41.975555],[-73.914091,41.975512],[-73.91336800000001,41.975362],[-73.912862,41.975258],[-73.912719,41.975229],[-73.911338,41.974945],[-73.911075,41.974891],[-73.911019,41.97488],[-73.91098100000001,41.974872],[-73.91095900000001,41.974865],[-73.910917,41.974859],[-73.91028799999999,41.97473],[-73.910133,41.974699],[-73.91008100000001,41.974688],[-73.909325,41.974535],[-73.909074,41.974484],[-73.908914,41.974452],[-73.90860600000001,41.974389],[-73.908573,41.974383],[-73.908205,41.974053],[-73.907805,41.973666],[-73.907771,41.973633],[-73.907398,41.973263],[-73.90718099999999,41.973047],[-73.90608,41.971952],[-73.905124,41.97101],[-73.904866,41.970759],[-73.90448499999999,41.970353],[-73.904248,41.970095],[-73.90380399999999,41.969564],[-73.90328100000001,41.968921],[-73.90246399999999,41.967897],[-73.901342,41.96649],[-73.899029,41.963585],[-73.89890200000001,41.963412],[-73.898657,41.963114],[-73.898445,41.962846],[-73.89729,41.961394],[-73.896671,41.960581],[-73.89619,41.959911],[-73.895303,41.958588],[-73.895174,41.958403],[-73.894899,41.957986],[-73.894203,41.956892],[-73.89510900000001,41.95574],[-73.89557000000001,41.955121],[-73.89593600000001,41.954654],[-73.896264,41.954236],[-73.896359,41.954107],[-73.89651600000001,41.953906],[-73.896866,41.953445],[-73.89699,41.953283],[-73.897266,41.952926],[-73.897402,41.952745],[-73.89747699999999,41.952654],[-73.897723,41.952315],[-73.89846300000001,41.95138],[-73.898718,41.951044],[-73.89896400000001,41.950715],[-73.899176,41.950448],[-73.89957099999999,41.949928],[-73.899703,41.949762],[-73.90012400000001,41.949214],[-73.90020800000001,41.949105],[-73.90073,41.948398],[-73.900948,41.948114],[-73.901516,41.947379],[-73.901749,41.94709],[-73.90213199999999,41.946598],[-73.902314,41.946362],[-73.902596,41.946006],[-73.90334,41.945028],[-73.903419,41.944925],[-73.90388,41.944322],[-73.904061,41.944092],[-73.904652,41.94334],[-73.90536899999999,41.94239],[-73.905794,41.941848],[-73.90723,41.939964],[-73.90790699999999,41.939083],[-73.90802600000001,41.938928],[-73.908113,41.938943],[-73.909029,41.939034],[-73.909593,41.939088],[-73.910056,41.939132],[-73.913048,41.939429],[-73.91385699999999,41.939509],[-73.914671,41.939589],[-73.915319,41.939652],[-73.91561400000001,41.939681],[-73.915708,41.93969],[-73.915721,41.939692],[-73.915746,41.939683],[-73.915891,41.939636],[-73.91621600000001,41.939531],[-73.916307,41.939502],[-73.916336,41.939492],[-73.91637799999999,41.939479],[-73.91719399999999,41.939215],[-73.917486,41.939122],[-73.91758400000001,41.93909],[-73.91825900000001,41.938867],[-73.91839299999999,41.938823],[-73.918407,41.938818],[-73.919155,41.938571],[-73.919432,41.93848],[-73.91994200000001,41.938323],[-73.92008199999999,41.938281],[-73.920817,41.938056],[-73.920863,41.938042],[-73.920917,41.938026],[-73.921204,41.937939],[-73.92098,41.936991],[-73.920873,41.936573],[-73.920237,41.933922],[-73.919867,41.932452],[-73.91973299999999,41.931914],[-73.919253,41.930032],[-73.918992,41.929011],[-73.918978,41.928955],[-73.918474,41.926912],[-73.918565,41.926929],[-73.91870400000001,41.926957],[-73.918998,41.926998],[-73.91902399999999,41.927001],[-73.919315,41.927029],[-73.919529,41.927054],[-73.91972199999999,41.927098],[-73.919968,41.927185],[-73.92013,41.927243],[-73.920368,41.927343],[-73.920959,41.927618],[-73.92166400000001,41.927902],[-73.921892,41.927985],[-73.92199100000001,41.928021],[-73.92216500000001,41.928065],[-73.92225500000001,41.928072],[-73.92239600000001,41.928082],[-73.924654,41.928119],[-73.92862599999999,41.928148],[-73.92914399999999,41.928152],[-73.930779,41.92816],[-73.93326,41.928179],[-73.934498,41.928172],[-73.935929,41.928182],[-73.936453,41.928183],[-73.936453,41.91916],[-73.936453,41.915748],[-73.936453,41.913563],[-73.93678199999999,41.913562],[-73.943259,41.913559],[-73.946442,41.913558],[-73.949748,41.913562],[-73.954728,41.913562],[-73.95483299999999,41.913563],[-73.954566,41.914632],[-73.954312,41.915569],[-73.95402199999999,41.9165],[-73.953502,41.918335],[-73.953147,41.919319],[-73.95316099999999,41.919356],[-73.95317799999999,41.919373],[-73.953217,41.919411],[-73.953215,41.919456],[-73.95229500000001,41.921075],[-73.952213,41.921289],[-73.95283499999999,41.921354],[-73.957938,41.92198],[-73.95769300000001,41.923884]]],"type":"Polygon"}
}