{
  "id": "360894914003",
  "type": "Feature",
  "properties": {
    "area_land":3385197,
    "area_water":0,
    "geoid":"360894914003",
    "name":"Block Group 3",
    "state":"ny"
},
  "bbox": [
    -75.48227,
    44.690999,
    -75.447233,
    44.715396
],
  "geometry": {"coordinates":[[[-75.48141,44.698116],[-75.48027399999999,44.698618],[-75.479204,44.699088],[-75.478128,44.699553],[-75.47713899999999,44.699984],[-75.477053,44.700022],[-75.47632,44.70034],[-75.475904,44.700526],[-75.47534400000001,44.70078],[-75.474808,44.701015],[-75.47434199999999,44.701213],[-75.47402099999999,44.701349],[-75.47342999999999,44.701623],[-75.472582,44.70199],[-75.471889,44.702287],[-75.47019,44.703039],[-75.46933900000001,44.703411],[-75.46848300000001,44.703789],[-75.467375,44.704275],[-75.466787,44.704529],[-75.466246,44.704749],[-75.46717200000001,44.705828],[-75.46807099999999,44.706876],[-75.46774499999999,44.707023],[-75.467389,44.707229],[-75.467128,44.707439],[-75.46705300000001,44.707502],[-75.466797,44.707808],[-75.46662499999999,44.708012],[-75.46651900000001,44.708135],[-75.466336,44.70835],[-75.466095,44.70857],[-75.465856,44.708734],[-75.46313600000001,44.710388],[-75.462255,44.710914],[-75.46216800000001,44.710961],[-75.4618,44.711145],[-75.460919,44.711536],[-75.459307,44.712239],[-75.45778199999999,44.712904],[-75.45583000000001,44.713755],[-75.454464,44.714356],[-75.452949,44.715019],[-75.452815,44.715077],[-75.452078,44.715396],[-75.45189999999999,44.715194],[-75.451604,44.714899],[-75.451392,44.714718],[-75.451069,44.71447],[-75.45071799999999,44.714232],[-75.450441,44.714071],[-75.450367,44.714037],[-75.449808,44.713778],[-75.449322,44.713584],[-75.44995299999999,44.712696],[-75.450242,44.712288],[-75.4508,44.711482],[-75.450834,44.711396],[-75.451161,44.710928],[-75.451708,44.710146],[-75.44940699999999,44.710506],[-75.448651,44.70656],[-75.447233,44.705229],[-75.44878199999999,44.704359],[-75.451905,44.702709],[-75.449439,44.700233],[-75.449364,44.700171],[-75.449596,44.70005],[-75.45418600000001,44.69777],[-75.452422,44.696681],[-75.45321,44.696172],[-75.45355000000001,44.695836],[-75.45422499999999,44.695048],[-75.454418,44.694806],[-75.454581,44.694642],[-75.455057,44.694323],[-75.455153,44.694245],[-75.455243,44.694146],[-75.46060799999999,44.697483],[-75.46144099999999,44.698004],[-75.463764,44.696912],[-75.469977,44.693975],[-75.472173,44.692942],[-75.472416,44.692815],[-75.472824,44.692601],[-75.47575500000001,44.690999],[-75.47599700000001,44.691168],[-75.477435,44.692117],[-75.477672,44.69229],[-75.47774200000001,44.692353],[-75.477901,44.692522],[-75.478724,44.693511],[-75.479608,44.694577],[-75.480439,44.695566],[-75.480476,44.69561],[-75.481368,44.696673],[-75.48227,44.697743],[-75.48141,44.698116]]],"type":"Polygon"}
}