{
  "id": "360650264004",
  "type": "Feature",
  "properties": {
    "area_land":236060,
    "area_water":0,
    "geoid":"360650264004",
    "name":"Block Group 4",
    "state":"ny"
},
  "bbox": [
    -75.256014,
    43.086759,
    -75.246983,
    43.092546
],
  "geometry": {"coordinates":[[[-75.25601399999999,43.089227],[-75.254679,43.08989],[-75.254259,43.090096],[-75.253867,43.090289],[-75.252785,43.090826],[-75.25218099999999,43.091124],[-75.251831,43.091298],[-75.25129,43.091565],[-75.250356,43.092028],[-75.25018300000001,43.092113],[-75.24932099999999,43.092546],[-75.24928199999999,43.092504],[-75.248366,43.091514],[-75.24781299999999,43.090896],[-75.246983,43.090009],[-75.247197,43.089746],[-75.24758799999999,43.089257],[-75.24766099999999,43.08918],[-75.24788599999999,43.088963],[-75.24810100000001,43.088776],[-75.24842599999999,43.088487],[-75.249146,43.087834],[-75.249645,43.087392],[-75.250083,43.087011],[-75.250328,43.086759],[-75.250524,43.086836],[-75.25226499999999,43.087568],[-75.253382,43.088059],[-75.253745,43.088212],[-75.25447699999999,43.088545],[-75.255757,43.089111],[-75.25601399999999,43.089227]]],"type":"Polygon"}
}