{
  "id": "360810053004",
  "type": "Feature",
  "properties": {
    "area_land":63899,
    "area_water":0,
    "geoid":"360810053004",
    "name":"Block Group 4",
    "state":"ny"
},
  "bbox": [
    -73.932152,
    40.756213,
    -73.927703,
    40.759253
],
  "geometry": {"coordinates":[[[-73.932152,40.75771],[-73.93089999999999,40.759253],[-73.9301,40.75888],[-73.929301,40.758504],[-73.928501,40.758129],[-73.92770299999999,40.757753],[-73.928956,40.756213],[-73.929751,40.756581],[-73.930553,40.756959],[-73.93135100000001,40.757334],[-73.932152,40.75771]]],"type":"Polygon"}
}