{
  "id": "360650262005",
  "type": "Feature",
  "properties": {
    "area_land":19092489,
    "area_water":393393,
    "geoid":"360650262005",
    "name":"Block Group 5",
    "state":"ny"
},
  "bbox": [
    -75.325544,
    43.130938,
    -75.23546,
    43.190968
],
  "geometry": {"coordinates":[[[-75.32554399999999,43.165264],[-75.32444599999999,43.166888],[-75.324004,43.167552],[-75.32368200000001,43.168032],[-75.32336599999999,43.168501],[-75.32328099999999,43.168625],[-75.32316,43.16878],[-75.323082,43.168867],[-75.322793,43.169125],[-75.32253900000001,43.169317],[-75.322429,43.169395],[-75.321046,43.167943],[-75.320318,43.167192],[-75.320297,43.16717],[-75.31961,43.166448],[-75.31891,43.165693],[-75.31829,43.165064],[-75.317894,43.164651],[-75.31731499999999,43.164049],[-75.316979,43.16372],[-75.314767,43.1617],[-75.313948,43.160974],[-75.313356,43.160493],[-75.312803,43.160086],[-75.31182,43.159424],[-75.310992,43.158898],[-75.309107,43.157744],[-75.308373,43.15727],[-75.306995,43.15632],[-75.30560800000001,43.155338],[-75.304861,43.15483],[-75.30445400000001,43.154542],[-75.30420100000001,43.154362],[-75.303051,43.153608],[-75.302404,43.153213],[-75.300496,43.15215],[-75.29983799999999,43.15178],[-75.299392,43.151543],[-75.29883,43.151267],[-75.29829100000001,43.15099],[-75.297465,43.150612],[-75.29485200000001,43.152967],[-75.293553,43.154171],[-75.291138,43.156413],[-75.28870499999999,43.158516],[-75.287575,43.159531],[-75.286124,43.16082],[-75.2865,43.16126],[-75.28704,43.16158],[-75.28692100000001,43.162703],[-75.287222,43.163871],[-75.28836200000001,43.164169],[-75.289342,43.16404],[-75.288771,43.164158],[-75.288259,43.164327],[-75.288083,43.16448],[-75.28851899999999,43.164684],[-75.289153,43.164993],[-75.28939699999999,43.165141],[-75.289203,43.165307],[-75.288465,43.16546],[-75.28864,43.165707],[-75.28878,43.165994],[-75.288786,43.166197],[-75.288578,43.166285],[-75.288416,43.166473],[-75.287145,43.167189],[-75.28630099999999,43.167532],[-75.285302,43.167727],[-75.28455700000001,43.167857],[-75.284198,43.168292],[-75.28456799999999,43.168533],[-75.28501,43.168823],[-75.28558700000001,43.169142],[-75.28586900000001,43.169318],[-75.285528,43.169696],[-75.285262,43.170307],[-75.285529,43.170865],[-75.285618,43.171026],[-75.285782,43.171387],[-75.286264,43.171582],[-75.28682499999999,43.171046],[-75.287443,43.17059],[-75.287705,43.170499],[-75.290344,43.172705],[-75.289868,43.173417],[-75.28906499999999,43.174675],[-75.288612,43.175433],[-75.288263,43.176023],[-75.28802399999999,43.176381],[-75.287384,43.177192],[-75.286736,43.177963],[-75.28582900000001,43.178917],[-75.28566499999999,43.179079],[-75.28551299999999,43.179202],[-75.285445,43.179257],[-75.285303,43.179343],[-75.284424,43.179804],[-75.283691,43.180163],[-75.282973,43.180481],[-75.282122,43.180817],[-75.28075699999999,43.181298],[-75.278899,43.181996],[-75.276506,43.182938],[-75.275718,43.183235],[-75.275482,43.183329],[-75.274961,43.183536],[-75.274452,43.183767],[-75.273545,43.184228],[-75.273392,43.18431],[-75.273166,43.18445],[-75.27305699999999,43.184529],[-75.272761,43.184794],[-75.270432,43.187213],[-75.268626,43.189132],[-75.267993,43.189788],[-75.267658,43.190086],[-75.267466,43.190227],[-75.267319,43.190317],[-75.26705,43.190461],[-75.26669800000001,43.190615],[-75.266051,43.190874],[-75.265845,43.190968],[-75.265672,43.190782],[-75.264591,43.18966],[-75.26431599999999,43.189386],[-75.261821,43.186898],[-75.261667,43.186746],[-75.256444,43.181574],[-75.25611600000001,43.181205],[-75.255931,43.180948],[-75.25575000000001,43.180615],[-75.25550800000001,43.180137],[-75.255287,43.179652],[-75.255049,43.179171],[-75.25489899999999,43.178922],[-75.25472499999999,43.178684],[-75.254321,43.178195],[-75.253955,43.177767],[-75.25382500000001,43.177612],[-75.25378600000001,43.177567],[-75.25368,43.177444],[-75.253364,43.177079],[-75.25319500000001,43.176926],[-75.253083,43.176849],[-75.25290699999999,43.17675],[-75.25269,43.176663],[-75.25252999999999,43.176607],[-75.252056,43.176487],[-75.25167399999999,43.176396],[-75.251504,43.176321],[-75.251283,43.176169],[-75.25109399999999,43.175994],[-75.249396,43.174164],[-75.24921500000001,43.173993],[-75.249015,43.173839],[-75.24890499999999,43.173771],[-75.24863999999999,43.173643],[-75.24839,43.173558],[-75.248262,43.173524],[-75.24799899999999,43.173482],[-75.24747499999999,43.173428],[-75.246955,43.173383],[-75.24594500000001,43.173236],[-75.245199,43.173094],[-75.244918,43.173014],[-75.244793,43.172958],[-75.24474499999999,43.172928],[-75.244634,43.172856],[-75.244215,43.172491],[-75.242632,43.171057],[-75.242225,43.170732],[-75.241947,43.170547],[-75.241581,43.170343],[-75.241286,43.170179],[-75.23818900000001,43.168542],[-75.23773199999999,43.168329],[-75.23692,43.16798],[-75.23585300000001,43.167525],[-75.23546,43.167365],[-75.235664,43.166635],[-75.23619600000001,43.164592],[-75.23630799999999,43.164213],[-75.236392,43.163992],[-75.236525,43.163746],[-75.23672000000001,43.16347],[-75.237055,43.163067],[-75.23723200000001,43.162873],[-75.23793000000001,43.162185],[-75.23851000000001,43.161605],[-75.239079,43.160993],[-75.24031600000001,43.159547],[-75.242711,43.156688],[-75.24466099999999,43.15431],[-75.245454,43.153373],[-75.248024,43.150227],[-75.249421,43.148534],[-75.249666,43.148237],[-75.249943,43.147913],[-75.25027,43.14753],[-75.25033500000001,43.147454],[-75.250817,43.146871],[-75.25376300000001,43.143313],[-75.25591799999999,43.14071],[-75.256574,43.139907],[-75.25687499999999,43.140104],[-75.257536,43.14056],[-75.25856899999999,43.141221],[-75.26025300000001,43.142336],[-75.26063000000001,43.142582],[-75.261258,43.143022],[-75.262919,43.144088],[-75.265811,43.145987],[-75.266479,43.146426],[-75.26757000000001,43.14713],[-75.268728,43.147911],[-75.268839,43.147486],[-75.26909000000001,43.146573],[-75.26925799999999,43.146084],[-75.269453,43.145631],[-75.26957899999999,43.145337],[-75.269625,43.145249],[-75.269761,43.145013],[-75.269974,43.144717],[-75.270129,43.144539],[-75.270365,43.144293],[-75.27054099999999,43.144133],[-75.270871,43.143881],[-75.271241,43.143645],[-75.271922,43.143228],[-75.272628,43.142815],[-75.272932,43.142632],[-75.272987,43.1426],[-75.273099,43.142528],[-75.27344600000001,43.142303],[-75.273906,43.141959],[-75.274269,43.141628],[-75.274434,43.141464],[-75.274486,43.141412],[-75.274585,43.141302],[-75.27480199999999,43.141059],[-75.275119,43.140641],[-75.275272,43.140413],[-75.27555599999999,43.139882],[-75.275629,43.139702],[-75.27566299999999,43.139619],[-75.275682,43.139563],[-75.27576999999999,43.1393],[-75.27606,43.138257],[-75.27619799999999,43.137763],[-75.276342,43.137208],[-75.27639499999999,43.137022],[-75.276467,43.136807],[-75.276619,43.136498],[-75.276893,43.136036],[-75.277019,43.135826],[-75.277141,43.135624],[-75.277271,43.135418],[-75.27748099999999,43.13508],[-75.277545,43.134976],[-75.277843,43.134493],[-75.278435,43.13353],[-75.278724,43.132987],[-75.27900200000001,43.132334],[-75.27954200000001,43.130938],[-75.28059500000001,43.131448],[-75.28119700000001,43.131787],[-75.28178,43.131992],[-75.28194499999999,43.132075],[-75.28229,43.13228],[-75.282841,43.132666],[-75.28322799999999,43.133044],[-75.28391000000001,43.133832],[-75.284153,43.134187],[-75.28427600000001,43.134379],[-75.284802,43.13517],[-75.284873,43.135324],[-75.28515400000001,43.135788],[-75.28558700000001,43.136502],[-75.285842,43.136839],[-75.286188,43.137134],[-75.286886,43.137693],[-75.288408,43.138851],[-75.290488,43.140346],[-75.290628,43.14042],[-75.29074300000001,43.140445],[-75.290915,43.140445],[-75.29107999999999,43.140428],[-75.29122,43.140395],[-75.2914,43.140297],[-75.29167200000001,43.140092],[-75.291894,43.13996],[-75.29208300000001,43.13987],[-75.292354,43.139812],[-75.29295500000001,43.139747],[-75.29370299999999,43.139763],[-75.29495199999999,43.139894],[-75.295281,43.139919],[-75.295709,43.139894],[-75.296029,43.139829],[-75.296284,43.139747],[-75.29638300000001,43.139697],[-75.296515,43.139566],[-75.29691699999999,43.139122],[-75.297814,43.137997],[-75.298052,43.137759],[-75.29848800000001,43.137159],[-75.298751,43.136921],[-75.298956,43.136831],[-75.299187,43.136789],[-75.299499,43.136781],[-75.299779,43.136847],[-75.300303,43.137078],[-75.30104300000001,43.137448],[-75.301281,43.137612],[-75.301512,43.137891],[-75.302038,43.138434],[-75.30229,43.138789],[-75.302423,43.138974],[-75.30263600000001,43.139274],[-75.302817,43.139527],[-75.303083,43.139906],[-75.30314,43.140085],[-75.30314799999999,43.140274],[-75.30309800000001,43.14043],[-75.303033,43.140569],[-75.30293399999999,43.140701],[-75.302729,43.140807],[-75.301355,43.141251],[-75.301051,43.141358],[-75.300755,43.141514],[-75.30032799999999,43.14181],[-75.300056,43.142031],[-75.299662,43.142442],[-75.29906099999999,43.143198],[-75.29874100000001,43.143641],[-75.298568,43.143937],[-75.298502,43.144159],[-75.298461,43.144454],[-75.298461,43.144717],[-75.298511,43.144914],[-75.29860100000001,43.145079],[-75.29874100000001,43.145202],[-75.298905,43.145276],[-75.29924200000001,43.145341],[-75.29947300000001,43.14544],[-75.29959599999999,43.145522],[-75.299736,43.14567],[-75.30009800000001,43.146245],[-75.300246,43.146393],[-75.300451,43.146516],[-75.300731,43.146639],[-75.301306,43.14682],[-75.30168399999999,43.146869],[-75.302063,43.146951],[-75.302334,43.147066],[-75.302753,43.147305],[-75.303082,43.147444],[-75.303337,43.14751],[-75.30366600000001,43.147543],[-75.304044,43.147502],[-75.30438100000001,43.147403],[-75.304784,43.147214],[-75.305048,43.147025],[-75.305245,43.146812],[-75.30573,43.146196],[-75.30598500000001,43.145999],[-75.306338,43.145785],[-75.306708,43.145646],[-75.30707,43.14558],[-75.30743200000001,43.145563],[-75.3079,43.145596],[-75.30891200000001,43.145908],[-75.3098,43.146253],[-75.310112,43.146426],[-75.31058899999999,43.146763],[-75.312501,43.148215],[-75.313855,43.149065],[-75.31397699999999,43.149171],[-75.314036,43.14924],[-75.314086,43.149353],[-75.314115,43.149462],[-75.31411799999999,43.1496],[-75.314097,43.149763],[-75.31406800000001,43.149916],[-75.314043,43.149982],[-75.31398,43.150041],[-75.31387700000001,43.150104],[-75.313401,43.150282],[-75.312505,43.150677],[-75.31223799999999,43.150739],[-75.312015,43.150763],[-75.311834,43.150817],[-75.311666,43.150938],[-75.311533,43.1511],[-75.31137,43.151377],[-75.311195,43.151763],[-75.311081,43.152179],[-75.311038,43.152468],[-75.31106200000001,43.152869],[-75.311177,43.15326],[-75.311358,43.153754],[-75.311762,43.15448],[-75.311859,43.154677],[-75.312106,43.155173],[-75.312341,43.155589],[-75.312505,43.155846],[-75.312594,43.156086],[-75.31280099999999,43.156446],[-75.313318,43.157234],[-75.313502,43.157469],[-75.31361699999999,43.157603],[-75.313778,43.157771],[-75.314784,43.158632],[-75.31603,43.159724],[-75.31711199999999,43.160689],[-75.318465,43.161743],[-75.318979,43.162235],[-75.319721,43.162983],[-75.320369,43.163693],[-75.320582,43.163897],[-75.320689,43.163962],[-75.32080499999999,43.163997],[-75.321281,43.164016],[-75.32141900000001,43.164028],[-75.32158099999999,43.164063],[-75.321713,43.16411],[-75.321826,43.164166],[-75.32194200000001,43.16425],[-75.322095,43.164388],[-75.322227,43.164473],[-75.322496,43.164573],[-75.32263399999999,43.164592],[-75.322834,43.164604],[-75.323054,43.164604],[-75.323317,43.164576],[-75.323379,43.164545],[-75.323458,43.164488],[-75.323735,43.164102],[-75.324427,43.164573],[-75.324449,43.164587],[-75.325181,43.16505],[-75.32554399999999,43.165264]]],"type":"Polygon"}
}