{
  "id": "361150840002",
  "type": "Feature",
  "properties": {
    "area_land":67490421,
    "area_water":638199,
    "geoid":"361150840002",
    "name":"Block Group 2",
    "state":"ny"
},
  "bbox": [
    -73.366778,
    43.342302,
    -73.249694,
    43.438101
],
  "geometry": {"coordinates":[[[-73.366778,43.393773],[-73.36631800000001,43.393992],[-73.36579999999999,43.394349],[-73.365543,43.39448],[-73.36534,43.394553],[-73.36492699999999,43.394641],[-73.364328,43.394747],[-73.363635,43.394919],[-73.363204,43.395047],[-73.362694,43.395235],[-73.362357,43.395385],[-73.36109399999999,43.395993],[-73.360344,43.396456],[-73.35963700000001,43.396903],[-73.35893299999999,43.39729],[-73.358144,43.397696],[-73.357918,43.397869],[-73.357812,43.397981],[-73.35772,43.398128],[-73.357647,43.398305],[-73.357285,43.399386],[-73.357052,43.400293],[-73.356994,43.400454],[-73.356954,43.400565],[-73.356719,43.400954],[-73.355788,43.402194],[-73.35526,43.402885],[-73.354737,43.403609],[-73.35459,43.403771],[-73.354444,43.403896],[-73.35424,43.404024],[-73.354128,43.404084],[-73.353967,43.404155],[-73.35377200000001,43.404226],[-73.35328,43.404373],[-73.352873,43.404452],[-73.35245,43.404528],[-73.352242,43.404586],[-73.35209399999999,43.40464],[-73.351393,43.404954],[-73.350945,43.405106],[-73.349553,43.405512],[-73.347909,43.406068],[-73.347623,43.40614],[-73.347469,43.40617],[-73.347103,43.406216],[-73.346895,43.406229],[-73.346104,43.40625],[-73.345748,43.406277],[-73.345033,43.406421],[-73.344695,43.40649],[-73.34418100000001,43.406557],[-73.343315,43.406655],[-73.34271200000001,43.406707],[-73.341977,43.40674],[-73.34164199999999,43.40677],[-73.341396,43.406815],[-73.34119200000001,43.406887],[-73.341084,43.406932],[-73.340968,43.406992],[-73.340801,43.407116],[-73.340647,43.407268],[-73.34001600000001,43.408055],[-73.339887,43.408209],[-73.339354,43.408808],[-73.339277,43.408881],[-73.339067,43.409032],[-73.33893999999999,43.409105],[-73.338432,43.409333],[-73.338015,43.409489],[-73.337873,43.409542],[-73.33671099999999,43.409856],[-73.33648700000001,43.409941],[-73.33633500000001,43.41001],[-73.33514,43.410667],[-73.33479699999999,43.410832],[-73.334486,43.410951],[-73.334216,43.411032],[-73.33299599999999,43.411307],[-73.331705,43.411646],[-73.33069399999999,43.411909],[-73.329246,43.412243],[-73.327957,43.412554],[-73.327668,43.412641],[-73.327241,43.412807],[-73.32669799999999,43.413074],[-73.326604,43.413133],[-73.326286,43.413396],[-73.32552800000001,43.414105],[-73.325018,43.414566],[-73.324502,43.415011],[-73.32423199999999,43.415223],[-73.324057,43.415331],[-73.323815,43.415432],[-73.323487,43.415534],[-73.32226900000001,43.415859],[-73.321701,43.41602],[-73.321254,43.416183],[-73.321018,43.41631],[-73.320948,43.416355],[-73.32076600000001,43.416488],[-73.320517,43.416711],[-73.320256,43.416986],[-73.320088,43.417181],[-73.319514,43.417928],[-73.31925699999999,43.41829],[-73.318956,43.418676],[-73.318348,43.419343],[-73.317784,43.419933],[-73.317588,43.420094],[-73.317228,43.420363],[-73.31701,43.420511],[-73.31616099999999,43.421031],[-73.315669,43.421293],[-73.314868,43.421679],[-73.31441599999999,43.421931],[-73.314212,43.422057],[-73.313992,43.422208],[-73.313041,43.422934],[-73.312501,43.423259],[-73.312197,43.423405],[-73.31129300000001,43.423769],[-73.311137,43.423846],[-73.310971,43.423941],[-73.31082499999999,43.424038],[-73.310751,43.4241],[-73.310569,43.424284],[-73.310063,43.424882],[-73.30961499999999,43.425374],[-73.309389,43.425584],[-73.309265,43.425678],[-73.30910299999999,43.425775],[-73.30885600000001,43.425899],[-73.306758,43.426796],[-73.30647399999999,43.426921],[-73.306201,43.427087],[-73.305941,43.427298],[-73.30588899999999,43.427345],[-73.305381,43.427806],[-73.305137,43.428056],[-73.305014,43.428222],[-73.304976,43.428295],[-73.304939,43.428365],[-73.304579,43.429329],[-73.30449900000001,43.429545],[-73.304434,43.429675],[-73.30434700000001,43.42981],[-73.304272,43.429902],[-73.30416700000001,43.429978],[-73.304017,43.430064],[-73.30385699999999,43.430125],[-73.30362599999999,43.430186],[-73.30341799999999,43.430215],[-73.301147,43.430436],[-73.299295,43.430598],[-73.298113,43.430694],[-73.296412,43.430852],[-73.29489,43.431003],[-73.294045,43.431078],[-73.29268999999999,43.431181],[-73.28967900000001,43.43146],[-73.28908199999999,43.431125],[-73.288805,43.43097],[-73.288657,43.430878],[-73.288123,43.430527],[-73.287831,43.430313],[-73.287519,43.430063],[-73.287234,43.429812],[-73.287029,43.429613],[-73.28664499999999,43.429221],[-73.286186,43.428723],[-73.285304,43.427628],[-73.28543500000001,43.427987],[-73.285487,43.428169],[-73.285539,43.428475],[-73.28553599999999,43.42877],[-73.28551,43.428926],[-73.285462,43.429109],[-73.285363,43.429412],[-73.284704,43.430529],[-73.284126,43.431536],[-73.28382499999999,43.432044],[-73.28371300000001,43.432264],[-73.283641,43.432436],[-73.283608,43.432543],[-73.283529,43.432856],[-73.283503,43.433061],[-73.283491,43.433426],[-73.283394,43.433419],[-73.28329600000001,43.433392],[-73.28320100000001,43.43335],[-73.28302600000001,43.433229],[-73.282228,43.432673],[-73.281561,43.433063],[-73.281103,43.433306],[-73.280959,43.433369],[-73.280624,43.433451],[-73.280413,43.433486],[-73.28023899999999,43.433504],[-73.279713,43.433511],[-73.278893,43.433541],[-73.278249,43.433564],[-73.277787,43.433623],[-73.277659,43.433655],[-73.27757099999999,43.433677],[-73.27748699999999,43.433714],[-73.2774,43.433753],[-73.27731900000001,43.433818],[-73.277244,43.433902],[-73.277001,43.434288],[-73.276926,43.434373],[-73.276822,43.43447],[-73.276639,43.434602],[-73.27645699999999,43.434716],[-73.27606299999999,43.434965],[-73.27574199999999,43.435167],[-73.275566,43.435251],[-73.27544899999999,43.435293],[-73.275126,43.435371],[-73.274902,43.435389],[-73.274349,43.435457],[-73.27253399999999,43.435777],[-73.271581,43.435925],[-73.270999,43.436006],[-73.26966899999999,43.43617],[-73.268967,43.436244],[-73.268458,43.436309],[-73.267774,43.436365],[-73.267028,43.436431],[-73.26626400000001,43.436467],[-73.26581899999999,43.43648],[-73.265615,43.436496],[-73.264866,43.436625],[-73.26469,43.436628],[-73.264505,43.436608],[-73.26430000000001,43.436573],[-73.264167,43.43653],[-73.263098,43.43605],[-73.262822,43.435943],[-73.26239,43.435806],[-73.261476,43.435556],[-73.26108000000001,43.43541],[-73.260565,43.435113],[-73.260445,43.435058],[-73.260305,43.435009],[-73.26012299999999,43.43496],[-73.259922,43.434924],[-73.258912,43.434788],[-73.258021,43.434652],[-73.257677,43.434613],[-73.257482,43.434603],[-73.257206,43.434603],[-73.256868,43.434638],[-73.25667,43.434684],[-73.25626,43.43483],[-73.255646,43.435135],[-73.25523200000001,43.435367],[-73.255105,43.435455],[-73.255008,43.435536],[-73.25461300000001,43.435957],[-73.254535,43.436028],[-73.25441499999999,43.436113],[-73.254051,43.436317],[-73.25397599999999,43.436365],[-73.25386899999999,43.436434],[-73.253664,43.436593],[-73.253381,43.436853],[-73.253242,43.437012],[-73.252954,43.43739],[-73.252841,43.437513],[-73.25275999999999,43.437557],[-73.252521,43.437626],[-73.252493,43.43763],[-73.25095,43.437848],[-73.250517,43.437909],[-73.250196,43.437938],[-73.250033,43.437915],[-73.249841,43.437865],[-73.24969400000001,43.438101],[-73.24977800000001,43.436079],[-73.249838,43.43439],[-73.24999800000001,43.429893],[-73.24999800000001,43.429871],[-73.250006,43.429669],[-73.25001,43.429561],[-73.250147,43.425713],[-73.250422,43.419011],[-73.25084699999999,43.408703],[-73.250917,43.406997],[-73.250952,43.406147],[-73.251238,43.406182],[-73.25244000000001,43.406489],[-73.25335800000001,43.406754],[-73.25391999999999,43.406932],[-73.25479199999999,43.407242],[-73.255286,43.407453],[-73.255449,43.407532],[-73.256214,43.4079],[-73.25687000000001,43.408192],[-73.25712,43.408276],[-73.257172,43.40829],[-73.257361,43.408303],[-73.25752199999999,43.4083],[-73.257666,43.408299],[-73.258146,43.408252],[-73.258562,43.408211],[-73.258976,43.408152],[-73.25928500000001,43.408057],[-73.259546,43.40795],[-73.259169,43.407394],[-73.25913300000001,43.407317],[-73.25909900000001,43.407201],[-73.259096,43.407081],[-73.259122,43.406944],[-73.259187,43.406785],[-73.259304,43.406559],[-73.25985799999999,43.405555],[-73.25990299999999,43.405448],[-73.259941,43.405253],[-73.259953,43.404993],[-73.26009000000001,43.404961],[-73.260279,43.404961],[-73.26048,43.404974],[-73.26060200000001,43.405002],[-73.260617,43.405005],[-73.26066899999999,43.405016],[-73.26076,43.405059],[-73.26092199999999,43.405156],[-73.261049,43.405273],[-73.261174,43.405359],[-73.26129400000001,43.405405],[-73.261482,43.40544],[-73.26169400000001,43.405447],[-73.261898,43.405473],[-73.26211000000001,43.405534],[-73.262272,43.405596],[-73.26236,43.405645],[-73.262412,43.405694],[-73.262444,43.405752],[-73.262446,43.405864],[-73.262422,43.405982],[-73.26208200000001,43.406763],[-73.26205,43.406893],[-73.262041,43.40701],[-73.26203599999999,43.407345],[-73.262044,43.407688],[-73.26204799999999,43.407805],[-73.262129,43.408591],[-73.262162,43.408789],[-73.262308,43.409232],[-73.26249199999999,43.409653],[-73.262601,43.409908],[-73.262632,43.409974],[-73.26277899999999,43.410295],[-73.263006,43.410656],[-73.26314600000001,43.410831],[-73.263257,43.410938],[-73.263417,43.411054],[-73.263622,43.411164],[-73.26384299999999,43.411261],[-73.264178,43.411365],[-73.264483,43.411433],[-73.26516599999999,43.411547],[-73.265248,43.411578],[-73.265359,43.411643],[-73.265479,43.41175],[-73.265828,43.412106],[-73.266436,43.412628],[-73.266722,43.412849],[-73.266831,43.412907],[-73.26692,43.41293],[-73.26704100000001,43.412937],[-73.26788999999999,43.41275],[-73.268235,43.412636],[-73.268517,43.412513],[-73.26875099999999,43.412383],[-73.268924,43.412263],[-73.269373,43.411858],[-73.269841,43.411453],[-73.269971,43.411375],[-73.270062,43.411339],[-73.270173,43.411333],[-73.27032199999999,43.411352],[-73.27046199999999,43.411398],[-73.270751,43.411593],[-73.27083399999999,43.411695],[-73.270899,43.411815],[-73.27092500000001,43.411948],[-73.270923,43.412013],[-73.270922,43.412046],[-73.270886,43.412146],[-73.27073,43.412413],[-73.270686,43.412547],[-73.270686,43.412671],[-73.270702,43.412784],[-73.270754,43.412888],[-73.270956,43.413086],[-73.271326,43.41332],[-73.27169000000001,43.413476],[-73.27197099999999,43.413568],[-73.272212,43.41363],[-73.272345,43.413685],[-73.27244899999999,43.41377],[-73.272612,43.413952],[-73.27285500000001,43.414192],[-73.272924,43.414305],[-73.273011,43.414549],[-73.27305699999999,43.41462],[-73.27318,43.414718],[-73.27342899999999,43.414849],[-73.27357499999999,43.414898],[-73.27374500000001,43.414936],[-73.274084,43.414942],[-73.274235,43.414945],[-73.27440799999999,43.414952],[-73.274512,43.414964],[-73.27457800000001,43.414971],[-73.274693,43.415009],[-73.27478499999999,43.415039],[-73.27485299999999,43.414917],[-73.27494299999999,43.414756],[-73.274996,43.414678],[-73.275051,43.414597],[-73.27512299999999,43.414513],[-73.275153,43.414487],[-73.27520699999999,43.414441],[-73.275267,43.414399],[-73.27534,43.414347],[-73.275391,43.414289],[-73.27544899999999,43.414225],[-73.275465,43.414174],[-73.275465,43.414131],[-73.27544899999999,43.414098],[-73.275379,43.413966],[-73.2753,43.41382],[-73.275248,43.413699],[-73.275251,43.413612],[-73.27527000000001,43.413518],[-73.27532600000001,43.41343],[-73.27543300000001,43.413318],[-73.27560800000001,43.413134],[-73.275648,43.41307],[-73.275672,43.413033],[-73.275701,43.413048],[-73.276022,43.413219],[-73.27621600000001,43.413297],[-73.276177,43.412232],[-73.27610300000001,43.411762],[-73.276,43.411284],[-73.27573700000001,43.410493],[-73.275485,43.409615],[-73.275305,43.409038],[-73.274601,43.406845],[-73.273821,43.40448],[-73.273707,43.404159],[-73.273437,43.403461],[-73.273189,43.402914],[-73.273026,43.402612],[-73.272706,43.402097],[-73.27230400000001,43.401469],[-73.270123,43.398062],[-73.26979300000001,43.397596],[-73.269516,43.397282],[-73.269351,43.397116],[-73.269172,43.396963],[-73.268867,43.39673],[-73.26858900000001,43.396549],[-73.268345,43.396406],[-73.26815999999999,43.396309],[-73.267692,43.396091],[-73.267197,43.395887],[-73.26527400000001,43.395104],[-73.264881,43.394923],[-73.26469,43.394816],[-73.264214,43.394492],[-73.263957,43.394275],[-73.263786,43.394108],[-73.263611,43.393877],[-73.263267,43.393381],[-73.26319100000001,43.393273],[-73.262888,43.392827],[-73.262241,43.39196],[-73.262006,43.391692],[-73.261321,43.390992],[-73.261026,43.390664],[-73.259372,43.388651],[-73.258971,43.38813],[-73.25881,43.387888],[-73.258674,43.387621],[-73.258618,43.387465],[-73.25849100000001,43.386991],[-73.258335,43.386051],[-73.258262,43.385277],[-73.258127,43.382398],[-73.258156,43.381999],[-73.258242,43.381417],[-73.25834399999999,43.380805],[-73.258465,43.380186],[-73.258751,43.378876],[-73.25908699999999,43.377053],[-73.259198,43.376536],[-73.259451,43.375704],[-73.259581,43.375324],[-73.25975099999999,43.3749],[-73.259884,43.374609],[-73.260304,43.37363],[-73.26048900000001,43.373007],[-73.26061199999999,43.372382],[-73.260643,43.372078],[-73.260755,43.369985],[-73.26085399999999,43.369122],[-73.26092,43.368816],[-73.261047,43.368332],[-73.261201,43.367872],[-73.26177,43.366443],[-73.26212099999999,43.365537],[-73.262895,43.363591],[-73.263122,43.363112],[-73.26386100000001,43.361696],[-73.264011,43.361348],[-73.264084,43.361094],[-73.264101,43.361005],[-73.264166,43.360651],[-73.264392,43.359288],[-73.265246,43.353871],[-73.265557,43.351925],[-73.265579,43.351783],[-73.265586,43.351743],[-73.270287,43.351294],[-73.280579,43.350236],[-73.28951600000001,43.349334],[-73.29218899999999,43.349062],[-73.292664,43.349016],[-73.300973,43.34817],[-73.31305,43.346876],[-73.314852,43.346694],[-73.318178,43.346344],[-73.318674,43.346295],[-73.33392499999999,43.344716],[-73.336845,43.344409],[-73.345057,43.343544],[-73.346154,43.343432],[-73.355593,43.342471],[-73.35726,43.342302],[-73.35784200000001,43.345599],[-73.358857,43.351518],[-73.35983400000001,43.356442],[-73.36060999999999,43.360799],[-73.361589,43.366088],[-73.361721,43.366922],[-73.361952,43.368359],[-73.362026,43.368682],[-73.362718,43.371739],[-73.363354,43.375085],[-73.365075,43.384152],[-73.366677,43.392659],[-73.366668,43.392685],[-73.366679,43.392997],[-73.366722,43.393431],[-73.366778,43.393773]]],"type":"Polygon"}
}