{
  "id": "361031122141",
  "type": "Feature",
  "properties": {
    "area_land":1350709,
    "area_water":0,
    "geoid":"361031122141",
    "name":"Block Group 1",
    "state":"ny"
},
  "bbox": [
    -73.402077,
    40.783875,
    -73.373095,
    40.795638
],
  "geometry": {"coordinates":[[[-73.40207700000001,40.793594],[-73.402044,40.793762],[-73.401962,40.794159],[-73.401848,40.793999],[-73.401754,40.793872],[-73.40113700000001,40.793041],[-73.400926,40.79298],[-73.400251,40.792853],[-73.400116,40.792827],[-73.398697,40.792591],[-73.39758399999999,40.7924],[-73.396433,40.792168],[-73.396725,40.791286],[-73.39557000000001,40.79102],[-73.39516999999999,40.7903],[-73.39455,40.788922],[-73.393013,40.787556],[-73.390884,40.788173],[-73.390006,40.788441],[-73.38943500000001,40.788738],[-73.38890499999999,40.789185],[-73.387855,40.790054],[-73.38765100000001,40.790205],[-73.38687,40.790446],[-73.385291,40.790851],[-73.385161,40.791061],[-73.384822,40.791731],[-73.38479100000001,40.791755],[-73.382986,40.793136],[-73.381854,40.793803],[-73.380563,40.794564],[-73.378158,40.795219],[-73.377914,40.795292],[-73.377624,40.795357],[-73.37728,40.795444],[-73.376868,40.795531],[-73.37658500000001,40.795578],[-73.376099,40.795638],[-73.375946,40.795395],[-73.375664,40.794857],[-73.375052,40.792984],[-73.37437300000001,40.791691],[-73.374138,40.791144],[-73.373976,40.790728],[-73.37354499999999,40.789885],[-73.37309500000001,40.788976],[-73.37370900000001,40.788834],[-73.373959,40.788775],[-73.375004,40.788555],[-73.377994,40.788069],[-73.37803599999999,40.788064],[-73.382357,40.787493],[-73.383104,40.787392],[-73.383965,40.787288],[-73.386437,40.786939],[-73.387846,40.786705],[-73.388412,40.7866],[-73.390776,40.7861],[-73.390978,40.786057],[-73.392152,40.785805],[-73.393039,40.785615],[-73.393455,40.785518],[-73.39544600000001,40.785091],[-73.40006700000001,40.7841],[-73.401079,40.783875],[-73.401,40.784186],[-73.400982,40.784588],[-73.400835,40.785188],[-73.400575,40.786403],[-73.40038300000001,40.78733],[-73.40066899999999,40.787867],[-73.40104700000001,40.788574],[-73.40109099999999,40.788723],[-73.40147399999999,40.790188],[-73.40175000000001,40.791401],[-73.401993,40.792209],[-73.402016,40.792686],[-73.402047,40.793143],[-73.40207700000001,40.793594]]],"type":"Polygon"}
}