{
  "id": "360610159000",
  "type": "Feature",
  "properties": {
    "area_land":0,
    "area_water":110770,
    "geoid":"360610159000",
    "name":"Block Group 0",
    "state":"ny"
},
  "bbox": [
    -73.995705,
    40.779942,
    -73.98814,
    40.783789
],
  "geometry": {"coordinates":[[[-73.995705,40.782535],[-73.994765,40.783789],[-73.990484,40.782377],[-73.99017000000001,40.782246],[-73.98814,40.781409],[-73.98918999999999,40.779942],[-73.991637,40.780918],[-73.995639,40.782511],[-73.995705,40.782535]]],"type":"Polygon"}
}