{
  "id": "360070014001",
  "type": "Feature",
  "properties": {
    "area_land":162950,
    "area_water":28096,
    "geoid":"360070014001",
    "name":"Block Group 1",
    "state":"ny"
},
  "bbox": [
    -75.921916,
    42.092939,
    -75.916039,
    42.099446
],
  "geometry": {"coordinates":[[[-75.92174,42.097675],[-75.921074,42.099446],[-75.91978899999999,42.099205],[-75.91795,42.098853],[-75.917507,42.098785],[-75.91734099999999,42.098762],[-75.917051,42.098746],[-75.916758,42.098751],[-75.916313,42.098749],[-75.91620899999999,42.098747],[-75.916039,42.098073],[-75.916139,42.09578],[-75.916673,42.094475],[-75.917041,42.09358],[-75.91717199999999,42.09319],[-75.91775,42.093126],[-75.919065,42.092964],[-75.91932300000001,42.092939],[-75.919338,42.092963],[-75.91938500000001,42.093053],[-75.919383,42.093149],[-75.918997,42.094346],[-75.918808,42.094941],[-75.91874900000001,42.09511],[-75.918453,42.09594],[-75.918294,42.096414],[-75.919573,42.096655],[-75.920028,42.096741],[-75.920576,42.096856],[-75.920547,42.096944],[-75.921916,42.097207],[-75.92174,42.097675]]],"type":"Polygon"}
}