{
  "id": "361190068014",
  "type": "Feature",
  "properties": {
    "area_land":1008287,
    "area_water":0,
    "geoid":"361190068014",
    "name":"Block Group 4",
    "state":"ny"
},
  "bbox": [
    -73.795364,
    40.966665,
    -73.78172,
    40.985317
],
  "geometry": {"coordinates":[[[-73.79508199999999,40.966917],[-73.794985,40.967017],[-73.794861,40.967186],[-73.794781,40.967285],[-73.794718,40.967327],[-73.794659,40.967351],[-73.794376,40.967432],[-73.794299,40.96747],[-73.794237,40.967526],[-73.79415400000001,40.967668],[-73.793863,40.968277],[-73.793818,40.968353],[-73.79375899999999,40.968405],[-73.793098,40.968749],[-73.793004,40.968808],[-73.792945,40.968881],[-73.79245400000001,40.969768],[-73.792416,40.96981],[-73.792388,40.969913],[-73.79239099999999,40.969986],[-73.79251600000001,40.970531],[-73.792562,40.970962],[-73.792571,40.971033],[-73.792675,40.971411],[-73.792686,40.971451],[-73.792703,40.971516],[-73.79276900000001,40.971758],[-73.79279699999999,40.971817],[-73.792883,40.971889],[-73.79302199999999,40.971983],[-73.793143,40.972021],[-73.793254,40.972031],[-73.79332599999999,40.972048],[-73.79338199999999,40.972079],[-73.79343,40.972128],[-73.793488,40.972236],[-73.793527,40.972346],[-73.793783,40.972733],[-73.793936,40.972927],[-73.79397299999999,40.973016],[-73.79400800000001,40.973432],[-73.794026,40.973536],[-73.793999,40.973774],[-73.79396,40.973903],[-73.79390100000001,40.97399],[-73.79380399999999,40.97409],[-73.793558,40.974265],[-73.79347199999999,40.974365],[-73.79344500000001,40.974472],[-73.79342800000001,40.974563],[-73.793396,40.974732],[-73.79330899999999,40.974889],[-73.79314599999999,40.975111],[-73.7931,40.975152],[-73.79289300000001,40.975339],[-73.79188499999999,40.976109],[-73.79172699999999,40.97623],[-73.791315,40.976507],[-73.791186,40.976583],[-73.791134,40.976628],[-73.79101300000001,40.976855],[-73.790927,40.976979],[-73.790857,40.977052],[-73.790684,40.977169],[-73.79048299999999,40.97728],[-73.79045600000001,40.977311],[-73.79042800000001,40.977394],[-73.790435,40.97745],[-73.790583,40.977803],[-73.790837,40.978377],[-73.79124899999999,40.979086],[-73.791287,40.979173],[-73.791304,40.97927],[-73.791308,40.979391],[-73.79125999999999,40.979876],[-73.791254,40.979943],[-73.79124899999999,40.979995],[-73.791224,40.980064],[-73.791186,40.980102],[-73.790875,40.980272],[-73.79081600000001,40.980317],[-73.79060800000001,40.980609],[-73.79023100000001,40.981137],[-73.79011800000001,40.981279],[-73.79008899999999,40.981315],[-73.789438,40.982121],[-73.789022,40.982713],[-73.788493,40.983576],[-73.78823300000001,40.984],[-73.787693,40.984637],[-73.78756799999999,40.984758],[-73.787412,40.984855],[-73.78720800000001,40.984893],[-73.787166,40.98492],[-73.787128,40.984972],[-73.7871,40.98506],[-73.787066,40.98524],[-73.78704,40.985317],[-73.786393,40.98519],[-73.785861,40.985084],[-73.78497400000001,40.984875],[-73.78464,40.984751],[-73.784448,40.984627],[-73.784324,40.984494],[-73.784119,40.98423],[-73.78404399999999,40.98413],[-73.783783,40.983732],[-73.782918,40.982394],[-73.782385,40.981558],[-73.781886,40.980779],[-73.78180500000001,40.980673],[-73.78172000000001,40.980581],[-73.78197400000001,40.980376],[-73.78234,40.980103],[-73.78263099999999,40.979933],[-73.783755,40.97935],[-73.78410100000001,40.979167],[-73.78459700000001,40.978905],[-73.785146,40.978643],[-73.78594699999999,40.978285],[-73.78568799999999,40.977783],[-73.785251,40.976987],[-73.78492799999999,40.976423],[-73.78482200000001,40.976255],[-73.784582,40.975954],[-73.78394900000001,40.975226],[-73.783682,40.974916],[-73.783523,40.974595],[-73.783479,40.974469],[-73.78322199999999,40.97364],[-73.782938,40.972687],[-73.783199,40.972531],[-73.783466,40.972355],[-73.78382000000001,40.972144],[-73.784566,40.971752],[-73.785527,40.971329],[-73.78616,40.97109],[-73.786351,40.971022],[-73.787263,40.970747],[-73.787784,40.97063],[-73.78824899999999,40.970548],[-73.788965,40.970454],[-73.78935300000001,40.970426],[-73.790206,40.970401],[-73.79046700000001,40.970432],[-73.790684,40.970436],[-73.790879,40.970428],[-73.791099,40.970388],[-73.79145699999999,40.970336],[-73.791678,40.970277],[-73.791939,40.970084],[-73.792035,40.969998],[-73.79212699999999,40.969855],[-73.79257800000001,40.968954],[-73.79266699999999,40.968842],[-73.792918,40.968564],[-73.793117,40.968346],[-73.793277,40.968123],[-73.793781,40.96728],[-73.79389,40.967157],[-73.79397,40.967098],[-73.794237,40.967008],[-73.794472,40.966967],[-73.794597,40.966925],[-73.79470600000001,40.966877],[-73.794893,40.966781],[-73.795052,40.966665],[-73.79536400000001,40.966715],[-73.79508199999999,40.966917]]],"type":"Polygon"}
}