{
  "id": "360594076001",
  "type": "Feature",
  "properties": {
    "area_land":195285,
    "area_water":0,
    "geoid":"360594076001",
    "name":"Block Group 1",
    "state":"ny"
},
  "bbox": [
    -73.566796,
    40.748024,
    -73.558707,
    40.75361
],
  "geometry": {"coordinates":[[[-73.566796,40.752397],[-73.566284,40.752586],[-73.56591299999999,40.752716],[-73.565444,40.752871],[-73.564977,40.753017],[-73.564037,40.753313],[-73.56374099999999,40.753403],[-73.563084,40.75361],[-73.562399,40.753051],[-73.561804,40.752557],[-73.560025,40.751082],[-73.558707,40.749989],[-73.55942899999999,40.749483],[-73.56012800000001,40.748994],[-73.560835,40.748504],[-73.56152899999999,40.748024],[-73.562839,40.749119],[-73.56301000000001,40.749251],[-73.56462399999999,40.750591],[-73.56669599999999,40.752306],[-73.566796,40.752397]]],"type":"Polygon"}
}