{
  "id": "360130351001",
  "type": "Feature",
  "properties": {
    "area_land":1904264,
    "area_water":5052156,
    "geoid":"360130351001",
    "name":"Block Group 1",
    "state":"ny"
},
  "bbox": [
    -79.179632,
    42.5431,
    -79.136876,
    42.572605
],
  "geometry": {"coordinates":[[[-79.179632,42.560139],[-79.140995,42.572605],[-79.137873,42.570462],[-79.13708,42.569918],[-79.136978,42.569853],[-79.136876,42.569788],[-79.13711000000001,42.569172],[-79.137173,42.569152],[-79.13723400000001,42.569117],[-79.137291,42.569054],[-79.137342,42.568942],[-79.137389,42.568615],[-79.137484,42.568269],[-79.137613,42.567937],[-79.137715,42.567638],[-79.137799,42.56731],[-79.137888,42.567023],[-79.13802,42.566687],[-79.13856800000001,42.565493],[-79.138935,42.564811],[-79.13917499999999,42.564338],[-79.13966600000001,42.563609],[-79.139978,42.563106],[-79.14010500000001,42.562961],[-79.140118,42.562945],[-79.14031300000001,42.562698],[-79.140428,42.562501],[-79.140517,42.562305],[-79.14100999999999,42.561215],[-79.141121,42.560973],[-79.141245,42.560785],[-79.141317,42.560718],[-79.141425,42.560639],[-79.14154000000001,42.560527],[-79.141475,42.560337],[-79.141475,42.56026],[-79.141524,42.560154],[-79.141659,42.559929],[-79.141766,42.559536],[-79.141756,42.55925],[-79.14177599999999,42.5591],[-79.141845,42.558829],[-79.14201199999999,42.558372],[-79.142054,42.557985],[-79.142026,42.557576],[-79.14203500000001,42.557536],[-79.14206799999999,42.557389],[-79.142122,42.557471],[-79.142214,42.557441],[-79.14229,42.557343],[-79.142034,42.556983],[-79.142397,42.556643],[-79.14254800000001,42.556379],[-79.14276700000001,42.555884],[-79.142809,42.555796],[-79.142858,42.555627],[-79.142867,42.555523],[-79.142949,42.555369],[-79.14308200000001,42.555196],[-79.14314299999999,42.555073],[-79.143225,42.554664],[-79.143272,42.55398],[-79.143276,42.553927],[-79.14319500000001,42.553628],[-79.143147,42.553463],[-79.14308200000001,42.553238],[-79.143072,42.553115],[-79.143083,42.553031],[-79.143137,42.552603],[-79.14316100000001,42.552382],[-79.143174,42.552266],[-79.143209,42.552113],[-79.145471,42.551041],[-79.149218,42.549225],[-79.14984,42.548951],[-79.15056300000001,42.548612],[-79.153763,42.547072],[-79.15597200000001,42.546026],[-79.156408,42.545813],[-79.15647199999999,42.545783],[-79.156842,42.545611],[-79.157173,42.545462],[-79.15752000000001,42.545307],[-79.15803,42.545066],[-79.158109,42.545026],[-79.158502,42.544751],[-79.159003,42.544364],[-79.15925900000001,42.544165],[-79.15989,42.543672],[-79.160539,42.543171],[-79.16061999999999,42.543133],[-79.16070000000001,42.543108],[-79.16087899999999,42.5431],[-79.161118,42.543131],[-79.16169499999999,42.543247],[-79.162429,42.543378],[-79.164176,42.543738],[-79.164737,42.543855],[-79.16503400000001,42.543918],[-79.166663,42.544255],[-79.167321,42.544408],[-79.167575,42.544468],[-79.167884,42.544542],[-79.168373,42.544645],[-79.169648,42.5449],[-79.17051499999999,42.545089],[-79.170963,42.545186],[-79.172178,42.545461],[-79.172324,42.545496],[-79.17268,42.545575],[-79.174215,42.545896],[-79.174691,42.545616],[-79.17486700000001,42.545496],[-79.174924,42.545424],[-79.17496199999999,42.545339],[-79.174997,42.545126],[-79.175085,42.544444],[-79.176514,42.544444],[-79.177003,42.544432],[-79.177043,42.544431],[-79.17739,42.544397],[-79.177629,42.544356],[-79.17784399999999,42.544301],[-79.17822099999999,42.544184],[-79.178224,42.544339],[-79.17822,42.544472],[-79.17821600000001,42.544573],[-79.178224,42.544895],[-79.178229,42.544948],[-79.178226,42.545037],[-79.178226,42.546186],[-79.17817599999999,42.551063],[-79.178169,42.551741],[-79.178085,42.552091],[-79.177785,42.552335],[-79.179632,42.560139]]],"type":"Polygon"}
}