{
  "id": "360270703011",
  "type": "Feature",
  "properties": {
    "area_land":6336207,
    "area_water":67836,
    "geoid":"360270703011",
    "name":"Block Group 1",
    "state":"ny"
},
  "bbox": [
    -73.885172,
    41.756453,
    -73.855903,
    41.792862
],
  "geometry": {"coordinates":[[[-73.885172,41.782113],[-73.88516,41.782255],[-73.88514600000001,41.782325],[-73.885076,41.78266],[-73.884884,41.783641],[-73.884711,41.784518],[-73.884666,41.784689],[-73.884327,41.785771],[-73.884306,41.78593],[-73.88430200000001,41.78605],[-73.884198,41.786075],[-73.883916,41.786164],[-73.882552,41.786984],[-73.882125,41.78731],[-73.88196499999999,41.787482],[-73.881714,41.787786],[-73.88160000000001,41.787893],[-73.88119399999999,41.788188],[-73.88048000000001,41.788653],[-73.880262,41.788775],[-73.879188,41.789308],[-73.878833,41.789466],[-73.878711,41.789501],[-73.87845799999999,41.789517],[-73.878193,41.789481],[-73.87803700000001,41.789442],[-73.877826,41.789371],[-73.877422,41.789175],[-73.877092,41.789036],[-73.87690600000001,41.788987],[-73.876835,41.788973],[-73.87658999999999,41.788965],[-73.876077,41.788973],[-73.875444,41.789003],[-73.875001,41.789039],[-73.874135,41.789149],[-73.87347800000001,41.789211],[-73.87303900000001,41.789236],[-73.87247499999999,41.78927],[-73.87227,41.789296],[-73.871763,41.789391],[-73.871126,41.789558],[-73.870092,41.789839],[-73.87005000000001,41.789852],[-73.869541,41.790007],[-73.868905,41.790179],[-73.86789899999999,41.790452],[-73.86767500000001,41.79054],[-73.867554,41.790609],[-73.867345,41.790752],[-73.867161,41.790934],[-73.86701100000001,41.791078],[-73.86690299999999,41.791174],[-73.866624,41.791399],[-73.86642999999999,41.791511],[-73.866258,41.791591],[-73.865915,41.791735],[-73.865545,41.79187],[-73.865072,41.792044],[-73.864935,41.792092],[-73.864825,41.792119],[-73.86376300000001,41.792387],[-73.863055,41.792606],[-73.86228699999999,41.792862],[-73.861845,41.790603],[-73.861158,41.786753],[-73.858769,41.773346],[-73.858723,41.773037],[-73.857455,41.765721],[-73.855903,41.756536],[-73.856317,41.756579],[-73.857268,41.7567],[-73.85785199999999,41.756809],[-73.85794199999999,41.756847],[-73.858017,41.756893],[-73.858116,41.756985],[-73.85816199999999,41.757062],[-73.858193,41.757143],[-73.85836399999999,41.75799],[-73.85836399999999,41.75815],[-73.858214,41.758656],[-73.858197,41.758754],[-73.858214,41.759304],[-73.85825,41.759519],[-73.858344,41.759794],[-73.858436,41.759888],[-73.858502,41.759937],[-73.858667,41.760023],[-73.858728,41.760044],[-73.858921,41.760053],[-73.86009300000001,41.760078],[-73.860122,41.759766],[-73.860153,41.759573],[-73.86054799999999,41.756922],[-73.86062699999999,41.756453],[-73.861075,41.756502],[-73.861284,41.756548],[-73.86189400000001,41.756812],[-73.86205,41.756849],[-73.86272,41.75695],[-73.86287400000001,41.75699],[-73.86306999999999,41.75702],[-73.86318900000001,41.757022],[-73.863799,41.757016],[-73.863899,41.757024],[-73.864284,41.757071],[-73.864442,41.757082],[-73.864767,41.75709],[-73.86502,41.757076],[-73.86548500000001,41.757035],[-73.86577200000001,41.757035],[-73.866077,41.757025],[-73.866106,41.757024],[-73.86631199999999,41.757046],[-73.866387,41.757047],[-73.86649199999999,41.757049],[-73.86653699999999,41.757058],[-73.86660999999999,41.757072],[-73.866873,41.757159],[-73.867086,41.75728],[-73.867446,41.757511],[-73.867885,41.757704],[-73.868008,41.757768],[-73.86815900000001,41.757864],[-73.86832800000001,41.758009],[-73.86864,41.758313],[-73.86890099999999,41.75849],[-73.86915399999999,41.758699],[-73.869384,41.758873],[-73.86952700000001,41.758954],[-73.869889,41.759113],[-73.87015,41.75924],[-73.870181,41.759271],[-73.870462,41.759781],[-73.87059600000001,41.760001],[-73.870649,41.760106],[-73.870726,41.760216],[-73.871031,41.760539],[-73.87143500000001,41.760904],[-73.87161999999999,41.761031],[-73.87168699999999,41.761066],[-73.87172,41.761075],[-73.872282,41.761062],[-73.87387200000001,41.761145],[-73.87403,41.761181],[-73.87415300000001,41.761238],[-73.87450200000001,41.76155],[-73.874605,41.761603],[-73.874726,41.761651],[-73.875001,41.761722],[-73.875151,41.761742],[-73.875407,41.761746],[-73.87573500000001,41.761707],[-73.87593200000001,41.761659],[-73.87651700000001,41.761478],[-73.876623,41.761462],[-73.87683699999999,41.761446],[-73.87716,41.761438],[-73.877342,41.761462],[-73.877516,41.761545],[-73.87817,41.761841],[-73.87819399999999,41.76185],[-73.878424,41.761935],[-73.87866099999999,41.762062],[-73.87891500000001,41.76226],[-73.879124,41.762481],[-73.87921,41.762604],[-73.879299,41.762768],[-73.879355,41.762907],[-73.879396,41.763204],[-73.879426,41.763871],[-73.879465,41.764576],[-73.879524,41.765338],[-73.879713,41.766313],[-73.879779,41.766668],[-73.879867,41.766932],[-73.88015799999999,41.768016],[-73.88029299999999,41.768468],[-73.880319,41.768543],[-73.88036700000001,41.768678],[-73.88066600000001,41.769423],[-73.880916,41.770124],[-73.881107,41.770619],[-73.881316,41.771326],[-73.88144699999999,41.771699],[-73.881495,41.771871],[-73.881506,41.772042],[-73.881488,41.772303],[-73.881421,41.772699],[-73.88108099999999,41.774107],[-73.880689,41.775826],[-73.88068699999999,41.775836],[-73.880647,41.77615],[-73.880641,41.777331],[-73.880633,41.777712],[-73.880655,41.778908],[-73.880685,41.779117],[-73.88082300000001,41.779449],[-73.880905,41.779583],[-73.881013,41.779688],[-73.881096,41.779736],[-73.881182,41.77977],[-73.88126,41.779788],[-73.88251099999999,41.779869],[-73.883329,41.779956],[-73.883527,41.780001],[-73.88374,41.780094],[-73.88384000000001,41.780173],[-73.88390800000001,41.780259],[-73.88397500000001,41.780378],[-73.88406500000001,41.780624],[-73.884236,41.781022],[-73.88436,41.781205],[-73.88455399999999,41.78141],[-73.884575,41.781424],[-73.88502099999999,41.781734],[-73.885087,41.781825],[-73.88512799999999,41.781904],[-73.88516,41.78201],[-73.885172,41.782113]]],"type":"Polygon"}
}