{
  "id": "360099618002",
  "type": "Feature",
  "properties": {
    "area_land":483686,
    "area_water":6348,
    "geoid":"360099618002",
    "name":"Block Group 2",
    "state":"ny"
},
  "bbox": [
    -78.423342,
    42.075939,
    -78.411327,
    42.082861
],
  "geometry": {"coordinates":[[[-78.42334200000001,42.08032],[-78.423129,42.080292],[-78.422648,42.080221],[-78.42018400000001,42.079868],[-78.42018899999999,42.08002],[-78.42023399999999,42.080575],[-78.420294,42.080751],[-78.420376,42.080924],[-78.420495,42.081113],[-78.420824,42.081575],[-78.421646,42.082719],[-78.421713,42.082818],[-78.42155700000001,42.082857],[-78.420886,42.082861],[-78.420661,42.082859],[-78.41992,42.082854],[-78.418858,42.082858],[-78.417413,42.082849],[-78.416042,42.082861],[-78.415238,42.082832],[-78.413853,42.082493],[-78.413631,42.08245],[-78.41347399999999,42.082419],[-78.412908,42.082272],[-78.411806,42.082007],[-78.411327,42.081881],[-78.411438,42.081613],[-78.412071,42.080165],[-78.412432,42.07936],[-78.412875,42.078355],[-78.412941,42.078202],[-78.413147,42.077892],[-78.413307,42.077629],[-78.41292799999999,42.077501],[-78.413128,42.077164],[-78.413425,42.076724],[-78.41394699999999,42.075939],[-78.414632,42.076143],[-78.415346,42.0764],[-78.41540999999999,42.076424],[-78.41653700000001,42.07685],[-78.417063,42.07705],[-78.41984100000001,42.078085],[-78.419957,42.078114],[-78.42009299999999,42.078122],[-78.420351,42.078119],[-78.422494,42.077854],[-78.42291,42.077806],[-78.42325200000001,42.077768],[-78.423304,42.078838],[-78.423323,42.079604],[-78.42334200000001,42.08032]]],"type":"Polygon"}
}