{
  "id": "360830412002",
  "type": "Feature",
  "properties": {
    "area_land":392178,
    "area_water":0,
    "geoid":"360830412002",
    "name":"Block Group 2",
    "state":"ny"
},
  "bbox": [
    -73.66335,
    42.700012,
    -73.652671,
    42.709192
],
  "geometry": {"coordinates":[[[-73.663028,42.709045],[-73.662847,42.708938],[-73.66184199999999,42.708369],[-73.661472,42.708173],[-73.66126800000001,42.708082],[-73.660943,42.707981],[-73.66006899999999,42.707725],[-73.659329,42.707549],[-73.659177,42.707528],[-73.659153,42.707521],[-73.659068,42.707518],[-73.658311,42.707424],[-73.658188,42.707423],[-73.65799,42.707437],[-73.657657,42.707478],[-73.657512,42.707501],[-73.657318,42.707552],[-73.656829,42.707744],[-73.656676,42.707815],[-73.655709,42.708304],[-73.65497499999999,42.708681],[-73.65474500000001,42.708784],[-73.654518,42.708868],[-73.654321,42.708929],[-73.654066,42.708987],[-73.653893,42.709008],[-73.653851,42.709012],[-73.653147,42.704854],[-73.653262,42.704175],[-73.65307300000001,42.703411],[-73.652851,42.702376],[-73.65286399999999,42.701447],[-73.65276799999999,42.70055],[-73.652671,42.700012],[-73.653105,42.700288],[-73.65432800000001,42.701046],[-73.65470999999999,42.701278],[-73.65481200000001,42.701326],[-73.654915,42.701362],[-73.655759,42.70161],[-73.65653399999999,42.701856],[-73.656722,42.701939],[-73.656882,42.702038],[-73.657065,42.702169],[-73.657196,42.702289],[-73.657577,42.702676],[-73.658126,42.703295],[-73.658151,42.703323],[-73.65849,42.703702],[-73.65866699999999,42.703886],[-73.659021,42.704254],[-73.65941599999999,42.704664],[-73.65983300000001,42.705118],[-73.66031599999999,42.705563],[-73.66040700000001,42.705634],[-73.661079,42.706213],[-73.661136,42.706278],[-73.661312,42.706475],[-73.66171,42.706986],[-73.661789,42.707092],[-73.662243,42.707703],[-73.66334999999999,42.709192],[-73.663028,42.709045]]],"type":"Polygon"}
}