{
  "id": "360930321021",
  "type": "Feature",
  "properties": {
    "area_land":3086464,
    "area_water":1100961,
    "geoid":"360930321021",
    "name":"Block Group 1",
    "state":"ny"
},
  "bbox": [
    -73.849525,
    42.773163,
    -73.809369,
    42.804808
],
  "geometry": {"coordinates":[[[-73.848243,42.782629],[-73.84818,42.782717],[-73.847798,42.783242],[-73.847652,42.783448],[-73.847601,42.783518],[-73.84634,42.785285],[-73.846132,42.785631],[-73.845978,42.78643],[-73.845918,42.786603],[-73.84499599999999,42.788093],[-73.843075,42.789556],[-73.84603,42.790244],[-73.84654399999999,42.790411],[-73.84705700000001,42.790731],[-73.84738,42.790992],[-73.847492,42.791119],[-73.84763700000001,42.791287],[-73.847719,42.791502],[-73.847718,42.791526],[-73.847703,42.791779],[-73.847382,42.792668],[-73.846953,42.793244],[-73.846564,42.793572],[-73.84602599999999,42.793898],[-73.845518,42.794094],[-73.84486200000001,42.79431],[-73.84456299999999,42.794419],[-73.84450200000001,42.794506],[-73.844471,42.794659],[-73.844762,42.795604],[-73.84511000000001,42.796701],[-73.845134,42.797491],[-73.845123,42.798818],[-73.84512100000001,42.799114],[-73.845204,42.799903],[-73.84739399999999,42.801645],[-73.84765899999999,42.801975],[-73.847751,42.802123],[-73.847865,42.802305],[-73.847863,42.803475],[-73.847747,42.803868],[-73.847741,42.804014],[-73.84777800000001,42.804215],[-73.84626900000001,42.804808],[-73.84586400000001,42.804375],[-73.845803,42.80428],[-73.84372999999999,42.80103],[-73.84334699999999,42.80043],[-73.843081,42.800013],[-73.842866,42.799676],[-73.841672,42.798018],[-73.84156900000001,42.797875],[-73.83217,42.793076],[-73.831951,42.792872],[-73.83130199999999,42.792266],[-73.829064,42.790177],[-73.828468,42.784879],[-73.827958,42.784176],[-73.82766700000001,42.783776],[-73.82287100000001,42.780726],[-73.822166,42.780278],[-73.819957,42.780036],[-73.814246,42.779333],[-73.809471,42.778894],[-73.809369,42.778869],[-73.80944100000001,42.777685],[-73.809462,42.777344],[-73.809479,42.777064],[-73.809484,42.776981],[-73.809489,42.776897],[-73.80950300000001,42.776703],[-73.809517,42.776509],[-73.80955899999999,42.775784],[-73.809603,42.775016],[-73.811626,42.774774],[-73.81194600000001,42.774736],[-73.813281,42.774576],[-73.816424,42.774201],[-73.816529,42.774188],[-73.81930800000001,42.773855],[-73.824516,42.773237],[-73.824797,42.773203],[-73.82512699999999,42.773163],[-73.826446,42.773975],[-73.826931,42.77422],[-73.82755,42.774449],[-73.828738,42.774737],[-73.83033,42.775105],[-73.83427399999999,42.776169],[-73.837112,42.777034],[-73.839707,42.777839],[-73.840013,42.777931],[-73.841825,42.778517],[-73.845158,42.779637],[-73.84591,42.779857],[-73.847268,42.780278],[-73.849525,42.780865],[-73.848243,42.782629]]],"type":"Polygon"}
}