{
  "id": "360811032021",
  "type": "Feature",
  "properties": {
    "area_land":239059,
    "area_water":0,
    "geoid":"360811032021",
    "name":"Block Group 1",
    "state":"ny"
},
  "bbox": [
    -73.754419,
    40.60426,
    -73.744567,
    40.611992
],
  "geometry": {"coordinates":[[[-73.754419,40.604978],[-73.753726,40.606182],[-73.752914,40.606912],[-73.752421,40.607872],[-73.752267,40.60806],[-73.75106100000001,40.60942],[-73.749883,40.610338],[-73.74955799999999,40.610557],[-73.749216,40.610766],[-73.74885999999999,40.610962],[-73.748493,40.611144],[-73.747805,40.611395],[-73.746942,40.611775],[-73.746855,40.611574],[-73.745761,40.611992],[-73.74566299999999,40.611812],[-73.745633,40.611756],[-73.745368,40.611204],[-73.744567,40.610117],[-73.74514000000001,40.609867],[-73.7456,40.60966],[-73.745907,40.60952],[-73.746161,40.609407],[-73.746841,40.609109],[-73.74763799999999,40.60874],[-73.747671,40.608714],[-73.74869099999999,40.607874],[-73.74959200000001,40.607147],[-73.750254,40.606599],[-73.751131,40.605869],[-73.75183699999999,40.605285],[-73.75285,40.60426],[-73.75353800000001,40.604569],[-73.75399899999999,40.604783],[-73.754419,40.604978]]],"type":"Polygon"}
}