{
  "id": "360610207011",
  "type": "Feature",
  "properties": {
    "area_land":24864,
    "area_water":0,
    "geoid":"360610207011",
    "name":"Block Group 1",
    "state":"ny"
},
  "bbox": [
    -73.960106,
    40.807419,
    -73.957617,
    40.809341
],
  "geometry": {"coordinates":[[[-73.95994,40.808349],[-73.959648,40.808754],[-73.959217,40.809341],[-73.958624,40.809093],[-73.95812100000001,40.808882],[-73.957617,40.808671],[-73.957949,40.808053],[-73.95840699999999,40.807419],[-73.959791,40.80799],[-73.960106,40.80812],[-73.95994,40.808349]]],"type":"Polygon"}
}