{
  "id": "360150004002",
  "type": "Feature",
  "properties": {
    "area_land":1056796,
    "area_water":12420,
    "geoid":"360150004002",
    "name":"Block Group 2",
    "state":"ny"
},
  "bbox": [
    -76.842274,
    42.089907,
    -76.826141,
    42.113836
],
  "geometry": {"coordinates":[[[-76.842274,42.101761],[-76.83764499999999,42.102942],[-76.837011,42.103131],[-76.836288,42.103364],[-76.835776,42.103577],[-76.835503,42.10365],[-76.834675,42.103877],[-76.834292,42.104026],[-76.833629,42.10427],[-76.834656,42.105513],[-76.834879,42.105877],[-76.83505,42.106218],[-76.836382,42.10897],[-76.837,42.110391],[-76.83835999999999,42.113836],[-76.838295,42.11376],[-76.837718,42.113029],[-76.837288,42.112486],[-76.837013,42.111974],[-76.83569300000001,42.109518],[-76.83442700000001,42.107203],[-76.833603,42.105658],[-76.832443,42.103456],[-76.83178700000001,42.102224],[-76.831428,42.101557],[-76.830879,42.100534],[-76.829742,42.098421],[-76.827827,42.09485],[-76.827133,42.093561],[-76.82663700000001,42.09263],[-76.82614100000001,42.091711],[-76.826599,42.091577],[-76.826723,42.091517],[-76.82715,42.091351],[-76.827186,42.091356],[-76.827354,42.091345],[-76.827499,42.09131],[-76.829399,42.09075],[-76.830505,42.090471],[-76.83214700000001,42.089984],[-76.832448,42.089912],[-76.832707,42.089907],[-76.83284399999999,42.08993],[-76.833282,42.090971],[-76.83337400000001,42.091152],[-76.83370499999999,42.092723],[-76.834024,42.092918],[-76.83455499999999,42.093417],[-76.834793,42.093828],[-76.83600800000001,42.095754],[-76.836125,42.095986],[-76.837192,42.09805],[-76.83757,42.098753],[-76.84087100000001,42.097957],[-76.842274,42.101761]]],"type":"Polygon"}
}