{
  "id": "360550110002",
  "type": "Feature",
  "properties": {
    "area_land":353955,
    "area_water":0,
    "geoid":"360550110002",
    "name":"Block Group 2",
    "state":"ny"
},
  "bbox": [
    -77.540927,
    43.176942,
    -77.53165,
    43.182748
],
  "geometry": {"coordinates":[[[-77.540875,43.181504],[-77.540588,43.182414],[-77.538439,43.182556],[-77.535327,43.182748],[-77.53525500000001,43.181841],[-77.53583500000001,43.181804],[-77.53577300000001,43.180891],[-77.534499,43.180962],[-77.53324499999999,43.181024],[-77.53176000000001,43.181117],[-77.53165,43.179637],[-77.531661,43.17949],[-77.531694,43.179346],[-77.531745,43.17922],[-77.531824,43.179066],[-77.531947,43.178912],[-77.532122,43.178766],[-77.53236,43.178622],[-77.532629,43.178513],[-77.532839,43.178445],[-77.534077,43.178074],[-77.53533400000001,43.177683],[-77.536564,43.177304],[-77.536584,43.177214],[-77.536596,43.177041],[-77.537071,43.177088],[-77.537327,43.177089],[-77.538106,43.177044],[-77.53816,43.177042],[-77.538217,43.177039],[-77.53823300000001,43.177038],[-77.538269,43.177037],[-77.539357,43.176993],[-77.540626,43.176942],[-77.540784,43.179322],[-77.540869,43.18062],[-77.540927,43.181367],[-77.540875,43.181504]]],"type":"Polygon"}
}