{
  "id": "360271404003",
  "type": "Feature",
  "properties": {
    "area_land":5503159,
    "area_water":28788,
    "geoid":"360271404003",
    "name":"Block Group 3",
    "state":"ny"
},
  "bbox": [
    -73.92075,
    41.654098,
    -73.870642,
    41.679579
],
  "geometry": {"coordinates":[[[-73.920563,41.659878],[-73.920334,41.660439],[-73.92001399999999,41.661178],[-73.919838,41.661523],[-73.91968799999999,41.661737],[-73.919583,41.661868],[-73.919526,41.661939],[-73.919393,41.662064],[-73.91915400000001,41.662246],[-73.91900099999999,41.662339],[-73.91878199999999,41.662448],[-73.918329,41.66265],[-73.918176,41.662735],[-73.918074,41.662812],[-73.918014,41.662881],[-73.91791000000001,41.663021],[-73.917506,41.66357],[-73.917255,41.663905],[-73.917045,41.664186],[-73.916675,41.66463],[-73.916054,41.665284],[-73.915694,41.665667],[-73.91533,41.666076],[-73.91522500000001,41.666196],[-73.915099,41.66635],[-73.915047,41.66643],[-73.91464999999999,41.667198],[-73.914323,41.667888],[-73.91417199999999,41.668195],[-73.913815,41.668924],[-73.913793,41.669012],[-73.91378899999999,41.669227],[-73.913814,41.669341],[-73.91390199999999,41.669608],[-73.914221,41.670413],[-73.914276,41.670591],[-73.914303,41.670809],[-73.914294,41.670951],[-73.91408699999999,41.671636],[-73.911158,41.671585],[-73.910881,41.671581],[-73.90915099999999,41.671547],[-73.90595399999999,41.671494],[-73.90468300000001,41.67147],[-73.904335,41.671464],[-73.903465,41.671448],[-73.902171,41.671425],[-73.901695,41.671405],[-73.898347,41.670973],[-73.893709,41.670367],[-73.89237300000001,41.670306],[-73.89128100000001,41.670266],[-73.891158,41.670295],[-73.89101100000001,41.67045],[-73.89102699999999,41.670481],[-73.890985,41.670481],[-73.891008,41.670549],[-73.891076,41.670583],[-73.891175,41.670596],[-73.891273,41.670555],[-73.89135,41.670572],[-73.89139400000001,41.670617],[-73.891409,41.67073],[-73.89139400000001,41.670815],[-73.89135,41.670918],[-73.89125,41.670939],[-73.891111,41.670882],[-73.890978,41.670815],[-73.890871,41.67081],[-73.890789,41.670832],[-73.890759,41.670918],[-73.89069000000001,41.671035],[-73.89066,41.671154],[-73.890743,41.671347],[-73.890811,41.671419],[-73.890879,41.671453],[-73.89094,41.67143],[-73.890978,41.671368],[-73.89099299999999,41.671244],[-73.89103799999999,41.671204],[-73.891091,41.671187],[-73.891144,41.671216],[-73.891158,41.671266],[-73.891127,41.671395],[-73.891154,41.671437],[-73.891276,41.671446],[-73.89141600000001,41.67145],[-73.89144,41.671494],[-73.89141100000001,41.671551],[-73.891251,41.671581],[-73.89115099999999,41.671607],[-73.891144,41.671725],[-73.891217,41.671802],[-73.891324,41.671952],[-73.891364,41.672028],[-73.891373,41.672147],[-73.89145499999999,41.672632],[-73.891508,41.672822],[-73.891561,41.67311],[-73.891626,41.673576],[-73.891626,41.673683],[-73.891603,41.67378],[-73.891541,41.673846],[-73.891488,41.673917],[-73.891479,41.673988],[-73.89143900000001,41.674103],[-73.891369,41.674244],[-73.891193,41.674533],[-73.891193,41.6746],[-73.891319,41.674783],[-73.89147699999999,41.675114],[-73.89154600000001,41.675187],[-73.891575,41.675236],[-73.891535,41.675315],[-73.891402,41.675371],[-73.891273,41.675459],[-73.89125300000001,41.675506],[-73.891277,41.67581],[-73.891261,41.675931],[-73.891226,41.675987],[-73.891093,41.676048],[-73.891077,41.676101],[-73.891137,41.676272],[-73.891093,41.676626],[-73.891046,41.676814],[-73.890962,41.676951],[-73.890962,41.677066],[-73.89101100000001,41.677199],[-73.89101100000001,41.677252],[-73.89097599999999,41.677407],[-73.890992,41.677605],[-73.890968,41.677691],[-73.890857,41.67803],[-73.890866,41.678105],[-73.890897,41.678158],[-73.890969,41.678208],[-73.89100000000001,41.678248],[-73.891004,41.678292],[-73.890973,41.678367],[-73.890852,41.678482],[-73.89084,41.67854],[-73.890856,41.678582],[-73.890936,41.678624],[-73.890959,41.678651],[-73.890947,41.678721],[-73.890862,41.679082],[-73.89080199999999,41.679579],[-73.89053699999999,41.67947],[-73.890158,41.679291],[-73.88877599999999,41.678657],[-73.88737,41.678011],[-73.886785,41.677743],[-73.886092,41.677414],[-73.885988,41.677365],[-73.885796,41.677275],[-73.885605,41.677174],[-73.885509,41.677119],[-73.885338,41.677003],[-73.885214,41.676895],[-73.88511,41.676788],[-73.885031,41.676698],[-73.884941,41.676571],[-73.884901,41.676507],[-73.884811,41.676339],[-73.884739,41.676209],[-73.884652,41.676038],[-73.884495,41.675701],[-73.88440199999999,41.675504],[-73.884353,41.675356],[-73.88432400000001,41.675284],[-73.884289,41.675154],[-73.884269,41.675046],[-73.884246,41.674899],[-73.884249,41.674768],[-73.884246,41.674644],[-73.884263,41.674536],[-73.884292,41.674394],[-73.884342,41.674235],[-73.884399,41.67409],[-73.884457,41.673936],[-73.88451499999999,41.673789],[-73.88458199999999,41.673638],[-73.884631,41.673516],[-73.88468899999999,41.673377],[-73.884736,41.673232],[-73.884773,41.673113],[-73.884794,41.672986],[-73.884801,41.672896],[-73.88481299999999,41.672716],[-73.884834,41.672135],[-73.8848,41.671906],[-73.884697,41.671574],[-73.88465100000001,41.671455],[-73.884469,41.671129],[-73.884269,41.670824],[-73.88408699999999,41.670599],[-73.883833,41.670394],[-73.883169,41.669969],[-73.883146,41.669954],[-73.88155500000001,41.668935],[-73.879797,41.667799],[-73.87898800000001,41.667276],[-73.87890400000001,41.667328],[-73.878837,41.667355],[-73.878742,41.667358],[-73.878427,41.667312],[-73.878264,41.667258],[-73.87777800000001,41.666968],[-73.87765899999999,41.666875],[-73.87768800000001,41.666853],[-73.877696,41.666795],[-73.877657,41.66671],[-73.87752999999999,41.666576],[-73.877511,41.666522],[-73.877503,41.666445],[-73.877469,41.666364],[-73.87737799999999,41.666282],[-73.87696800000001,41.665835],[-73.876679,41.665655],[-73.876471,41.665508],[-73.87626299999999,41.665289],[-73.876002,41.664876],[-73.875878,41.664545],[-73.87573999999999,41.664418],[-73.875547,41.664291],[-73.87549,41.664222],[-73.875405,41.664168],[-73.875182,41.664095],[-73.874908,41.66416],[-73.874835,41.664145],[-73.874663,41.664059],[-73.87458599999999,41.664],[-73.874495,41.663906],[-73.874409,41.663773],[-73.874387,41.663656],[-73.874459,41.663443],[-73.87446799999999,41.663339],[-73.874453,41.663224],[-73.87436,41.663089],[-73.873648,41.662586],[-73.873513,41.662454],[-73.873469,41.662372],[-73.873402,41.662163],[-73.873328,41.662066],[-73.873238,41.661997],[-73.872924,41.66183],[-73.872871,41.661792],[-73.872809,41.661726],[-73.872756,41.661635],[-73.872682,41.661421],[-73.872671,41.661377],[-73.872632,41.66122],[-73.87257,41.661062],[-73.872484,41.660924],[-73.87217200000001,41.660588],[-73.872063,41.660444],[-73.871982,41.660274],[-73.871917,41.660081],[-73.871706,41.65959],[-73.871565,41.65939],[-73.871292,41.659079],[-73.871118,41.658825],[-73.871056,41.658735],[-73.870716,41.658329],[-73.87064700000001,41.658216],[-73.870642,41.658106],[-73.87067399999999,41.658051],[-73.87074,41.657989],[-73.87116899999999,41.657722],[-73.871371,41.657571],[-73.87150699999999,41.657428],[-73.871616,41.657281],[-73.87182199999999,41.656847],[-73.87191199999999,41.656618],[-73.871959,41.6565],[-73.872078,41.656082],[-73.872129,41.655865],[-73.872164,41.655655],[-73.87218900000001,41.655398],[-73.872184,41.654895],[-73.872198,41.654825],[-73.87224500000001,41.654741],[-73.872365,41.65463],[-73.872479,41.654552],[-73.872556,41.654508],[-73.873277,41.654098],[-73.873469,41.654202],[-73.873648,41.654333],[-73.873783,41.654443],[-73.873898,41.654554],[-73.873999,41.654687],[-73.874089,41.654828],[-73.87414200000001,41.655085],[-73.874188,41.655206],[-73.874291,41.655395],[-73.87437199999999,41.655481],[-73.874454,41.65556],[-73.87446799999999,41.65556],[-73.87467700000001,41.655586],[-73.87522199999999,41.655596],[-73.875711,41.655577],[-73.87634799999999,41.655555],[-73.876696,41.655547],[-73.87806,41.655506],[-73.878372,41.655508],[-73.881017,41.655448],[-73.881896,41.655427],[-73.882093,41.655421],[-73.88292800000001,41.655436],[-73.883235,41.655453],[-73.883493,41.655473],[-73.883652,41.655489],[-73.883734,41.655499],[-73.88446,41.655606],[-73.88552799999999,41.655778],[-73.885886,41.655853],[-73.88659199999999,41.655966],[-73.887023,41.656048],[-73.88820699999999,41.656235],[-73.888689,41.656274],[-73.889179,41.656293],[-73.889505,41.656289],[-73.88979,41.656276],[-73.889904,41.656275],[-73.890135,41.656293],[-73.890303,41.65631],[-73.890461,41.656349],[-73.890708,41.65643],[-73.890963,41.656527],[-73.891082,41.656584],[-73.891408,41.656771],[-73.892017,41.657103],[-73.89232800000001,41.657242],[-73.89264,41.657366],[-73.892788,41.657412],[-73.892943,41.657457],[-73.89310999999999,41.657493],[-73.893219,41.657518],[-73.89330200000001,41.657536],[-73.893424,41.657552],[-73.893567,41.657573],[-73.893698,41.657586],[-73.89384699999999,41.657603],[-73.894068,41.65762],[-73.89431999999999,41.657633],[-73.89458999999999,41.65765],[-73.894745,41.657652],[-73.895157,41.657668],[-73.895807,41.657676],[-73.896146,41.657654],[-73.897018,41.657589],[-73.897474,41.65759],[-73.897778,41.65761],[-73.898115,41.657656],[-73.898315,41.657694],[-73.89847,41.657728],[-73.89854200000001,41.657744],[-73.899196,41.657931],[-73.90231799999999,41.658936],[-73.903358,41.65928],[-73.90376000000001,41.659415],[-73.904225,41.65959],[-73.904383,41.659666],[-73.90444599999999,41.659698],[-73.90480700000001,41.659859],[-73.90513,41.660014],[-73.90554400000001,41.660203],[-73.905751,41.660282],[-73.905973,41.660372],[-73.90615200000001,41.660441],[-73.90633,41.660487],[-73.906425,41.660513],[-73.906606,41.660549],[-73.906807,41.660565],[-73.90704599999999,41.660575],[-73.907217,41.660563],[-73.907388,41.660551],[-73.90761999999999,41.660521],[-73.907776,41.66051],[-73.907977,41.66047],[-73.90865100000001,41.660345],[-73.90906200000001,41.66027],[-73.909808,41.660118],[-73.910343,41.660015],[-73.910929,41.659897],[-73.91171300000001,41.659718],[-73.912719,41.659475],[-73.912952,41.659415],[-73.913391,41.659337],[-73.913714,41.659308],[-73.91390800000001,41.659298],[-73.914344,41.6593],[-73.91454,41.659322],[-73.91493800000001,41.659379],[-73.915395,41.659451],[-73.915583,41.659481],[-73.91663699999999,41.659649],[-73.917265,41.659755],[-73.917658,41.659819],[-73.917794,41.659842],[-73.91818000000001,41.659886],[-73.918492,41.659899],[-73.918727,41.659894],[-73.91892900000001,41.659884],[-73.91915,41.659857],[-73.919281,41.659834],[-73.919419,41.659805],[-73.919629,41.659765],[-73.92075,41.659486],[-73.920563,41.659878]]],"type":"Polygon"}
}