{
  "id": "360870132002",
  "type": "Feature",
  "properties": {
    "area_land":781356,
    "area_water":0,
    "geoid":"360870132002",
    "name":"Block Group 2",
    "state":"ny"
},
  "bbox": [
    -73.933639,
    41.076339,
    -73.920814,
    41.090496
],
  "geometry": {"coordinates":[[[-73.933381,41.090496],[-73.928892,41.089481],[-73.928448,41.089329],[-73.92786099999999,41.089267],[-73.927319,41.088443],[-73.927241,41.088325],[-73.926339,41.086859],[-73.92541900000001,41.085404],[-73.92512000000001,41.084917],[-73.92400499999999,41.083131],[-73.923467,41.082266],[-73.923373,41.082118],[-73.922594,41.080844],[-73.92238999999999,41.080473],[-73.92211399999999,41.079899],[-73.921977,41.0796],[-73.921935,41.07951],[-73.921924,41.079487],[-73.921846,41.079314],[-73.921515,41.078448],[-73.921389,41.078081],[-73.92081399999999,41.076339],[-73.921346,41.076449],[-73.92188899999999,41.076565],[-73.92188299999999,41.076591],[-73.922392,41.076707],[-73.922445,41.076715],[-73.922876,41.076812],[-73.923001,41.076841],[-73.923036,41.076849],[-73.92305,41.076852],[-73.92307,41.076856],[-73.923154,41.076875],[-73.92325,41.076895],[-73.92354400000001,41.076966],[-73.923642,41.07699],[-73.923714,41.077006],[-73.923709,41.077022],[-73.923602,41.077526],[-73.92355499999999,41.077911],[-73.926188,41.078511],[-73.926501,41.078586],[-73.926498,41.078599],[-73.92707,41.078734],[-73.929529,41.079313],[-73.93079299999999,41.079612],[-73.93118699999999,41.079704],[-73.931434,41.079762],[-73.93142,41.081223],[-73.93144599999999,41.081399],[-73.931468,41.083274],[-73.93140099999999,41.083587],[-73.93137400000001,41.084957],[-73.93152499999999,41.085275],[-73.93188000000001,41.086025],[-73.932259,41.086826],[-73.93232999999999,41.086976],[-73.93269600000001,41.0878],[-73.933121,41.088759],[-73.933639,41.089927],[-73.933381,41.090496]]],"type":"Polygon"}
}