{
  "id": "360610083002",
  "type": "Feature",
  "properties": {
    "area_land":45876,
    "area_water":0,
    "geoid":"360610083002",
    "name":"Block Group 2",
    "state":"ny"
},
  "bbox": [
    -74.005158,
    40.739753,
    -74.001555,
    40.742284
],
  "geometry": {"coordinates":[[[-74.005082,40.741336],[-74.00486100000001,40.741642],[-74.00441600000001,40.742284],[-74.001555,40.74108],[-74.002019,40.740444],[-74.002523,40.739753],[-74.00274400000001,40.739845],[-74.00506300000001,40.740818],[-74.00515799999999,40.740858],[-74.005082,40.741336]]],"type":"Polygon"}
}