{
  "id": "360290124002",
  "type": "Feature",
  "properties": {
    "area_land":1126054,
    "area_water":0,
    "geoid":"360290124002",
    "name":"Block Group 2",
    "state":"ny"
},
  "bbox": [
    -78.840291,
    42.804862,
    -78.823946,
    42.816809
],
  "geometry": {"coordinates":[[[-78.840076,42.805078],[-78.83961499999999,42.805247],[-78.839223,42.80544],[-78.838221,42.805765],[-78.837965,42.806116],[-78.83780400000001,42.806414],[-78.83766799999999,42.806694],[-78.837383,42.807371],[-78.83729700000001,42.80764],[-78.83717,42.808217],[-78.837131,42.808595],[-78.837091,42.809101],[-78.83707800000001,42.809848],[-78.837119,42.810149],[-78.837182,42.810456],[-78.83723000000001,42.810746],[-78.837385,42.811184],[-78.837408,42.811261],[-78.837521,42.811812],[-78.837733,42.812096],[-78.837712,42.812592],[-78.83771299999999,42.812812],[-78.83740899999999,42.812894],[-78.837057,42.813004],[-78.836838,42.813073],[-78.836153,42.813345],[-78.835926,42.813409],[-78.834906,42.813696],[-78.83471299999999,42.813733],[-78.83457799999999,42.813759],[-78.83449899999999,42.813774],[-78.834288,42.813815],[-78.834187,42.813835],[-78.833907,42.813969],[-78.833809,42.814044],[-78.833589,42.814215],[-78.833573,42.814673],[-78.833349,42.814869],[-78.833189,42.815009],[-78.83293399999999,42.815068],[-78.833011,42.815759],[-78.833029,42.815918],[-78.833099,42.8166],[-78.833089,42.816809],[-78.83254700000001,42.816803],[-78.83228200000001,42.8168],[-78.832263,42.816788],[-78.83063,42.816764],[-78.830321,42.816757],[-78.830004,42.816749],[-78.829071,42.816728],[-78.82813,42.816707],[-78.828174,42.815443],[-78.82819600000001,42.815069],[-78.828226,42.815069],[-78.828242,42.814676],[-78.828275,42.813893],[-78.82829099999999,42.813501],[-78.82829099999999,42.813105],[-78.828294,42.813048],[-78.828315,42.812518],[-78.828321,42.812365],[-78.82838,42.811457],[-78.82729399999999,42.811445],[-78.82621,42.811432],[-78.825136,42.811419],[-78.823955,42.811405],[-78.823955,42.81138],[-78.823954,42.811041],[-78.823953,42.810757],[-78.823953,42.810581],[-78.82395099999999,42.81039],[-78.82394600000001,42.809868],[-78.82394600000001,42.809184],[-78.82394600000001,42.808611],[-78.82394600000001,42.80828],[-78.823947,42.80795],[-78.823949,42.806999],[-78.82395,42.806339],[-78.823949,42.805737],[-78.823947,42.804928],[-78.828796,42.804862],[-78.8318,42.804951],[-78.832216,42.804962],[-78.83438,42.805052],[-78.835571,42.805059],[-78.83605799999999,42.80505],[-78.836546,42.805042],[-78.836602,42.805042],[-78.838446,42.805014],[-78.84029099999999,42.804987],[-78.840076,42.805078]]],"type":"Polygon"}
}