{
  "id": "360290145012",
  "type": "Feature",
  "properties": {
    "area_land":780244,
    "area_water":0,
    "geoid":"360290145012",
    "name":"Block Group 2",
    "state":"ny"
},
  "bbox": [
    -78.696925,
    42.911922,
    -78.690091,
    42.927847
],
  "geometry": {"coordinates":[[[-78.69692499999999,42.927847],[-78.69367200000001,42.927817],[-78.69334000000001,42.927814],[-78.692526,42.927807],[-78.692136,42.927804],[-78.691917,42.92696],[-78.691335,42.927193],[-78.691346,42.925709],[-78.69009800000001,42.925689],[-78.69009800000001,42.924947],[-78.690127,42.923018],[-78.69015899999999,42.921214],[-78.690155,42.920642],[-78.69016000000001,42.920451],[-78.690119,42.920023],[-78.690096,42.919709],[-78.69010299999999,42.919537],[-78.690105,42.919492],[-78.690091,42.919079],[-78.691554,42.918631],[-78.693178,42.918092],[-78.69273200000001,42.917065],[-78.69261899999999,42.916386],[-78.69264099999999,42.914632],[-78.692651,42.913879],[-78.692671,42.912578],[-78.69372799999999,42.912411],[-78.69478599999999,42.912245],[-78.695806,42.912084],[-78.695843,42.912078],[-78.696538,42.911967],[-78.696924,42.911922],[-78.696921,42.912817],[-78.696917,42.913734],[-78.696915,42.913869],[-78.696918,42.914703],[-78.696907,42.915165],[-78.69690300000001,42.915399],[-78.696898,42.915698],[-78.69689700000001,42.915912],[-78.69689200000001,42.916861],[-78.69689099999999,42.9172],[-78.69689,42.91735],[-78.696912,42.918604],[-78.69690900000001,42.919544],[-78.69690900000001,42.920297],[-78.69690900000001,42.921074],[-78.69690900000001,42.921378],[-78.696911,42.922412],[-78.69691400000001,42.923011],[-78.696912,42.923829],[-78.696912,42.924061],[-78.696921,42.924597],[-78.696917,42.925409],[-78.696915,42.92579],[-78.69691400000001,42.92622],[-78.696918,42.926833],[-78.696922,42.92738],[-78.69692499999999,42.927847]]],"type":"Polygon"}
}