{
  "id": "360650216011",
  "type": "Feature",
  "properties": {
    "area_land":1157969,
    "area_water":0,
    "geoid":"360650216011",
    "name":"Block Group 1",
    "state":"ny"
},
  "bbox": [
    -75.212388,
    43.111171,
    -75.193887,
    43.124065
],
  "geometry": {"coordinates":[[[-75.212272,43.114927],[-75.21207800000001,43.115073],[-75.211935,43.11518],[-75.21137299999999,43.115669],[-75.211259,43.115799],[-75.210854,43.116287],[-75.210714,43.116443],[-75.210528,43.116662],[-75.21046800000001,43.116747],[-75.209614,43.117801],[-75.20948,43.117953],[-75.20931400000001,43.118135],[-75.209126,43.118387],[-75.209047,43.118499],[-75.20560500000001,43.122738],[-75.204995,43.123491],[-75.204526,43.124065],[-75.202507,43.123369],[-75.201488,43.122998],[-75.201407,43.122969],[-75.20060700000001,43.122669],[-75.198498,43.122027],[-75.198307,43.121969],[-75.197316,43.121789],[-75.197204,43.121767],[-75.195609,43.121573],[-75.193887,43.120969],[-75.19417799999999,43.120614],[-75.19516,43.119397],[-75.19547900000001,43.118997],[-75.195587,43.118863],[-75.19573200000001,43.118715],[-75.195826,43.118666],[-75.196275,43.118541],[-75.196099,43.118129],[-75.19616499999999,43.1181],[-75.196269,43.118009],[-75.1979,43.116042],[-75.198448,43.115348],[-75.198666,43.115071],[-75.199417,43.114158],[-75.199511,43.11403],[-75.199669,43.113669],[-75.19978,43.113515],[-75.200069,43.113571],[-75.20016099999999,43.113314],[-75.20025099999999,43.11313],[-75.200602,43.112694],[-75.20061800000001,43.11265],[-75.200605,43.112573],[-75.20058400000001,43.112549],[-75.200461,43.112491],[-75.200818,43.111427],[-75.200858,43.111307],[-75.20090399999999,43.111171],[-75.20105100000001,43.111184],[-75.201156,43.111199],[-75.202698,43.111416],[-75.203591,43.111579],[-75.204134,43.111692],[-75.20501899999999,43.111909],[-75.205366,43.112003],[-75.20542500000001,43.112021],[-75.20636399999999,43.112309],[-75.206914,43.112494],[-75.20725899999999,43.11262],[-75.20797399999999,43.112884],[-75.20915599999999,43.113398],[-75.210876,43.114171],[-75.212157,43.114739],[-75.212388,43.11484],[-75.212272,43.114927]]],"type":"Polygon"}
}