{
  "id": "360470529002",
  "type": "Feature",
  "properties": {
    "area_land":63288,
    "area_water":0,
    "geoid":"360470529002",
    "name":"Block Group 2",
    "state":"ny"
},
  "bbox": [
    -73.956337,
    40.704312,
    -73.951086,
    40.70692
],
  "geometry": {"coordinates":[[[-73.956337,40.705439],[-73.954424,40.706673],[-73.95412899999999,40.70692],[-73.953378,40.706857],[-73.952913,40.706701],[-73.95251500000001,40.706559],[-73.95229999999999,40.70649],[-73.95191,40.70636],[-73.951086,40.705913],[-73.95253200000001,40.704983],[-73.953163,40.705544],[-73.955074,40.704312],[-73.955704,40.704876],[-73.956337,40.705439]]],"type":"Polygon"}
}