{
  "id": "360610090006",
  "type": "Feature",
  "properties": {
    "area_land":17123,
    "area_water":0,
    "geoid":"360610090006",
    "name":"Block Group 6",
    "state":"ny"
},
  "bbox": [
    -73.972588,
    40.752379,
    -73.969886,
    40.753943
],
  "geometry": {"coordinates":[[[-73.97213600000001,40.753943],[-73.971239,40.753566],[-73.970663,40.753325],[-73.969886,40.752999],[-73.970341,40.752379],[-73.970733,40.752543],[-73.971683,40.75294],[-73.972588,40.753318],[-73.97213600000001,40.753943]]],"type":"Polygon"}
}