{
  "id": "360811347005",
  "type": "Feature",
  "properties": {
    "area_land":223644,
    "area_water":0,
    "geoid":"360811347005",
    "name":"Block Group 5",
    "state":"ny"
},
  "bbox": [
    -73.786713,
    40.735352,
    -73.780404,
    40.7419
],
  "geometry": {"coordinates":[[[-73.78671300000001,40.740911],[-73.78313199999999,40.7419],[-73.783089,40.741803],[-73.783062,40.741732],[-73.78300900000001,40.741595],[-73.78208100000001,40.741848],[-73.78188400000001,40.741427],[-73.782444,40.741222],[-73.782101,40.740407],[-73.782224,40.740085],[-73.781633,40.739045],[-73.780846,40.739217],[-73.780404,40.73831],[-73.781606,40.737979],[-73.781171,40.737105],[-73.780779,40.736284],[-73.780975,40.736229],[-73.781026,40.736194],[-73.781048,40.736149],[-73.781047,40.736117],[-73.781036,40.736089],[-73.78211400000001,40.7358],[-73.782647,40.735649],[-73.783119,40.735522],[-73.78374700000001,40.735352],[-73.78378499999999,40.735416],[-73.783868,40.7355],[-73.783997,40.735575],[-73.78409499999999,40.735607],[-73.784217,40.735625],[-73.784469,40.736173],[-73.785184,40.737682],[-73.785405,40.738146],[-73.78567,40.738738],[-73.785617,40.738785],[-73.785573,40.73884],[-73.785534,40.738917],[-73.785521,40.738966],[-73.785516,40.73904],[-73.78553100000001,40.739119],[-73.785549,40.739164],[-73.785606,40.739256],[-73.785657,40.739308],[-73.785719,40.739354],[-73.785838,40.739411],[-73.78590699999999,40.739431],[-73.786018,40.739448],[-73.786574,40.740611],[-73.786672,40.740823],[-73.78671300000001,40.740911]]],"type":"Polygon"}
}