{
  "id": "361059501001",
  "type": "Feature",
  "properties": {
    "area_land":101321013,
    "area_water":6211264,
    "geoid":"361059501001",
    "name":"Block Group 1",
    "state":"ny"
},
  "bbox": [
    -74.709773,
    41.816427,
    -74.572154,
    41.963676
],
  "geometry": {"coordinates":[[[-74.70804699999999,41.85183],[-74.706694,41.854666],[-74.706452,41.855174],[-74.69883799999999,41.871132],[-74.698364,41.872125],[-74.69673299999999,41.87566],[-74.690804,41.888099],[-74.685935,41.898441],[-74.682406,41.905703],[-74.679917,41.910918],[-74.67959,41.911587],[-74.67789,41.915243],[-74.677431,41.91619],[-74.675939,41.919662],[-74.67503499999999,41.921322],[-74.671328,41.929162],[-74.67007099999999,41.932],[-74.66959799999999,41.932817],[-74.657319,41.95885],[-74.655147,41.963514],[-74.65503200000001,41.963676],[-74.655,41.963662],[-74.644346,41.95925],[-74.63111000000001,41.953769],[-74.630647,41.953577],[-74.63006900000001,41.953356],[-74.629914,41.953297],[-74.629578,41.953172],[-74.62642,41.951841],[-74.62635899999999,41.951817],[-74.6246,41.951112],[-74.61696999999999,41.947766],[-74.612948,41.945982],[-74.603621,41.941811],[-74.60166099999999,41.940911],[-74.601167,41.940684],[-74.592412,41.936786],[-74.58473600000001,41.93337],[-74.57655699999999,41.92971],[-74.576561,41.929671],[-74.576582,41.929317],[-74.57661,41.929127],[-74.576837,41.928055],[-74.576937,41.927489],[-74.57697,41.926899],[-74.577032,41.926345],[-74.577127,41.925187],[-74.577342,41.923471],[-74.57736,41.923001],[-74.57734600000001,41.922819],[-74.577305,41.922502],[-74.577262,41.922356],[-74.577156,41.92209],[-74.577061,41.921919],[-74.576897,41.921678],[-74.576756,41.921519],[-74.576646,41.921405],[-74.576376,41.921168],[-74.576121,41.920968],[-74.575683,41.92068],[-74.575417,41.920567],[-74.5753,41.920542],[-74.575165,41.920531],[-74.574777,41.92057],[-74.574637,41.920578],[-74.57449800000001,41.920571],[-74.57431699999999,41.920523],[-74.57416600000001,41.920436],[-74.573932,41.92022],[-74.57273000000001,41.918957],[-74.57248,41.918673],[-74.57233600000001,41.918507],[-74.572154,41.918298],[-74.572463,41.918062],[-74.572689,41.917829],[-74.57283099999999,41.917632],[-74.57289,41.917519],[-74.572953,41.917364],[-74.572975,41.9173],[-74.57299500000001,41.917242],[-74.573032,41.917085],[-74.573053,41.916852],[-74.573049,41.916743],[-74.57304600000001,41.916675],[-74.57301699999999,41.916401],[-74.572828,41.915173],[-74.572689,41.914226],[-74.57265599999999,41.913898],[-74.57266,41.913745],[-74.572722,41.91332],[-74.572858,41.912828],[-74.573035,41.912252],[-74.57324,41.91168],[-74.573397,41.911269],[-74.57362000000001,41.910762],[-74.57384399999999,41.910316],[-74.574084,41.909878],[-74.57566799999999,41.907166],[-74.57588699999999,41.906812],[-74.57602900000001,41.906561],[-74.576505,41.905691],[-74.576752,41.905116],[-74.576836,41.904953],[-74.57694600000001,41.90479],[-74.577214,41.904471],[-74.57744700000001,41.904229],[-74.57786900000001,41.903763],[-74.578334,41.903196],[-74.578551,41.902906],[-74.578756,41.902604],[-74.578935,41.902312],[-74.579131,41.901955],[-74.57929300000001,41.901688],[-74.579463,41.901443],[-74.580679,41.899629],[-74.580946,41.899215],[-74.581034,41.899081],[-74.581298,41.898628],[-74.581382,41.898453],[-74.58157199999999,41.897983],[-74.581776,41.897546],[-74.58202799999999,41.897135],[-74.582256,41.896838],[-74.58270400000001,41.89635],[-74.583083,41.895924],[-74.583468,41.895444],[-74.58398,41.894729],[-74.584035,41.894655],[-74.58448300000001,41.894055],[-74.584706,41.893807],[-74.585041,41.89348],[-74.58557999999999,41.892997],[-74.585725,41.892867],[-74.585939,41.892685],[-74.586682,41.892029],[-74.58713299999999,41.891588],[-74.5877,41.891004],[-74.587836,41.890887],[-74.588076,41.890748],[-74.588397,41.890612],[-74.588859,41.890405],[-74.589004,41.890315],[-74.58913699999999,41.890199],[-74.589229,41.890101],[-74.589327,41.889972],[-74.590007,41.88895],[-74.590127,41.888715],[-74.590543,41.887624],[-74.59059499999999,41.887494],[-74.590649,41.887361],[-74.590812,41.8869],[-74.59085399999999,41.886745],[-74.59088199999999,41.886643],[-74.59092699999999,41.886447],[-74.59115,41.88529],[-74.59132099999999,41.88452],[-74.591448,41.88407],[-74.591579,41.883752],[-74.591674,41.883584],[-74.59180499999999,41.883384],[-74.592573,41.88245],[-74.592972,41.881985],[-74.593497,41.881329],[-74.593694,41.88102],[-74.593771,41.880852],[-74.59386000000001,41.880623],[-74.593873,41.880572],[-74.59393300000001,41.880342],[-74.593992,41.879912],[-74.59402900000001,41.879433],[-74.594059,41.879056],[-74.59405700000001,41.878903],[-74.59401699999999,41.878589],[-74.593981,41.878455],[-74.59387099999999,41.878153],[-74.593718,41.877843],[-74.592814,41.876368],[-74.592602,41.876074],[-74.592398,41.875836],[-74.592198,41.875632],[-74.59154100000001,41.875051],[-74.59138799999999,41.874923],[-74.591224,41.874769],[-74.591024,41.874562],[-74.590863,41.874358],[-74.59077600000001,41.874219],[-74.590637,41.873924],[-74.5902,41.872766],[-74.589952,41.872168],[-74.58968900000001,41.871676],[-74.589412,41.871221],[-74.588993,41.870485],[-74.588825,41.870143],[-74.588504,41.869374],[-74.587906,41.867862],[-74.58772,41.867447],[-74.587414,41.866853],[-74.58609800000001,41.864507],[-74.585894,41.864193],[-74.58522600000001,41.863446],[-74.58514599999999,41.863341],[-74.584986,41.863086],[-74.584906,41.862925],[-74.584833,41.862732],[-74.584731,41.862343],[-74.584636,41.861803],[-74.584592,41.861614],[-74.584501,41.861341],[-74.58432999999999,41.860995],[-74.584217,41.860816],[-74.584126,41.860692],[-74.583918,41.860448],[-74.583462,41.860062],[-74.582656,41.85949],[-74.581563,41.858673],[-74.58161200000001,41.858459],[-74.581914,41.85832],[-74.582632,41.857929],[-74.583163,41.857668],[-74.583451,41.85756],[-74.58676800000001,41.856548],[-74.58722299999999,41.85642],[-74.587591,41.856334],[-74.58792099999999,41.856279],[-74.58937,41.856102],[-74.59087599999999,41.85594],[-74.59127700000001,41.85589],[-74.591995,41.855853],[-74.592448,41.855882],[-74.59279100000001,41.855933],[-74.593552,41.856099],[-74.59379800000001,41.856134],[-74.59418700000001,41.856165],[-74.594543,41.856169],[-74.594713,41.856157],[-74.59554,41.856076],[-74.59594800000001,41.856022],[-74.596476,41.855959],[-74.597454,41.855851],[-74.598136,41.855805],[-74.59955100000001,41.855733],[-74.599992,41.855694],[-74.600481,41.855623],[-74.600784,41.855562],[-74.601479,41.855403],[-74.60180699999999,41.855314],[-74.602208,41.855185],[-74.60392,41.854515],[-74.604176,41.854404],[-74.60441,41.8543],[-74.605028,41.854015],[-74.605661,41.853711],[-74.60753,41.852705],[-74.60809999999999,41.852409],[-74.60914099999999,41.851788],[-74.609673,41.851449],[-74.60999099999999,41.851307],[-74.61011999999999,41.851254],[-74.61024399999999,41.851186],[-74.610353,41.851125],[-74.610713,41.850946],[-74.612387,41.850045],[-74.612841,41.849834],[-74.615061,41.848889],[-74.61775900000001,41.847795],[-74.61857500000001,41.84745],[-74.61905299999999,41.84723],[-74.620667,41.846527],[-74.621382,41.846236],[-74.622873,41.845647],[-74.625055,41.844816],[-74.626448,41.844277],[-74.627111,41.84401],[-74.627369,41.843889],[-74.62786800000001,41.843696],[-74.628086,41.843608],[-74.63059800000001,41.8426],[-74.632358,41.841893],[-74.633036,41.84161],[-74.633262,41.841514],[-74.63380600000001,41.841225],[-74.634117,41.841031],[-74.634546,41.840712],[-74.634856,41.840441],[-74.63508899999999,41.840202],[-74.63531500000001,41.83994],[-74.635616,41.839511],[-74.637018,41.837069],[-74.637151,41.836794],[-74.637263,41.836527],[-74.63736900000001,41.836183],[-74.63743700000001,41.835879],[-74.637485,41.835521],[-74.637502,41.835362],[-74.63750899999999,41.834899],[-74.637468,41.834514],[-74.637368,41.83403],[-74.637154,41.833341],[-74.63698100000001,41.832836],[-74.636318,41.831009],[-74.63619300000001,41.83064],[-74.636104,41.830325],[-74.636042,41.83005],[-74.636003,41.829807],[-74.635957,41.829272],[-74.63589899999999,41.828587],[-74.635859,41.827838],[-74.635869,41.827532],[-74.635904,41.82731],[-74.635989,41.826949],[-74.63604599999999,41.826772],[-74.636127,41.826587],[-74.636258,41.82633],[-74.63637199999999,41.826139],[-74.63651,41.825935],[-74.636675,41.825725],[-74.636831,41.825548],[-74.637084,41.825306],[-74.637225,41.825188],[-74.637603,41.824907],[-74.63791999999999,41.824709],[-74.638302,41.824488],[-74.639562,41.823719],[-74.641606,41.822503],[-74.64369000000001,41.821255],[-74.645062,41.820452],[-74.645359,41.820311],[-74.64565399999999,41.820208],[-74.645815,41.820161],[-74.646095,41.820098],[-74.646435,41.820051],[-74.646883,41.820037],[-74.647384,41.820063],[-74.647385,41.819858],[-74.647352,41.819731],[-74.647206,41.819512],[-74.647082,41.819374],[-74.64694,41.819239],[-74.646542,41.818937],[-74.64636400000001,41.818826],[-74.646451,41.818662],[-74.64662300000001,41.81813],[-74.646816,41.817598],[-74.647122,41.816848],[-74.647338,41.816427],[-74.662644,41.820811],[-74.66288900000001,41.820827],[-74.663735,41.820898],[-74.664016,41.820929],[-74.664844,41.82107],[-74.665155,41.821136],[-74.681843,41.823242],[-74.683133,41.823372],[-74.683685,41.823429],[-74.685002,41.823711],[-74.6889,41.824258],[-74.685542,41.831814],[-74.68159,41.840608],[-74.684394,41.841394],[-74.68778399999999,41.842299],[-74.70525000000001,41.847114],[-74.709773,41.848377],[-74.70804699999999,41.85183]]],"type":"Polygon"}
}