{
  "id": "360595213011",
  "type": "Feature",
  "properties": {
    "area_land":419692,
    "area_water":0,
    "geoid":"360595213011",
    "name":"Block Group 1",
    "state":"ny"
},
  "bbox": [
    -73.482369,
    40.666794,
    -73.474298,
    40.676629
],
  "geometry": {"coordinates":[[[-73.482072,40.669644],[-73.482169,40.6709],[-73.481921,40.671544],[-73.481669,40.6722],[-73.482167,40.673201],[-73.48236900000001,40.6736],[-73.481971,40.674925],[-73.48198499999999,40.675121],[-73.481996,40.675279],[-73.482068,40.676099],[-73.481358,40.676141],[-73.480515,40.676207],[-73.47784,40.676395],[-73.474538,40.676629],[-73.47453299999999,40.676566],[-73.47456200000001,40.676237],[-73.474602,40.675899],[-73.474616,40.675742],[-73.474597,40.675398],[-73.474526,40.674571],[-73.47444900000001,40.673875],[-73.47436999999999,40.673165],[-73.474321,40.672772],[-73.474317,40.672708],[-73.474298,40.672447],[-73.474335,40.672276],[-73.474481,40.671731],[-73.474672,40.671024],[-73.477997,40.671076],[-73.480733,40.67112],[-73.480754,40.670419],[-73.480774,40.66974],[-73.480789,40.669049],[-73.480808,40.668327],[-73.480829,40.667603],[-73.480825,40.66682],[-73.481618,40.666827],[-73.48207600000001,40.666794],[-73.48106900000001,40.667601],[-73.48236900000001,40.6689],[-73.482072,40.669644]]],"type":"Polygon"}
}