{
  "id": "360630234052",
  "type": "Feature",
  "properties": {
    "area_land":1447754,
    "area_water":0,
    "geoid":"360630234052",
    "name":"Block Group 2",
    "state":"ny"
},
  "bbox": [
    -78.696868,
    43.111339,
    -78.679856,
    43.12457
],
  "geometry": {"coordinates":[[[-78.696867,43.114393],[-78.696865,43.115396],[-78.696865,43.115731],[-78.69686400000001,43.115847],[-78.69686400000001,43.116199],[-78.69686400000001,43.116316],[-78.69686299999999,43.116725],[-78.69686299999999,43.11731],[-78.69686400000001,43.120292],[-78.696865,43.121172],[-78.69585499999999,43.121149],[-78.695728,43.121142],[-78.69549000000001,43.121105],[-78.69538799999999,43.121124],[-78.69524699999999,43.121035],[-78.69510699999999,43.121014],[-78.694768,43.121003],[-78.69417799999999,43.120986],[-78.69370000000001,43.120904],[-78.69346400000001,43.120884],[-78.69333399999999,43.12088],[-78.693262,43.120878],[-78.692993,43.120898],[-78.69285499999999,43.120898],[-78.692615,43.120896],[-78.692211,43.120853],[-78.692055,43.120837],[-78.69132399999999,43.120709],[-78.690901,43.120607],[-78.69067800000001,43.120544],[-78.690466,43.120473],[-78.690327,43.120418],[-78.689992,43.120285],[-78.68973099999999,43.120171],[-78.689607,43.120122],[-78.68947799999999,43.120089],[-78.689374,43.120063],[-78.689094,43.120033],[-78.688835,43.120045],[-78.688687,43.120064],[-78.688654,43.120069],[-78.688562,43.120092],[-78.688433,43.120138],[-78.68816,43.120232],[-78.688129,43.12024],[-78.68770600000001,43.120352],[-78.68719,43.120445],[-78.68687199999999,43.120484],[-78.686702,43.120493],[-78.686301,43.120515],[-78.686193,43.120517],[-78.686024,43.120521],[-78.686021,43.120794],[-78.686016,43.121615],[-78.686014,43.121889],[-78.686007,43.12243],[-78.68599399999999,43.12367],[-78.68595000000001,43.123931],[-78.685909,43.124044],[-78.685819,43.124295],[-78.68568999999999,43.124538],[-78.68552699999999,43.124504],[-78.685433,43.124485],[-78.68516099999999,43.124446],[-78.685036,43.124439],[-78.684871,43.124431],[-78.684675,43.124441],[-78.684442,43.124454],[-78.684095,43.124528],[-78.683989,43.124552],[-78.683903,43.124562],[-78.683729,43.124566],[-78.683615,43.12457],[-78.68345100000001,43.12456],[-78.68324699999999,43.124521],[-78.68321400000001,43.12451],[-78.68304999999999,43.124457],[-78.682907,43.124389],[-78.682852,43.124363],[-78.68249,43.124165],[-78.68235199999999,43.12409],[-78.68221200000001,43.124016],[-78.681792,43.123796],[-78.681653,43.123723],[-78.681517,43.123653],[-78.68135700000001,43.123571],[-78.681107,43.123452],[-78.68096300000001,43.123403],[-78.680846,43.123373],[-78.680745,43.12336],[-78.680634,43.123346],[-78.68007799999999,43.123327],[-78.679856,43.12332],[-78.679879,43.12286],[-78.679947,43.121483],[-78.67997099999999,43.121024],[-78.67998900000001,43.120632],[-78.680001,43.120383],[-78.68001099999999,43.120151],[-78.680043,43.119782],[-78.680105,43.11859],[-78.68011,43.118462],[-78.680138,43.117822],[-78.680161,43.117277],[-78.680227,43.116072],[-78.680244,43.115782],[-78.68035,43.113912],[-78.680446,43.111994],[-78.680486,43.111339],[-78.680941,43.111356],[-78.682281,43.111431],[-78.68335399999999,43.111487],[-78.683741,43.111508],[-78.68513799999999,43.111582],[-78.685687,43.11161],[-78.687031,43.11168],[-78.687333,43.111706],[-78.68746400000001,43.111718],[-78.687876,43.111794],[-78.68814,43.111853],[-78.688332,43.111902],[-78.689696,43.11225],[-78.690151,43.112366],[-78.690354,43.112417],[-78.690963,43.112572],[-78.691166,43.112624],[-78.691575,43.112728],[-78.69280500000001,43.113042],[-78.69313099999999,43.113126],[-78.693215,43.113148],[-78.693521,43.113227],[-78.694442,43.113465],[-78.694655,43.11352],[-78.69475,43.113544],[-78.695172,43.11365],[-78.69644099999999,43.113971],[-78.696613,43.114015],[-78.69686799999999,43.114059],[-78.696867,43.114393]]],"type":"Polygon"}
}