{
  "id": "360595209001",
  "type": "Feature",
  "properties": {
    "area_land":345862,
    "area_water":0,
    "geoid":"360595209001",
    "name":"Block Group 1",
    "state":"ny"
},
  "bbox": [
    -73.484376,
    40.699419,
    -73.470388,
    40.705847
],
  "geometry": {"coordinates":[[[-73.484376,40.702219],[-73.48422100000001,40.702523],[-73.484225,40.702563],[-73.484245,40.702766],[-73.48398899999999,40.702822],[-73.483343,40.702932],[-73.483137,40.702958],[-73.482688,40.703026],[-73.482472,40.703062],[-73.482097,40.703107],[-73.481173,40.703249],[-73.479651,40.703531],[-73.47913699999999,40.703653],[-73.478218,40.703856],[-73.477217,40.704123],[-73.47693099999999,40.704199],[-73.476179,40.70442],[-73.47571600000001,40.704566],[-73.47434199999999,40.705032],[-73.47372,40.705221],[-73.47293999999999,40.705424],[-73.47251900000001,40.705516],[-73.471913,40.705639],[-73.471289,40.705737],[-73.471206,40.705751],[-73.470527,40.705835],[-73.470388,40.705847],[-73.4704,40.705617],[-73.470427,40.705104],[-73.47049199999999,40.704714],[-73.472421,40.704703],[-73.472469,40.704702],[-73.47256299999999,40.704717],[-73.472595,40.70473],[-73.472746,40.704835],[-73.472821,40.704874],[-73.472882,40.704894],[-73.47295099999999,40.704902],[-73.473052,40.7049],[-73.473153,40.704879],[-73.47348599999999,40.704768],[-73.474356,40.704494],[-73.474009,40.703875],[-73.47384099999999,40.70366],[-73.47372300000001,40.703479],[-73.473624,40.703297],[-73.473539,40.703088],[-73.473479,40.702879],[-73.473438,40.702637],[-73.473418,40.702363],[-73.473401,40.702286],[-73.473316,40.702077],[-73.473141,40.70185],[-73.473637,40.701611],[-73.47380699999999,40.701527],[-73.47393700000001,40.701471],[-73.47402099999999,40.701421],[-73.474108,40.701378],[-73.47421199999999,40.70134],[-73.4744,40.701308],[-73.475081,40.701256],[-73.475977,40.701181],[-73.476924,40.701105],[-73.47712900000001,40.701084],[-73.477287,40.701085],[-73.477467,40.70111],[-73.477512,40.701137],[-73.477693,40.700897],[-73.477726,40.700812],[-73.477726,40.70072],[-73.47768000000001,40.700382],[-73.477761,40.700381],[-73.477844,40.700365],[-73.479862,40.700206],[-73.480414,40.700163],[-73.48076,40.700131],[-73.48126600000001,40.700062],[-73.481807,40.700023],[-73.482045,40.700003],[-73.482671,40.699961],[-73.482738,40.699956],[-73.48293700000001,40.699924],[-73.483085,40.699875],[-73.483208,40.699813],[-73.483324,40.699734],[-73.483446,40.699597],[-73.483626,40.699431],[-73.483644,40.699419],[-73.483728,40.699738],[-73.48383,40.700414],[-73.483895,40.700754],[-73.483966,40.701249],[-73.48402,40.701532],[-73.484044,40.701653],[-73.484073,40.701793],[-73.484078,40.701846],[-73.484324,40.702061],[-73.484376,40.702219]]],"type":"Polygon"}
}