{
  "id": "360610012002",
  "type": "Feature",
  "properties": {
    "area_land":36855,
    "area_water":0,
    "geoid":"360610012002",
    "name":"Block Group 2",
    "state":"ny"
},
  "bbox": [
    -73.983338,
    40.714461,
    -73.980577,
    40.716976
],
  "geometry": {"coordinates":[[[-73.983338,40.714933],[-73.98285,40.715882],[-73.98255399999999,40.71645],[-73.982495,40.716561],[-73.982463,40.716622],[-73.982393,40.716759],[-73.982364,40.716818],[-73.98228899999999,40.716976],[-73.981438,40.716718],[-73.980577,40.716455],[-73.98067,40.716304],[-73.980699,40.716257],[-73.98073599999999,40.716199],[-73.980745,40.716184],[-73.980778,40.716116],[-73.98081000000001,40.716055],[-73.980879,40.715924],[-73.98117000000001,40.715378],[-73.98165,40.714461],[-73.982342,40.714658],[-73.98245300000001,40.714699],[-73.983,40.714835],[-73.983338,40.714933]]],"type":"Polygon"}
}