{
  "id": "360930331024",
  "type": "Feature",
  "properties": {
    "area_land":16986157,
    "area_water":280554,
    "geoid":"360930331024",
    "name":"Block Group 4",
    "state":"ny"
},
  "bbox": [
    -74.188024,
    42.71936,
    -74.103814,
    42.78437
],
  "geometry": {"coordinates":[[[-74.18801499999999,42.746458],[-74.188011,42.746515],[-74.187985,42.74667],[-74.18794,42.746821],[-74.18786900000001,42.746995],[-74.187839,42.747048],[-74.187798,42.747122],[-74.18767699999999,42.747311],[-74.187433,42.747584],[-74.187387,42.747634],[-74.187228,42.747805],[-74.187162,42.747861],[-74.18643299999999,42.748478],[-74.18515600000001,42.749538],[-74.184455,42.75012],[-74.183589,42.750973],[-74.183409,42.751322],[-74.1833,42.751748],[-74.183277,42.752133],[-74.183256,42.752498],[-74.183204,42.753141],[-74.18321299999999,42.753202],[-74.18314700000001,42.753485],[-74.182907,42.754207],[-74.18290399999999,42.754302],[-74.18229599999999,42.755909],[-74.182221,42.756157],[-74.181957,42.757034],[-74.181814,42.757688],[-74.181783,42.759349],[-74.181862,42.760169],[-74.182067,42.760949],[-74.18247100000001,42.762061],[-74.18262799999999,42.762429],[-74.183328,42.764273],[-74.184341,42.76694],[-74.18452000000001,42.767568],[-74.18204799999999,42.768041],[-74.17852999999999,42.768553],[-74.174527,42.769136],[-74.172439,42.769476],[-74.172196,42.769506],[-74.17130400000001,42.769564],[-74.170311,42.769578],[-74.165334,42.769346],[-74.16015400000001,42.769106],[-74.156744,42.768763],[-74.15553800000001,42.76857],[-74.155522,42.768849],[-74.15547599999999,42.769892],[-74.155518,42.770465],[-74.155833,42.773419],[-74.15602800000001,42.775237],[-74.154484,42.775372],[-74.15237999999999,42.775555],[-74.150246,42.775741],[-74.14824900000001,42.776185],[-74.14764099999999,42.776344],[-74.147402,42.776424],[-74.147141,42.776599],[-74.146945,42.776775],[-74.14664,42.77719],[-74.146591,42.777291],[-74.14629100000001,42.777908],[-74.146248,42.777972],[-74.146074,42.778068],[-74.145053,42.778322],[-74.143765,42.77858],[-74.143642,42.778608],[-74.143209,42.778817],[-74.14219,42.779494],[-74.140694,42.780315],[-74.139545,42.780896],[-74.13891599999999,42.781138],[-74.138373,42.781284],[-74.13556800000001,42.781614],[-74.13522,42.781711],[-74.134946,42.781796],[-74.134552,42.781952],[-74.13418299999999,42.782087],[-74.13385700000001,42.782151],[-74.13356400000001,42.782174],[-74.13282599999999,42.782181],[-74.132381,42.782212],[-74.13205600000001,42.782259],[-74.130709,42.782585],[-74.129863,42.782751],[-74.12917899999999,42.782838],[-74.128365,42.782908],[-74.12755199999999,42.782899],[-74.127216,42.782866],[-74.127042,42.782842],[-74.12694399999999,42.782842],[-74.126814,42.782849],[-74.126721,42.78288],[-74.12661900000001,42.782913],[-74.12639,42.783014],[-74.126043,42.783168],[-74.125837,42.783231],[-74.125525,42.783251],[-74.12423,42.783344],[-74.124135,42.783352],[-74.123254,42.783422],[-74.12139500000001,42.783598],[-74.120932,42.783649],[-74.119317,42.7838],[-74.117963,42.78395],[-74.11737100000001,42.783995],[-74.11297,42.784357],[-74.112595,42.78437],[-74.112172,42.78434],[-74.111755,42.784293],[-74.111468,42.784235],[-74.110793,42.78402],[-74.11059899999999,42.783853],[-74.110305,42.783272],[-74.109977,42.783053],[-74.109703,42.782994],[-74.109298,42.783013],[-74.108008,42.783056],[-74.107895,42.783063],[-74.10634899999999,42.783158],[-74.106289,42.783154],[-74.106278,42.783093],[-74.10597,42.781316],[-74.105902,42.780928],[-74.10588,42.780801],[-74.10563999999999,42.779445],[-74.10544,42.778311],[-74.10542700000001,42.778235],[-74.105093,42.776347],[-74.10426099999999,42.771634],[-74.104196,42.771263],[-74.103814,42.769104],[-74.104232,42.768932],[-74.106385,42.768031],[-74.10646,42.767996],[-74.108811,42.766924],[-74.108925,42.766882],[-74.110364,42.766154],[-74.112326,42.765387],[-74.11253499999999,42.765295],[-74.112662,42.765239],[-74.115225,42.764439],[-74.11548000000001,42.764355],[-74.118106,42.763758],[-74.11976900000001,42.763612],[-74.120862,42.763628],[-74.12092199999999,42.763584],[-74.12103500000001,42.763628],[-74.121685,42.763645],[-74.12308,42.763567],[-74.12453600000001,42.763446],[-74.12563400000001,42.763275],[-74.125696,42.763268],[-74.12587499999999,42.763248],[-74.127022,42.763038],[-74.128651,42.762673],[-74.129953,42.762363],[-74.133905,42.761475],[-74.134443,42.761389],[-74.135049,42.761245],[-74.138937,42.760214],[-74.139055,42.760173],[-74.139557,42.759997],[-74.13995199999999,42.75978],[-74.14031900000001,42.75947],[-74.140458,42.759298],[-74.14063,42.759086],[-74.14091999999999,42.758643],[-74.14142099999999,42.757556],[-74.141699,42.756914],[-74.142121,42.756432],[-74.142584,42.755992],[-74.14318799999999,42.755587],[-74.143748,42.755286],[-74.144406,42.755007],[-74.144976,42.754862],[-74.145999,42.754658],[-74.146326,42.754573],[-74.15239,42.753298],[-74.156436,42.752461],[-74.159055,42.751841],[-74.15955700000001,42.751703],[-74.160028,42.751507],[-74.16048000000001,42.751304],[-74.160749,42.751141],[-74.161389,42.750677],[-74.161485,42.750619],[-74.161884,42.750329],[-74.162143,42.750136],[-74.162262,42.750045],[-74.163235,42.749321],[-74.164052,42.748705],[-74.166212,42.747153],[-74.166298,42.747085],[-74.167018,42.746711],[-74.16771199999999,42.7464],[-74.16815200000001,42.746229],[-74.168374,42.746164],[-74.168784,42.746044],[-74.168812,42.746035],[-74.168858,42.746021],[-74.16962700000001,42.745904],[-74.17045899999999,42.745717],[-74.17113000000001,42.745421],[-74.171195,42.745372],[-74.171944,42.744888],[-74.17465799999999,42.742999],[-74.175155,42.742694],[-74.175568,42.742362],[-74.17443299999999,42.742214],[-74.17281699999999,42.74193],[-74.172562,42.741867],[-74.172406,42.741783],[-74.172349,42.741699],[-74.171925,42.739417],[-74.171871,42.739061],[-74.171751,42.738035],[-74.171626,42.737817],[-74.171516,42.737655],[-74.17139,42.737564],[-74.17118600000001,42.737391],[-74.170889,42.737208],[-74.17068500000001,42.737059],[-74.17046499999999,42.736886],[-74.17032399999999,42.736691],[-74.168781,42.733109],[-74.168655,42.732786],[-74.16860800000001,42.732532],[-74.168575,42.732268],[-74.16858999999999,42.732003],[-74.168808,42.73145],[-74.180274,42.729979],[-74.181708,42.723637],[-74.182678,42.71936],[-74.18306800000001,42.719952],[-74.18356300000001,42.720722],[-74.183894,42.721148],[-74.183942,42.72121],[-74.18435599999999,42.721684],[-74.18443499999999,42.722465],[-74.18461000000001,42.723777],[-74.184881,42.724652],[-74.184916,42.724845],[-74.18490799999999,42.725009],[-74.184881,42.725555],[-74.184866,42.725851],[-74.18483999999999,42.726576],[-74.184839,42.726891],[-74.18488499999999,42.727495],[-74.185001,42.727929],[-74.18505999999999,42.728148],[-74.185305,42.729817],[-74.18532999999999,42.730152],[-74.18543200000001,42.730942],[-74.185491,42.731274],[-74.185734,42.733133],[-74.18582000000001,42.733898],[-74.18593199999999,42.734894],[-74.185982,42.735512],[-74.186037,42.735993],[-74.186121,42.736296],[-74.18622000000001,42.736557],[-74.18639,42.736861],[-74.186402,42.736878],[-74.18682800000001,42.737499],[-74.18728,42.738201],[-74.187336,42.738462],[-74.187364,42.738671],[-74.187307,42.738995],[-74.187192,42.739706],[-74.187198,42.740567],[-74.187202,42.741296],[-74.187332,42.742227],[-74.18763300000001,42.743583],[-74.187687,42.743832],[-74.187709,42.743934],[-74.187794,42.744327],[-74.187961,42.7451],[-74.187999,42.745818],[-74.188024,42.746303],[-74.18801499999999,42.746458]]],"type":"Polygon"}
}