{
  "id": "360594097001",
  "type": "Feature",
  "properties": {
    "area_land":374609,
    "area_water":0,
    "geoid":"360594097001",
    "name":"Block Group 1",
    "state":"ny"
},
  "bbox": [
    -73.520191,
    40.692135,
    -73.506369,
    40.700017
],
  "geometry": {"coordinates":[[[-73.52013700000001,40.69807],[-73.520138,40.698427],[-73.520138,40.698616],[-73.52014,40.698804],[-73.51859399999999,40.698592],[-73.518469,40.69857],[-73.51837999999999,40.698555],[-73.518056,40.698518],[-73.51768800000001,40.698491],[-73.517501,40.698466],[-73.517083,40.69847],[-73.51637599999999,40.698494],[-73.51537999999999,40.698553],[-73.51497500000001,40.698612],[-73.51471600000001,40.698622],[-73.51358999999999,40.698735],[-73.51016799999999,40.699118],[-73.509821,40.699177],[-73.509619,40.699223],[-73.508731,40.699447],[-73.508275,40.699536],[-73.50748,40.699735],[-73.50660999999999,40.69995],[-73.506518,40.699972],[-73.50636900000001,40.700017],[-73.50645400000001,40.699705],[-73.506507,40.699515],[-73.50654400000001,40.699391],[-73.506687,40.698793],[-73.50670100000001,40.698732],[-73.506828,40.698199],[-73.506906,40.697886],[-73.507727,40.697983],[-73.50849100000001,40.697953],[-73.508736,40.698028],[-73.508993,40.698234],[-73.509446,40.698597],[-73.50966200000001,40.698661],[-73.509878,40.698665],[-73.510513,40.698596],[-73.511034,40.698442],[-73.51411400000001,40.698096],[-73.515004,40.697996],[-73.514342,40.694532],[-73.51525100000001,40.694413],[-73.515112,40.693846],[-73.51528999999999,40.693493],[-73.515468,40.693099],[-73.514983,40.693013],[-73.513693,40.693219],[-73.513572,40.692747],[-73.516268,40.692355],[-73.516481,40.692325],[-73.516794,40.692297],[-73.517526,40.692227],[-73.51825700000001,40.692156],[-73.518728,40.692135],[-73.51933699999999,40.692833],[-73.51957899999999,40.693238],[-73.51978800000001,40.693733],[-73.52003999999999,40.694793],[-73.520191,40.696298],[-73.52013700000001,40.69807]]],"type":"Polygon"}
}