{
  "id": "360390811022",
  "type": "Feature",
  "properties": {
    "area_land":14202215,
    "area_water":47972,
    "geoid":"360390811022",
    "name":"Block Group 2",
    "state":"ny"
},
  "bbox": [
    -73.937424,
    42.213245,
    -73.882531,
    42.259875
],
  "geometry": {"coordinates":[[[-73.93742399999999,42.223681],[-73.93647900000001,42.225377],[-73.93056799999999,42.236214],[-73.927814,42.241096],[-73.922532,42.250595],[-73.922268,42.251078],[-73.921592,42.25233],[-73.919949,42.252961],[-73.915691,42.254618],[-73.91426800000001,42.255156],[-73.914001,42.25527],[-73.911101,42.256387],[-73.90918499999999,42.256429],[-73.906747,42.256211],[-73.906209,42.256366],[-73.905751,42.256989],[-73.905137,42.258305],[-73.904265,42.259029],[-73.90415299999999,42.259257],[-73.90384899999999,42.259875],[-73.902845,42.259643],[-73.901404,42.259325],[-73.894571,42.257998],[-73.894515,42.257979],[-73.89389799999999,42.257649],[-73.88866400000001,42.254912],[-73.885356,42.253181],[-73.88434700000001,42.252653],[-73.884147,42.252549],[-73.883572,42.252248],[-73.88350199999999,42.252211],[-73.882741,42.251813],[-73.882531,42.251703],[-73.883321,42.250935],[-73.883822,42.250506],[-73.88402600000001,42.250337],[-73.884101,42.250289],[-73.884146,42.250256],[-73.884715,42.24976],[-73.886427,42.248395],[-73.887173,42.247791],[-73.887317,42.247672],[-73.88759400000001,42.247445],[-73.888805,42.246493],[-73.88962100000001,42.245829],[-73.88989599999999,42.245607],[-73.890457,42.245154],[-73.891334,42.244444],[-73.891352,42.244429],[-73.891391,42.244398],[-73.891451,42.244353],[-73.89148,42.24433],[-73.89161199999999,42.244228],[-73.892112,42.243799],[-73.892252,42.243641],[-73.892392,42.243482],[-73.892565,42.243326],[-73.89279999999999,42.243138],[-73.89279000000001,42.242958],[-73.89279500000001,42.242521],[-73.89281800000001,42.24233],[-73.89289599999999,42.242058],[-73.892989,42.241898],[-73.893136,42.241714],[-73.893293,42.241444],[-73.893371,42.241257],[-73.89340300000001,42.241038],[-73.893445,42.240182],[-73.89342600000001,42.240094],[-73.89338499999999,42.240015],[-73.893293,42.239927],[-73.893113,42.239817],[-73.89279000000001,42.239695],[-73.892376,42.239606],[-73.89197900000001,42.239497],[-73.891638,42.239384],[-73.891329,42.239255],[-73.89103,42.239094],[-73.890818,42.238917],[-73.890703,42.238716],[-73.890592,42.238467],[-73.890472,42.238279],[-73.89032899999999,42.23817],[-73.89007599999999,42.23803],[-73.889832,42.23785],[-73.889551,42.237601],[-73.889343,42.237341],[-73.8892,42.237123],[-73.889094,42.236843],[-73.889025,42.236605],[-73.888998,42.236318],[-73.889011,42.235721],[-73.889053,42.235401],[-73.889122,42.235067],[-73.889251,42.234756],[-73.889394,42.234558],[-73.88961,42.234337],[-73.889993,42.23406],[-73.890505,42.233815],[-73.89121,42.233498],[-73.891458,42.233279],[-73.89157400000001,42.233126],[-73.89165199999999,42.232844],[-73.891702,42.232604],[-73.891902,42.232045],[-73.89196200000001,42.231815],[-73.891992,42.231565],[-73.891982,42.231335],[-73.891912,42.231155],[-73.891842,42.231025],[-73.891682,42.230835],[-73.891171,42.230415],[-73.890991,42.230225],[-73.890781,42.229925],[-73.890641,42.229665],[-73.89052599999999,42.229346],[-73.890137,42.228523],[-73.889865,42.227862],[-73.889729,42.227346],[-73.889608,42.226787],[-73.889528,42.225938],[-73.889518,42.225628],[-73.889548,42.225148],[-73.889618,42.224838],[-73.889708,42.224618],[-73.88991,42.224351],[-73.89031,42.223931],[-73.89060000000001,42.223571],[-73.89068,42.223441],[-73.89077,42.223081],[-73.89078000000001,42.222941],[-73.89069000000001,42.222631],[-73.89057,42.222441],[-73.89041,42.222281],[-73.89021,42.222171],[-73.88997000000001,42.222081],[-73.88955900000001,42.221942],[-73.889259,42.221872],[-73.889149,42.221859],[-73.889118,42.221735],[-73.889115,42.221683],[-73.889141,42.221469],[-73.88967100000001,42.221444],[-73.889978,42.221408],[-73.890377,42.221344],[-73.890711,42.221273],[-73.891082,42.221159],[-73.891409,42.221045],[-73.892022,42.22086],[-73.892641,42.22064],[-73.892848,42.220505],[-73.893044,42.220315],[-73.89335,42.219966],[-73.89354899999999,42.21971],[-73.893727,42.219504],[-73.893855,42.219376],[-73.894019,42.219261],[-73.89439299999999,42.219024],[-73.89518099999999,42.218523],[-73.89588500000001,42.218116],[-73.896365,42.21781],[-73.89665100000001,42.217647],[-73.89676799999999,42.217612],[-73.896905,42.217619],[-73.89705499999999,42.217636],[-73.89737,42.217765],[-73.89761900000001,42.217838],[-73.897882,42.217904],[-73.898173,42.218005],[-73.898398,42.218112],[-73.898915,42.218325],[-73.899258,42.218495],[-73.89949300000001,42.218672],[-73.89977,42.21893],[-73.900019,42.219201],[-73.90020199999999,42.219527],[-73.900423,42.219996],[-73.90046,42.220253],[-73.900498,42.220379],[-73.90088900000001,42.220257],[-73.90092300000001,42.2203],[-73.900982,42.220353],[-73.901101,42.220426],[-73.901219,42.220487],[-73.901387,42.220545],[-73.90170999999999,42.220644],[-73.90273500000001,42.220919],[-73.90325799999999,42.221041],[-73.903606,42.221091],[-73.90374,42.2211],[-73.903986,42.221091],[-73.904112,42.221071],[-73.90421000000001,42.221044],[-73.90433,42.221],[-73.90446799999999,42.220921],[-73.905669,42.220072],[-73.905951,42.219888],[-73.906103,42.219779],[-73.906329,42.219592],[-73.906757,42.219191],[-73.907309,42.21864],[-73.907433,42.218494],[-73.90807,42.217626],[-73.908269,42.217366],[-73.908427,42.217193],[-73.90856599999999,42.217067],[-73.90867799999999,42.216983],[-73.90922500000001,42.216612],[-73.910093,42.215902],[-73.91047,42.215573],[-73.910684,42.215364],[-73.911141,42.215427],[-73.911248,42.215456],[-73.911316,42.215481],[-73.91149,42.215589],[-73.911614,42.215723],[-73.911738,42.21594],[-73.911873,42.216225],[-73.911957,42.216359],[-73.912081,42.216492],[-73.912419,42.216793],[-73.912803,42.217198],[-73.913017,42.217373],[-73.913135,42.21744],[-73.913242,42.21749],[-73.91349599999999,42.217569],[-73.91355799999999,42.217584],[-73.91407100000001,42.217711],[-73.914439,42.217777],[-73.914665,42.217807],[-73.914697,42.217811],[-73.915074,42.21787],[-73.915464,42.217925],[-73.915537,42.217935],[-73.91587800000001,42.217995],[-73.91603499999999,42.218029],[-73.916162,42.218076],[-73.916307,42.218136],[-73.916608,42.218295],[-73.917198,42.218533],[-73.917294,42.21858],[-73.917359,42.218635],[-73.917396,42.218697],[-73.917447,42.218813],[-73.91746999999999,42.218902],[-73.917502,42.21897],[-73.917553,42.219022],[-73.917604,42.219045],[-73.917765,42.219083],[-73.917959,42.219114],[-73.91811,42.219122],[-73.91823100000001,42.21911],[-73.918347,42.219083],[-73.918604,42.218976],[-73.918744,42.218895],[-73.919437,42.218414],[-73.919765,42.218207],[-73.919957,42.218063],[-73.920079,42.217944],[-73.920261,42.217727],[-73.920413,42.217559],[-73.92048699999999,42.217519],[-73.920581,42.217479],[-73.920704,42.217457],[-73.921177,42.217407],[-73.921269,42.217385],[-73.92137200000001,42.217351],[-73.921487,42.217296],[-73.92159700000001,42.217238],[-73.921705,42.217172],[-73.92181600000001,42.217097],[-73.921907,42.217022],[-73.92201900000001,42.216905],[-73.92209800000001,42.216791],[-73.922163,42.216676],[-73.922208,42.216556],[-73.92223300000001,42.216452],[-73.922247,42.216302],[-73.92223300000001,42.216162],[-73.922206,42.216002],[-73.92219299999999,42.215866],[-73.92219299999999,42.215653],[-73.92220399999999,42.215538],[-73.922235,42.215358],[-73.922301,42.215187],[-73.922577,42.214529],[-73.92277900000001,42.214187],[-73.92329599999999,42.213495],[-73.92334099999999,42.213445],[-73.923422,42.213388],[-73.92357,42.213312],[-73.923665,42.213275],[-73.92382600000001,42.213245],[-73.92396100000001,42.213245],[-73.924159,42.213268],[-73.92441100000001,42.213312],[-73.924837,42.213412],[-73.924999,42.213465],[-73.925161,42.213525],[-73.925363,42.213608],[-73.925624,42.213728],[-73.925907,42.213865],[-73.92617199999999,42.213974],[-73.926406,42.214051],[-73.92662199999999,42.214101],[-73.926862,42.214152],[-73.92691000000001,42.214162],[-73.927166,42.214251],[-73.927359,42.214337],[-73.92757899999999,42.2145],[-73.927717,42.21461],[-73.927882,42.214708],[-73.928011,42.214745],[-73.92806899999999,42.214753],[-73.928184,42.214745],[-73.928284,42.214716],[-73.92837299999999,42.214662],[-73.92856999999999,42.214518],[-73.929287,42.213981],[-73.929779,42.213631],[-73.929969,42.213516],[-73.93013500000001,42.213459],[-73.93027499999999,42.213436],[-73.930345,42.213433],[-73.930449,42.213444],[-73.930566,42.21347],[-73.930651,42.213516],[-73.930716,42.213559],[-73.930789,42.213623],[-73.930847,42.213683],[-73.93088299999999,42.213754],[-73.93090599999999,42.213849],[-73.93090599999999,42.213929],[-73.930847,42.214374],[-73.930832,42.21458],[-73.93082,42.214941],[-73.930802,42.215085],[-73.930674,42.215494],[-73.930643,42.215669],[-73.930634,42.21585],[-73.930629,42.216115],[-73.93068100000001,42.216661],[-73.930707,42.216794],[-73.930742,42.216929],[-73.93078800000001,42.217038],[-73.930931,42.217291],[-73.931129,42.217555],[-73.931265,42.217751],[-73.931361,42.217899],[-73.931471,42.218128],[-73.931552,42.218262],[-73.931645,42.218379],[-73.931803,42.21854],[-73.932198,42.219001],[-73.932822,42.219696],[-73.93301599999999,42.219874],[-73.93314700000001,42.219974],[-73.93332100000001,42.220086],[-73.93344,42.220147],[-73.93368,42.220255],[-73.934567,42.220677],[-73.935002,42.220852],[-73.93535,42.221021],[-73.935683,42.221207],[-73.936032,42.221416],[-73.936159,42.221508],[-73.93633699999999,42.221689],[-73.936426,42.221795],[-73.93650700000001,42.221915],[-73.936561,42.222007],[-73.93662,42.222139],[-73.93667000000001,42.222345],[-73.936725,42.222666],[-73.936817,42.223101],[-73.936848,42.223172],[-73.936891,42.223232],[-73.93695700000001,42.223307],[-73.93715400000001,42.223493],[-73.93727800000001,42.223585],[-73.93737900000001,42.223654],[-73.93742399999999,42.223681]]],"type":"Polygon"}
}