{
  "id": "361031587091",
  "type": "Feature",
  "properties": {
    "area_land":13099359,
    "area_water":110761,
    "geoid":"361031587091",
    "name":"Block Group 1",
    "state":"ny"
},
  "bbox": [
    -72.947165,
    40.829986,
    -72.887162,
    40.867061
],
  "geometry": {"coordinates":[[[-72.947165,40.855602],[-72.94649200000001,40.857626],[-72.946448,40.857761],[-72.94435,40.859809],[-72.944175,40.859909],[-72.94329,40.861667],[-72.943274,40.862339],[-72.942672,40.863276],[-72.942503,40.863261],[-72.942396,40.863242],[-72.942252,40.863192],[-72.94210699999999,40.863151],[-72.941878,40.863113],[-72.941627,40.863193],[-72.94126199999999,40.863296],[-72.941016,40.863357],[-72.940597,40.863472],[-72.940353,40.863528],[-72.939643,40.863636],[-72.9393,40.863766],[-72.9392,40.863876],[-72.939131,40.864006],[-72.93882600000001,40.864273],[-72.938444,40.864509],[-72.937797,40.864895],[-72.93708700000001,40.865242],[-72.936812,40.86533],[-72.936499,40.865257],[-72.93621,40.865223],[-72.935378,40.86515],[-72.934949,40.865101],[-72.934318,40.865166],[-72.93388899999999,40.865229],[-72.93302,40.865326],[-72.93191400000001,40.865379],[-72.931273,40.865524],[-72.930808,40.865619],[-72.930396,40.865676],[-72.930083,40.86573],[-72.929801,40.865764],[-72.92933499999999,40.865829],[-72.928701,40.865889],[-72.927786,40.865966],[-72.926597,40.866051],[-72.925978,40.866085],[-72.92472100000001,40.86617],[-72.924331,40.866199],[-72.922995,40.866314],[-72.919133,40.866629],[-72.91871500000001,40.866659],[-72.917265,40.866772],[-72.915442,40.866909],[-72.914691,40.866945],[-72.91421200000001,40.866989],[-72.914072,40.867006],[-72.913946,40.867013],[-72.91375499999999,40.867039],[-72.91322,40.867061],[-72.913053,40.867041],[-72.91124499999999,40.866764],[-72.908665,40.866405],[-72.90834700000001,40.866344],[-72.908255,40.866332],[-72.908041,40.86634],[-72.90742299999999,40.866337],[-72.90684400000001,40.866344],[-72.90643799999999,40.866339],[-72.906127,40.866352],[-72.905821,40.866337],[-72.90552599999999,40.866322],[-72.904337,40.866244],[-72.90411400000001,40.866224],[-72.90377599999999,40.866133],[-72.903414,40.866022],[-72.90317899999999,40.865954],[-72.90289199999999,40.865859],[-72.902339,40.865697],[-72.90221200000001,40.865676],[-72.90178299999999,40.865604],[-72.90110199999999,40.86544],[-72.90122,40.864856],[-72.90132199999999,40.864184],[-72.90139499999999,40.863288],[-72.901403,40.862651],[-72.901394,40.862201],[-72.901133,40.859388],[-72.90099499999999,40.857994],[-72.900937,40.857632],[-72.900837,40.857183],[-72.900627,40.856529],[-72.900277,40.855762],[-72.899795,40.854983],[-72.89939,40.854488],[-72.89817600000001,40.85306],[-72.898028,40.852886],[-72.89776999999999,40.852585],[-72.897656,40.852452],[-72.892642,40.846589],[-72.890851,40.844466],[-72.890682,40.844289],[-72.89056600000001,40.844157],[-72.890371,40.843934],[-72.890264,40.843807],[-72.890173,40.843698],[-72.889213,40.84257],[-72.888881,40.842128],[-72.88835400000001,40.841226],[-72.888302,40.841133],[-72.888272,40.841066],[-72.88824200000001,40.841013],[-72.888231,40.840972],[-72.888201,40.840908],[-72.887818,40.84013],[-72.887366,40.839146],[-72.887162,40.8387],[-72.887254,40.838658],[-72.887382,40.838602],[-72.88766200000001,40.838467],[-72.888015,40.838342],[-72.888227,40.83826],[-72.88855599999999,40.83813],[-72.88931100000001,40.837764],[-72.889526,40.837671],[-72.88991300000001,40.837504],[-72.89081400000001,40.837139],[-72.891576,40.836773],[-72.892591,40.836322],[-72.89369000000001,40.835842],[-72.894492,40.835505],[-72.895162,40.835139],[-72.895512,40.834995],[-72.896315,40.834674],[-72.896879,40.834434],[-72.897597,40.834067],[-72.89822100000001,40.833778],[-72.898878,40.833537],[-72.899518,40.833202],[-72.900121,40.832866],[-72.901168,40.832359],[-72.902013,40.832019],[-72.90602800000001,40.830195],[-72.90631500000001,40.830082],[-72.906526,40.829996],[-72.906554,40.829986],[-72.906565,40.83001],[-72.906942,40.830803],[-72.90828500000001,40.831843],[-72.90811100000001,40.832099],[-72.908362,40.832531],[-72.90917899999999,40.832866],[-72.910445,40.833187],[-72.9111,40.833633],[-72.911214,40.833694],[-72.911528,40.833864],[-72.912631,40.834264],[-72.91488699999999,40.835182],[-72.916462,40.835613],[-72.916732,40.83565],[-72.917052,40.835506],[-72.917356,40.835442],[-72.917692,40.835346],[-72.918108,40.835234],[-72.91844399999999,40.835154],[-72.918908,40.835138],[-72.919388,40.835154],[-72.92006000000001,40.835298],[-72.920396,40.835362],[-72.920796,40.83549],[-72.92142,40.835506],[-72.921852,40.835618],[-72.92239600000001,40.835746],[-72.922684,40.835842],[-72.92301999999999,40.83597],[-72.92341999999999,40.836194],[-72.923708,40.836274],[-72.92404399999999,40.836434],[-72.924364,40.836482],[-72.924812,40.836578],[-72.92535700000001,40.836723],[-72.92566100000001,40.836819],[-72.925949,40.836931],[-72.926205,40.837027],[-72.92647700000001,40.837107],[-72.926717,40.837219],[-72.92690899999999,40.837299],[-72.92708500000001,40.837427],[-72.927373,40.837523],[-72.92759700000001,40.837651],[-72.927853,40.837715],[-72.928029,40.837763],[-72.928349,40.837731],[-72.92913299999999,40.837699],[-72.929469,40.837715],[-72.929693,40.837747],[-72.92994899999999,40.837859],[-72.930205,40.837923],[-72.930413,40.838003],[-72.930621,40.838099],[-72.93076600000001,40.838163],[-72.931102,40.838147],[-72.93127800000001,40.838147],[-72.93158200000001,40.838067],[-72.93190199999999,40.838051],[-72.932238,40.838051],[-72.932558,40.838035],[-72.932862,40.838051],[-72.933134,40.838115],[-72.933486,40.838179],[-72.93409699999999,40.838421],[-72.934731,40.839428],[-72.935851,40.840899],[-72.936499,40.841713],[-72.93671399999999,40.842018],[-72.936682,40.842258],[-72.93679400000001,40.842466],[-72.936922,40.842722],[-72.93713099999999,40.843042],[-72.937371,40.84333],[-72.937547,40.843698],[-72.937755,40.844018],[-72.93785099999999,40.844274],[-72.938059,40.844546],[-72.938171,40.844834],[-72.938141,40.845011],[-72.938109,40.845187],[-72.938061,40.845315],[-72.937997,40.845507],[-72.937997,40.845699],[-72.93798099999999,40.845891],[-72.937949,40.846307],[-72.93798099999999,40.846499],[-72.938029,40.846739],[-72.93809299999999,40.846931],[-72.938158,40.847075],[-72.938366,40.847363],[-72.938462,40.847539],[-72.938638,40.847731],[-72.93875,40.847907],[-72.939566,40.848114],[-72.939978,40.848658],[-72.940299,40.848643],[-72.943465,40.850592],[-72.94476400000001,40.851188],[-72.946365,40.852034],[-72.946815,40.853122],[-72.946884,40.85372],[-72.947067,40.855281],[-72.947165,40.855602]]],"type":"Polygon"}
}