{
  "id": "360810263001",
  "type": "Feature",
  "properties": {
    "area_land":67553,
    "area_water":0,
    "geoid":"360810263001",
    "name":"Block Group 1",
    "state":"ny"
},
  "bbox": [
    -73.898942,
    40.746108,
    -73.895025,
    40.7493
],
  "geometry": {"coordinates":[[[-73.898616,40.746937],[-73.898336,40.747561],[-73.89791700000001,40.748494],[-73.897577,40.7493],[-73.896871,40.748993],[-73.89661099999999,40.748878],[-73.896457,40.74881],[-73.89643,40.7488],[-73.896359,40.74877],[-73.89619500000001,40.748521],[-73.896181,40.7485],[-73.89615000000001,40.748453],[-73.89605899999999,40.748289],[-73.895893,40.747997],[-73.895709,40.747686],[-73.895618,40.747544],[-73.895532,40.747402],[-73.895318,40.747021],[-73.895115,40.746641],[-73.895025,40.74647],[-73.89504100000001,40.746468],[-73.895421,40.746428],[-73.896325,40.746335],[-73.89722399999999,40.746238],[-73.89811,40.746144],[-73.89846,40.746108],[-73.89894200000001,40.746237],[-73.898616,40.746937]]],"type":"Polygon"}
}