{
  "id": "360810238003",
  "type": "Feature",
  "properties": {
    "area_land":34030,
    "area_water":0,
    "geoid":"360810238003",
    "name":"Block Group 3",
    "state":"ny"
},
  "bbox": [
    -73.809268,
    40.703822,
    -73.805648,
    40.705692
],
  "geometry": {"coordinates":[[[-73.809268,40.704848],[-73.808065,40.705176],[-73.80756100000001,40.70531],[-73.80613700000001,40.705692],[-73.80564800000001,40.704672],[-73.807061,40.704288],[-73.80758400000001,40.704146],[-73.80878800000001,40.703822],[-73.809268,40.704848]]],"type":"Polygon"}
}