{
  "id": "360910625012",
  "type": "Feature",
  "properties": {
    "area_land":4020847,
    "area_water":0,
    "geoid":"360910625012",
    "name":"Block Group 2",
    "state":"ny"
},
  "bbox": [
    -73.827342,
    42.891651,
    -73.783616,
    42.91073
],
  "geometry": {"coordinates":[[[-73.827302,42.89341],[-73.827225,42.893564],[-73.827163,42.893659],[-73.827051,42.89376],[-73.826902,42.893856],[-73.826746,42.89394],[-73.826469,42.894006],[-73.826274,42.894035],[-73.826058,42.894036],[-73.82586999999999,42.894005],[-73.825222,42.893855],[-73.824206,42.893632],[-73.823913,42.893556],[-73.823617,42.89348],[-73.822486,42.893197],[-73.822109,42.893122],[-73.821894,42.893091],[-73.821744,42.893104],[-73.821601,42.893146],[-73.821468,42.893232],[-73.821352,42.893372],[-73.82091800000001,42.894076],[-73.820778,42.894304],[-73.820679,42.894465],[-73.82038799999999,42.895035],[-73.82028,42.895214],[-73.81924100000001,42.896932],[-73.818794,42.897692],[-73.818685,42.897942],[-73.818641,42.898074],[-73.81851399999999,42.898589],[-73.818499,42.898927],[-73.818591,42.899491],[-73.818708,42.899932],[-73.818939,42.900726],[-73.819216,42.901392],[-73.81940299999999,42.901763],[-73.82015199999999,42.903256],[-73.820778,42.904528],[-73.821275,42.905466],[-73.82251100000001,42.907916],[-73.822827,42.908542],[-73.823114,42.909067],[-73.823577,42.909885],[-73.823419,42.909911],[-73.82329300000001,42.909945],[-73.822902,42.910109],[-73.822352,42.91036],[-73.822102,42.910531],[-73.822014,42.910613],[-73.821934,42.91073],[-73.82174000000001,42.91069],[-73.82092,42.910587],[-73.81991499999999,42.910481],[-73.818611,42.910334],[-73.818252,42.910302],[-73.816654,42.910157],[-73.815882,42.9101],[-73.814837,42.91],[-73.814335,42.909962],[-73.812263,42.909752],[-73.81195099999999,42.909725],[-73.811436,42.909677],[-73.810877,42.909597],[-73.81070200000001,42.909548],[-73.81064000000001,42.909523],[-73.81048,42.909452],[-73.81019000000001,42.909297],[-73.809938,42.909163],[-73.80950799999999,42.908857],[-73.808874,42.908435],[-73.80861299999999,42.908218],[-73.80825400000001,42.907978],[-73.807778,42.907681],[-73.807416,42.907501],[-73.80697600000001,42.907317],[-73.804524,42.906266],[-73.803427,42.905835],[-73.80276000000001,42.905563],[-73.801393,42.905058],[-73.80077799999999,42.904838],[-73.80018800000001,42.904652],[-73.799758,42.904514],[-73.79858,42.904176],[-73.79743499999999,42.903905],[-73.796492,42.903714],[-73.795858,42.90361],[-73.79537000000001,42.903528],[-73.794229,42.903386],[-73.79386,42.903315],[-73.793542,42.903228],[-73.792492,42.902905],[-73.79152999999999,42.902572],[-73.79079299999999,42.902321],[-73.790308,42.902175],[-73.78994299999999,42.902075],[-73.789681,42.902033],[-73.78926800000001,42.902003],[-73.789081,42.902003],[-73.788608,42.902029],[-73.788434,42.902042],[-73.78809200000001,42.902111],[-73.78774199999999,42.902221],[-73.78762,42.902285],[-73.78703400000001,42.902534],[-73.78672899999999,42.902668],[-73.786379,42.902816],[-73.786055,42.902963],[-73.784655,42.901222],[-73.78385400000001,42.900226],[-73.78361599999999,42.899889],[-73.783964,42.899729],[-73.784277,42.899603],[-73.785892,42.898886],[-73.78674100000001,42.898528],[-73.78711699999999,42.898373],[-73.788697,42.897669],[-73.789143,42.897482],[-73.789497,42.897325],[-73.78980799999999,42.897196],[-73.79052900000001,42.896882],[-73.79157499999999,42.896439],[-73.792435,42.896068],[-73.79488000000001,42.895026],[-73.795777,42.894631],[-73.796261,42.894427],[-73.797196,42.894021],[-73.797921,42.893718],[-73.798255,42.893583],[-73.79864999999999,42.893443],[-73.79902199999999,42.893334],[-73.799333,42.893235],[-73.800236,42.893024],[-73.801677,42.892694],[-73.802453,42.892534],[-73.80329999999999,42.892336],[-73.804723,42.892012],[-73.805164,42.89192],[-73.805573,42.891849],[-73.80607999999999,42.891784],[-73.806415,42.89175],[-73.80663800000001,42.891716],[-73.80720100000001,42.891682],[-73.80781899999999,42.891662],[-73.808652,42.891651],[-73.809293,42.891679],[-73.809749,42.891692],[-73.810484,42.891736],[-73.811526,42.891835],[-73.812163,42.8919],[-73.812584,42.891931],[-73.813382,42.892012],[-73.81446,42.892111],[-73.81573400000001,42.892243],[-73.817621,42.892417],[-73.817646,42.892416],[-73.81865000000001,42.892518],[-73.81985400000001,42.892627],[-73.820347,42.892682],[-73.820988,42.892743],[-73.82190900000001,42.892825],[-73.82233600000001,42.892855],[-73.82281,42.892872],[-73.82367000000001,42.892858],[-73.824614,42.892801],[-73.824896,42.892889],[-73.825335,42.892995],[-73.82580900000001,42.893084],[-73.8262,42.893134],[-73.82658000000001,42.893155],[-73.82703100000001,42.893155],[-73.827342,42.893148],[-73.827302,42.89341]]],"type":"Polygon"}
}