{
  "id": "360099607023",
  "type": "Feature",
  "properties": {
    "area_land":20530432,
    "area_water":63309,
    "geoid":"360099607023",
    "name":"Block Group 3",
    "state":"ny"
},
  "bbox": [
    -78.69693,
    42.259099,
    -78.608924,
    42.30746
],
  "geometry": {"coordinates":[[[-78.69692000000001,42.26195],[-78.696845,42.264194],[-78.69681300000001,42.265131],[-78.696794,42.26567],[-78.69661000000001,42.27122],[-78.696693,42.272457],[-78.696848,42.274983],[-78.696473,42.27497],[-78.695763,42.274946],[-78.69530399999999,42.274911],[-78.694885,42.274846],[-78.694382,42.274729],[-78.693893,42.274608],[-78.693653,42.274549],[-78.693546,42.274527],[-78.69309699999999,42.274432],[-78.69265900000001,42.274374],[-78.692515,42.274365],[-78.692458,42.274361],[-78.691951,42.27434],[-78.691751,42.274336],[-78.691227,42.274363],[-78.691063,42.274382],[-78.690849,42.274412],[-78.690341,42.274512],[-78.689705,42.274692],[-78.689319,42.274827],[-78.689058,42.274899],[-78.68888200000001,42.274935],[-78.68866,42.274972],[-78.688301,42.275014],[-78.687826,42.275018],[-78.687546,42.275],[-78.68679,42.274879],[-78.685979,42.274714],[-78.68539199999999,42.274597],[-78.683741,42.274275],[-78.683611,42.274255],[-78.68332700000001,42.27421],[-78.68324699999999,42.274205],[-78.68300499999999,42.274188],[-78.682892,42.27418],[-78.682737,42.274179],[-78.682182,42.274195],[-78.681586,42.274226],[-78.68066899999999,42.274268],[-78.67967,42.274306],[-78.678861,42.274326],[-78.678359,42.274348],[-78.67811500000001,42.274357],[-78.677745,42.274367],[-78.677561,42.274357],[-78.677418,42.274337],[-78.675749,42.273958],[-78.67553100000001,42.273935],[-78.675421,42.273946],[-78.675037,42.274104],[-78.67470299999999,42.274256],[-78.674323,42.274416],[-78.67332399999999,42.274851],[-78.672822,42.275052],[-78.672275,42.275275],[-78.672217,42.2753],[-78.67215,42.275386],[-78.671299,42.275747],[-78.670627,42.276028],[-78.67014899999999,42.276229],[-78.66976200000001,42.276397],[-78.66965999999999,42.276396],[-78.66963,42.276399],[-78.66951400000001,42.276461],[-78.66937299999999,42.276539],[-78.669211,42.27668],[-78.668959,42.276945],[-78.667687,42.278392],[-78.667348,42.278796],[-78.667109,42.279063],[-78.666573,42.279701],[-78.66650300000001,42.279777],[-78.665953,42.280384],[-78.66581499999999,42.280538],[-78.66555,42.280776],[-78.664207,42.281945],[-78.663349,42.282661],[-78.663218,42.282775],[-78.662954,42.282978],[-78.662724,42.283123],[-78.66188200000001,42.283556],[-78.661063,42.283949],[-78.66099199999999,42.283985],[-78.660915,42.284031],[-78.660083,42.284439],[-78.659071,42.284931],[-78.658011,42.285453],[-78.65576299999999,42.286546],[-78.65542499999999,42.286706],[-78.65487299999999,42.286941],[-78.654211,42.287178],[-78.65370799999999,42.287327],[-78.653063,42.287504],[-78.652192,42.287729],[-78.651286,42.287978],[-78.650098,42.288334],[-78.649573,42.288516],[-78.649078,42.288708],[-78.648382,42.289002],[-78.648295,42.289044],[-78.64783799999999,42.289262],[-78.647657,42.289361],[-78.646029,42.290419],[-78.645217,42.290904],[-78.644672,42.291219],[-78.644147,42.291547],[-78.64401599999999,42.29164],[-78.64382999999999,42.291805],[-78.643519,42.292141],[-78.64327400000001,42.292467],[-78.643097,42.292766],[-78.64290699999999,42.293115],[-78.642658,42.293608],[-78.642233,42.294332],[-78.641983,42.29467],[-78.641807,42.294867],[-78.641541,42.295115],[-78.641296,42.29532],[-78.640777,42.295669],[-78.639966,42.29615],[-78.63924400000001,42.29657],[-78.638818,42.296846],[-78.638239,42.297302],[-78.63628199999999,42.298909],[-78.635728,42.299347],[-78.63445400000001,42.300187],[-78.633977,42.300508],[-78.632919,42.301285],[-78.632317,42.301743],[-78.630202,42.303325],[-78.629533,42.303918],[-78.628969,42.304424],[-78.62799099999999,42.305354],[-78.62702899999999,42.30629],[-78.62603799999999,42.307295],[-78.625856,42.3072],[-78.6258,42.307173],[-78.62566,42.307097],[-78.625455,42.306985],[-78.625298,42.306918],[-78.625186,42.306889],[-78.625063,42.306878],[-78.624961,42.306886],[-78.62477199999999,42.306942],[-78.624422,42.307118],[-78.624251,42.307192],[-78.623965,42.307288],[-78.623668,42.307344],[-78.62338,42.307368],[-78.62221,42.307409],[-78.620407,42.30746],[-78.620036,42.307455],[-78.619213,42.307424],[-78.618347,42.307335],[-78.61778099999999,42.307249],[-78.61635699999999,42.306957],[-78.614875,42.306679],[-78.613525,42.3064],[-78.6135,42.306394],[-78.612747,42.30621],[-78.612402,42.306137],[-78.61121900000001,42.305924],[-78.6113,42.305454],[-78.611366,42.305057],[-78.611411,42.304876],[-78.611614,42.304146],[-78.611977,42.302738],[-78.612122,42.302009],[-78.61218599999999,42.301738],[-78.61222600000001,42.301631],[-78.612397,42.301282],[-78.61258599999999,42.300952],[-78.61272,42.300773],[-78.61291199999999,42.300581],[-78.61309900000001,42.300414],[-78.613786,42.299867],[-78.614256,42.299465],[-78.614339,42.299383],[-78.61441600000001,42.299286],[-78.614515,42.299125],[-78.614566,42.298957],[-78.614617,42.298479],[-78.61463500000001,42.298067],[-78.61463000000001,42.29631],[-78.614649,42.294888],[-78.614638,42.293476],[-78.614574,42.292778],[-78.614512,42.292397],[-78.614462,42.2922],[-78.614098,42.291376],[-78.61380699999999,42.290673],[-78.613536,42.290108],[-78.61350299999999,42.290039],[-78.61326800000001,42.289744],[-78.61283,42.289258],[-78.612239,42.288515],[-78.61191100000001,42.288103],[-78.6117,42.28786],[-78.611537,42.287698],[-78.611272,42.287485],[-78.610749,42.28714],[-78.610337,42.286909],[-78.610164,42.28684],[-78.609402,42.286641],[-78.609191,42.286561],[-78.609106,42.286516],[-78.608924,42.286388],[-78.608976,42.286247],[-78.609067,42.286003],[-78.609318,42.285225],[-78.609663,42.284025],[-78.60982799999999,42.283059],[-78.610023,42.281492],[-78.61004699999999,42.281302],[-78.610106,42.280964],[-78.61017,42.280604],[-78.61027,42.280211],[-78.610429,42.279848],[-78.610603,42.279519],[-78.610703,42.279364],[-78.610744,42.279312],[-78.610784,42.279259],[-78.61094300000001,42.279106],[-78.613496,42.276861],[-78.614278,42.276259],[-78.614527,42.276003],[-78.61465800000001,42.275816],[-78.615448,42.274442],[-78.61582300000001,42.273825],[-78.616293,42.27308],[-78.616511,42.272829],[-78.61673,42.272627],[-78.617097,42.272355],[-78.618253,42.271682],[-78.61891300000001,42.271309],[-78.619696,42.270894],[-78.62003799999999,42.270739],[-78.620615,42.270529],[-78.621956,42.270106],[-78.622247,42.270005],[-78.622559,42.269857],[-78.623059,42.269576],[-78.624036,42.268984],[-78.625669,42.267936],[-78.62774400000001,42.266543],[-78.629029,42.265694],[-78.630527,42.264818],[-78.630912,42.264585],[-78.631451,42.264253],[-78.631973,42.263898],[-78.63269699999999,42.263357],[-78.63479599999999,42.261786],[-78.6353,42.261357],[-78.637663,42.259336],[-78.64505,42.259241],[-78.646631,42.259239],[-78.653925,42.259214],[-78.65559500000001,42.259193],[-78.657837,42.259394],[-78.658466,42.259428],[-78.65989999999999,42.259512],[-78.660906,42.259558],[-78.667061,42.259216],[-78.66780300000001,42.259131],[-78.670416,42.259119],[-78.678557,42.259112],[-78.683364,42.259109],[-78.6883,42.259105],[-78.69692999999999,42.259099],[-78.69692000000001,42.26195]]],"type":"Polygon"}
}