{
  "id": "360850277023",
  "type": "Feature",
  "properties": {
    "area_land":275940,
    "area_water":0,
    "geoid":"360850277023",
    "name":"Block Group 3",
    "state":"ny"
},
  "bbox": [
    -74.1637,
    40.576162,
    -74.156863,
    40.584795
],
  "geometry": {"coordinates":[[[-74.16348000000001,40.579283],[-74.162806,40.581241],[-74.162738,40.581529],[-74.16265,40.581808],[-74.16255099999999,40.58206],[-74.162423,40.582332],[-74.162279,40.58259],[-74.16214100000001,40.582805],[-74.16199,40.583015],[-74.16181400000001,40.583233],[-74.161607,40.583462],[-74.161423,40.583643],[-74.16124600000001,40.583805],[-74.161008,40.584056],[-74.16033400000001,40.584795],[-74.15970900000001,40.584464],[-74.158918,40.584041],[-74.158474,40.583806],[-74.15830699999999,40.583716],[-74.158199,40.583658],[-74.15814,40.583626],[-74.15766600000001,40.583375],[-74.157217,40.583137],[-74.156863,40.582948],[-74.157128,40.582663],[-74.157414,40.582313],[-74.157501,40.582206],[-74.158636,40.581224],[-74.158726,40.581136],[-74.158815,40.581049],[-74.15925900000001,40.580096],[-74.159375,40.579845],[-74.158629,40.579255],[-74.159462,40.57853],[-74.159595,40.578413],[-74.15971,40.578368],[-74.159936,40.578376],[-74.160391,40.57847],[-74.160614,40.578347],[-74.16040099999999,40.578427],[-74.16008100000001,40.578188],[-74.159863,40.578011],[-74.160433,40.577551],[-74.160664,40.577717],[-74.16097499999999,40.57794],[-74.161297,40.577881],[-74.161626,40.576715],[-74.16222500000001,40.576162],[-74.163076,40.576614],[-74.162992,40.577662],[-74.16370000000001,40.577732],[-74.16348000000001,40.579283]]],"type":"Polygon"}
}