{
  "id": "360471124002",
  "type": "Feature",
  "properties": {
    "area_land":71954,
    "area_water":0,
    "geoid":"360471124002",
    "name":"Block Group 2",
    "state":"ny"
},
  "bbox": [
    -73.888889,
    40.664047,
    -73.885563,
    40.667521
],
  "geometry": {"coordinates":[[[-73.88888900000001,40.66712],[-73.88798800000001,40.667254],[-73.887084,40.667388],[-73.886183,40.667521],[-73.885795,40.665994],[-73.885563,40.665141],[-73.886413,40.664781],[-73.886577,40.664708],[-73.887261,40.664414],[-73.88739200000001,40.664353],[-73.888108,40.664047],[-73.888498,40.665592],[-73.88888900000001,40.66712]]],"type":"Polygon"}
}