{
  "id": "360610034002",
  "type": "Feature",
  "properties": {
    "area_land":35337,
    "area_water":0,
    "geoid":"360610034002",
    "name":"Block Group 2",
    "state":"ny"
},
  "bbox": [
    -73.982228,
    40.726866,
    -73.978998,
    40.729086
],
  "geometry": {"coordinates":[[[-73.98179,40.728446],[-73.981325,40.729086],[-73.978998,40.728106],[-73.97946899999999,40.727468],[-73.979906,40.726866],[-73.98222800000001,40.727846],[-73.98179,40.728446]]],"type":"Polygon"}
}