{
  "id": "360810204001",
  "type": "Feature",
  "properties": {
    "area_land":194997,
    "area_water":0,
    "geoid":"360810204001",
    "name":"Block Group 1",
    "state":"ny"
},
  "bbox": [
    -73.806243,
    40.69308,
    -73.797537,
    40.699291
],
  "geometry": {"coordinates":[[[-73.80624299999999,40.694741],[-73.805356,40.69546],[-73.804891,40.695852],[-73.80449,40.696169],[-73.804226,40.696382],[-73.803572,40.696935],[-73.803532,40.696968],[-73.802367,40.697874],[-73.801053,40.698419],[-73.800282,40.69872],[-73.79955200000001,40.699157],[-73.799341,40.699291],[-73.79753700000001,40.698199],[-73.79786199999999,40.697993],[-73.798546,40.697467],[-73.798827,40.697205],[-73.799182,40.696871],[-73.799859,40.696347],[-73.800532,40.695857],[-73.80107599999999,40.69543],[-73.801196,40.695337],[-73.80211300000001,40.694544],[-73.802959,40.693817],[-73.80381800000001,40.69308],[-73.80463399999999,40.693638],[-73.805435,40.694182],[-73.80624299999999,40.694741]]],"type":"Polygon"}
}