{
  "id": "361031473006",
  "type": "Feature",
  "properties": {
    "area_land":1777613,
    "area_water":1897398,
    "geoid":"361031473006",
    "name":"Block Group 6",
    "state":"ny"
},
  "bbox": [
    -73.247194,
    40.702242,
    -73.223466,
    40.728039
],
  "geometry": {"coordinates":[[[-73.246461,40.72147],[-73.246218,40.721713],[-73.246064,40.721883],[-73.24593400000001,40.721989],[-73.24540399999999,40.722368],[-73.244423,40.722918],[-73.24395699999999,40.723252],[-73.243499,40.723846],[-73.243557,40.724174],[-73.24353000000001,40.724191],[-73.24253,40.724496],[-73.24208299999999,40.724636],[-73.241558,40.72473],[-73.24087400000001,40.724856],[-73.23948300000001,40.725111],[-73.239317,40.725154],[-73.238973,40.725279],[-73.238512,40.725436],[-73.237396,40.72583],[-73.23649,40.726158],[-73.236321,40.726219],[-73.235998,40.726338],[-73.23527799999999,40.726577],[-73.234548,40.726713],[-73.231318,40.727251],[-73.23094,40.727334],[-73.230306,40.727545],[-73.229347,40.727852],[-73.229146,40.727908],[-73.228933,40.727949],[-73.228707,40.727984],[-73.228218,40.728033],[-73.227924,40.728039],[-73.22701499999999,40.728014],[-73.226541,40.727999],[-73.225455,40.72796],[-73.224683,40.727942],[-73.224718,40.727365],[-73.22486499999999,40.726149],[-73.224723,40.725917],[-73.224305,40.72568],[-73.224243,40.725651],[-73.224129,40.726064],[-73.22406700000001,40.726511],[-73.22381300000001,40.726483],[-73.22394799999999,40.725894],[-73.22398200000001,40.725702],[-73.22388100000001,40.725604],[-73.22377899999999,40.725634],[-73.223468,40.725595],[-73.223467,40.725521],[-73.223466,40.72538],[-73.223598,40.722451],[-73.223821,40.72144],[-73.223823,40.721427],[-73.224191,40.71977],[-73.22429099999999,40.719317],[-73.22443199999999,40.718679],[-73.224602,40.717916],[-73.22591799999999,40.710809],[-73.225368,40.702978],[-73.22743199999999,40.702482],[-73.23028100000001,40.702354],[-73.232758,40.702272],[-73.233673,40.702242],[-73.23853699999999,40.702914],[-73.241401,40.703042],[-73.238552,40.707152],[-73.237234,40.709618],[-73.236814,40.710729],[-73.236391,40.712056],[-73.237903,40.713302],[-73.238846,40.713734],[-73.240959,40.715394],[-73.24161100000001,40.715966],[-73.242262,40.716619],[-73.242794,40.717085],[-73.245541,40.719511],[-73.24719399999999,40.720973],[-73.246461,40.72147]]],"type":"Polygon"}
}