{
  "id": "360670121003",
  "type": "Feature",
  "properties": {
    "area_land":13307625,
    "area_water":0,
    "geoid":"360670121003",
    "name":"Block Group 3",
    "state":"ny"
},
  "bbox": [
    -76.37312,
    43.010385,
    -76.304707,
    43.057121
],
  "geometry": {"coordinates":[[[-76.37312,43.034329],[-76.369203,43.034502],[-76.367643,43.034559],[-76.366525,43.034588],[-76.365258,43.034631],[-76.364071,43.034654],[-76.363224,43.034681],[-76.35995699999999,43.03474],[-76.358468,43.034783],[-76.356792,43.034845],[-76.35520699999999,43.034892],[-76.3522,43.034996],[-76.350677,43.03507],[-76.349569,43.035144],[-76.348175,43.03525],[-76.34791199999999,43.035263],[-76.346558,43.035369],[-76.343953,43.035566],[-76.341262,43.035766],[-76.337917,43.036035],[-76.337836,43.036043],[-76.337664,43.036058],[-76.336918,43.036117],[-76.334604,43.036302],[-76.334695,43.036738],[-76.3348,43.038117],[-76.334929,43.039452],[-76.334937,43.039544],[-76.33508399999999,43.041154],[-76.335154,43.041643],[-76.33519800000001,43.041835],[-76.33527100000001,43.041997],[-76.335335,43.042095],[-76.335515,43.042309],[-76.33644,43.043324],[-76.336626,43.043535],[-76.337029,43.04401],[-76.337773,43.044954],[-76.338435,43.045896],[-76.339027,43.046837],[-76.339679,43.047804],[-76.339983,43.048268],[-76.340164,43.048515],[-76.340401,43.048774],[-76.341483,43.049903],[-76.34223799999999,43.050682],[-76.343621,43.052317],[-76.34464199999999,43.053551],[-76.345113,43.054103],[-76.34554799999999,43.054504],[-76.345494,43.054543],[-76.34544,43.054569],[-76.34534499999999,43.054594],[-76.345016,43.054619],[-76.343113,43.054669],[-76.34229999999999,43.054689],[-76.33946,43.054803],[-76.336809,43.054892],[-76.336556,43.054927],[-76.336494,43.05496],[-76.336388,43.055068],[-76.33635,43.055141],[-76.336327,43.055258],[-76.336429,43.057023],[-76.334429,43.057086],[-76.33372300000001,43.057117],[-76.333476,43.057121],[-76.333337,43.05711],[-76.33322699999999,43.057091],[-76.333066,43.057036],[-76.332798,43.056895],[-76.332037,43.056462],[-76.331155,43.055969],[-76.331042,43.055902],[-76.33048599999999,43.055508],[-76.33024399999999,43.055354],[-76.329921,43.055186],[-76.32883,43.054722],[-76.328191,43.054471],[-76.327986,43.05439],[-76.32776,43.05435],[-76.32757599999999,43.054335],[-76.32709199999999,43.054327],[-76.326993,43.054313],[-76.326751,43.054254],[-76.326577,43.054189],[-76.32621,43.054022],[-76.32580900000001,43.053804],[-76.325575,43.053638],[-76.325312,43.053428],[-76.325199,43.05332],[-76.32464400000001,43.052856],[-76.324321,43.052621],[-76.323272,43.051905],[-76.321926,43.050979],[-76.320949,43.050343],[-76.32053399999999,43.050036],[-76.32015800000001,43.04972],[-76.319333,43.04909],[-76.31872300000001,43.048611],[-76.318056,43.048121],[-76.317463,43.047741],[-76.316996,43.047413],[-76.316766,43.04724],[-76.316485,43.046977],[-76.31627899999999,43.046734],[-76.316135,43.046495],[-76.31601000000001,43.046202],[-76.315941,43.045991],[-76.315641,43.044955],[-76.315523,43.044656],[-76.315423,43.044477],[-76.31512600000001,43.044053],[-76.314909,43.043834],[-76.31466,43.043637],[-76.314091,43.043264],[-76.311942,43.045103],[-76.30969399999999,43.047035],[-76.30910299999999,43.047522],[-76.30870899999999,43.047804],[-76.30806800000001,43.048176],[-76.307384,43.048554],[-76.307147,43.048736],[-76.306966,43.048949],[-76.306877,43.049104],[-76.306758,43.049411],[-76.30667699999999,43.04971],[-76.306668,43.049728],[-76.30659799999999,43.049842],[-76.30632199999999,43.050143],[-76.305939,43.05053],[-76.30568599999999,43.050308],[-76.305554,43.050176],[-76.305328,43.049914],[-76.305211,43.049756],[-76.305037,43.049468],[-76.30499500000001,43.04938],[-76.30480300000001,43.048896],[-76.304783,43.04883],[-76.304755,43.04873],[-76.304743,43.048687],[-76.30471,43.048318],[-76.30470699999999,43.04828],[-76.30471799999999,43.047956],[-76.304771,43.047581],[-76.304844,43.047365],[-76.304953,43.047078],[-76.30505700000001,43.046843],[-76.306303,43.044172],[-76.306443,43.043879],[-76.30808,43.04385],[-76.31011599999999,43.043863],[-76.310152,43.042566],[-76.31115200000001,43.042566],[-76.311251,43.04257],[-76.312977,43.042531],[-76.313052,43.041814],[-76.313838,43.041501],[-76.31441599999999,43.041141],[-76.315641,43.040801],[-76.316266,43.040328],[-76.316228,43.039918],[-76.317785,43.039112],[-76.31776600000001,43.038487],[-76.317622,43.038529],[-76.317155,43.038634],[-76.316889,43.038708],[-76.316332,43.038927],[-76.315906,43.039056],[-76.315496,43.035504],[-76.315416,43.034843],[-76.317033,43.033632],[-76.316852,43.033366],[-76.316344,43.032924],[-76.315652,43.032366],[-76.31424800000001,43.034048],[-76.31375199999999,43.033666],[-76.313142,43.033258],[-76.313183,43.033095],[-76.313185,43.032738],[-76.31320700000001,43.032651],[-76.313261,43.032567],[-76.31359999999999,43.032297],[-76.31367,43.032254],[-76.313757,43.032221],[-76.31383,43.032221],[-76.313928,43.032239],[-76.31417500000001,43.032316],[-76.314229,43.032308],[-76.314284,43.032286],[-76.314367,43.032191],[-76.314408,43.032137],[-76.314488,43.032064],[-76.31470299999999,43.03194],[-76.31485600000001,43.031824],[-76.315241,43.031379],[-76.315274,43.031259],[-76.315381,43.030636],[-76.315414,43.030512],[-76.315462,43.030399],[-76.31558200000001,43.030235],[-76.31568900000001,43.03013],[-76.315781,43.030057],[-76.31585699999999,43.030017],[-76.315952,43.029991],[-76.31608,43.02998],[-76.316236,43.029991],[-76.316666,43.030126],[-76.316867,43.030217],[-76.317232,43.030363],[-76.317392,43.03041],[-76.317589,43.03045],[-76.31774900000001,43.03045],[-76.317837,43.030436],[-76.317899,43.03041],[-76.317932,43.030363],[-76.317955,43.030148],[-76.317988,43.030068],[-76.318043,43.030009],[-76.318108,43.029962],[-76.3182,43.029929],[-76.31828,43.029922],[-76.318444,43.029926],[-76.31854800000001,43.029969],[-76.318628,43.030013],[-76.318697,43.030035],[-76.31881799999999,43.030053],[-76.319018,43.03005],[-76.319124,43.03002],[-76.319237,43.029969],[-76.319361,43.029897],[-76.31959000000001,43.02974],[-76.3197,43.029689],[-76.31988200000001,43.029623],[-76.32053999999999,43.029445],[-76.320628,43.029412],[-76.32070400000001,43.029365],[-76.32080999999999,43.029244],[-76.320865,43.029066],[-76.320865,43.028964],[-76.320846,43.028847],[-76.32080999999999,43.02876],[-76.320719,43.028643],[-76.320283,43.028192],[-76.31994,43.027809],[-76.31991499999999,43.027769],[-76.319911,43.027722],[-76.31993,43.027649],[-76.319981,43.027587],[-76.32018100000001,43.027412],[-76.32022499999999,43.027343],[-76.320329,43.027124],[-76.32044500000001,43.02696],[-76.320584,43.026833],[-76.320671,43.026767],[-76.320814,43.026683],[-76.321271,43.026479],[-76.321443,43.026432],[-76.32158800000001,43.026443],[-76.32166100000001,43.026476],[-76.32172300000001,43.026538],[-76.32177299999999,43.026611],[-76.321867,43.026924],[-76.321918,43.027015],[-76.321988,43.027091],[-76.322123,43.027208],[-76.322367,43.027387],[-76.32261800000001,43.027525],[-76.322795,43.027605],[-76.323109,43.027703],[-76.32329799999999,43.027725],[-76.32372100000001,43.027714],[-76.323965,43.027671],[-76.32414799999999,43.02762],[-76.32426100000001,43.027569],[-76.324367,43.027496],[-76.32456000000001,43.02731],[-76.32460399999999,43.027237],[-76.32464,43.02715],[-76.324676,43.026924],[-76.324665,43.026764],[-76.324636,43.026716],[-76.324585,43.026687],[-76.32449800000001,43.026676],[-76.32438500000001,43.02668],[-76.324184,43.026742],[-76.323893,43.026873],[-76.323809,43.026887],[-76.32341700000001,43.026895],[-76.323322,43.02688],[-76.323278,43.026858],[-76.323165,43.026705],[-76.32314,43.026614],[-76.32313600000001,43.026516],[-76.32314700000001,43.026403],[-76.32317999999999,43.026305],[-76.32324199999999,43.026188],[-76.32334,43.026068],[-76.32362999999999,43.025754],[-76.32379,43.025612],[-76.32387799999999,43.025576],[-76.324181,43.02554],[-76.32428299999999,43.025503],[-76.324461,43.02539],[-76.32460399999999,43.025357],[-76.325495,43.025201],[-76.325597,43.025193],[-76.325699,43.025212],[-76.325827,43.025277],[-76.325943,43.025361],[-76.326013,43.025441],[-76.326035,43.025525],[-76.326042,43.025612],[-76.326071,43.025678],[-76.326111,43.025729],[-76.326317,43.025835],[-76.326368,43.025878],[-76.32638300000001,43.025929],[-76.326379,43.025995],[-76.32635000000001,43.026046],[-76.326346,43.026108],[-76.32636100000001,43.026159],[-76.326412,43.026195],[-76.32649600000001,43.026224],[-76.326645,43.026243],[-76.326842,43.026246],[-76.327028,43.026239],[-76.32714799999999,43.026217],[-76.327232,43.026173],[-76.327298,43.026126],[-76.327342,43.026053],[-76.32738500000001,43.025846],[-76.327569,43.025354],[-76.327624,43.025248],[-76.327693,43.025175],[-76.327763,43.025121],[-76.32785,43.025073],[-76.327945,43.025048],[-76.328288,43.025026],[-76.328412,43.025037],[-76.328514,43.025059],[-76.328594,43.025091],[-76.32867400000001,43.025157],[-76.32874700000001,43.025234],[-76.328835,43.025295],[-76.32890399999999,43.025328],[-76.32914599999999,43.025354],[-76.32926999999999,43.025383],[-76.329511,43.02547],[-76.329624,43.025481],[-76.329751,43.025478],[-76.329897,43.025445],[-76.330134,43.025343],[-76.33026,43.025234],[-76.330388,43.025164],[-76.330479,43.025099],[-76.33050799999999,43.02503],[-76.330519,43.024949],[-76.33051500000001,43.024877],[-76.330359,43.024359],[-76.33036199999999,43.024148],[-76.330395,43.024064],[-76.330867,43.023448],[-76.330918,43.023397],[-76.330969,43.023368],[-76.33109,43.023372],[-76.331334,43.023452],[-76.331418,43.023452],[-76.331569,43.023434],[-76.331689,43.023445],[-76.33177999999999,43.023474],[-76.331857,43.023525],[-76.331912,43.023587],[-76.331941,43.023656],[-76.331981,43.023846],[-76.332036,43.023915],[-76.332123,43.023991],[-76.33230500000001,43.024119],[-76.332375,43.024119],[-76.332448,43.024101],[-76.33251,43.024046],[-76.332593,43.024002],[-76.332801,43.024002],[-76.3329,43.024031],[-76.332948,43.024057],[-76.332984,43.024075],[-76.333038,43.02413],[-76.333146,43.024308],[-76.33321100000001,43.024363],[-76.333281,43.024399],[-76.333343,43.024405],[-76.33339700000001,43.02441],[-76.33351399999999,43.024407],[-76.333653,43.024374],[-76.333951,43.02425],[-76.33477000000001,43.023831],[-76.33525899999999,43.02355],[-76.33560900000001,43.023317],[-76.335813,43.023091],[-76.335891,43.022971],[-76.33594600000001,43.022862],[-76.336037,43.022731],[-76.336113,43.022676],[-76.33620500000001,43.022647],[-76.336321,43.022629],[-76.336438,43.022643],[-76.336726,43.022738],[-76.33683499999999,43.022756],[-76.33691899999999,43.022756],[-76.337003,43.022724],[-76.33704299999999,43.022676],[-76.337047,43.022581],[-76.336865,43.022228],[-76.33681,43.022166],[-76.336719,43.022111],[-76.3366,43.022108],[-76.336516,43.022093],[-76.336411,43.022039],[-76.336349,43.02198],[-76.336108,43.021663],[-76.33610400000001,43.021616],[-76.336123,43.021547],[-76.336174,43.02151],[-76.336268,43.021485],[-76.336606,43.021448],[-76.336679,43.021419],[-76.336741,43.021368],[-76.33689699999999,43.021157],[-76.33699900000001,43.021051],[-76.337065,43.021019],[-76.337164,43.020986],[-76.33741499999999,43.020928],[-76.337568,43.020877],[-76.33793900000001,43.020726],[-76.338314,43.020631],[-76.338409,43.020599],[-76.33867499999999,43.020486],[-76.338905,43.02046],[-76.33900300000001,43.020435],[-76.33906899999999,43.020406],[-76.339189,43.020318],[-76.339665,43.019779],[-76.339738,43.019757],[-76.33995299999999,43.019743],[-76.340022,43.019764],[-76.340103,43.019768],[-76.340172,43.019757],[-76.340248,43.019724],[-76.340307,43.019673],[-76.340329,43.019633],[-76.340332,43.019582],[-76.34031400000001,43.019524],[-76.340256,43.019429],[-76.34022299999999,43.019342],[-76.340132,43.019192],[-76.340051,43.019127],[-76.33994800000001,43.018985],[-76.339929,43.018886],[-76.33992600000001,43.018457],[-76.339878,43.018238],[-76.339811,43.0181],[-76.339654,43.017954],[-76.339443,43.017794],[-76.339322,43.017673],[-76.33909300000001,43.0174],[-76.33899099999999,43.01722],[-76.338945,43.017105],[-76.338917,43.016955],[-76.33890100000001,43.016682],[-76.338911,43.016521],[-76.3389,43.01644],[-76.338859,43.016394],[-76.338801,43.016368],[-76.3386,43.016317],[-76.338491,43.01627],[-76.33834899999999,43.016226],[-76.338035,43.01616],[-76.337791,43.016058],[-76.33762299999999,43.015935],[-76.337322,43.015556],[-76.337271,43.015465],[-76.337239,43.015352],[-76.337191,43.015042],[-76.33708,43.014721],[-76.337058,43.014557],[-76.33705500000001,43.014332],[-76.337073,43.014226],[-76.337166,43.014013],[-76.337434,43.013483],[-76.33746600000001,43.013388],[-76.33747,43.013308],[-76.337445,43.013231],[-76.337386,43.013155],[-76.33730199999999,43.013082],[-76.33686299999999,43.012751],[-76.336732,43.01267],[-76.33655,43.012583],[-76.33593500000001,43.012362],[-76.335615,43.01229],[-76.335508,43.012238],[-76.335397,43.012166],[-76.335426,43.012064],[-76.335944,43.012034],[-76.355469,43.011133],[-76.36992600000001,43.010449],[-76.37083800000001,43.010426],[-76.371174,43.010385],[-76.37133,43.012382],[-76.37180600000001,43.018591],[-76.371967,43.020455],[-76.372213,43.02342],[-76.37312,43.034329]]],"type":"Polygon"}
}