{
  "id": "360810679002",
  "type": "Feature",
  "properties": {
    "area_land":73676,
    "area_water":0,
    "geoid":"360810679002",
    "name":"Block Group 2",
    "state":"ny"
},
  "bbox": [
    -73.872802,
    40.723493,
    -73.869293,
    40.727979
],
  "geometry": {"coordinates":[[[-73.87224500000001,40.726146],[-73.871815,40.726794],[-73.87101800000001,40.727979],[-73.870772,40.727394],[-73.870632,40.727059],[-73.870211,40.726187],[-73.869699,40.725146],[-73.869293,40.724436],[-73.869619,40.724287],[-73.87055100000001,40.723862],[-73.871353,40.723493],[-73.87280199999999,40.725304],[-73.87224500000001,40.726146]]],"type":"Polygon"}
}