{
  "id": "360595199004",
  "type": "Feature",
  "properties": {
    "area_land":302774,
    "area_water":0,
    "geoid":"360595199004",
    "name":"Block Group 4",
    "state":"ny"
},
  "bbox": [
    -73.487039,
    40.755035,
    -73.478246,
    40.761338
],
  "geometry": {"coordinates":[[[-73.487039,40.758846],[-73.48535800000001,40.759197],[-73.48459800000001,40.759349],[-73.483846,40.759512],[-73.483397,40.759705],[-73.48308900000001,40.759842],[-73.482919,40.759929],[-73.482828,40.759991],[-73.482737,40.760079],[-73.481881,40.761085],[-73.481824,40.761167],[-73.481668,40.761338],[-73.480982,40.761065],[-73.480896,40.761039],[-73.480752,40.761017],[-73.480648,40.761006],[-73.48031899999999,40.760946],[-73.480294,40.760932],[-73.48017,40.760923],[-73.479894,40.760881],[-73.47968299999999,40.760832],[-73.47940800000001,40.760629],[-73.479271,40.760571],[-73.479131,40.76054],[-73.479015,40.760534],[-73.478914,40.760542],[-73.47837,40.760653],[-73.478255,40.760333],[-73.478246,40.760179],[-73.47826499999999,40.76007],[-73.47829400000001,40.759982],[-73.478397,40.759818],[-73.47857500000001,40.759635],[-73.478677,40.75949],[-73.47873199999999,40.759372],[-73.478871,40.758969],[-73.478877,40.758887],[-73.478835,40.758711],[-73.478859,40.758368],[-73.47896299999999,40.757185],[-73.479084,40.755828],[-73.47914900000001,40.755035],[-73.481199,40.755439],[-73.481228,40.755453],[-73.48128199999999,40.755456],[-73.48232,40.755655],[-73.483975,40.755953],[-73.48433900000001,40.756033],[-73.484602,40.7561],[-73.485179,40.756206],[-73.485311,40.75641],[-73.485377,40.756665],[-73.485653,40.757385],[-73.485742,40.757583],[-73.485834,40.757749],[-73.485838,40.757782],[-73.485984,40.757983],[-73.48618399999999,40.758181],[-73.486366,40.758405],[-73.486694,40.758651],[-73.486949,40.7588],[-73.487039,40.758846]]],"type":"Polygon"}
}