{
  "id": "360810014001",
  "type": "Feature",
  "properties": {
    "area_land":70450,
    "area_water":0,
    "geoid":"360810014001",
    "name":"Block Group 1",
    "state":"ny"
},
  "bbox": [
    -73.858331,
    40.695473,
    -73.852664,
    40.697572
],
  "geometry": {"coordinates":[[[-73.85833100000001,40.696744],[-73.857444,40.696913],[-73.856572,40.697065],[-73.85567399999999,40.697179],[-73.854788,40.697297],[-73.852664,40.697572],[-73.852807,40.696845],[-73.85283,40.69614],[-73.85449,40.695937],[-73.85537600000001,40.695827],[-73.856268,40.695708],[-73.857158,40.695595],[-73.858047,40.695473],[-73.85833100000001,40.696744]]],"type":"Polygon"}
}