{
  "id": "360810262001",
  "type": "Feature",
  "properties": {
    "area_land":143393,
    "area_water":0,
    "geoid":"360810262001",
    "name":"Block Group 1",
    "state":"ny"
},
  "bbox": [
    -73.796647,
    40.688657,
    -73.787783,
    40.693398
],
  "geometry": {"coordinates":[[[-73.79664699999999,40.68985],[-73.795907,40.690171],[-73.79507,40.690536],[-73.79467099999999,40.690708],[-73.79480700000001,40.690894],[-73.79400099999999,40.691236],[-73.793181,40.691584],[-73.792526,40.69186],[-73.792384,40.691921],[-73.791723,40.6922],[-73.790954,40.692526],[-73.789845,40.693007],[-73.78893100000001,40.693398],[-73.788172,40.692356],[-73.787783,40.691819],[-73.788704,40.691431],[-73.789796,40.69096],[-73.790279,40.690755],[-73.79043,40.690641],[-73.790571,40.69063],[-73.791382,40.690287],[-73.792034,40.690012],[-73.792855,40.689665],[-73.793696,40.689377],[-73.794995,40.688917],[-73.795615,40.688657],[-73.79610099999999,40.689282],[-73.79664699999999,40.68985]]],"type":"Polygon"}
}