{
  "id": "360550112052",
  "type": "Feature",
  "properties": {
    "area_land":3316290,
    "area_water":1454,
    "geoid":"360550112052",
    "name":"Block Group 2",
    "state":"ny"
},
  "bbox": [
    -77.475965,
    43.213596,
    -77.446618,
    43.230528
],
  "geometry": {"coordinates":[[[-77.475965,43.230411],[-77.47146600000001,43.230507],[-77.47049699999999,43.230528],[-77.46339,43.227887],[-77.463368,43.227868],[-77.46131099999999,43.227115],[-77.45961699999999,43.226503],[-77.453378,43.224247],[-77.450114,43.223066],[-77.446849,43.221886],[-77.44664400000001,43.221812],[-77.446646,43.221685],[-77.446618,43.22054],[-77.44662599999999,43.216653],[-77.446628,43.215963],[-77.446631,43.215706],[-77.44663199999999,43.215662],[-77.446636,43.215438],[-77.446636,43.215415],[-77.447518,43.215436],[-77.448595,43.215438],[-77.449427,43.215407],[-77.44988600000001,43.215386],[-77.45081,43.2153],[-77.452879,43.215056],[-77.459171,43.214313],[-77.461304,43.214113],[-77.46442399999999,43.213755],[-77.465154,43.213692],[-77.466071,43.213639],[-77.46753,43.2136],[-77.473546,43.213775],[-77.472165,43.213596],[-77.47479300000001,43.21379],[-77.475015,43.213795],[-77.47509700000001,43.214123],[-77.475117,43.214214],[-77.475194,43.214559],[-77.475256,43.214856],[-77.47557999999999,43.216422],[-77.475825,43.217494],[-77.475838,43.218399],[-77.475843,43.218699],[-77.475853,43.219332],[-77.47586800000001,43.220253],[-77.475882,43.221575],[-77.47589600000001,43.224043],[-77.47589600000001,43.224224],[-77.47589499999999,43.224404],[-77.475904,43.226211],[-77.475911,43.226648],[-77.475917,43.227545],[-77.475936,43.228427],[-77.475949,43.229306],[-77.475965,43.230411]]],"type":"Polygon"}
}