{
  "id": "360050110001",
  "type": "Feature",
  "properties": {
    "area_land":2069297,
    "area_water":0,
    "geoid":"360050110001",
    "name":"Block Group 1",
    "state":"ny"
},
  "bbox": [
    -73.840426,
    40.804816,
    -73.82319,
    40.828464
],
  "geometry": {"coordinates":[[[-73.840068,40.813601],[-73.839907,40.81447],[-73.839872,40.815539],[-73.83985800000001,40.815976],[-73.83998,40.816391],[-73.838959,40.816369],[-73.837327,40.816346],[-73.836961,40.816341],[-73.836738,40.817193],[-73.836708,40.817554],[-73.83673400000001,40.817822],[-73.83645,40.81784],[-73.836032,40.817856],[-73.83594100000001,40.819987],[-73.83602,40.82376],[-73.83620999999999,40.824974],[-73.83643499999999,40.826374],[-73.836544,40.82712],[-73.83669399999999,40.827892],[-73.83674600000001,40.828198],[-73.836777,40.828274],[-73.83681300000001,40.828386],[-73.836838,40.828464],[-73.83643600000001,40.828395],[-73.83629999999999,40.828369],[-73.83617,40.828334],[-73.835999,40.828313],[-73.835336,40.828192],[-73.832441,40.827148],[-73.831498,40.826806],[-73.83110600000001,40.826819],[-73.82918600000001,40.82618],[-73.829097,40.826154],[-73.827493,40.825677],[-73.82463799999999,40.824766],[-73.824793,40.82469],[-73.82518,40.824501],[-73.827882,40.823176],[-73.829459,40.822377],[-73.828329,40.82104],[-73.82719299999999,40.821603],[-73.826717,40.821819],[-73.82536899999999,40.820212],[-73.824191,40.818385],[-73.823707,40.817649],[-73.823345,40.816958],[-73.82319,40.816673],[-73.82408100000001,40.816351],[-73.824973,40.81605],[-73.825801,40.815764],[-73.826652,40.815466],[-73.82750900000001,40.81517],[-73.828298,40.814811],[-73.827263,40.812934],[-73.82665799999999,40.811955],[-73.82659200000001,40.811612],[-73.826345,40.811196],[-73.82956799999999,40.811069],[-73.830377,40.810594],[-73.83105,40.810009],[-73.831585,40.809436],[-73.831897,40.808863],[-73.832009,40.808278],[-73.831971,40.807481],[-73.83174699999999,40.80702],[-73.83143,40.80683],[-73.831453,40.806597],[-73.831648,40.80631],[-73.83168499999999,40.806098],[-73.83153900000001,40.805726],[-73.831582,40.805288],[-73.83159499999999,40.805153],[-73.831603,40.805074],[-73.83167299999999,40.805033],[-73.831698,40.805018],[-73.831833,40.804939],[-73.831959,40.804865],[-73.832881,40.804816],[-73.83449899999999,40.805015],[-73.835919,40.805588],[-73.83647999999999,40.805922],[-73.83798400000001,40.806226],[-73.839018,40.808216],[-73.84042599999999,40.811873],[-73.840068,40.813601]]],"type":"Polygon"}
}