{
  "id": "360670133002",
  "type": "Feature",
  "properties": {
    "area_land":743329,
    "area_water":0,
    "geoid":"360670133002",
    "name":"Block Group 2",
    "state":"ny"
},
  "bbox": [
    -76.21772,
    43.096377,
    -76.198718,
    43.106913
],
  "geometry": {"coordinates":[[[-76.21772,43.103882],[-76.217226,43.104199],[-76.215829,43.103522],[-76.21570699999999,43.103684],[-76.21563999999999,43.103829],[-76.215537,43.103753],[-76.215406,43.103695],[-76.215045,43.103618],[-76.213894,43.103355],[-76.21359699999999,43.103285],[-76.212768,43.103107],[-76.212135,43.102964],[-76.21168299999999,43.104056],[-76.211223,43.105182],[-76.210995,43.105126],[-76.209412,43.104777],[-76.208187,43.104514],[-76.208071,43.104513],[-76.208043,43.104473],[-76.207887,43.104334],[-76.207628,43.10417],[-76.207587,43.104208],[-76.206777,43.104946],[-76.206637,43.105087],[-76.206501,43.105225],[-76.206255,43.10545],[-76.205664,43.106016],[-76.204716,43.106913],[-76.204632,43.106905],[-76.20455200000001,43.106886],[-76.203175,43.106164],[-76.20277400000001,43.105924],[-76.202213,43.105625],[-76.202118,43.105562],[-76.201987,43.10545],[-76.201947,43.105377],[-76.201931,43.1053],[-76.200576,43.104551],[-76.200137,43.104169],[-76.200756,43.103304],[-76.199547,43.102774],[-76.198831,43.10246],[-76.198718,43.102311],[-76.19902999999999,43.102149],[-76.19922200000001,43.102011],[-76.199461,43.101435],[-76.19984599999999,43.100529],[-76.200817,43.098544],[-76.201522,43.097554],[-76.20156799999999,43.097538],[-76.201611,43.097523],[-76.201655,43.097507],[-76.201836,43.097439],[-76.202005,43.097286],[-76.202135,43.097205],[-76.202296,43.097148],[-76.203459,43.096377],[-76.203549,43.096473],[-76.203587,43.096504],[-76.20376,43.096568],[-76.203811,43.096614],[-76.20394899999999,43.096875],[-76.204195,43.097129],[-76.204311,43.097221],[-76.204696,43.097435],[-76.204796,43.097543],[-76.204865,43.097581],[-76.204977,43.097596],[-76.205077,43.097635],[-76.2052,43.097716],[-76.20522,43.097789],[-76.20520399999999,43.097804],[-76.205135,43.097831],[-76.205125,43.097863],[-76.20513099999999,43.097881],[-76.20532300000001,43.097877],[-76.205358,43.0979],[-76.20543499999999,43.098058],[-76.20545799999999,43.098085],[-76.205735,43.098245],[-76.20578500000001,43.098256],[-76.205828,43.098245],[-76.205882,43.098214],[-76.20598200000001,43.098218],[-76.206036,43.098245],[-76.20606600000001,43.098279],[-76.206063,43.098348],[-76.20604299999999,43.098379],[-76.20604299999999,43.098414],[-76.20606600000001,43.098433],[-76.206093,43.098441],[-76.20623999999999,43.098379],[-76.206294,43.098383],[-76.206344,43.098518],[-76.206363,43.098629],[-76.20639,43.09866],[-76.20645500000001,43.098702],[-76.206513,43.098718],[-76.206563,43.098752],[-76.206582,43.098798],[-76.206598,43.098868],[-76.206644,43.098898],[-76.20682100000001,43.098914],[-76.20687100000001,43.098941],[-76.206906,43.099002],[-76.20694399999999,43.099118],[-76.206987,43.099187],[-76.207037,43.099221],[-76.20707899999999,43.099237],[-76.207268,43.099256],[-76.207302,43.099268],[-76.207691,43.09955],[-76.20775999999999,43.099585],[-76.207949,43.099635],[-76.20828899999999,43.099892],[-76.208742,43.100027],[-76.209118,43.100038],[-76.20955600000001,43.09998],[-76.209608,43.099949],[-76.20966,43.099902],[-76.20977000000001,43.099782],[-76.20991600000001,43.099746],[-76.210103,43.099782],[-76.210359,43.099892],[-76.210453,43.099986],[-76.210604,43.100158],[-76.21060900000001,43.100194],[-76.210573,43.100236],[-76.210521,43.100241],[-76.210494,43.10021],[-76.210296,43.100017],[-76.210093,43.099913],[-76.209957,43.099871],[-76.209874,43.099881],[-76.20984300000001,43.099897],[-76.209733,43.100043],[-76.209665,43.100173],[-76.209613,43.100225],[-76.209571,43.100246],[-76.209519,43.100236],[-76.209462,43.10022],[-76.209425,43.100241],[-76.20941500000001,43.100278],[-76.20941500000001,43.100314],[-76.209458,43.100372],[-76.209739,43.100798],[-76.209858,43.100937],[-76.20990500000001,43.100968],[-76.21070899999999,43.101266],[-76.210921,43.101327],[-76.21099,43.101323],[-76.21104800000001,43.101308],[-76.21109,43.101273],[-76.211313,43.100904],[-76.21144700000001,43.100672],[-76.211474,43.100607],[-76.211479,43.100552],[-76.21146400000001,43.100502],[-76.211214,43.100198],[-76.211214,43.100173],[-76.211225,43.100156],[-76.211271,43.100152],[-76.21146400000001,43.100373],[-76.211518,43.100438],[-76.21154,43.100487],[-76.211545,43.100527],[-76.21158699999999,43.100735],[-76.211668,43.100946],[-76.211749,43.101112],[-76.212014,43.101433],[-76.212422,43.101825],[-76.212873,43.102058],[-76.213296,43.102246],[-76.214213,43.10257],[-76.21550999999999,43.103121],[-76.215695,43.103175],[-76.215864,43.103195],[-76.21594899999999,43.103191],[-76.21628800000001,43.10311],[-76.216345,43.10311],[-76.216418,43.103133],[-76.21649499999999,43.103179],[-76.216757,43.103393],[-76.216992,43.10355],[-76.21743499999999,43.103771],[-76.217617,43.103844],[-76.21772,43.103882]]],"type":"Polygon"}
}