{
  "id": "360810739005",
  "type": "Feature",
  "properties": {
    "area_land":33049,
    "area_water":0,
    "geoid":"360810739005",
    "name":"Block Group 5",
    "state":"ny"
},
  "bbox": [
    -73.843978,
    40.720065,
    -73.840529,
    40.722314
],
  "geometry": {"coordinates":[[[-73.84397800000001,40.721455],[-73.84153999999999,40.722314],[-73.841199,40.721649],[-73.840858,40.720984],[-73.840529,40.720324],[-73.840852,40.720065],[-73.841853,40.720507],[-73.842174,40.720614],[-73.84289200000001,40.720967],[-73.84397800000001,40.721455]]],"type":"Polygon"}
}