{
  "id": "361190021052",
  "type": "Feature",
  "properties": {
    "area_land":759692,
    "area_water":0,
    "geoid":"361190021052",
    "name":"Block Group 2",
    "state":"ny"
},
  "bbox": [
    -73.824719,
    40.973318,
    -73.810425,
    40.988393
],
  "geometry": {"coordinates":[[[-73.82453,40.975675],[-73.824308,40.976365],[-73.82404200000001,40.977016],[-73.823823,40.977568],[-73.823815,40.97759],[-73.82377700000001,40.977711],[-73.823773,40.97779],[-73.823791,40.977867],[-73.823832,40.977949],[-73.82394499999999,40.978129],[-73.823978,40.978229],[-73.823981,40.978286],[-73.82396300000001,40.978351],[-73.823752,40.978808],[-73.823674,40.978955],[-73.823346,40.97991],[-73.823224,40.980375],[-73.82300600000001,40.981253],[-73.82289400000001,40.98163],[-73.822175,40.983538],[-73.821853,40.984332],[-73.820476,40.984071],[-73.819919,40.983942],[-73.819632,40.983853],[-73.81946000000001,40.983781],[-73.819256,40.983667],[-73.81913,40.983586],[-73.81902599999999,40.983489],[-73.81893599999999,40.983381],[-73.81885699999999,40.983263],[-73.81872199999999,40.98299],[-73.818669,40.983023],[-73.818583,40.983102],[-73.818504,40.983229],[-73.81847500000001,40.983304],[-73.818403,40.983426],[-73.818228,40.983673],[-73.81819,40.983744],[-73.818095,40.983921],[-73.81791200000001,40.984182],[-73.81788299999999,40.984368],[-73.81785499999999,40.9846],[-73.817815,40.984714],[-73.817729,40.984883],[-73.81747799999999,40.985318],[-73.817442,40.985408],[-73.817438,40.985501],[-73.817448,40.985605],[-73.817362,40.986161],[-73.81735999999999,40.986332],[-73.81740600000001,40.986462],[-73.817403,40.986551],[-73.817375,40.986683],[-73.817296,40.986898],[-73.817136,40.987177],[-73.817016,40.987402],[-73.816981,40.987503],[-73.815309,40.987708],[-73.81502,40.987756],[-73.813997,40.987922],[-73.813084,40.988092],[-73.812817,40.988129],[-73.81184500000001,40.988225],[-73.81155699999999,40.988281],[-73.81137200000001,40.988299],[-73.811205,40.988315],[-73.81097200000001,40.988345],[-73.810855,40.98835],[-73.810425,40.988393],[-73.81068399999999,40.987908],[-73.810958,40.987392],[-73.811194,40.987074],[-73.811336,40.986854],[-73.811733,40.986164],[-73.81244,40.984845],[-73.812613,40.984622],[-73.813605,40.983671],[-73.813726,40.983554],[-73.81487799999999,40.982776],[-73.814678,40.981998],[-73.814503,40.98182],[-73.814167,40.981494],[-73.814285,40.980721],[-73.81373000000001,40.980126],[-73.813581,40.979453],[-73.813979,40.979432],[-73.814199,40.979442],[-73.81461,40.979457],[-73.815342,40.979527],[-73.81555400000001,40.979559],[-73.81643,40.979691],[-73.81701,40.979769],[-73.817156,40.979425],[-73.817249,40.979252],[-73.817504,40.978933],[-73.81766500000001,40.978769],[-73.81787,40.978604],[-73.81806,40.978496],[-73.81844,40.978369],[-73.81871599999999,40.978258],[-73.818881,40.978175],[-73.81906499999999,40.978054],[-73.819365,40.977799],[-73.81961099999999,40.977556],[-73.819712,40.977456],[-73.81989299999999,40.977281],[-73.82011199999999,40.977037],[-73.820172,40.976944],[-73.82019699999999,40.976906],[-73.820266,40.976801],[-73.82047,40.976344],[-73.820571,40.976208],[-73.8207,40.976089],[-73.820981,40.975904],[-73.821342,40.97567],[-73.821392,40.975622],[-73.821485,40.975493],[-73.821611,40.975285],[-73.821675,40.9752],[-73.821708,40.975156],[-73.821939,40.975009],[-73.82217799999999,40.974848],[-73.82235,40.974692],[-73.822472,40.974555],[-73.822558,40.974416],[-73.822622,40.974233],[-73.822669,40.974025],[-73.822716,40.973564],[-73.822759,40.973318],[-73.822791,40.973397],[-73.82303899999999,40.973868],[-73.82309600000001,40.973969],[-73.82324699999999,40.974236],[-73.823466,40.974569],[-73.823577,40.974702],[-73.82375399999999,40.974842],[-73.82382800000001,40.974895],[-73.82401900000001,40.975006],[-73.82429,40.975163],[-73.824719,40.975354],[-73.82453,40.975675]]],"type":"Polygon"}
}