{
  "id": "360610230005",
  "type": "Feature",
  "properties": {
    "area_land":21705,
    "area_water":0,
    "geoid":"360610230005",
    "name":"Block Group 5",
    "state":"ny"
},
  "bbox": [
    -73.941391,
    40.817282,
    -73.938087,
    40.819097
],
  "geometry": {"coordinates":[[[-73.94092999999999,40.819097],[-73.938478,40.818065],[-73.938087,40.8179],[-73.938338,40.817555],[-73.93853900000001,40.817282],[-73.941391,40.818471],[-73.94092999999999,40.819097]]],"type":"Polygon"}
}