{
  "id": "360210010003",
  "type": "Feature",
  "properties": {
    "area_land":2962844,
    "area_water":13367,
    "geoid":"360210010003",
    "name":"Block Group 3",
    "state":"ny"
},
  "bbox": [
    -73.666445,
    42.247659,
    -73.631208,
    42.265895
],
  "geometry": {"coordinates":[[[-73.666445,42.263176],[-73.666425,42.263355],[-73.666366,42.263555],[-73.666319,42.263669],[-73.665627,42.264873],[-73.6653,42.265397],[-73.66515200000001,42.26557],[-73.66497099999999,42.265728],[-73.664795,42.265855],[-73.66475,42.265887],[-73.66473499999999,42.265895],[-73.66463899999999,42.265876],[-73.66231399999999,42.265057],[-73.66127299999999,42.264744],[-73.656041,42.262852],[-73.65576299999999,42.262752],[-73.65145099999999,42.261405],[-73.649708,42.260791],[-73.64733200000001,42.259954],[-73.647066,42.25987],[-73.64499600000001,42.259483],[-73.641542,42.258707],[-73.641358,42.258667],[-73.631208,42.256483],[-73.631283,42.256456],[-73.631409,42.256403],[-73.631726,42.256254],[-73.632437,42.255863],[-73.632992,42.255603],[-73.633517,42.255368],[-73.63369400000001,42.255289],[-73.63450400000001,42.254902],[-73.63467799999999,42.254809],[-73.63593,42.254049],[-73.636263,42.253878],[-73.63688500000001,42.253579],[-73.637103,42.253493],[-73.637277,42.253424],[-73.63790400000001,42.253248],[-73.63803799999999,42.25322],[-73.638187,42.253189],[-73.63885399999999,42.253079],[-73.63918,42.25301],[-73.63937799999999,42.252957],[-73.63955300000001,42.2529],[-73.64018900000001,42.252666],[-73.640879,42.252371],[-73.641187,42.252259],[-73.64173099999999,42.252093],[-73.64229,42.251885],[-73.642534,42.251757],[-73.643306,42.25116],[-73.64354,42.251003],[-73.643811,42.250839],[-73.643879,42.250799],[-73.64390899999999,42.250781],[-73.644003,42.250735],[-73.644263,42.250649],[-73.64553600000001,42.250248],[-73.64649300000001,42.249916],[-73.64674100000001,42.24983],[-73.646934,42.249757],[-73.647648,42.249502],[-73.647965,42.249399],[-73.648228,42.249332],[-73.648977,42.249176],[-73.64901999999999,42.249167],[-73.649058,42.249159],[-73.649857,42.248985],[-73.650659,42.248789],[-73.65097299999999,42.248681],[-73.65131100000001,42.248527],[-73.651555,42.248391],[-73.652006,42.248094],[-73.65226800000001,42.247911],[-73.652444,42.247806],[-73.65254899999999,42.247758],[-73.65270200000001,42.247703],[-73.652845,42.247672],[-73.65301100000001,42.247659],[-73.653178,42.24767],[-73.653367,42.247707],[-73.653612,42.247799],[-73.653803,42.247904],[-73.654608,42.248449],[-73.654804,42.248558],[-73.65527400000001,42.248766],[-73.65549300000001,42.248843],[-73.655655,42.248883],[-73.655833,42.248905],[-73.656099,42.248892],[-73.656424,42.248858],[-73.65734999999999,42.248749],[-73.65799800000001,42.248698],[-73.65808,42.248691],[-73.658365,42.248687],[-73.65853199999999,42.248697],[-73.658604,42.248706],[-73.658698,42.248719],[-73.658884,42.248783],[-73.659042,42.248884],[-73.659114,42.248949],[-73.659218,42.249105],[-73.659272,42.249205],[-73.65964099999999,42.250167],[-73.65972600000001,42.250422],[-73.659797,42.250703],[-73.659915,42.251517],[-73.659989,42.251688],[-73.660043,42.251776],[-73.660217,42.251926],[-73.66041300000001,42.252047],[-73.660507,42.252099],[-73.660757,42.252206],[-73.66114899999999,42.252322],[-73.661208,42.25234],[-73.661503,42.252409],[-73.661529,42.252414],[-73.66217899999999,42.252547],[-73.662599,42.25266],[-73.663106,42.252838],[-73.664063,42.253227],[-73.664222,42.253272],[-73.66444300000001,42.253309],[-73.664563,42.253314],[-73.664732,42.253306],[-73.664913,42.253285],[-73.66513399999999,42.253236],[-73.665601,42.253081],[-73.6657,42.253289],[-73.66588299999999,42.253899],[-73.666195,42.254704],[-73.666239,42.254843],[-73.666246,42.2549],[-73.666246,42.254966],[-73.66623800000001,42.255035],[-73.666206,42.255126],[-73.666146,42.255229],[-73.66608600000001,42.255311],[-73.6656,42.255877],[-73.665357,42.256221],[-73.664861,42.256978],[-73.66447599999999,42.25754],[-73.664368,42.257743],[-73.664334,42.257904],[-73.664339,42.258122],[-73.664378,42.25833],[-73.664417,42.25842],[-73.664513,42.258592],[-73.665195,42.259495],[-73.665302,42.25965],[-73.665431,42.259892],[-73.665604,42.260325],[-73.665859,42.261058],[-73.666112,42.261724],[-73.666252,42.262141],[-73.66637299999999,42.262588],[-73.666445,42.262987],[-73.666445,42.263176]]],"type":"Polygon"}
}