{
  "id": "360470304002",
  "type": "Feature",
  "properties": {
    "area_land":81898,
    "area_water":0,
    "geoid":"360470304002",
    "name":"Block Group 2",
    "state":"ny"
},
  "bbox": [
    -73.996747,
    40.593173,
    -73.992389,
    40.597093
],
  "geometry": {"coordinates":[[[-73.996747,40.595643],[-73.995225,40.597093],[-73.994523,40.596607],[-73.99384499999999,40.596141],[-73.993134,40.595661],[-73.992389,40.595211],[-73.994021,40.593645],[-73.99420600000001,40.593534],[-73.99429000000001,40.593619],[-73.99524700000001,40.593173],[-73.996194,40.593992],[-73.99530799999999,40.594428],[-73.995499,40.594594],[-73.996116,40.595116],[-73.996747,40.595643]]],"type":"Polygon"}
}