{
  "id": "361190040002",
  "type": "Feature",
  "properties": {
    "area_land":150724,
    "area_water":0,
    "geoid":"361190040002",
    "name":"Block Group 2",
    "state":"ny"
},
  "bbox": [
    -73.834026,
    40.911465,
    -73.825826,
    40.914811
],
  "geometry": {"coordinates":[[[-73.83402599999999,40.912492],[-73.83401600000001,40.912607],[-73.83401499999999,40.913042],[-73.83326099999999,40.913231],[-73.833017,40.913278],[-73.832945,40.913283],[-73.83310299999999,40.914572],[-73.832016,40.914632],[-73.830935,40.914701],[-73.829982,40.914751],[-73.829373,40.914784],[-73.829069,40.914811],[-73.828866,40.913641],[-73.828709,40.912712],[-73.826368,40.912953],[-73.82623599999999,40.912157],[-73.826216,40.912125],[-73.82616899999999,40.91209],[-73.826064,40.912058],[-73.825952,40.912049],[-73.82582600000001,40.911512],[-73.82616,40.911483],[-73.826533,40.911465],[-73.827077,40.911469],[-73.827247,40.911477],[-73.827451,40.911487],[-73.82769999999999,40.911499],[-73.828131,40.911532],[-73.82874,40.911603],[-73.829609,40.911704],[-73.83086,40.911889],[-73.83287300000001,40.912188],[-73.833744,40.912259],[-73.834019,40.912263],[-73.834018,40.912398],[-73.83402599999999,40.912492]]],"type":"Polygon"}
}