{
  "id": "361019607004",
  "type": "Feature",
  "properties": {
    "area_land":285078,
    "area_water":0,
    "geoid":"361019607004",
    "name":"Block Group 4",
    "state":"ny"
},
  "bbox": [
    -77.665529,
    42.325233,
    -77.653514,
    42.330732
],
  "geometry": {"coordinates":[[[-77.66552900000001,42.329135],[-77.66522999999999,42.329249],[-77.664703,42.329454],[-77.66378400000001,42.329924],[-77.66340599999999,42.330097],[-77.663358,42.330118],[-77.663273,42.330157],[-77.663229,42.330177],[-77.662965,42.330288],[-77.662143,42.330565],[-77.66183700000001,42.330634],[-77.661545,42.330689],[-77.661202,42.330705],[-77.660838,42.330722],[-77.659149,42.330727],[-77.657582,42.330732],[-77.65767700000001,42.330585],[-77.658417,42.329468],[-77.657888,42.329274],[-77.65615,42.328636],[-77.655557,42.328417],[-77.655109,42.328256],[-77.6549,42.328181],[-77.653514,42.327676],[-77.653944,42.327023],[-77.65419300000001,42.326645],[-77.65497499999999,42.325458],[-77.65514,42.325233],[-77.65570700000001,42.325444],[-77.65651,42.325739],[-77.656797,42.325844],[-77.65745800000001,42.326086],[-77.658145,42.326337],[-77.65848,42.326462],[-77.65993400000001,42.327001],[-77.660032,42.327037],[-77.66158900000001,42.327594],[-77.662221,42.327838],[-77.66229300000001,42.327866],[-77.66237099999999,42.327896],[-77.662893,42.328085],[-77.663445,42.328295],[-77.663611,42.328358],[-77.664097,42.328533],[-77.664326,42.328617],[-77.66445400000001,42.328665],[-77.664646,42.328736],[-77.664799,42.328796],[-77.66491600000001,42.328843],[-77.665299,42.329021],[-77.66552900000001,42.329135]]],"type":"Polygon"}
}