{
  "id": "360811215002",
  "type": "Feature",
  "properties": {
    "area_land":124336,
    "area_water":0,
    "geoid":"360811215002",
    "name":"Block Group 2",
    "state":"ny"
},
  "bbox": [
    -73.814995,
    40.740492,
    -73.807298,
    40.742974
],
  "geometry": {"coordinates":[[[-73.81481100000001,40.741367],[-73.81476600000001,40.741493],[-73.81459,40.742076],[-73.814549,40.742195],[-73.81430899999999,40.742974],[-73.812956,40.742739],[-73.812029,40.742594],[-73.811092,40.742447],[-73.810506,40.742354],[-73.81013299999999,40.742295],[-73.809167,40.742152],[-73.808238,40.742011],[-73.807298,40.741994],[-73.807395,40.740492],[-73.808333,40.740529],[-73.809271,40.740563],[-73.810244,40.740601],[-73.811216,40.740637],[-73.812155,40.740673],[-73.81309,40.740709],[-73.81402300000001,40.740746],[-73.814995,40.740787],[-73.81481100000001,40.741367]]],"type":"Polygon"}
}