{
  "id": "360290147024",
  "type": "Feature",
  "properties": {
    "area_land":8360243,
    "area_water":91661,
    "geoid":"360290147024",
    "name":"Block Group 4",
    "state":"ny"
},
  "bbox": [
    -78.633828,
    42.954753,
    -78.577546,
    42.978269
],
  "geometry": {"coordinates":[[[-78.63382799999999,42.972674],[-78.63093600000001,42.973291],[-78.629884,42.97352],[-78.629036,42.973704],[-78.62895399999999,42.973721],[-78.628826,42.973748],[-78.627579,42.974009],[-78.62491300000001,42.974567],[-78.62342700000001,42.974874],[-78.621409,42.975279],[-78.619876,42.975599],[-78.619674,42.975641],[-78.619635,42.975649],[-78.619561,42.975665],[-78.61769700000001,42.976081],[-78.616709,42.976301],[-78.616283,42.976396],[-78.615891,42.976479],[-78.615218,42.976621],[-78.61340300000001,42.977005],[-78.613332,42.97702],[-78.609673,42.97779],[-78.60739700000001,42.978269],[-78.60740800000001,42.976917],[-78.60745900000001,42.974639],[-78.607461,42.974414],[-78.607489,42.971375],[-78.607607,42.968962],[-78.607626,42.968541],[-78.607716,42.966454],[-78.607641,42.966452],[-78.606754,42.966424],[-78.606517,42.966417],[-78.606168,42.966407],[-78.60264599999999,42.966303],[-78.600246,42.966231],[-78.59829000000001,42.966173],[-78.592753,42.966002],[-78.59255,42.969588],[-78.592502,42.970407],[-78.592438,42.971941],[-78.59164199999999,42.971933],[-78.590565,42.971927],[-78.589168,42.971919],[-78.587996,42.97191],[-78.587898,42.97191],[-78.582662,42.971885],[-78.579005,42.970678],[-78.578137,42.970369],[-78.577546,42.970211],[-78.577746,42.960158],[-78.577789,42.959957],[-78.57794199999999,42.958775],[-78.577949,42.958506],[-78.578039,42.95516],[-78.578048,42.954758],[-78.590745,42.954753],[-78.591825,42.954753],[-78.59205900000001,42.954753],[-78.592648,42.954806],[-78.59307200000001,42.954775],[-78.59324599999999,42.954759],[-78.594134,42.954773],[-78.612712,42.955077],[-78.627893,42.955371],[-78.632341,42.955457],[-78.63236999999999,42.956529],[-78.632385,42.957071],[-78.632384,42.958828],[-78.632384,42.958865],[-78.63237700000001,42.960002],[-78.63245499999999,42.963307],[-78.632474,42.965467],[-78.632481,42.965742],[-78.63249,42.966061],[-78.632553,42.966803],[-78.63273599999999,42.9677],[-78.632965,42.968542],[-78.632986,42.968618],[-78.63315,42.969333],[-78.63338400000001,42.970394],[-78.63382799999999,42.972674]]],"type":"Polygon"}
}