{
  "id": "360070013004",
  "type": "Feature",
  "properties": {
    "area_land":242769,
    "area_water":0,
    "geoid":"360070013004",
    "name":"Block Group 4",
    "state":"ny"
},
  "bbox": [
    -75.937991,
    42.10158,
    -75.926385,
    42.10974
],
  "geometry": {"coordinates":[[[-75.937991,42.10974],[-75.934962,42.108189],[-75.933024,42.107198],[-75.931629,42.106481],[-75.93037099999999,42.105845],[-75.930255,42.105785],[-75.929481,42.10539],[-75.929211,42.105251],[-75.928515,42.104931],[-75.928106,42.104769],[-75.92796300000001,42.104712],[-75.92770299999999,42.104618],[-75.927408,42.104529],[-75.927353,42.104512],[-75.927014,42.104415],[-75.926762,42.104359],[-75.926385,42.104284],[-75.926406,42.104217],[-75.926418,42.10418],[-75.926557,42.103757],[-75.926806,42.10293],[-75.92728700000001,42.10158],[-75.92846400000001,42.102245],[-75.929541,42.102842],[-75.93013000000001,42.103168],[-75.93160899999999,42.103988],[-75.931859,42.104126],[-75.931996,42.104202],[-75.932968,42.104739],[-75.934071,42.105348],[-75.935125,42.105931],[-75.936173,42.106509],[-75.936852,42.106884],[-75.936972,42.107225],[-75.937014,42.107325],[-75.93708599999999,42.107451],[-75.937651,42.108896],[-75.937882,42.109467],[-75.937991,42.10974]]],"type":"Polygon"}
}