{
  "id": "360050370001",
  "type": "Feature",
  "properties": {
    "area_land":55899,
    "area_water":0,
    "geoid":"360050370001",
    "name":"Block Group 1",
    "state":"ny"
},
  "bbox": [
    -73.858488,
    40.87125,
    -73.856513,
    40.874704
],
  "geometry": {"coordinates":[[[-73.85843199999999,40.873067],[-73.85839,40.874077],[-73.858029,40.874704],[-73.85744200000001,40.874514],[-73.85651300000001,40.874218],[-73.856551,40.87303],[-73.85661399999999,40.87125],[-73.85754799999999,40.871267],[-73.85848799999999,40.871284],[-73.85843199999999,40.873067]]],"type":"Polygon"}
}