{
  "id": "360850156013",
  "type": "Feature",
  "properties": {
    "area_land":202213,
    "area_water":0,
    "geoid":"360850156013",
    "name":"Block Group 3",
    "state":"ny"
},
  "bbox": [
    -74.153397,
    40.537701,
    -74.145912,
    40.543497
],
  "geometry": {"coordinates":[[[-74.15293,40.540801],[-74.15154,40.541876],[-74.149838,40.543217],[-74.149152,40.542767],[-74.148461,40.542321],[-74.147465,40.543497],[-74.147293,40.543359],[-74.146811,40.543004],[-74.145912,40.542424],[-74.147103,40.541012],[-74.14789399999999,40.540066],[-74.148143,40.539775],[-74.148544,40.539288],[-74.149024,40.538715],[-74.149359,40.538327],[-74.149591,40.538067],[-74.15000999999999,40.537701],[-74.151391,40.538479],[-74.15179000000001,40.538843],[-74.153397,40.54048],[-74.15293,40.540801]]],"type":"Polygon"}
}