{
  "id": "360630225001",
  "type": "Feature",
  "properties": {
    "area_land":607275,
    "area_water":0,
    "geoid":"360630225001",
    "name":"Block Group 1",
    "state":"ny"
},
  "bbox": [
    -78.950123,
    43.089437,
    -78.941852,
    43.099373
],
  "geometry": {"coordinates":[[[-78.950123,43.099308],[-78.949153,43.099308],[-78.948942,43.09931],[-78.945402,43.099357],[-78.94422299999999,43.099373],[-78.944175,43.099264],[-78.944034,43.098938],[-78.94398700000001,43.09883],[-78.94386900000001,43.097906],[-78.943623,43.095971],[-78.942781,43.095922],[-78.941852,43.095869],[-78.941855,43.095736],[-78.941868,43.095337],[-78.941873,43.095205],[-78.941908,43.094613],[-78.942015,43.092841],[-78.94205100000001,43.09225],[-78.942126,43.091133],[-78.94224,43.091024],[-78.942431,43.090917],[-78.942652,43.090833],[-78.942818,43.090798],[-78.942879,43.090785],[-78.943522,43.090719],[-78.943742,43.090684],[-78.943983,43.090606],[-78.94445,43.090401],[-78.94567600000001,43.089771],[-78.946072,43.089587],[-78.946245,43.089535],[-78.946455,43.089495],[-78.946609,43.089493],[-78.946793,43.089509],[-78.947248,43.089573],[-78.947751,43.089672],[-78.948027,43.089714],[-78.948162,43.089714],[-78.94944599999999,43.089471],[-78.949574,43.089437],[-78.94968299999999,43.089649],[-78.949702,43.090072],[-78.949761,43.091341],[-78.949781,43.091764],[-78.9498,43.092252],[-78.94985800000001,43.093716],[-78.949878,43.094205],[-78.949895,43.09469],[-78.949944,43.096087],[-78.949945,43.096148],[-78.94995400000001,43.096576],[-78.94996,43.096634],[-78.949963,43.096695],[-78.94997499999999,43.096879],[-78.94997600000001,43.096889],[-78.949978,43.096941],[-78.94998,43.097032],[-78.949989,43.097308],[-78.94999199999999,43.0974],[-78.95000400000001,43.097764],[-78.95000400000001,43.097783],[-78.95003699999999,43.0989],[-78.95004299999999,43.098933],[-78.950086,43.099164],[-78.950123,43.099308]]],"type":"Polygon"}
}