{
  "id": "360811283001",
  "type": "Feature",
  "properties": {
    "area_land":1971930,
    "area_water":0,
    "geoid":"360811283001",
    "name":"Block Group 1",
    "state":"ny"
},
  "bbox": [
    -73.778038,
    40.722442,
    -73.756774,
    40.74583
],
  "geometry": {"coordinates":[[[-73.778038,40.723284],[-73.777817,40.723339],[-73.77758300000001,40.723418],[-73.77739,40.723498],[-73.777182,40.723607],[-73.77699,40.723731],[-73.776832,40.723851],[-73.77666600000001,40.724009],[-73.776546,40.724145],[-73.776422,40.724323],[-73.776338,40.724469],[-73.775234,40.725238],[-73.775561,40.72597],[-73.77596200000001,40.726813],[-73.77672800000001,40.72843],[-73.777575,40.730193],[-73.776685,40.730439],[-73.77580399999999,40.73068],[-73.774913,40.730913],[-73.77399699999999,40.731081],[-73.77307,40.731249],[-73.77228599999999,40.731391],[-73.77152700000001,40.731522],[-73.770107,40.731779],[-73.77286100000001,40.736276],[-73.77329400000001,40.737297],[-73.77377,40.738648],[-73.774198,40.739913],[-73.774264,40.740122],[-73.774559,40.740817],[-73.775588,40.743006],[-73.77566,40.743167],[-73.77567999999999,40.743211],[-73.775718,40.743295],[-73.77575899999999,40.743367],[-73.77443599999999,40.743566],[-73.772445,40.74392],[-73.771638,40.744197],[-73.77147100000001,40.744262],[-73.770432,40.744781],[-73.76947800000001,40.745247],[-73.768626,40.745583],[-73.768277,40.745695],[-73.768045,40.745762],[-73.76775600000001,40.74583],[-73.76770999999999,40.74573],[-73.76761500000001,40.745526],[-73.76697900000001,40.744223],[-73.76680899999999,40.744016],[-73.76668100000001,40.743894],[-73.76658500000001,40.743816],[-73.766451,40.743721],[-73.766273,40.743616],[-73.766175,40.743567],[-73.765568,40.743258],[-73.765151,40.742437],[-73.764315,40.740673],[-73.763609,40.739175],[-73.76319100000001,40.738308],[-73.762683,40.737256],[-73.762597,40.737087],[-73.762531,40.736912],[-73.762486,40.736731],[-73.762472,40.736621],[-73.762463,40.736548],[-73.762463,40.736364],[-73.762485,40.736182],[-73.762529,40.736004],[-73.762733,40.735262],[-73.765041,40.734477],[-73.764709,40.734085],[-73.7637,40.732864],[-73.764268,40.732767],[-73.764807,40.732674],[-73.764917,40.732655],[-73.765551,40.732544],[-73.765387,40.732365],[-73.764535,40.731469],[-73.764246,40.731211],[-73.763413,40.730466],[-73.762263,40.729605],[-73.762038,40.729452],[-73.76158,40.729156],[-73.761094,40.728869],[-73.760661,40.728616],[-73.76018500000001,40.728369],[-73.760029,40.72829],[-73.759882,40.728235],[-73.758877,40.727746],[-73.75845,40.727537],[-73.757034,40.726608],[-73.75701100000001,40.726587],[-73.75677399999999,40.726376],[-73.756783,40.726306],[-73.75688,40.726279],[-73.757026,40.726246],[-73.75747800000001,40.72613],[-73.758016,40.726032],[-73.75855900000001,40.725969],[-73.759022,40.725924],[-73.75947600000001,40.725892],[-73.75998800000001,40.725879],[-73.760818,40.725962],[-73.76179,40.726083],[-73.762028,40.72611],[-73.762401,40.726161],[-73.763897,40.726364],[-73.764415,40.726441],[-73.7647,40.726479],[-73.76504199999999,40.726488],[-73.765457,40.726474],[-73.766244,40.726403],[-73.767183,40.726264],[-73.76772699999999,40.726169],[-73.768466,40.726039],[-73.76924099999999,40.725903],[-73.77028900000001,40.725634],[-73.771058,40.725485],[-73.771984,40.725229],[-73.77274300000001,40.725035],[-73.77359,40.724742],[-73.774263,40.724416],[-73.774917,40.724088],[-73.776056,40.723356],[-73.777385,40.722442],[-73.777505,40.72257],[-73.777579,40.722642],[-73.777749,40.722842],[-73.77787600000001,40.723037],[-73.778038,40.723284]]],"type":"Polygon"}
}