{
  "id": "360810515001",
  "type": "Feature",
  "properties": {
    "area_land":54829,
    "area_water":0,
    "geoid":"360810515001",
    "name":"Block Group 1",
    "state":"ny"
},
  "bbox": [
    -73.900242,
    40.729019,
    -73.899022,
    40.735149
],
  "geometry": {"coordinates":[[[-73.90014499999999,40.731389],[-73.900074,40.733477],[-73.90006700000001,40.733658],[-73.90006,40.733776],[-73.900054,40.73387],[-73.90002800000001,40.734339],[-73.90000999999999,40.73485],[-73.899022,40.735149],[-73.899055,40.734318],[-73.899072,40.733804],[-73.899079,40.733632],[-73.899103,40.73294],[-73.899143,40.73204],[-73.89917199999999,40.731359],[-73.899198,40.730666],[-73.89924999999999,40.729486],[-73.89924600000001,40.72905],[-73.90024200000001,40.729019],[-73.90014499999999,40.731389]]],"type":"Polygon"}
}