{
  "id": "360810043001",
  "type": "Feature",
  "properties": {
    "area_land":106575,
    "area_water":0,
    "geoid":"360810043001",
    "name":"Block Group 1",
    "state":"ny"
},
  "bbox": [
    -73.939145,
    40.759883,
    -73.933981,
    40.76424
],
  "geometry": {"coordinates":[[[-73.939145,40.760802],[-73.938045,40.762529],[-73.937005,40.76424],[-73.936256,40.763894],[-73.93541399999999,40.763497],[-73.933981,40.762826],[-73.93538700000001,40.761355],[-73.936791,40.759883],[-73.937489,40.760202],[-73.93834200000001,40.760517],[-73.939145,40.760802]]],"type":"Polygon"}
}