{
  "id": "360470804003",
  "type": "Feature",
  "properties": {
    "area_land":89699,
    "area_water":0,
    "geoid":"360470804003",
    "name":"Block Group 3",
    "state":"ny"
},
  "bbox": [
    -73.950416,
    40.655423,
    -73.947159,
    40.658876
],
  "geometry": {"coordinates":[[[-73.950416,40.658693],[-73.94752200000001,40.658876],[-73.947433,40.658031],[-73.947354,40.65728],[-73.947264,40.656437],[-73.947159,40.655594],[-73.947703,40.655562],[-73.95006600000001,40.655423],[-73.95016,40.65626],[-73.950247,40.657095],[-73.950326,40.657838],[-73.950416,40.658693]]],"type":"Polygon"}
}