{
  "id": "360593012001",
  "type": "Feature",
  "properties": {
    "area_land":433527,
    "area_water":0,
    "geoid":"360593012001",
    "name":"Block Group 1",
    "state":"ny"
},
  "bbox": [
    -73.698562,
    40.82478,
    -73.689677,
    40.832332
],
  "geometry": {"coordinates":[[[-73.698562,40.829854],[-73.69855099999999,40.829953],[-73.698499,40.830263],[-73.69848500000001,40.830348],[-73.698156,40.832332],[-73.697551,40.83222],[-73.69744900000001,40.832146],[-73.69739199999999,40.832074],[-73.697298,40.831886],[-73.69654,40.8314],[-73.69631200000001,40.831343],[-73.6943,40.830936],[-73.69351899999999,40.830777],[-73.692487,40.830566],[-73.692149,40.830499],[-73.69208399999999,40.83049],[-73.691885,40.83044],[-73.691575,40.83039],[-73.69138,40.830387],[-73.69111700000001,40.8304],[-73.69103800000001,40.83004],[-73.690945,40.829801],[-73.690883,40.829586],[-73.690614,40.828636],[-73.690592,40.828529],[-73.690461,40.828114],[-73.69042399999999,40.827971],[-73.6902,40.827146],[-73.690139,40.826973],[-73.689922,40.826303],[-73.689677,40.825558],[-73.690196,40.825421],[-73.690381,40.825386],[-73.69076,40.825313],[-73.693682,40.824816],[-73.693805,40.82478],[-73.694062,40.82567],[-73.69652000000001,40.825262],[-73.69778599999999,40.825062],[-73.69800499999999,40.825867],[-73.698178,40.826558],[-73.69823599999999,40.826821],[-73.698334,40.827259],[-73.698357,40.827298],[-73.698466,40.827893],[-73.698514,40.828138],[-73.69853000000001,40.828221],[-73.69855200000001,40.829132],[-73.698555,40.829786],[-73.698562,40.829854]]],"type":"Polygon"}
}