{
  "id": "360471182012",
  "type": "Feature",
  "properties": {
    "area_land":67380,
    "area_water":0,
    "geoid":"360471182012",
    "name":"Block Group 2",
    "state":"ny"
},
  "bbox": [
    -73.874054,
    40.68541,
    -73.870704,
    40.689921
],
  "geometry": {"coordinates":[[[-73.874054,40.689299],[-73.872603,40.689921],[-73.87204199999999,40.687555],[-73.87197,40.687251],[-73.87106900000001,40.687474],[-73.87098,40.687082],[-73.87081499999999,40.686392],[-73.870704,40.685918],[-73.871601,40.685696],[-73.872739,40.68541],[-73.87293,40.686028],[-73.87311200000001,40.686601],[-73.873222,40.686939],[-73.873448,40.687594],[-73.87348799999999,40.687706],[-73.87371899999999,40.688364],[-73.874054,40.689299]]],"type":"Polygon"}
}