{
  "id": "361090014002",
  "type": "Feature",
  "properties": {
    "area_land":22898856,
    "area_water":55995,
    "geoid":"361090014002",
    "name":"Block Group 2",
    "state":"ny"
},
  "bbox": [
    -76.449814,
    42.431969,
    -76.353691,
    42.485075
],
  "geometry": {"coordinates":[[[-76.449814,42.455836],[-76.449442,42.455723],[-76.447633,42.454698],[-76.44690900000001,42.454298],[-76.446093,42.454089],[-76.446011,42.454113],[-76.44493,42.454424],[-76.444563,42.454628],[-76.44448300000001,42.454637],[-76.444447,42.454628],[-76.44441399999999,42.454645],[-76.444305,42.454657],[-76.44387399999999,42.454588],[-76.443653,42.454552],[-76.443443,42.454573],[-76.44184,42.454896],[-76.44100899999999,42.454957],[-76.44012600000001,42.455366],[-76.43937200000001,42.455526],[-76.438766,42.455771],[-76.43855499999999,42.456433],[-76.438458,42.456908],[-76.43836400000001,42.456862],[-76.438151,42.456759],[-76.437704,42.456535],[-76.437352,42.456368],[-76.43703600000001,42.456233],[-76.436273,42.455895],[-76.435667,42.456326],[-76.43379299999999,42.457804],[-76.43345600000001,42.458047],[-76.433086,42.458263],[-76.432687,42.458449],[-76.43200299999999,42.458696],[-76.428129,42.460059],[-76.428055,42.460082],[-76.42756900000001,42.460273],[-76.427404,42.460347],[-76.427415,42.460167],[-76.427438,42.459955],[-76.42765199999999,42.457476],[-76.42773099999999,42.457015],[-76.427914,42.456324],[-76.428551,42.453966],[-76.428595,42.453857],[-76.42865399999999,42.453753],[-76.42872699999999,42.453653],[-76.428815,42.453557],[-76.428923,42.453466],[-76.429292,42.453178],[-76.427593,42.452992],[-76.42691000000001,42.452888],[-76.426689,42.45285],[-76.426339,42.452814],[-76.42598700000001,42.4528],[-76.425635,42.452818],[-76.425325,42.452858],[-76.423996,42.45305],[-76.422585,42.453294],[-76.421476,42.453486],[-76.421099,42.453554],[-76.420796,42.453603],[-76.42009299999999,42.453702],[-76.418646,42.453819],[-76.417601,42.453877],[-76.41650300000001,42.453915],[-76.4158,42.45394],[-76.41540000000001,42.453962],[-76.41522399999999,42.453966],[-76.414691,42.45398],[-76.412148,42.454079],[-76.40686100000001,42.454293],[-76.404663,42.454374],[-76.404461,42.454379],[-76.403099,42.454411],[-76.401847,42.454449],[-76.401566,42.454464],[-76.40071,42.454508],[-76.400806,42.454655],[-76.401005,42.455022],[-76.40198100000001,42.45682],[-76.40213799999999,42.457097],[-76.40405699999999,42.460149],[-76.404304,42.46047],[-76.406342,42.462724],[-76.407016,42.463446],[-76.407481,42.463944],[-76.40800400000001,42.464459],[-76.40841399999999,42.464851],[-76.409305,42.465678],[-76.41040599999999,42.466699],[-76.410473,42.466752],[-76.410804,42.467046],[-76.411112,42.467303],[-76.409958,42.467811],[-76.40946,42.46806],[-76.409235,42.468229],[-76.40910700000001,42.468339],[-76.40901700000001,42.468436],[-76.408931,42.468539],[-76.408828,42.468627],[-76.408688,42.468748],[-76.40842499999999,42.468786],[-76.40804900000001,42.46887],[-76.407488,42.468996],[-76.406783,42.469207],[-76.40622500000001,42.469401],[-76.405535,42.469641],[-76.404391,42.47011],[-76.404245,42.470166],[-76.403429,42.470477],[-76.402992,42.470648],[-76.402788,42.470728],[-76.402142,42.47097],[-76.40175600000001,42.471115],[-76.40143500000001,42.47124],[-76.40136200000001,42.471273],[-76.40108600000001,42.471377],[-76.400732,42.47151],[-76.400657,42.471542],[-76.39971799999999,42.471892],[-76.399643,42.471924],[-76.39879999999999,42.472238],[-76.398594,42.472315],[-76.39755,42.472715],[-76.39712299999999,42.472869],[-76.39704999999999,42.472901],[-76.395929,42.473311],[-76.394462,42.473847],[-76.393247,42.474276],[-76.393173,42.474308],[-76.391572,42.47485],[-76.390917,42.475074],[-76.390406,42.47523],[-76.38952399999999,42.475532],[-76.38853899999999,42.475846],[-76.388465,42.475865],[-76.387714,42.476119],[-76.38744199999999,42.476199],[-76.387193,42.476273],[-76.387078,42.476312],[-76.38688500000001,42.476382],[-76.386651,42.476462],[-76.384445,42.47724],[-76.382074,42.478061],[-76.380639,42.478554],[-76.379471,42.478962],[-76.376508,42.480026],[-76.376273,42.4801],[-76.375908,42.480213],[-76.375614,42.480293],[-76.374844,42.480469],[-76.37366400000001,42.480731],[-76.373425,42.480784],[-76.37132800000001,42.481254],[-76.36950899999999,42.481664],[-76.368048,42.481993],[-76.36753,42.48211],[-76.365897,42.482472],[-76.36579,42.482491],[-76.36339599999999,42.483024],[-76.36126,42.483522],[-76.35950099999999,42.483953],[-76.35909700000001,42.484052],[-76.356072,42.484799],[-76.355116,42.485017],[-76.354832,42.485075],[-76.354833,42.484602],[-76.354821,42.484382],[-76.354815,42.484134],[-76.354778,42.4835],[-76.35472,42.482104],[-76.354675,42.481384],[-76.35460999999999,42.480957],[-76.354513,42.480459],[-76.35445199999999,42.480036],[-76.354423,42.479775],[-76.354422,42.479708],[-76.35440800000001,42.479073],[-76.35442500000001,42.478542],[-76.354466,42.477893],[-76.354482,42.477255],[-76.354473,42.476357],[-76.354437,42.475038],[-76.35441,42.474572],[-76.35439700000001,42.474354],[-76.354373,42.474156],[-76.35431699999999,42.473797],[-76.354277,42.473424],[-76.354249,42.473077],[-76.354224,42.472371],[-76.354219,42.471889],[-76.354203,42.471376],[-76.354184,42.470984],[-76.354151,42.470692],[-76.354119,42.470319],[-76.35407600000001,42.469338],[-76.354066,42.469139],[-76.353943,42.466651],[-76.353917,42.466183],[-76.353914,42.466112],[-76.35386200000001,42.464981],[-76.35385100000001,42.464396],[-76.35382199999999,42.463834],[-76.353801,42.463271],[-76.35371600000001,42.461385],[-76.353691,42.459963],[-76.353694,42.459629],[-76.35370500000001,42.459517],[-76.353731,42.459386],[-76.35377200000001,42.459259],[-76.35382,42.459232],[-76.35382300000001,42.459151],[-76.353893,42.459042],[-76.35406500000001,42.458806],[-76.354675,42.4581],[-76.35513899999999,42.457582],[-76.35642799999999,42.456121],[-76.356759,42.455757],[-76.357361,42.455115],[-76.35811200000001,42.454327],[-76.35834800000001,42.454094],[-76.35846600000001,42.453994],[-76.358617,42.453884],[-76.358895,42.453696],[-76.35897300000001,42.45365],[-76.35921,42.453539],[-76.359712,42.453358],[-76.35984500000001,42.453311],[-76.36017200000001,42.453211],[-76.36094199999999,42.452974],[-76.361366,42.452856],[-76.361716,42.45274],[-76.362092,42.452596],[-76.362245,42.452513],[-76.362386,42.452425],[-76.36251300000001,42.45232],[-76.36262499999999,42.452211],[-76.362741,42.452075],[-76.36286200000001,42.451871],[-76.362939,42.451717],[-76.362979,42.451608],[-76.363001,42.451533],[-76.36307600000001,42.451274],[-76.363185,42.45084],[-76.363355,42.450212],[-76.363525,42.449521],[-76.363603,42.449165],[-76.363664,42.448646],[-76.363703,42.448407],[-76.363755,42.448231],[-76.36382399999999,42.448068],[-76.363923,42.447895],[-76.364169,42.447573],[-76.364324,42.447422],[-76.36449,42.447281],[-76.36532200000001,42.446663],[-76.365476,42.446521],[-76.365583,42.446408],[-76.36566500000001,42.446299],[-76.365729,42.446194],[-76.365881,42.445913],[-76.36604199999999,42.44561],[-76.36606999999999,42.445559],[-76.366218,42.445293],[-76.36630700000001,42.445156],[-76.366556,42.444852],[-76.366685,42.44471],[-76.366868,42.444551],[-76.36706100000001,42.444395],[-76.36724,42.444258],[-76.36744299999999,42.444112],[-76.367749,42.44391],[-76.36788,42.443836],[-76.36804100000001,42.443758],[-76.368228,42.443679],[-76.368574,42.44355],[-76.368832,42.443456],[-76.369381,42.443251],[-76.369889,42.443047],[-76.370171,42.44294],[-76.37048900000001,42.442807],[-76.370571,42.442773],[-76.370817,42.442648],[-76.371047,42.442502],[-76.371242,42.442342],[-76.371365,42.442228],[-76.37149700000001,42.442073],[-76.371725,42.441773],[-76.37174899999999,42.441736],[-76.371909,42.441483],[-76.372108,42.441129],[-76.372445,42.440577],[-76.37254799999999,42.440408],[-76.372912,42.439895],[-76.37313399999999,42.439581],[-76.373439,42.439204],[-76.373701,42.438935],[-76.37389899999999,42.438771],[-76.374398,42.438386],[-76.376329,42.436999],[-76.376576,42.436793],[-76.377014,42.436369],[-76.377673,42.435704],[-76.378185,42.435162],[-76.37834100000001,42.435011],[-76.378489,42.434897],[-76.37866699999999,42.434778],[-76.378861,42.434672],[-76.37898800000001,42.434616],[-76.379069,42.434584],[-76.379288,42.434509],[-76.379496,42.434457],[-76.379678,42.434417],[-76.379735,42.434405],[-76.379856,42.434379],[-76.380155,42.434314],[-76.38094599999999,42.434161],[-76.38178499999999,42.43402],[-76.382587,42.433866],[-76.383082,42.433756],[-76.383582,42.433615],[-76.38443100000001,42.433362],[-76.385831,42.432953],[-76.385926,42.432921],[-76.386016,42.432879],[-76.386099,42.432833],[-76.38617600000001,42.432783],[-76.386246,42.432723],[-76.386306,42.432659],[-76.386357,42.432596],[-76.386399,42.432523],[-76.38643,42.432451],[-76.38645099999999,42.432374],[-76.38646,42.432297],[-76.38646,42.432221],[-76.386448,42.432144],[-76.386425,42.432068],[-76.386422,42.431969],[-76.38727900000001,42.432675],[-76.388464,42.433664],[-76.38911,42.434211],[-76.389287,42.434361],[-76.39012700000001,42.435081],[-76.39079700000001,42.435631],[-76.391279,42.436017],[-76.392076,42.43661],[-76.392112,42.436642],[-76.392636,42.437049],[-76.392956,42.437356],[-76.392977,42.437378],[-76.393165,42.43757],[-76.39346500000001,42.437904],[-76.393596,42.438001],[-76.39367,42.438041],[-76.39375099999999,42.438076],[-76.39383599999999,42.438107],[-76.393924,42.438128],[-76.394024,42.438145],[-76.395447,42.438308],[-76.398478,42.438653],[-76.39968399999999,42.438783],[-76.400682,42.438897],[-76.40129899999999,42.438912],[-76.40195,42.438904],[-76.40284699999999,42.438848],[-76.403327,42.438797],[-76.404213,42.438682],[-76.404923,42.438606],[-76.40553800000001,42.438558],[-76.406138,42.438524],[-76.407151,42.43852],[-76.40804900000001,42.438442],[-76.40945499999999,42.438383],[-76.40987800000001,42.438365],[-76.41019300000001,42.438365],[-76.41053700000001,42.438366],[-76.41131900000001,42.438388],[-76.41269200000001,42.43847],[-76.41284400000001,42.438545],[-76.41306,42.438641],[-76.41687,42.440422],[-76.417771,42.440807],[-76.418192,42.440955],[-76.418904,42.441149],[-76.419301,42.441248],[-76.41983999999999,42.441381],[-76.420748,42.441606],[-76.421829,42.441874],[-76.42205300000001,42.441925],[-76.42242400000001,42.441984],[-76.4228,42.44201],[-76.423216,42.442005],[-76.423918,42.441984],[-76.426551,42.441905],[-76.426851,42.441924],[-76.427064,42.441953],[-76.427272,42.442],[-76.427509,42.442078],[-76.42841199999999,42.4424],[-76.428557,42.442439],[-76.42870600000001,42.442464],[-76.428881,42.442484],[-76.428865,42.442258],[-76.428861,42.442199],[-76.428971,42.442217],[-76.429179,42.442245],[-76.429238,42.442261],[-76.429349,42.442278],[-76.42952699999999,42.442283],[-76.42966,42.442201],[-76.429727,42.442173],[-76.42976400000001,42.442151],[-76.42980900000001,42.442151],[-76.429912,42.442173],[-76.42997200000001,42.442206],[-76.430046,42.442261],[-76.43015699999999,42.442371],[-76.430164,42.442426],[-76.43018600000001,42.442453],[-76.430194,42.442492],[-76.430223,42.442525],[-76.43023100000001,42.442558],[-76.43029,42.442667],[-76.430312,42.442684],[-76.43034900000001,42.4427],[-76.430438,42.4427],[-76.430476,42.442695],[-76.430646,42.442558],[-76.430757,42.442519],[-76.430913,42.442508],[-76.431172,42.442525],[-76.431254,42.442519],[-76.431313,42.442503],[-76.43140200000001,42.442437],[-76.431461,42.442366],[-76.431535,42.442327],[-76.431639,42.442344],[-76.43166100000001,42.442366],[-76.431691,42.442415],[-76.431698,42.442448],[-76.431676,42.442519],[-76.431602,42.442601],[-76.431498,42.442706],[-76.43134999999999,42.442838],[-76.431343,42.442865],[-76.431365,42.442892],[-76.431528,42.442975],[-76.43163199999999,42.442997],[-76.43174999999999,42.443002],[-76.432017,42.442958],[-76.432069,42.442958],[-76.43226900000001,42.442986],[-76.43238700000001,42.442986],[-76.432491,42.442969],[-76.432573,42.442914],[-76.43264000000001,42.442838],[-76.43266199999999,42.442821],[-76.43273600000001,42.442805],[-76.432832,42.44281],[-76.432929,42.44286],[-76.432973,42.442887],[-76.433269,42.443112],[-76.43334400000001,42.443134],[-76.433477,42.443139],[-76.433536,42.443123],[-76.433573,42.443096],[-76.43364699999999,42.44303],[-76.433662,42.442975],[-76.433684,42.442958],[-76.433684,42.442931],[-76.43375899999999,42.442876],[-76.433796,42.442876],[-76.433922,42.442914],[-76.433981,42.442942],[-76.434122,42.44298],[-76.43424,42.442986],[-76.434366,42.442969],[-76.43439600000001,42.442953],[-76.43441900000001,42.442947],[-76.434529,42.442887],[-76.434566,42.44286],[-76.434589,42.442728],[-76.434566,42.442667],[-76.434455,42.442563],[-76.434181,42.442388],[-76.434144,42.442355],[-76.434144,42.442228],[-76.434166,42.442124],[-76.434196,42.442064],[-76.434218,42.442042],[-76.43423300000001,42.442009],[-76.43427699999999,42.441959],[-76.434381,42.441904],[-76.43441799999999,42.441899],[-76.434455,42.441877],[-76.434611,42.441888],[-76.434759,42.441926],[-76.434848,42.441954],[-76.435011,42.442025],[-76.435056,42.44208],[-76.435056,42.442152],[-76.435018,42.442234],[-76.434996,42.442256],[-76.43498099999999,42.442289],[-76.434922,42.442366],[-76.434907,42.442409],[-76.434907,42.442519],[-76.435011,42.442585],[-76.43507,42.442591],[-76.43514500000001,42.442591],[-76.435271,42.442574],[-76.435367,42.442514],[-76.435515,42.442371],[-76.43558899999999,42.442289],[-76.435604,42.442256],[-76.435626,42.442228],[-76.435641,42.442173],[-76.43566300000001,42.442151],[-76.435678,42.441976],[-76.43566300000001,42.441861],[-76.435456,42.441652],[-76.435456,42.441625],[-76.435463,42.441597],[-76.435478,42.441597],[-76.435515,42.441614],[-76.43558899999999,42.44163],[-76.43566300000001,42.441657],[-76.435789,42.441712],[-76.4359,42.441734],[-76.43601200000001,42.441734],[-76.436093,42.441707],[-76.436278,42.441586],[-76.43633,42.441581],[-76.43645600000001,42.441597],[-76.436538,42.44163],[-76.436612,42.441652],[-76.436716,42.441652],[-76.436775,42.44163],[-76.43680500000001,42.441636],[-76.436916,42.441619],[-76.43699700000001,42.441614],[-76.437034,42.441625],[-76.437071,42.441652],[-76.43708599999999,42.441734],[-76.437071,42.441778],[-76.437071,42.441806],[-76.437049,42.441822],[-76.437027,42.442086],[-76.437049,42.442162],[-76.437071,42.442179],[-76.437079,42.442234],[-76.43710799999999,42.442256],[-76.437116,42.4423],[-76.437145,42.442316],[-76.437153,42.442366],[-76.437183,42.442393],[-76.43719,42.442426],[-76.43730100000001,42.442508],[-76.43736800000001,42.442519],[-76.437449,42.442519],[-76.43764899999999,42.442475],[-76.437738,42.442448],[-76.437827,42.442426],[-76.43795299999999,42.442409],[-76.438035,42.442475],[-76.438042,42.442519],[-76.43801999999999,42.442613],[-76.437961,42.442678],[-76.437731,42.442832],[-76.437635,42.442914],[-76.43759799999999,42.442958],[-76.43759799999999,42.443024],[-76.43767200000001,42.443068],[-76.437738,42.443079],[-76.43776099999999,42.443096],[-76.43785699999999,42.443118],[-76.438005,42.443134],[-76.438057,42.443123],[-76.438153,42.443052],[-76.438405,42.442755],[-76.438413,42.442733],[-76.43844199999999,42.442711],[-76.43845,42.442673],[-76.438479,42.442656],[-76.43848699999999,42.442618],[-76.438554,42.442547],[-76.43862799999999,42.442481],[-76.43870200000001,42.442464],[-76.438761,42.442464],[-76.43885,42.442547],[-76.438857,42.442618],[-76.438828,42.442706],[-76.43882000000001,42.442755],[-76.438776,42.442887],[-76.438761,42.442903],[-76.438717,42.442997],[-76.43870200000001,42.44315],[-76.43872399999999,42.443249],[-76.43874599999999,42.443271],[-76.438858,42.443343],[-76.438924,42.443343],[-76.43898299999999,42.443332],[-76.439043,42.443266],[-76.439058,42.443222],[-76.439117,42.44315],[-76.43914700000001,42.443096],[-76.439176,42.442991],[-76.43919099999999,42.442969],[-76.439206,42.442914],[-76.439243,42.442838],[-76.43928,42.442783],[-76.43928,42.442755],[-76.439384,42.44264],[-76.43942800000001,42.442645],[-76.43951,42.442733],[-76.43952400000001,42.442755],[-76.439539,42.442794],[-76.439576,42.442865],[-76.439599,42.442892],[-76.43961299999999,42.442931],[-76.43966500000001,42.442986],[-76.439688,42.443002],[-76.439702,42.443052],[-76.439784,42.443123],[-76.439888,42.443178],[-76.439977,42.443189],[-76.44003600000001,42.443183],[-76.44015400000001,42.443128],[-76.44026599999999,42.44303],[-76.44028,42.442997],[-76.440303,42.442975],[-76.44031,42.442936],[-76.440332,42.442892],[-76.440355,42.442805],[-76.440377,42.44275],[-76.440406,42.442711],[-76.440451,42.442684],[-76.44047399999999,42.442678],[-76.440777,42.44264],[-76.440821,42.442601],[-76.44085800000001,42.442558],[-76.44091,42.442409],[-76.44090300000001,42.442376],[-76.440888,42.442354],[-76.440873,42.4423],[-76.440836,42.442256],[-76.44068799999999,42.442124],[-76.44066599999999,42.442069],[-76.44066599999999,42.442031],[-76.44068799999999,42.44197],[-76.44077,42.441904],[-76.440814,42.441888],[-76.44085800000001,42.44186],[-76.441058,42.441822],[-76.441118,42.441822],[-76.44146600000001,42.441844],[-76.441577,42.44186],[-76.441703,42.441888],[-76.441785,42.441915],[-76.44211799999999,42.442151],[-76.442415,42.442382],[-76.442556,42.442464],[-76.4426,42.442503],[-76.442778,42.442612],[-76.442948,42.442695],[-76.44300800000001,42.442711],[-76.443178,42.442793],[-76.44324,42.442806],[-76.443504,42.442859],[-76.44361600000001,42.442859],[-76.443727,42.442837],[-76.443808,42.442782],[-76.44386,42.442738],[-76.443882,42.442684],[-76.443912,42.442667],[-76.44391899999999,42.44259],[-76.443949,42.442574],[-76.443979,42.442404],[-76.44399300000001,42.442272],[-76.444023,42.442255],[-76.44403,42.442179],[-76.44405999999999,42.442151],[-76.44408199999999,42.442118],[-76.444119,42.442041],[-76.44423,42.44191],[-76.444356,42.441816],[-76.444519,42.441712],[-76.44460100000001,42.441685],[-76.444675,42.441668],[-76.44478599999999,42.441668],[-76.444912,42.441685],[-76.44502300000001,42.441712],[-76.445075,42.441739],[-76.44559099999999,42.442108],[-76.44569799999999,42.442184],[-76.445994,42.44242],[-76.446217,42.442563],[-76.44640200000001,42.442645],[-76.44656500000001,42.442694],[-76.446713,42.442711],[-76.44679499999999,42.442716],[-76.446995,42.442716],[-76.447684,42.442694],[-76.447988,42.442656],[-76.44806199999999,42.442639],[-76.44821,42.442557],[-76.448284,42.442475],[-76.448292,42.442392],[-76.448284,42.442299],[-76.448255,42.442283],[-76.44824699999999,42.442255],[-76.448173,42.442173],[-76.448106,42.442123],[-76.44801,42.442008],[-76.447973,42.44197],[-76.447958,42.441931],[-76.44787700000001,42.441832],[-76.447862,42.441794],[-76.44784,42.441767],[-76.44782499999999,42.441734],[-76.44780299999999,42.441706],[-76.447773,42.441602],[-76.447743,42.44136],[-76.447751,42.441322],[-76.447765,42.441295],[-76.447788,42.441273],[-76.447802,42.44124],[-76.447862,42.441168],[-76.44787599999999,42.441141],[-76.44789900000001,42.441119],[-76.447914,42.441075],[-76.447936,42.441058],[-76.447951,42.441004],[-76.447973,42.440982],[-76.447988,42.440938],[-76.448032,42.440883],[-76.448099,42.440855],[-76.44813600000001,42.440855],[-76.448329,42.440899],[-76.44838,42.440927],[-76.448573,42.440971],[-76.448714,42.440982],[-76.448734,42.440982],[-76.44873699999999,42.44103],[-76.448759,42.441511],[-76.44877700000001,42.442261],[-76.44878199999999,42.442342],[-76.448846,42.443449],[-76.448898,42.444146],[-76.448909,42.444328],[-76.44893,42.444691],[-76.44900699999999,42.446036],[-76.449072,42.447022],[-76.449127,42.447668],[-76.44913699999999,42.447786],[-76.449265,42.449176],[-76.449372,42.450521],[-76.449405,42.450791],[-76.449423,42.450844],[-76.449448,42.450898],[-76.449477,42.450947],[-76.449743,42.454026],[-76.449809,42.455697],[-76.44981199999999,42.455766],[-76.449814,42.455836]]],"type":"Polygon"}
}