{
  "id": "360050173002",
  "type": "Feature",
  "properties": {
    "area_land":26115,
    "area_water":0,
    "geoid":"360050173002",
    "name":"Block Group 2",
    "state":"ny"
},
  "bbox": [
    -73.917533,
    40.826546,
    -73.91476,
    40.828389
],
  "geometry": {"coordinates":[[[-73.917222,40.827809],[-73.916906,40.828389],[-73.916088,40.828067],[-73.915656,40.827898],[-73.915288,40.827763],[-73.91476,40.827556],[-73.915316,40.826546],[-73.915418,40.826579],[-73.916235,40.826842],[-73.91753300000001,40.82725],[-73.917222,40.827809]]],"type":"Polygon"}
}