{
  "id": "360379401001",
  "type": "Feature",
  "properties": {
    "area_land":23726989,
    "area_water":180036,
    "geoid":"360379401001",
    "name":"Block Group 1",
    "state":"ny"
},
  "bbox": [
    -78.464449,
    43.031227,
    -78.411259,
    43.096568
],
  "geometry": {"coordinates":[[[-78.46444700000001,43.088748],[-78.46430599999999,43.091514],[-78.460948,43.091476],[-78.46096199999999,43.090458],[-78.46088,43.090467],[-78.46066500000001,43.090519],[-78.460379,43.090524],[-78.460183,43.090516],[-78.459896,43.0905],[-78.459582,43.090537],[-78.459277,43.09068],[-78.458912,43.091004],[-78.458749,43.091191],[-78.458546,43.091326],[-78.45823900000001,43.09142],[-78.457843,43.091565],[-78.45767499999999,43.091553],[-78.457424,43.091615],[-78.456773,43.09145],[-78.456334,43.091329],[-78.454893,43.091445],[-78.453883,43.091406],[-78.453256,43.091545],[-78.452799,43.091484],[-78.452426,43.091165],[-78.452101,43.090863],[-78.45164,43.090528],[-78.45115,43.090433],[-78.450507,43.090579],[-78.449808,43.090617],[-78.449333,43.09063],[-78.448803,43.090533],[-78.448183,43.090362],[-78.447962,43.09028],[-78.44789900000001,43.09037],[-78.44677799999999,43.092422],[-78.444523,43.096544],[-78.444363,43.096514],[-78.43694000000001,43.096508],[-78.429833,43.096539],[-78.42705599999999,43.096568],[-78.426858,43.096559],[-78.421009,43.086921],[-78.415798,43.078235],[-78.413597,43.074727],[-78.411259,43.070754],[-78.411264,43.070385],[-78.41138100000001,43.067413],[-78.41151499999999,43.063803],[-78.411598,43.062494],[-78.41168,43.061467],[-78.41166800000001,43.060261],[-78.41215200000001,43.045261],[-78.412505,43.031848],[-78.41256,43.031227],[-78.422675,43.031553],[-78.426012,43.031636],[-78.438897,43.032058],[-78.439835,43.032113],[-78.44041799999999,43.033076],[-78.440496,43.033195],[-78.440574,43.033317],[-78.440774,43.033626],[-78.44172399999999,43.035096],[-78.449974,43.048271],[-78.451382,43.050208],[-78.451729,43.05073],[-78.45405100000001,43.054274],[-78.454841,43.055537],[-78.460615,43.064998],[-78.46424500000001,43.064958],[-78.464264,43.067711],[-78.464254,43.079038],[-78.464252,43.079132],[-78.46422699999999,43.080233],[-78.464229,43.080303],[-78.464449,43.088703],[-78.46444700000001,43.088748]]],"type":"Polygon"}
}