{
  "id": "360710146002",
  "type": "Feature",
  "properties": {
    "area_land":5696101,
    "area_water":1388,
    "geoid":"360710146002",
    "name":"Block Group 2",
    "state":"ny"
},
  "bbox": [
    -74.358629,
    41.247764,
    -74.316144,
    41.274144
],
  "geometry": {"coordinates":[[[-74.35862899999999,41.258054],[-74.358109,41.258633],[-74.35805499999999,41.258699],[-74.357995,41.258772],[-74.357573,41.259337],[-74.357525,41.25941],[-74.357467,41.259512],[-74.35698600000001,41.259738],[-74.356711,41.259856],[-74.355861,41.260166],[-74.35512799999999,41.260402],[-74.354035,41.260722],[-74.353274,41.260914],[-74.35212799999999,41.261219],[-74.35107000000001,41.261525],[-74.350871,41.261602],[-74.35056400000001,41.261761],[-74.348564,41.263019],[-74.34830700000001,41.263181],[-74.347792,41.263507],[-74.347373,41.263781],[-74.346397,41.264414],[-74.34534499999999,41.265127],[-74.34498600000001,41.265361],[-74.343907,41.266061],[-74.343278,41.266536],[-74.34262099999999,41.266997],[-74.34232900000001,41.26721],[-74.340093,41.268892],[-74.33989200000001,41.26905],[-74.339482,41.269314],[-74.33923299999999,41.269449],[-74.338745,41.269676],[-74.338493,41.269788],[-74.33792,41.270031],[-74.337543,41.270202],[-74.337153,41.270384],[-74.336327,41.270832],[-74.335446,41.271329],[-74.335204,41.271461],[-74.335043,41.271541],[-74.334897,41.271599],[-74.33472,41.271665],[-74.33462900000001,41.271686],[-74.333727,41.271877],[-74.33344,41.271951],[-74.333155,41.272036],[-74.332848,41.272133],[-74.33189400000001,41.272484],[-74.331243,41.272714],[-74.330778,41.272892],[-74.330282,41.273099],[-74.329184,41.273627],[-74.32881399999999,41.27379],[-74.328388,41.273948],[-74.32804299999999,41.274046],[-74.32763199999999,41.274144],[-74.327648,41.274044],[-74.32689000000001,41.273619],[-74.32686,41.273504],[-74.32679,41.273194],[-74.32671999999999,41.272855],[-74.326718,41.272826],[-74.326646,41.271844],[-74.326651,41.271756],[-74.3267,41.271543],[-74.326911,41.271099],[-74.327144,41.270657],[-74.32726700000001,41.27042],[-74.32730599999999,41.270344],[-74.327406,41.270096],[-74.32744099999999,41.269945],[-74.32745199999999,41.269821],[-74.327459,41.26936],[-74.32746400000001,41.268919],[-74.327439,41.268708],[-74.327263,41.26822],[-74.327187,41.268077],[-74.32684500000001,41.267562],[-74.326725,41.267426],[-74.32633,41.267018],[-74.32589900000001,41.266509],[-74.325737,41.266333],[-74.32509899999999,41.265593],[-74.32504,41.265509],[-74.325008,41.265408],[-74.32499900000001,41.265344],[-74.324995,41.265033],[-74.325065,41.264321],[-74.32508799999999,41.264243],[-74.325141,41.26413],[-74.325194,41.264046],[-74.325236,41.264001],[-74.32557799999999,41.263727],[-74.325625,41.263674],[-74.325626,41.263636],[-74.325614,41.263602],[-74.32557799999999,41.263555],[-74.324943,41.263171],[-74.323922,41.262408],[-74.323455,41.262042],[-74.322754,41.261538],[-74.32203199999999,41.261084],[-74.32172199999999,41.260917],[-74.32114300000001,41.260586],[-74.320925,41.260429],[-74.32069300000001,41.260217],[-74.319329,41.258587],[-74.318387,41.257401],[-74.317609,41.25646],[-74.31720199999999,41.255995],[-74.316642,41.255314],[-74.316551,41.255181],[-74.31643099999999,41.254963],[-74.316388,41.25483],[-74.31619999999999,41.254088],[-74.316151,41.253854],[-74.31614399999999,41.253568],[-74.316273,41.253589],[-74.316305,41.253594],[-74.316721,41.253624],[-74.316941,41.253636],[-74.31724,41.253653],[-74.318032,41.253746],[-74.318595,41.253828],[-74.318843,41.253837],[-74.319069,41.253813],[-74.31972500000001,41.253642],[-74.320457,41.25345],[-74.321156,41.253276],[-74.322205,41.25299],[-74.32265200000001,41.252845],[-74.323376,41.252668],[-74.325046,41.2522],[-74.32588,41.251977],[-74.32695,41.251668],[-74.327259,41.251587],[-74.328017,41.251397],[-74.328941,41.251186],[-74.32913000000001,41.251143],[-74.330478,41.250797],[-74.33095,41.250668],[-74.33193900000001,41.250398],[-74.332578,41.250226],[-74.332859,41.250152],[-74.334337,41.249748],[-74.33474200000001,41.249635],[-74.335461,41.249429],[-74.33562999999999,41.249379],[-74.336124,41.249233],[-74.336544,41.249094],[-74.337037,41.248933],[-74.337444,41.248822],[-74.338157,41.248644],[-74.33875399999999,41.248473],[-74.338852,41.248445],[-74.33887900000001,41.248437],[-74.340559,41.247955],[-74.341188,41.247831],[-74.341722,41.247778],[-74.341978,41.247764],[-74.342409,41.247765],[-74.34283499999999,41.24779],[-74.34289699999999,41.247796],[-74.34297100000001,41.247804],[-74.34349400000001,41.247887],[-74.34397,41.248],[-74.34432200000001,41.24811],[-74.344455,41.248156],[-74.344865,41.248318],[-74.34519400000001,41.24848],[-74.345591,41.248718],[-74.347229,41.249815],[-74.34764699999999,41.250047],[-74.34777200000001,41.250105],[-74.347796,41.250116],[-74.34801400000001,41.250217],[-74.348252,41.250314],[-74.348693,41.250465],[-74.34902700000001,41.250548],[-74.349523,41.250624],[-74.34960100000001,41.250629],[-74.35054700000001,41.250664],[-74.351269,41.250684],[-74.35214499999999,41.250715],[-74.352682,41.250742],[-74.35386699999999,41.250804],[-74.354153,41.250803],[-74.35450299999999,41.250799],[-74.354761,41.250772],[-74.35505999999999,41.250727],[-74.35589899999999,41.250578],[-74.355949,41.250703],[-74.356364,41.251362],[-74.356465,41.251533],[-74.35694100000001,41.252325],[-74.357209,41.252795],[-74.357461,41.253333],[-74.357567,41.253598],[-74.35761599999999,41.253722],[-74.35812300000001,41.254807],[-74.35828100000001,41.255191],[-74.358541,41.25582],[-74.358572,41.255915],[-74.358608,41.25612],[-74.358611,41.256169],[-74.35860599999999,41.256266],[-74.358583,41.256463],[-74.358581,41.256559],[-74.358484,41.257318],[-74.358474,41.257495],[-74.358481,41.257686],[-74.358532,41.257906],[-74.358555,41.257952],[-74.35862899999999,41.258054]]],"type":"Polygon"}
}