{
  "id": "360810463002",
  "type": "Feature",
  "properties": {
    "area_land":114115,
    "area_water":0,
    "geoid":"360810463002",
    "name":"Block Group 2",
    "state":"ny"
},
  "bbox": [
    -73.874505,
    40.742379,
    -73.867491,
    40.745601
],
  "geometry": {"coordinates":[[[-73.874505,40.743311],[-73.87348900000001,40.743621],[-73.872426,40.743939],[-73.871363,40.744271],[-73.87082599999999,40.744558],[-73.870127,40.744991],[-73.869288,40.745242],[-73.86808600000001,40.745601],[-73.86790999999999,40.744934],[-73.867893,40.744752],[-73.867851,40.744717],[-73.867678,40.744042],[-73.867491,40.743302],[-73.870362,40.742502],[-73.870593,40.742379],[-73.87142,40.742412],[-73.872373,40.742454],[-73.873485,40.742501],[-73.873997,40.742892],[-73.874505,40.743311]]],"type":"Polygon"}
}