{
  "id": "360630226021",
  "type": "Feature",
  "properties": {
    "area_land":2795872,
    "area_water":0,
    "geoid":"360630226021",
    "name":"Block Group 1",
    "state":"ny"
},
  "bbox": [
    -78.999129,
    43.107817,
    -78.968307,
    43.123173
],
  "geometry": {"coordinates":[[[-78.999129,43.115976],[-78.998937,43.116441],[-78.998364,43.117836],[-78.99817299999999,43.118302],[-78.998209,43.118374],[-78.998217,43.118392],[-78.998352,43.118666],[-78.998891,43.119758],[-78.999071,43.120123],[-78.998763,43.120174],[-78.99845999999999,43.120226],[-78.99793699999999,43.120298],[-78.99783600000001,43.120308],[-78.99752599999999,43.12034],[-78.997114,43.120374],[-78.996976,43.120385],[-78.996911,43.12039],[-78.996788,43.1204],[-78.99659,43.120405],[-78.996483,43.120408],[-78.99644000000001,43.120409],[-78.995625,43.120422],[-78.99305200000001,43.120466],[-78.992938,43.120468],[-78.99235299999999,43.120522],[-78.992199,43.120542],[-78.99082199999999,43.120774],[-78.990103,43.120888],[-78.98554799999999,43.121618],[-78.98451900000001,43.121799],[-78.98381500000001,43.121911],[-78.981719,43.122247],[-78.980598,43.122429],[-78.977464,43.122939],[-78.977236,43.122977],[-78.977177,43.122987],[-78.976114,43.123147],[-78.975955,43.123165],[-78.97565400000001,43.123173],[-78.975459,43.12317],[-78.975373,43.12317],[-78.975151,43.123154],[-78.974655,43.123083],[-78.974362,43.123017],[-78.97408,43.122935],[-78.973663,43.122785],[-78.97355399999999,43.122733],[-78.973035,43.122488],[-78.972961,43.122454],[-78.972543,43.122258],[-78.97218599999999,43.122093],[-78.970444,43.121291],[-78.97024999999999,43.12121],[-78.970033,43.121133],[-78.96983899999999,43.121074],[-78.969812,43.121066],[-78.969621,43.121023],[-78.969302,43.120969],[-78.968998,43.120932],[-78.96886000000001,43.120922],[-78.968818,43.12092],[-78.968445,43.120917],[-78.968307,43.120916],[-78.968315,43.117486],[-78.96882600000001,43.117181],[-78.97036300000001,43.116269],[-78.97087500000001,43.115965],[-78.97154500000001,43.115566],[-78.97355899999999,43.114372],[-78.97423000000001,43.113974],[-78.974673,43.113714],[-78.97523700000001,43.113384],[-78.97595099999999,43.113008],[-78.976026,43.112973],[-78.976495,43.112761],[-78.976775,43.112635],[-78.977616,43.112258],[-78.977897,43.112133],[-78.978697,43.111775],[-78.98109700000001,43.110705],[-78.981898,43.110348],[-78.98238600000001,43.110135],[-78.98309999999999,43.109826],[-78.983844,43.109484],[-78.984328,43.109263],[-78.984645,43.109114],[-78.985596,43.108671],[-78.985913,43.108523],[-78.986227,43.108381],[-78.987173,43.107958],[-78.987488,43.107817],[-78.987549,43.107894],[-78.987587,43.107938],[-78.987801,43.108183],[-78.98786699999999,43.108243],[-78.987971,43.108323],[-78.98798499999999,43.108329],[-78.98809,43.108379],[-78.98825100000001,43.108421],[-78.988353,43.108431],[-78.98846500000001,43.108428],[-78.988732,43.108409],[-78.990109,43.108223],[-78.990821,43.108127],[-78.991006,43.108104],[-78.991561,43.108036],[-78.991747,43.108014],[-78.992154,43.108199],[-78.992284,43.108257],[-78.99240399999999,43.108318],[-78.992833,43.108538],[-78.993161,43.108725],[-78.993652,43.109032],[-78.993775,43.109112],[-78.994249,43.10946],[-78.99433399999999,43.109523],[-78.994806,43.109924],[-78.99509,43.110191],[-78.995261,43.110367],[-78.99534800000001,43.110457],[-78.995769,43.110944],[-78.996038,43.111298],[-78.996424,43.111874],[-78.996779,43.112403],[-78.996938,43.112644],[-78.997415,43.113369],[-78.997574,43.113611],[-78.997629,43.113696],[-78.997795,43.113951],[-78.997851,43.114037],[-78.99791999999999,43.114144],[-78.99812900000001,43.114468],[-78.998199,43.114576],[-78.998341,43.114796],[-78.99838200000001,43.114857],[-78.998942,43.115696],[-78.999129,43.115976]]],"type":"Polygon"}
}