{
  "id": "360570721001",
  "type": "Feature",
  "properties": {
    "area_land":30387072,
    "area_water":969650,
    "geoid":"360570721001",
    "name":"Block Group 1",
    "state":"ny"
},
  "bbox": [
    -74.176012,
    42.896869,
    -74.083883,
    42.982934
],
  "geometry": {"coordinates":[[[-74.175545,42.924683],[-74.175185,42.924994],[-74.174864,42.925265],[-74.17438,42.925114],[-74.174285,42.925096],[-74.174131,42.925067],[-74.17391000000001,42.924937],[-74.173196,42.92452],[-74.172698,42.924309],[-74.170614,42.923673],[-74.169805,42.92337],[-74.168631,42.923029],[-74.16856,42.923009],[-74.166725,42.922141],[-74.16467,42.921378],[-74.163454,42.920827],[-74.163115,42.920746],[-74.163022,42.92097],[-74.163518,42.921289],[-74.16429599999999,42.921862],[-74.164328,42.922159],[-74.164452,42.922341],[-74.164421,42.92271],[-74.16390699999999,42.923097],[-74.164789,42.923304],[-74.168526,42.924079],[-74.16866400000001,42.923726],[-74.170501,42.924315],[-74.17066,42.924613],[-74.171702,42.925047],[-74.172731,42.925393],[-74.17348699999999,42.925582],[-74.17415099999999,42.925646],[-74.17436499999999,42.925713],[-74.17425799999999,42.925811],[-74.174159,42.925898],[-74.172939,42.926927],[-74.172838,42.927013],[-74.172442,42.9277],[-74.17206,42.927937],[-74.17098900000001,42.927514],[-74.169349,42.926801],[-74.16695900000001,42.925761],[-74.166296,42.926423],[-74.16564,42.926101],[-74.16301900000001,42.928973],[-74.163656,42.929179],[-74.16394699999999,42.92888],[-74.16551,42.929604],[-74.16513,42.929929],[-74.164519,42.930449],[-74.161956,42.932671],[-74.161888,42.932764],[-74.161344,42.932881],[-74.161342,42.932964],[-74.161366,42.933168],[-74.164371,42.93425],[-74.163921,42.934618],[-74.162065,42.936172],[-74.162487,42.937774],[-74.16265,42.938768],[-74.16288900000001,42.940553],[-74.162971,42.941024],[-74.16333400000001,42.943064],[-74.16341799999999,42.943652],[-74.163196,42.943672],[-74.16181899999999,42.943746],[-74.16143700000001,42.9438],[-74.161083,42.943873],[-74.1596,42.944285],[-74.15884200000001,42.9445],[-74.158208,42.944662],[-74.156721,42.944931],[-74.15654499999999,42.944979],[-74.150051,42.946171],[-74.14667300000001,42.946795],[-74.145487,42.946974],[-74.14515299999999,42.946971],[-74.14489500000001,42.946991],[-74.14317,42.94711],[-74.14252,42.947125],[-74.142123,42.947111],[-74.14051000000001,42.946994],[-74.139667,42.946926],[-74.13897,42.94688],[-74.138504,42.946881],[-74.138015,42.946926],[-74.13755,42.946996],[-74.137113,42.947087],[-74.136555,42.947226],[-74.136135,42.94735],[-74.133363,42.948273],[-74.13319,42.948394],[-74.132132,42.94878],[-74.128697,42.950178],[-74.12830200000001,42.950334],[-74.127877,42.9504],[-74.127391,42.950488],[-74.124172,42.95075],[-74.121545,42.950979],[-74.120907,42.951101],[-74.120588,42.951201],[-74.12052199999999,42.951264],[-74.120394,42.951334],[-74.120045,42.951527],[-74.11902499999999,42.952192],[-74.117919,42.952719],[-74.115454,42.953805],[-74.11509100000001,42.954008],[-74.11484,42.954177],[-74.114589,42.954382],[-74.114316,42.954659],[-74.11398,42.955103],[-74.11366700000001,42.955535],[-74.113083,42.956338],[-74.112945,42.956559],[-74.112787,42.956911],[-74.11265899999999,42.957522],[-74.112655,42.95769],[-74.112719,42.958221],[-74.11285100000001,42.959075],[-74.11293000000001,42.959691],[-74.113175,42.961152],[-74.113724,42.965103],[-74.11383499999999,42.965786],[-74.113941,42.966642],[-74.113946,42.966853],[-74.113921,42.966997],[-74.113832,42.967211],[-74.11377299999999,42.967291],[-74.11366700000001,42.967404],[-74.114011,42.967701],[-74.114092,42.967862],[-74.114116,42.967978],[-74.114152,42.968219],[-74.114881,42.972843],[-74.11523699999999,42.975018],[-74.115207,42.975152],[-74.11512999999999,42.975252],[-74.114993,42.975475],[-74.11197799999999,42.977799],[-74.11176500000001,42.977989],[-74.111688,42.978156],[-74.111673,42.978323],[-74.112033,42.980338],[-74.11247899999999,42.982818],[-74.105996,42.982897],[-74.105581,42.982899],[-74.10502099999999,42.982851],[-74.104978,42.982847],[-74.09746699999999,42.982934],[-74.096897,42.979378],[-74.09672500000001,42.978307],[-74.096599,42.977207],[-74.096585,42.977123],[-74.096132,42.974621],[-74.096047,42.974093],[-74.095176,42.968673],[-74.095078,42.968062],[-74.094757,42.965639],[-74.09475399999999,42.965617],[-74.094713,42.965306],[-74.094466,42.963644],[-74.09381399999999,42.959378],[-74.09298,42.955868],[-74.09237299999999,42.953316],[-74.092359,42.952881],[-74.092241,42.952178],[-74.091392,42.947112],[-74.090462,42.941243],[-74.089572,42.935619],[-74.089366,42.934318],[-74.089079,42.932218],[-74.088257,42.927313],[-74.088303,42.925775],[-74.088213,42.925394],[-74.088139,42.924754],[-74.088114,42.924007],[-74.08804000000001,42.923577],[-74.087729,42.921947],[-74.08754,42.920696],[-74.08721199999999,42.918574],[-74.08708799999999,42.917922],[-74.08696500000001,42.917183],[-74.086842,42.916617],[-74.08660399999999,42.915776],[-74.08645799999999,42.915137],[-74.08653099999999,42.915121],[-74.08659400000001,42.915107],[-74.086547,42.914516],[-74.08631699999999,42.912921],[-74.08558600000001,42.908796],[-74.085148,42.906226],[-74.084909,42.90466],[-74.084868,42.904424],[-74.08429700000001,42.900434],[-74.08413899999999,42.899286],[-74.08409,42.898843],[-74.08404,42.898399],[-74.084013,42.898185],[-74.083989,42.898023],[-74.083979,42.897951],[-74.08395400000001,42.897783],[-74.083883,42.897354],[-74.084844,42.896869],[-74.084985,42.896957],[-74.087504,42.898543],[-74.08967699999999,42.899795],[-74.092202,42.901146],[-74.092276,42.901189],[-74.09473699999999,42.902838],[-74.096431,42.903851],[-74.098482,42.904824],[-74.101465,42.90494],[-74.104828,42.905522],[-74.105846,42.906122],[-74.108431,42.907147],[-74.110995,42.908273],[-74.11550800000001,42.909771],[-74.119837,42.910705],[-74.12463700000001,42.911491],[-74.125488,42.911524],[-74.126856,42.911702],[-74.127945,42.91208],[-74.129546,42.912866],[-74.13135800000001,42.913555],[-74.132868,42.914143],[-74.134629,42.914766],[-74.13598399999999,42.915264],[-74.137762,42.916285],[-74.138169,42.91657],[-74.13921499999999,42.917305],[-74.140491,42.917943],[-74.14183,42.918241],[-74.143755,42.918584],[-74.14410599999999,42.91863],[-74.147732,42.919185],[-74.15093,42.918412],[-74.152247,42.918284],[-74.15626899999999,42.917893],[-74.161235,42.919015],[-74.16880999999999,42.921621],[-74.170103,42.921863],[-74.17075699999999,42.921986],[-74.17161,42.922275],[-74.17325,42.92301],[-74.174584,42.923678],[-74.174814,42.923886],[-74.174914,42.923955],[-74.176012,42.924284],[-74.175545,42.924683]]],"type":"Polygon"}
}