{
  "id": "360130374003",
  "type": "Feature",
  "properties": {
    "area_land":70127737,
    "area_water":594538,
    "geoid":"360130374003",
    "name":"Block Group 3",
    "state":"ny"
},
  "bbox": [
    -79.16879,
    42.086368,
    -79.059246,
    42.184106
],
  "geometry": {"coordinates":[[[-79.16860699999999,42.103298],[-79.16837,42.10373],[-79.168207,42.104134],[-79.168162,42.104355],[-79.168155,42.10454],[-79.16819099999999,42.104829],[-79.16836000000001,42.105659],[-79.16837599999999,42.105779],[-79.16837599999999,42.105938],[-79.168344,42.106172],[-79.168282,42.106354],[-79.16816799999999,42.106605],[-79.16798,42.106933],[-79.167109,42.108557],[-79.16693600000001,42.108811],[-79.166833,42.108927],[-79.165796,42.109888],[-79.165218,42.110389],[-79.16510700000001,42.110485],[-79.16439,42.111107],[-79.16411600000001,42.111323],[-79.163967,42.111419],[-79.16321499999999,42.111829],[-79.162644,42.112119],[-79.162401,42.11222],[-79.16219,42.112281],[-79.16201100000001,42.11232],[-79.16175699999999,42.112359],[-79.161501,42.112385],[-79.160659,42.1124],[-79.15971999999999,42.112408],[-79.159575,42.112416],[-79.159395,42.112427],[-79.159132,42.112453],[-79.158716,42.112544],[-79.158469,42.11262],[-79.158276,42.112696],[-79.157978,42.112838],[-79.157702,42.112994],[-79.15742899999999,42.113163],[-79.157098,42.113393],[-79.156856,42.113577],[-79.15673700000001,42.113684],[-79.156633,42.113794],[-79.156571,42.113882],[-79.15650599999999,42.114005],[-79.156464,42.114112],[-79.156425,42.114348],[-79.15642800000001,42.114562],[-79.156448,42.114686],[-79.15657400000001,42.115091],[-79.156597,42.115146],[-79.15676000000001,42.115547],[-79.156977,42.116005],[-79.157107,42.116249],[-79.157189,42.116363],[-79.15725399999999,42.116434],[-79.157471,42.116604],[-79.157787,42.116807],[-79.15784499999999,42.116844],[-79.158046,42.116977],[-79.157937,42.117231],[-79.157923,42.117252],[-79.157582,42.11778],[-79.157501,42.117923],[-79.15744599999999,42.118127],[-79.157433,42.118463],[-79.157483,42.119102],[-79.157516,42.119235],[-79.15759799999999,42.119403],[-79.157982,42.120019],[-79.15806600000001,42.120171],[-79.158109,42.120281],[-79.158151,42.120522],[-79.15817,42.120962],[-79.15818,42.12208],[-79.15820600000001,42.122736],[-79.158197,42.123092],[-79.158118,42.123514],[-79.157946,42.124089],[-79.15786199999999,42.12436],[-79.157821,42.12453],[-79.157769,42.124748],[-79.15754800000001,42.125718],[-79.157512,42.12595],[-79.157492,42.126247],[-79.157462,42.127134],[-79.15742,42.127846],[-79.157319,42.128717],[-79.15723199999999,42.129222],[-79.157076,42.130327],[-79.15699499999999,42.130864],[-79.156903,42.131474],[-79.156656,42.132921],[-79.15638,42.134748],[-79.15580799999999,42.134649],[-79.154027,42.134375],[-79.15223400000001,42.134127],[-79.14919500000001,42.133691],[-79.14735,42.133433],[-79.14673500000001,42.133337],[-79.14613300000001,42.133258],[-79.14201199999999,42.132658],[-79.14130299999999,42.132558],[-79.14048699999999,42.132448],[-79.139892,42.13238],[-79.139431,42.132343],[-79.138858,42.132333],[-79.137204,42.132358],[-79.134895,42.132427],[-79.13465100000001,42.132441],[-79.133726,42.132496],[-79.13336099999999,42.132527],[-79.132949,42.132581],[-79.13254999999999,42.132648],[-79.132139,42.132741],[-79.131624,42.132888],[-79.13100799999999,42.133077],[-79.130308,42.133315],[-79.128866,42.133821],[-79.128399,42.133963],[-79.12607800000001,42.134713],[-79.12688900000001,42.135972],[-79.127021,42.136209],[-79.12723,42.136527],[-79.127289,42.13667],[-79.127325,42.136801],[-79.127346,42.136926],[-79.127459,42.13761],[-79.127506,42.137755],[-79.127546,42.137835],[-79.127726,42.138108],[-79.12775000000001,42.138145],[-79.128252,42.138834],[-79.12863299999999,42.139195],[-79.128957,42.139417],[-79.129637,42.139828],[-79.12978699999999,42.139923],[-79.129994,42.140067],[-79.130304,42.140284],[-79.131349,42.141104],[-79.131502,42.141235],[-79.131719,42.141483],[-79.13187600000001,42.141727],[-79.13196000000001,42.14192],[-79.13199299999999,42.142029],[-79.132031,42.142437],[-79.132023,42.142737],[-79.132019,42.142772],[-79.131969,42.142904],[-79.13191399999999,42.143009],[-79.131657,42.143377],[-79.13155500000001,42.143494],[-79.131395,42.143643],[-79.131136,42.143858],[-79.13050699999999,42.144306],[-79.12991599999999,42.144707],[-79.12964599999999,42.144922],[-79.129548,42.145017],[-79.129413,42.14517],[-79.12927999999999,42.145356],[-79.129181,42.145556],[-79.129108,42.145804],[-79.129087,42.145946],[-79.129076,42.146128],[-79.129079,42.147025],[-79.12909000000001,42.147676],[-79.129085,42.148117],[-79.12902099999999,42.149065],[-79.128923,42.150926],[-79.128927,42.151289],[-79.12893800000001,42.151539],[-79.12896600000001,42.151739],[-79.129054,42.152021],[-79.129366,42.152773],[-79.129761,42.153734],[-79.12997,42.154227],[-79.13072699999999,42.156052],[-79.131213,42.157291],[-79.131388,42.157699],[-79.13148200000001,42.157889],[-79.13161700000001,42.158107],[-79.131703,42.158224],[-79.13198199999999,42.15856],[-79.132285,42.158873],[-79.132409,42.158967],[-79.13243,42.158979],[-79.132752,42.159164],[-79.13346799999999,42.159528],[-79.133764,42.159707],[-79.134103,42.159962],[-79.13439099999999,42.160261],[-79.134524,42.160432],[-79.13564,42.162352],[-79.136015,42.163029],[-79.136276,42.163576],[-79.13637799999999,42.163762],[-79.13656,42.164003],[-79.136681,42.164119],[-79.13687,42.164279],[-79.137096,42.164443],[-79.138471,42.165292],[-79.138949,42.165679],[-79.139465,42.166156],[-79.140488,42.16715],[-79.141109,42.167861],[-79.14094799999999,42.167988],[-79.137241,42.170626],[-79.13689100000001,42.170892],[-79.135959,42.17157],[-79.13435699999999,42.172703],[-79.132698,42.173833],[-79.132169,42.174189],[-79.13037,42.175236],[-79.129496,42.175734],[-79.12854,42.176308],[-79.128198,42.176547],[-79.127684,42.176864],[-79.126918,42.177396],[-79.1263,42.177888],[-79.126001,42.178139],[-79.125906,42.178244],[-79.125835,42.178394],[-79.12581299999999,42.17847],[-79.125806,42.17862],[-79.125849,42.178915],[-79.126504,42.182489],[-79.126756,42.184025],[-79.125822,42.184043],[-79.124726,42.184036],[-79.120206,42.184082],[-79.11820899999999,42.184106],[-79.11722899999999,42.184096],[-79.115903,42.184103],[-79.115393,42.184092],[-79.115163,42.184077],[-79.115039,42.184059],[-79.11481499999999,42.184001],[-79.11469099999999,42.183946],[-79.112945,42.183036],[-79.111422,42.182234],[-79.11001,42.181516],[-79.108637,42.180795],[-79.10730100000001,42.180081],[-79.105722,42.179196],[-79.105441,42.179021],[-79.10470100000001,42.178452],[-79.10224599999999,42.176529],[-79.10171,42.176085],[-79.101495,42.175928],[-79.10112100000001,42.175757],[-79.10092,42.175687],[-79.10070899999999,42.175625],[-79.10021999999999,42.175534],[-79.099976,42.175509],[-79.099371,42.175533],[-79.099322,42.175412],[-79.098964,42.174551],[-79.098705,42.173972],[-79.098569,42.173709],[-79.098489,42.173567],[-79.098467,42.173528],[-79.098361,42.173375],[-79.09824399999999,42.173232],[-79.097145,42.172045],[-79.096402,42.171295],[-79.09569,42.17058],[-79.09521599999999,42.170129],[-79.094347,42.169352],[-79.093244,42.168387],[-79.093109,42.168289],[-79.092945,42.168191],[-79.092535,42.167979],[-79.091368,42.167462],[-79.09012300000001,42.166945],[-79.088801,42.166384],[-79.088342,42.16618],[-79.08687399999999,42.165557],[-79.086461,42.1654],[-79.08602999999999,42.165251],[-79.08590100000001,42.165702],[-79.085661,42.166503],[-79.085559,42.166743],[-79.08517000000001,42.167538],[-79.084717,42.168473],[-79.084575,42.168721],[-79.08444299999999,42.168878],[-79.08432999999999,42.168984],[-79.083805,42.16941],[-79.083495,42.169632],[-79.083297,42.169738],[-79.082431,42.170055],[-79.08063799999999,42.170635],[-79.080161,42.170787],[-79.07989499999999,42.170871],[-79.079319,42.170976],[-79.076706,42.171315],[-79.07623599999999,42.17137],[-79.07551100000001,42.171479],[-79.07436,42.171643],[-79.072275,42.171923],[-79.071691,42.171993],[-79.071247,42.172033],[-79.070753,42.172055],[-79.070286,42.172054],[-79.06990999999999,42.172025],[-79.06938100000001,42.17197],[-79.068754,42.171882],[-79.068482,42.171826],[-79.068308,42.171793],[-79.068107,42.17174],[-79.06786,42.171672],[-79.067837,42.171666],[-79.067669,42.171615],[-79.067365,42.171512],[-79.06690999999999,42.171333],[-79.066441,42.171103],[-79.06626799999999,42.171007],[-79.066137,42.170933],[-79.06576200000001,42.170679],[-79.065133,42.170198],[-79.06430899999999,42.169548],[-79.06268799999999,42.168296],[-79.06156,42.167401],[-79.061093,42.167067],[-79.060782,42.166895],[-79.06045399999999,42.166756],[-79.059737,42.166524],[-79.059735,42.166448],[-79.059735,42.166433],[-79.059608,42.160934],[-79.05959,42.158827],[-79.059589,42.15729],[-79.059594,42.156824],[-79.059584,42.155434],[-79.059579,42.155259],[-79.059562,42.154666],[-79.05953,42.153581],[-79.059545,42.153414],[-79.05957100000001,42.153112],[-79.059606,42.152701],[-79.059686,42.152083],[-79.059653,42.146799],[-79.05960899999999,42.140631],[-79.05953,42.129434],[-79.059528,42.129136],[-79.059513,42.127102],[-79.05928,42.125049],[-79.059264,42.124879],[-79.05927,42.117414],[-79.05929,42.113943],[-79.059309,42.110447],[-79.059246,42.109387],[-79.059276,42.107645],[-79.059281,42.107463],[-79.059282,42.107425],[-79.059296,42.101824],[-79.05929,42.100724],[-79.059299,42.092278],[-79.05930600000001,42.086992],[-79.05930600000001,42.086731],[-79.05930600000001,42.086371],[-79.088019,42.086368],[-79.088038,42.086368],[-79.0958,42.086394],[-79.09684900000001,42.086387],[-79.119574,42.086458],[-79.12476700000001,42.086465],[-79.12665800000001,42.086442],[-79.126858,42.08646],[-79.12698899999999,42.08645],[-79.12703999999999,42.086435],[-79.12705099999999,42.086429],[-79.127593,42.086413],[-79.127709,42.086453],[-79.127786,42.086457],[-79.127841,42.08645],[-79.12789600000001,42.086417],[-79.12854400000001,42.086416],[-79.129046,42.086406],[-79.13032,42.08643],[-79.131122,42.08644],[-79.137518,42.086444],[-79.14923,42.086495],[-79.154549,42.086584],[-79.155033,42.088077],[-79.15666400000001,42.092868],[-79.15709699999999,42.094049],[-79.15773299999999,42.095747],[-79.15800900000001,42.096441],[-79.158389,42.097399],[-79.15848,42.097596],[-79.158591,42.097797],[-79.158782,42.098078],[-79.1589,42.098214],[-79.159036,42.098351],[-79.160619,42.099816],[-79.161216,42.100351],[-79.161463,42.100555],[-79.16170700000001,42.100731],[-79.16189799999999,42.100856],[-79.16227600000001,42.10107],[-79.162617,42.101226],[-79.163055,42.101405],[-79.164716,42.101961],[-79.16504399999999,42.102052],[-79.167838,42.102775],[-79.16879,42.103036],[-79.16860699999999,42.103298]]],"type":"Polygon"}
}