{
  "id": "360050283002",
  "type": "Feature",
  "properties": {
    "area_land":110614,
    "area_water":0,
    "geoid":"360050283002",
    "name":"Block Group 2",
    "state":"ny"
},
  "bbox": [
    -73.902822,
    40.880995,
    -73.896839,
    40.886537
],
  "geometry": {"coordinates":[[[-73.902822,40.881687],[-73.90158700000001,40.883482],[-73.901043,40.884371],[-73.90064700000001,40.885099],[-73.900369,40.885632],[-73.90024,40.885878],[-73.900182,40.885973],[-73.900109,40.886094],[-73.89984,40.886537],[-73.899664,40.886507],[-73.898926,40.886383],[-73.897383,40.886087],[-73.89715700000001,40.886045],[-73.896839,40.885986],[-73.89775400000001,40.885209],[-73.89860400000001,40.884407],[-73.900177,40.882602],[-73.90157600000001,40.880995],[-73.90176700000001,40.881104],[-73.902002,40.881235],[-73.902822,40.881687]]],"type":"Polygon"}
}