{
  "id": "360290014021",
  "type": "Feature",
  "properties": {
    "area_land":157335,
    "area_water":0,
    "geoid":"360290014021",
    "name":"Block Group 1",
    "state":"ny"
},
  "bbox": [
    -78.859933,
    42.878983,
    -78.852891,
    42.882748
],
  "geometry": {"coordinates":[[[-78.859667,42.880827],[-78.859646,42.880893],[-78.859413,42.881575],[-78.859331,42.88182],[-78.85902,42.882748],[-78.857501,42.882483],[-78.85680600000001,42.882362],[-78.85660900000001,42.882328],[-78.855587,42.882148],[-78.85545399999999,42.882125],[-78.855092,42.882059],[-78.85391799999999,42.881845],[-78.853392,42.88175],[-78.852898,42.881661],[-78.852891,42.880465],[-78.853911,42.880642],[-78.85391,42.880287],[-78.85407600000001,42.879788],[-78.854269,42.879211],[-78.854337,42.878993],[-78.854488,42.879026],[-78.85456499999999,42.879038],[-78.85473,42.879046],[-78.854889,42.879041],[-78.85500399999999,42.879025],[-78.855114,42.878994],[-78.855141,42.878983],[-78.855254,42.879106],[-78.855358,42.879161],[-78.855512,42.879193],[-78.85598400000001,42.879273],[-78.85753,42.879549],[-78.859933,42.879974],[-78.859667,42.880827]]],"type":"Polygon"}
}