{
  "id": "361070204013",
  "type": "Feature",
  "properties": {
    "area_land":23458803,
    "area_water":855197,
    "geoid":"361070204013",
    "name":"Block Group 3",
    "state":"ny"
},
  "bbox": [
    -76.230341,
    42.02954,
    -76.141259,
    42.099362
],
  "geometry": {"coordinates":[[[-76.23033100000001,42.049571],[-76.23031400000001,42.04966],[-76.230304,42.049717],[-76.230262,42.049836],[-76.230204,42.049952],[-76.230116,42.050082],[-76.229966,42.050263],[-76.229812,42.050417],[-76.22944,42.050742],[-76.22937899999999,42.050811],[-76.22933999999999,42.050873],[-76.229275,42.051023],[-76.22926699999999,42.051265],[-76.229313,42.051557],[-76.22974000000001,42.05345],[-76.229944,42.054438],[-76.230053,42.05515],[-76.22906999999999,42.055215],[-76.228208,42.05525],[-76.226011,42.055371],[-76.225244,42.055425],[-76.224751,42.055461],[-76.222497,42.05554],[-76.219369,42.055688],[-76.21789099999999,42.055763],[-76.214471,42.055938],[-76.212356,42.05607],[-76.21120500000001,42.05612],[-76.21081100000001,42.056141],[-76.208808,42.056253],[-76.208658,42.056288],[-76.208597,42.056318],[-76.208539,42.056372],[-76.208527,42.056401],[-76.208504,42.056453],[-76.208395,42.058193],[-76.208387,42.05887],[-76.208341,42.062773],[-76.208321,42.063146],[-76.208298,42.063334],[-76.208208,42.063633],[-76.208135,42.063798],[-76.20778799999999,42.064452],[-76.207567,42.064942],[-76.207486,42.065186],[-76.207111,42.06654],[-76.206986,42.067073],[-76.20691100000001,42.067571],[-76.206891,42.067909],[-76.20692200000001,42.068148],[-76.207143,42.069042],[-76.207155,42.069158],[-76.207151,42.069284],[-76.20711900000001,42.069582],[-76.207083,42.069731],[-76.20700600000001,42.069955],[-76.206895,42.070136],[-76.206701,42.070365],[-76.206416,42.070611],[-76.20619600000001,42.070765],[-76.205467,42.071356],[-76.205313,42.071521],[-76.205197,42.071709],[-76.20509699999999,42.071948],[-76.20482199999999,42.072715],[-76.20465299999999,42.073238],[-76.204531,42.073767],[-76.204514,42.074119],[-76.204526,42.074261],[-76.204564,42.074419],[-76.204689,42.074714],[-76.20475399999999,42.074826],[-76.205485,42.075305],[-76.20581799999999,42.075499],[-76.206672,42.075957],[-76.20695000000001,42.076111],[-76.207125,42.076263],[-76.207256,42.076424],[-76.207302,42.076509],[-76.207386,42.076774],[-76.207573,42.077996],[-76.207652,42.078444],[-76.207706,42.078851],[-76.20781599999999,42.079914],[-76.20701099999999,42.079943],[-76.206288,42.080012],[-76.205327,42.080168],[-76.204869,42.080276],[-76.204009,42.080505],[-76.202603,42.080941],[-76.20271200000001,42.081213],[-76.20282899999999,42.081497],[-76.203063,42.082068],[-76.20314399999999,42.082314],[-76.203163,42.082563],[-76.203141,42.082758],[-76.203086,42.082931],[-76.20298200000001,42.083154],[-76.20270600000001,42.0836],[-76.202451,42.083943],[-76.201916,42.084555],[-76.20159700000001,42.084888],[-76.201308,42.085149],[-76.201078,42.085296],[-76.20056,42.085542],[-76.20013299999999,42.085732],[-76.198268,42.086484],[-76.198088,42.086558],[-76.196681,42.087133],[-76.19522000000001,42.087712],[-76.195064,42.08777],[-76.194434,42.08801],[-76.192109,42.088918],[-76.191361,42.08923],[-76.190578,42.089559],[-76.189086,42.090211],[-76.188974,42.090264],[-76.188641,42.090425],[-76.18853,42.09048],[-76.188637,42.090484],[-76.18877999999999,42.090529],[-76.188936,42.090594],[-76.18907400000001,42.090665],[-76.189087,42.090672],[-76.18920199999999,42.090749],[-76.189312,42.090795],[-76.189436,42.090823],[-76.189532,42.090823],[-76.18964200000001,42.090837],[-76.18974300000001,42.090869],[-76.189803,42.090915],[-76.18991800000001,42.090974],[-76.190106,42.090992],[-76.190257,42.090951],[-76.19034000000001,42.090942],[-76.190409,42.090947],[-76.190468,42.090974],[-76.19051399999999,42.091011],[-76.190624,42.091057],[-76.190687,42.09112],[-76.190725,42.091158],[-76.190799,42.09119],[-76.190909,42.091185],[-76.191028,42.09119],[-76.191102,42.091203],[-76.191143,42.091235],[-76.19120100000001,42.091307],[-76.191638,42.091407],[-76.192949,42.091709],[-76.193387,42.09181],[-76.184646,42.096935],[-76.180673,42.099266],[-76.167699,42.099362],[-76.160421,42.097759],[-76.15644899999999,42.094153],[-76.15613500000001,42.093868],[-76.157875,42.086363],[-76.157444,42.084407],[-76.15628,42.079663],[-76.156014,42.079371],[-76.153823,42.076965],[-76.15038,42.073844],[-76.145163,42.07037],[-76.14422500000001,42.068989],[-76.14298700000001,42.067166],[-76.142123,42.065894],[-76.14125900000001,42.064622],[-76.14148900000001,42.064421],[-76.142179,42.063822],[-76.14241,42.063622],[-76.14261999999999,42.063538],[-76.143254,42.063287],[-76.14346500000001,42.063204],[-76.143518,42.063182],[-76.14367900000001,42.063119],[-76.143733,42.063098],[-76.143996,42.062983],[-76.144037,42.062964],[-76.144374,42.062815],[-76.144801,42.062684],[-76.14498,42.062655],[-76.145309,42.062603],[-76.14579500000001,42.063059],[-76.146164,42.063406],[-76.146931,42.064152],[-76.147104,42.064331],[-76.14721900000001,42.064462],[-76.147659,42.064964],[-76.147719,42.065043],[-76.147891,42.065256],[-76.148207,42.065716],[-76.14839600000001,42.066026],[-76.148533,42.06625],[-76.149081,42.067211],[-76.149581,42.068131],[-76.149974,42.068763],[-76.150244,42.069101],[-76.150409,42.069268],[-76.150453,42.069306],[-76.151428,42.070159],[-76.151662,42.070358],[-76.15236400000001,42.070956],[-76.152598,42.071156],[-76.15316300000001,42.071628],[-76.154068,42.072384],[-76.154342,42.072628],[-76.15476,42.073048],[-76.15480599999999,42.073103],[-76.15522,42.073594],[-76.155276,42.073671],[-76.155416,42.073863],[-76.155565,42.074098],[-76.15572400000001,42.074347],[-76.15634300000001,42.075437],[-76.15646099999999,42.075645],[-76.15659599999999,42.075888],[-76.156794,42.076245],[-76.156864,42.076371],[-76.157398,42.077311],[-76.157601,42.077667],[-76.15769,42.077825],[-76.157957,42.0783],[-76.158047,42.078459],[-76.15808800000001,42.078532],[-76.158145,42.078632],[-76.15844199999999,42.079154],[-76.158541,42.079328],[-76.158917,42.079999],[-76.158978,42.080102],[-76.15922999999999,42.080524],[-76.15945000000001,42.080851],[-76.159665,42.081131],[-76.159864,42.08136],[-76.160141,42.081637],[-76.16044100000001,42.081903],[-76.16071100000001,42.082102],[-76.161427,42.082632],[-76.16152200000001,42.082591],[-76.161706,42.082562],[-76.16260699999999,42.082493],[-76.16290499999999,42.082471],[-76.163866,42.082405],[-76.165359,42.082301],[-76.166766,42.082204],[-76.168578,42.082041],[-76.16934500000001,42.081996],[-76.169577,42.081996],[-76.169853,42.082031],[-76.170085,42.082085],[-76.170309,42.082167],[-76.17089199999999,42.082405],[-76.17158499999999,42.082663],[-76.171967,42.08279],[-76.172313,42.082892],[-76.172571,42.082948],[-76.172631,42.082961],[-76.173661,42.083116],[-76.17429300000001,42.083249],[-76.174629,42.083348],[-76.17496199999999,42.083489],[-76.17488,42.083389],[-76.174738,42.08309],[-76.17463100000001,42.082791],[-76.17461,42.082756],[-76.17456,42.082713],[-76.174474,42.082699],[-76.17438900000001,42.082628],[-76.174346,42.082563],[-76.17430400000001,42.082357],[-76.174311,42.082158],[-76.17428,42.081833],[-76.17409499999999,42.081236],[-76.174081,42.08115],[-76.174102,42.080652],[-76.174159,42.080432],[-76.17420199999999,42.080268],[-76.174195,42.080168],[-76.17412400000001,42.079912],[-76.173732,42.079315],[-76.173433,42.07908],[-76.172614,42.07871],[-76.172522,42.078641],[-76.1724,42.078527],[-76.172374,42.078476],[-76.17232799999999,42.078307],[-76.172298,42.078243],[-76.172251,42.078197],[-76.172048,42.078044],[-76.171908,42.077981],[-76.17184899999999,42.077939],[-76.171812,42.07784],[-76.17178199999999,42.077686],[-76.17173200000001,42.077631],[-76.171683,42.0776],[-76.17152299999999,42.077532],[-76.171288,42.077471],[-76.171165,42.077428],[-76.17111,42.077384],[-76.171091,42.077348],[-76.17107900000001,42.077286],[-76.17108500000001,42.077206],[-76.171116,42.077144],[-76.171239,42.077058],[-76.17128200000001,42.077003],[-76.17128200000001,42.07696],[-76.17126399999999,42.076935],[-76.171215,42.076916],[-76.171184,42.076892],[-76.171184,42.076799],[-76.171221,42.076725],[-76.171221,42.07667],[-76.17119,42.076602],[-76.171116,42.076541],[-76.171048,42.076424],[-76.17102300000001,42.076276],[-76.170968,42.076116],[-76.170894,42.07603],[-76.17075800000001,42.075906],[-76.17069600000001,42.075812],[-76.170646,42.075711],[-76.17064999999999,42.075625],[-76.17067,42.075594],[-76.170689,42.075582],[-76.170821,42.075594],[-76.170868,42.075586],[-76.170907,42.075566],[-76.171004,42.075488],[-76.171055,42.0755],[-76.171102,42.075543],[-76.171133,42.075555],[-76.17120300000001,42.075559],[-76.171254,42.075547],[-76.17129300000001,42.075516],[-76.171375,42.075422],[-76.171434,42.075379],[-76.171527,42.075348],[-76.171543,42.075325],[-76.171558,42.075235],[-76.171644,42.075192],[-76.171707,42.075149],[-76.171847,42.075005],[-76.172038,42.074841],[-76.17245200000001,42.074709],[-76.172569,42.074682],[-76.172697,42.074666],[-76.17318299999999,42.074489],[-76.17339200000001,42.074387],[-76.17341,42.074374],[-76.17348800000001,42.074325],[-76.173641,42.074207],[-76.173754,42.074105],[-76.173855,42.07397],[-76.173935,42.073834],[-76.173985,42.073693],[-76.17401599999999,42.073481],[-76.17403899999999,42.073165],[-76.17409499999999,42.073029],[-76.17416299999999,42.072922],[-76.17437700000001,42.072753],[-76.17450700000001,42.0726],[-76.174677,42.072442],[-76.174925,42.072239],[-76.175072,42.072199],[-76.175276,42.072182],[-76.175506,42.072149],[-76.175138,42.072015],[-76.17397099999999,42.071526],[-76.173804,42.07144],[-76.17364499999999,42.07131],[-76.17359999999999,42.071245],[-76.173537,42.071021],[-76.173509,42.070805],[-76.173452,42.070544],[-76.173388,42.070335],[-76.17335799999999,42.070266],[-76.17329700000001,42.070124],[-76.173207,42.069974],[-76.172932,42.069571],[-76.172616,42.069167],[-76.172241,42.068658],[-76.172057,42.068389],[-76.17196300000001,42.06823],[-76.171922,42.068133],[-76.171847,42.067856],[-76.17178,42.067416],[-76.171727,42.066947],[-76.171368,42.064602],[-76.17132100000001,42.064097],[-76.171266,42.062611],[-76.17125,42.062554],[-76.171223,42.062515],[-76.171162,42.062469],[-76.17108899999999,42.062442],[-76.170985,42.062419],[-76.170815,42.062407],[-76.17061099999999,42.062407],[-76.170292,42.062442],[-76.170086,42.06247],[-76.169344,42.062574],[-76.168733,42.062682],[-76.168615,42.062695],[-76.168476,42.062686],[-76.168378,42.062642],[-76.168317,42.062572],[-76.168284,42.0624],[-76.168257,42.061995],[-76.16821899999999,42.061672],[-76.168149,42.061273],[-76.167745,42.061276],[-76.16745400000001,42.061247],[-76.167424,42.06124],[-76.167131,42.06117],[-76.16668799999999,42.061008],[-76.166184,42.060789],[-76.16542099999999,42.060399],[-76.16477500000001,42.060069],[-76.165272,42.059701],[-76.165768,42.059336],[-76.166321,42.058953],[-76.16652499999999,42.058799],[-76.166758,42.05859],[-76.166786,42.058566],[-76.166861,42.058476],[-76.167002,42.058285],[-76.16707700000001,42.058143],[-76.1671,42.05808],[-76.167132,42.057991],[-76.167168,42.057805],[-76.167179,42.057752],[-76.167199,42.057495],[-76.167181,42.056955],[-76.16717300000001,42.056672],[-76.167157,42.056428],[-76.167136,42.056311],[-76.16697499999999,42.055373],[-76.16695900000001,42.055236],[-76.166938,42.055055],[-76.166928,42.054875],[-76.16692500000001,42.054835],[-76.16692,42.054721],[-76.166926,42.054679],[-76.166962,42.054436],[-76.16696899999999,42.054395],[-76.167028,42.054151],[-76.167142,42.053849],[-76.167196,42.05374],[-76.167219,42.053696],[-76.16732399999999,42.05353],[-76.167357,42.053478],[-76.167458,42.053324],[-76.16749299999999,42.053273],[-76.16809000000001,42.052444],[-76.168216,42.052254],[-76.168463,42.051886],[-76.168724,42.051434],[-76.169016,42.050856],[-76.169134,42.050575],[-76.169291,42.050135],[-76.16945,42.049564],[-76.16950900000001,42.049296],[-76.16956999999999,42.048852],[-76.169574,42.048805],[-76.169613,42.048359],[-76.16962599999999,42.047756],[-76.169613,42.047559],[-76.172527,42.047439],[-76.172798,42.047428],[-76.17322900000001,42.047397],[-76.17491699999999,42.047149],[-76.17505199999999,42.047122],[-76.175175,42.047083],[-76.17525999999999,42.047045],[-76.175341,42.046995],[-76.175518,42.046822],[-76.176666,42.045195],[-76.176939,42.044911],[-76.177093,42.044783],[-76.17732700000001,42.044649],[-76.17742,42.044618],[-76.17759700000001,42.044586],[-76.179113,42.044497],[-76.1801,42.044468],[-76.180437,42.044459],[-76.182272,42.044511],[-76.18301700000001,42.044512],[-76.183306,42.044513],[-76.184102,42.044494],[-76.18480700000001,42.044463],[-76.186385,42.044222],[-76.18645100000001,42.044213],[-76.187352,42.044063],[-76.189463,42.043646],[-76.191282,42.043236],[-76.191475,42.043178],[-76.194052,42.042288],[-76.196163,42.041541],[-76.197091,42.041213],[-76.197249,42.041144],[-76.197357,42.041078],[-76.197609,42.04088],[-76.198527,42.039917],[-76.198829,42.039578],[-76.198959,42.039432],[-76.19919899999999,42.039107],[-76.199292,42.038949],[-76.19934499999999,42.038833],[-76.19958200000001,42.038321],[-76.199732,42.037944],[-76.20007699999999,42.036988],[-76.20021199999999,42.036661],[-76.20037499999999,42.036332],[-76.200385,42.036314],[-76.20058899999999,42.03599],[-76.200883,42.035553],[-76.200937,42.035474],[-76.201137,42.035224],[-76.20147,42.034848],[-76.201711,42.034578],[-76.202783,42.033419],[-76.203062,42.0331],[-76.203327,42.032817],[-76.20338599999999,42.032755],[-76.203934,42.032129],[-76.204544,42.031432],[-76.20473,42.031252],[-76.204965,42.031043],[-76.20544700000001,42.030686],[-76.20551,42.03064],[-76.20589200000001,42.030398],[-76.206228,42.030232],[-76.20647099999999,42.030159],[-76.20660100000001,42.030134],[-76.207572,42.030074],[-76.208409,42.030039],[-76.20926,42.029986],[-76.2116,42.029859],[-76.211735,42.029852],[-76.213697,42.02976],[-76.21414900000001,42.029739],[-76.21460399999999,42.029719],[-76.216562,42.029633],[-76.217325,42.02959],[-76.218232,42.02954],[-76.21960199999999,42.031252],[-76.22070100000001,42.032642],[-76.22105000000001,42.033152],[-76.22134,42.03368],[-76.221664,42.034376],[-76.221782,42.034628],[-76.22212500000001,42.035477],[-76.22220799999999,42.035617],[-76.222545,42.036078],[-76.22275500000001,42.036312],[-76.22299599999999,42.036546],[-76.223394,42.036982],[-76.223552,42.037198],[-76.223677,42.03743],[-76.223885,42.037884],[-76.224093,42.038269],[-76.224205,42.038415],[-76.224626,42.038902],[-76.225065,42.039355],[-76.22546699999999,42.039846],[-76.227737,42.043086],[-76.228965,42.044917],[-76.229187,42.045305],[-76.229235,42.045419],[-76.229423,42.046089],[-76.229465,42.046259],[-76.22966599999999,42.046959],[-76.229839,42.047488],[-76.23012199999999,42.048411],[-76.23025199999999,42.048896],[-76.230329,42.049284],[-76.230341,42.049434],[-76.23033100000001,42.049571]]],"type":"Polygon"}
}