{
  "id": "360630240012",
  "type": "Feature",
  "properties": {
    "area_land":43450559,
    "area_water":0,
    "geoid":"360630240012",
    "name":"Block Group 2",
    "state":"ny"
},
  "bbox": [
    -78.619413,
    43.069424,
    -78.518551,
    43.151495
],
  "geometry": {"coordinates":[[[-78.61941299999999,43.143322],[-78.618871,43.151111],[-78.618818,43.151422],[-78.618365,43.151416],[-78.613755,43.151354],[-78.61190499999999,43.151342],[-78.609517,43.151318],[-78.608847,43.151311],[-78.606837,43.151291],[-78.606168,43.151285],[-78.60447000000001,43.151277],[-78.60351199999999,43.151274],[-78.599379,43.151292],[-78.597683,43.1513],[-78.596602,43.151306],[-78.594104,43.151332],[-78.593998,43.151332],[-78.59099399999999,43.151339],[-78.58931699999999,43.151357],[-78.587585,43.151362],[-78.585821,43.151388],[-78.582943,43.151413],[-78.58255699999999,43.151417],[-78.57925899999999,43.151461],[-78.578158,43.151465],[-78.57753700000001,43.151468],[-78.575135,43.151495],[-78.57485699999999,43.151495],[-78.573757,43.151495],[-78.573757,43.150903],[-78.573761,43.149127],[-78.573762,43.148536],[-78.571258,43.148534],[-78.570892,43.148534],[-78.568763,43.148566],[-78.567702,43.148569],[-78.565546,43.148593],[-78.56374599999999,43.148598],[-78.561243,43.148605],[-78.558083,43.148606],[-78.556713,43.148603],[-78.554861,43.148601],[-78.55399199999999,43.148591],[-78.553417,43.148572],[-78.552961,43.148527],[-78.551267,43.148311],[-78.549666,43.148075],[-78.548958,43.147931],[-78.548084,43.147768],[-78.54626399999999,43.147405],[-78.545309,43.147229],[-78.54343799999999,43.146862],[-78.543278,43.146834],[-78.542754,43.146742],[-78.54152999999999,43.146509],[-78.53924600000001,43.146057],[-78.538828,43.145999],[-78.538893,43.144983],[-78.539079,43.142092],[-78.53908699999999,43.141938],[-78.539143,43.140923],[-78.53916099999999,43.14065],[-78.539186,43.140299],[-78.53920599999999,43.13983],[-78.539219,43.139557],[-78.539254,43.138971],[-78.53929599999999,43.13881],[-78.53936899999999,43.138703],[-78.53942600000001,43.138654],[-78.539573,43.138566],[-78.540156,43.138356],[-78.54020300000001,43.13834],[-78.54067000000001,43.138196],[-78.541184,43.138006],[-78.54179600000001,43.137824],[-78.54348899999999,43.137403],[-78.544667,43.137135],[-78.545085,43.137023],[-78.54522,43.136989],[-78.546919,43.136567],[-78.54687699999999,43.136376],[-78.546875,43.136072],[-78.546941,43.135127],[-78.546993,43.134403],[-78.54713700000001,43.132749],[-78.547281,43.130966],[-78.54729500000001,43.130802],[-78.54735700000001,43.130125],[-78.547408,43.12936],[-78.54741799999999,43.129301],[-78.54745,43.129127],[-78.547462,43.12907],[-78.547532,43.128975],[-78.54762599999999,43.128892],[-78.54774500000001,43.128804],[-78.548119,43.128592],[-78.549058,43.128027],[-78.549758,43.127617],[-78.554239,43.125003],[-78.555368,43.124329],[-78.55681800000001,43.123497],[-78.556827,43.12349],[-78.55697000000001,43.1234],[-78.557166,43.123228],[-78.557196,43.123147],[-78.557215,43.123038],[-78.55731299999999,43.120938],[-78.557345,43.120339],[-78.557388,43.119546],[-78.55741,43.118934],[-78.557435,43.118542],[-78.557474,43.117944],[-78.557514,43.117107],[-78.55756,43.116503],[-78.557569,43.11634],[-78.5578,43.112349],[-78.55784199999999,43.112122],[-78.557911,43.111941],[-78.557954,43.111864],[-78.558046,43.111766],[-78.55813000000001,43.111705],[-78.558176,43.111687],[-78.558195,43.111685],[-78.55842,43.111664],[-78.558673,43.111672],[-78.5598,43.111708],[-78.559453,43.111663],[-78.55940200000001,43.111657],[-78.558971,43.111567],[-78.55869300000001,43.111496],[-78.558437,43.111416],[-78.558269,43.111363],[-78.558108,43.111303],[-78.557806,43.11118],[-78.55736,43.110946],[-78.556808,43.110595],[-78.556465,43.110332],[-78.55595599999999,43.109942],[-78.554293,43.108645],[-78.552751,43.10746],[-78.55233800000001,43.107094],[-78.55197800000001,43.106747],[-78.5506,43.105417],[-78.549662,43.10451],[-78.54703000000001,43.101968],[-78.54684399999999,43.101798],[-78.546389,43.101382],[-78.545894,43.100905],[-78.544499,43.099565],[-78.544172,43.099291],[-78.543935,43.099102],[-78.54243099999999,43.097989],[-78.54126100000001,43.097132],[-78.54046099999999,43.096546],[-78.53800699999999,43.094737],[-78.535369,43.092805],[-78.534892,43.092514],[-78.53466899999999,43.092392],[-78.534255,43.092195],[-78.53387600000001,43.092038],[-78.533458,43.091892],[-78.53271599999999,43.091679],[-78.532105,43.091563],[-78.528318,43.090948],[-78.527725,43.090869],[-78.527513,43.090855],[-78.526718,43.090821],[-78.525773,43.090796],[-78.52503400000001,43.090781],[-78.523933,43.090759],[-78.521371,43.090687],[-78.520944,43.090642],[-78.520714,43.090603],[-78.520247,43.090494],[-78.519993,43.090413],[-78.51972000000001,43.090314],[-78.519503,43.090223],[-78.519158,43.09005],[-78.519031,43.089975],[-78.518913,43.089905],[-78.518711,43.089757],[-78.518669,43.089727],[-78.518551,43.089641],[-78.519031,43.089336],[-78.519569,43.089039],[-78.520042,43.088805],[-78.520233,43.08876],[-78.520439,43.088734],[-78.520645,43.08876],[-78.52079000000001,43.088799],[-78.520882,43.088875],[-78.521072,43.089222],[-78.521309,43.08979],[-78.52137,43.089878],[-78.521444,43.089942],[-78.521568,43.090015],[-78.52171300000001,43.090031],[-78.52182000000001,43.090019],[-78.521942,43.089981],[-78.522041,43.089943],[-78.522141,43.08987],[-78.522278,43.089722],[-78.52235400000001,43.089611],[-78.52237700000001,43.089561],[-78.522293,43.088593],[-78.52224,43.088413],[-78.522217,43.088314],[-78.52222399999999,43.088211],[-78.522263,43.08815],[-78.522392,43.088058],[-78.522469,43.088017],[-78.52281499999999,43.08793],[-78.52288799999999,43.08791],[-78.52299499999999,43.087898],[-78.523207,43.087891],[-78.52376599999999,43.08791],[-78.524719,43.088078],[-78.524981,43.088088],[-78.52533699999999,43.088032],[-78.525497,43.087975],[-78.525665,43.087883],[-78.526222,43.087612],[-78.526436,43.087563],[-78.526726,43.08754],[-78.527061,43.087563],[-78.52726699999999,43.087631],[-78.527542,43.08773],[-78.52767900000001,43.087791],[-78.527968,43.087976],[-78.52806099999999,43.088062],[-78.528122,43.088142],[-78.52810700000001,43.088245],[-78.528069,43.088299],[-78.527969,43.088352],[-78.52761099999999,43.088463],[-78.527306,43.088593],[-78.526825,43.088875],[-78.526672,43.088966],[-78.526642,43.089027],[-78.52660400000001,43.089176],[-78.526611,43.08926],[-78.52697000000001,43.090363],[-78.527016,43.090431],[-78.5271,43.090511],[-78.52718299999999,43.090577],[-78.52729600000001,43.09062],[-78.527405,43.090649],[-78.527573,43.090649],[-78.527901,43.090588],[-78.52800000000001,43.090572],[-78.52860099999999,43.090417],[-78.52873200000001,43.090347],[-78.528831,43.090279],[-78.528893,43.090221],[-78.528976,43.090115],[-78.528991,43.089998],[-78.528969,43.089806],[-78.52887699999999,43.089626],[-78.528458,43.089222],[-78.52825900000001,43.088905],[-78.52821400000001,43.088772],[-78.528206,43.088696],[-78.528229,43.088608],[-78.528244,43.08857],[-78.528328,43.088543],[-78.528488,43.088455],[-78.528679,43.088367],[-78.528931,43.088203],[-78.52928199999999,43.088062],[-78.529747,43.087749],[-78.5299,43.087688],[-78.530045,43.087688],[-78.53022,43.08773],[-78.530304,43.087776],[-78.53037999999999,43.087791],[-78.530491,43.087797],[-78.530602,43.087749],[-78.530731,43.087681],[-78.531136,43.087376],[-78.53124200000001,43.087341],[-78.531395,43.087349],[-78.53154000000001,43.087402],[-78.53171500000001,43.087532],[-78.53179900000001,43.087654],[-78.531853,43.087784],[-78.531853,43.087936],[-78.531952,43.088593],[-78.532005,43.088665],[-78.532089,43.088696],[-78.532234,43.088692],[-78.53241,43.088661],[-78.532555,43.088585],[-78.532661,43.088512],[-78.53276099999999,43.08844],[-78.53288499999999,43.088285],[-78.53299699999999,43.088165],[-78.533035,43.088104],[-78.533148,43.087925],[-78.533783,43.08688],[-78.534035,43.086563],[-78.534431,43.086182],[-78.53473700000001,43.085991],[-78.534981,43.085938],[-78.535225,43.085911],[-78.535721,43.085632],[-78.53598,43.085541],[-78.53613300000001,43.085491],[-78.53627,43.085491],[-78.53643,43.085564],[-78.53655999999999,43.085678],[-78.536674,43.085896],[-78.536804,43.086273],[-78.536817,43.086427],[-78.536827,43.08675],[-78.536858,43.086819],[-78.537682,43.08733],[-78.538048,43.087433],[-78.538292,43.087421],[-78.53846900000001,43.087374],[-78.538673,43.087276],[-78.538811,43.08709],[-78.539085,43.08691],[-78.539131,43.086864],[-78.539131,43.086758],[-78.539078,43.086571],[-78.539047,43.08654],[-78.538864,43.08643],[-78.538681,43.086369],[-78.53821600000001,43.0863],[-78.53808600000001,43.086239],[-78.538033,43.086182],[-78.537987,43.086075],[-78.53800200000001,43.086014],[-78.53808600000001,43.085911],[-78.53830000000001,43.085804],[-78.53846,43.085739],[-78.538628,43.085705],[-78.538887,43.085705],[-78.539047,43.085709],[-78.53975699999999,43.085678],[-78.539917,43.085693],[-78.54000000000001,43.08567],[-78.540115,43.085751],[-78.540254,43.085892],[-78.540306,43.086002],[-78.54039400000001,43.086203],[-78.540352,43.086437],[-78.540335,43.086556],[-78.540161,43.08709],[-78.54014599999999,43.087166],[-78.540161,43.087223],[-78.540215,43.087353],[-78.540312,43.087478],[-78.540436,43.087601],[-78.54059599999999,43.087696],[-78.540741,43.087749],[-78.54090100000001,43.087788],[-78.54109200000001,43.087795],[-78.541443,43.087772],[-78.54175600000001,43.087711],[-78.541854,43.087706],[-78.541977,43.087734],[-78.542061,43.087803],[-78.542114,43.087872],[-78.542125,43.08792],[-78.542137,43.087975],[-78.542114,43.088089],[-78.542008,43.088199],[-78.54173299999999,43.088299],[-78.541473,43.088345],[-78.54135100000001,43.088352],[-78.540916,43.088322],[-78.540482,43.088299],[-78.540283,43.088352],[-78.540237,43.088402],[-78.540199,43.088524],[-78.540359,43.088928],[-78.54042099999999,43.089951],[-78.540443,43.090092],[-78.54052,43.090263],[-78.540627,43.090427],[-78.54080999999999,43.090595],[-78.541496,43.091053],[-78.541687,43.091137],[-78.54195900000001,43.091206],[-78.54218400000001,43.091146],[-78.542282,43.091099],[-78.542625,43.090694],[-78.542923,43.090153],[-78.543007,43.08976],[-78.542992,43.089664],[-78.542976,43.089588],[-78.542877,43.089432],[-78.542824,43.089386],[-78.542419,43.089317],[-78.542389,43.089287],[-78.542389,43.089138],[-78.54244199999999,43.089027],[-78.542625,43.088802],[-78.54276,43.088741],[-78.542885,43.088741],[-78.54334299999999,43.088844],[-78.543633,43.088921],[-78.543854,43.089012],[-78.54428900000001,43.089237],[-78.544601,43.089447],[-78.544662,43.0895],[-78.545044,43.090183],[-78.54519500000001,43.09034],[-78.54540299999999,43.09045],[-78.545547,43.090477],[-78.54573000000001,43.090484],[-78.54594400000001,43.090446],[-78.546486,43.090061],[-78.546623,43.090008],[-78.546677,43.090008],[-78.54682200000001,43.090065],[-78.54689,43.090256],[-78.546921,43.090878],[-78.546959,43.091022],[-78.547043,43.09119],[-78.54718800000001,43.091351],[-78.54737900000001,43.091499],[-78.54737900000001,43.091557],[-78.547462,43.091751],[-78.547455,43.091969],[-78.54735599999999,43.092323],[-78.547258,43.092525],[-78.54716999999999,43.092672],[-78.547005,43.092865],[-78.546623,43.09314],[-78.546486,43.093231],[-78.54639400000001,43.093285],[-78.54631000000001,43.093315],[-78.54615699999999,43.093339],[-78.546074,43.09333],[-78.545692,43.093246],[-78.54553199999999,43.093246],[-78.545227,43.093285],[-78.544588,43.093268],[-78.54438500000001,43.09328],[-78.54426599999999,43.093277],[-78.54418200000001,43.093266],[-78.544067,43.093227],[-78.544022,43.093197],[-78.543587,43.092789],[-78.54356,43.092777],[-78.543488,43.092762],[-78.543434,43.092781],[-78.543137,43.092941],[-78.542778,43.093082],[-78.542404,43.093197],[-78.54222900000001,43.093243],[-78.542061,43.093281],[-78.541893,43.093292],[-78.54139600000001,43.093303],[-78.541313,43.093315],[-78.541267,43.093349],[-78.541191,43.093464],[-78.541107,43.093653],[-78.541084,43.093838],[-78.541095,43.093914],[-78.541138,43.094006],[-78.541344,43.09417],[-78.541443,43.094257],[-78.541702,43.094551],[-78.54186199999999,43.094742],[-78.542007,43.094967],[-78.542091,43.095158],[-78.542107,43.095234],[-78.542114,43.095425],[-78.542091,43.095711],[-78.542046,43.095848],[-78.54188499999999,43.0961],[-78.541855,43.096195],[-78.541856,43.096326],[-78.54190800000001,43.096478],[-78.542107,43.096638],[-78.54227400000001,43.09671],[-78.54235799999999,43.096737],[-78.542564,43.096741],[-78.54325900000001,43.096687],[-78.54386100000001,43.096621],[-78.544067,43.096615],[-78.54437299999999,43.096645],[-78.544594,43.096725],[-78.544777,43.096848],[-78.54486799999999,43.096947],[-78.545029,43.097206],[-78.545219,43.097569],[-78.54527299999999,43.097748],[-78.54528000000001,43.097927],[-78.545265,43.098083],[-78.545219,43.098431],[-78.545258,43.098549],[-78.54529599999999,43.098591],[-78.545456,43.098656],[-78.545616,43.098686],[-78.545822,43.098694],[-78.54586,43.098705],[-78.545998,43.098694],[-78.546097,43.098667],[-78.546234,43.098602],[-78.54630299999999,43.098557],[-78.546654,43.098186],[-78.547577,43.097446],[-78.547737,43.097363],[-78.54864499999999,43.097042],[-78.549255,43.096905],[-78.549868,43.096755],[-78.550079,43.096668],[-78.55017100000001,43.096588],[-78.550224,43.096478],[-78.550262,43.096371],[-78.550247,43.096298],[-78.550247,43.096218],[-78.55021499999999,43.096167],[-78.550179,43.096088],[-78.550095,43.096004],[-78.549995,43.095928],[-78.549255,43.095356],[-78.549187,43.095257],[-78.549155,43.095149],[-78.549156,43.095055],[-78.549271,43.094891],[-78.549347,43.094528],[-78.54940000000001,43.094357],[-78.54948400000001,43.094154],[-78.54956799999999,43.093971],[-78.54966,43.093815],[-78.549767,43.093681],[-78.55006400000001,43.093403],[-78.550336,43.093183],[-78.550721,43.092907],[-78.551097,43.092752],[-78.551666,43.092545],[-78.552487,43.092334],[-78.55302399999999,43.092251],[-78.553192,43.092232],[-78.55345800000001,43.092224],[-78.553792,43.092268],[-78.55481,43.09248],[-78.555001,43.092474],[-78.555145,43.092419],[-78.55523700000001,43.092184],[-78.555176,43.091732],[-78.55526,43.091553],[-78.55542800000001,43.091446],[-78.557951,43.090684],[-78.56014999999999,43.089935],[-78.56044799999999,43.089901],[-78.560661,43.089951],[-78.560743,43.09001],[-78.56089799999999,43.09021],[-78.560875,43.090405],[-78.560664,43.090757],[-78.56036400000001,43.091148],[-78.56012699999999,43.09129],[-78.55946400000001,43.091576],[-78.55920399999999,43.091705],[-78.55901299999999,43.091843],[-78.55883799999999,43.092026],[-78.558277,43.092936],[-78.558044,43.09322],[-78.55783599999999,43.093437],[-78.557388,43.093845],[-78.55707099999999,43.094019],[-78.55584,43.094498],[-78.55501599999999,43.09486],[-78.55489300000001,43.094913],[-78.55481,43.09507],[-78.554851,43.095211],[-78.55497,43.095345],[-78.55520300000001,43.095375],[-78.55658699999999,43.095036],[-78.55703,43.094982],[-78.557213,43.094975],[-78.557343,43.094986],[-78.557632,43.095081],[-78.55806,43.095558],[-78.558296,43.096012],[-78.55835,43.096149],[-78.55835,43.096233],[-78.558296,43.09631],[-78.558173,43.096397],[-78.558125,43.096468],[-78.55811300000001,43.096546],[-78.558136,43.096699],[-78.558159,43.096771],[-78.55818600000001,43.096823],[-78.558258,43.096943],[-78.558334,43.097008],[-78.55843400000001,43.097076],[-78.55856300000001,43.097141],[-78.55873099999999,43.097214],[-78.55911399999999,43.097292],[-78.559448,43.097355],[-78.559624,43.097366],[-78.55978399999999,43.097359],[-78.55999799999999,43.097336],[-78.560265,43.097279],[-78.560616,43.097168],[-78.560787,43.097092],[-78.56101099999999,43.096972],[-78.562523,43.095898],[-78.563225,43.095474],[-78.563789,43.095036],[-78.563937,43.094902],[-78.56403400000001,43.094807],[-78.564072,43.09473],[-78.564072,43.094702],[-78.564064,43.094635],[-78.564003,43.094555],[-78.563537,43.094144],[-78.563362,43.094025],[-78.563095,43.093899],[-78.563011,43.093819],[-78.56298099999999,43.093739],[-78.563011,43.093643],[-78.563496,43.092766],[-78.56360599999999,43.092541],[-78.563667,43.092388],[-78.563907,43.091527],[-78.56424,43.090515],[-78.56448399999999,43.088894],[-78.564701,43.088554],[-78.564964,43.088367],[-78.56532300000001,43.088219],[-78.567131,43.088013],[-78.567902,43.087963],[-78.56841300000001,43.088013],[-78.56881,43.088165],[-78.569168,43.088467],[-78.569542,43.088608],[-78.57034299999999,43.088669],[-78.57115400000001,43.088445],[-78.571411,43.088379],[-78.572954,43.088459],[-78.574135,43.088474],[-78.57435599999999,43.088486],[-78.57545500000001,43.088608],[-78.57624800000001,43.088791],[-78.57637,43.088669],[-78.576302,43.088425],[-78.57614100000001,43.08828],[-78.574776,43.087502],[-78.574333,43.08712],[-78.574234,43.08688],[-78.57428,43.086605],[-78.574493,43.086235],[-78.575104,43.085899],[-78.57531,43.085739],[-78.575363,43.085518],[-78.575294,43.084934],[-78.574738,43.083149],[-78.57416499999999,43.082409],[-78.573776,43.082253],[-78.573273,43.082207],[-78.572647,43.082275],[-78.57250999999999,43.08223],[-78.572372,43.08205],[-78.572334,43.081787],[-78.572372,43.081696],[-78.572487,43.081501],[-78.573269,43.080879],[-78.57431,43.080208],[-78.574989,43.079906],[-78.575165,43.079845],[-78.57543200000001,43.079781],[-78.575577,43.079758],[-78.575745,43.079742],[-78.57590500000001,43.079742],[-78.576065,43.079758],[-78.57625,43.079751],[-78.57648500000001,43.079913],[-78.576604,43.080038],[-78.576691,43.080183],[-78.57671499999999,43.080313],[-78.57659099999999,43.081375],[-78.57663700000001,43.081707],[-78.576736,43.08189],[-78.576965,43.082096],[-78.577651,43.082471],[-78.57817799999999,43.082664],[-78.578255,43.082741],[-78.578239,43.082916],[-78.578186,43.082985],[-78.577217,43.08358],[-78.577118,43.083778],[-78.57713,43.083882],[-78.577271,43.084141],[-78.578232,43.084515],[-78.578423,43.084602],[-78.57920799999999,43.085228],[-78.579308,43.085377],[-78.57931499999999,43.085579],[-78.57914,43.08604],[-78.578468,43.087051],[-78.57820100000001,43.087498],[-78.57815600000001,43.087749],[-78.578239,43.087921],[-78.578293,43.087971],[-78.57858299999999,43.087994],[-78.57888800000001,43.087864],[-78.579491,43.087517],[-78.579857,43.087429],[-78.580231,43.087547],[-78.581253,43.088787],[-78.58152,43.088917],[-78.581757,43.088928],[-78.582031,43.088886],[-78.582497,43.088654],[-78.584557,43.086655],[-78.584808,43.086315],[-78.585075,43.085632],[-78.58513600000001,43.08519],[-78.585089,43.084574],[-78.58482600000001,43.084144],[-78.58448,43.083729],[-78.58432000000001,43.08361],[-78.58371699999999,43.083218],[-78.58343499999999,43.083076],[-78.58235000000001,43.08259],[-78.582123,43.0825],[-78.581947,43.082367],[-78.58163500000001,43.082111],[-78.580772,43.081291],[-78.580505,43.080982],[-78.580332,43.080737],[-78.580231,43.080444],[-78.58019299999999,43.08017],[-78.580246,43.079964],[-78.580444,43.079582],[-78.581299,43.078514],[-78.581773,43.077926],[-78.58213000000001,43.077499],[-78.58252,43.077255],[-78.582977,43.077091],[-78.583366,43.076977],[-78.584114,43.076859],[-78.584244,43.076714],[-78.584396,43.076393],[-78.584373,43.076211],[-78.584282,43.076065],[-78.58409899999999,43.075958],[-78.583878,43.075928],[-78.58317599999999,43.075893],[-78.582954,43.075836],[-78.582736,43.075693],[-78.58260300000001,43.075512],[-78.582577,43.075359],[-78.582656,43.07515],[-78.58281700000001,43.07497],[-78.583101,43.074785],[-78.58429700000001,43.074272],[-78.58461,43.074123],[-78.584801,43.074017],[-78.58563599999999,43.073428],[-78.586136,43.073109],[-78.58627300000001,43.073048],[-78.586372,43.073009],[-78.586533,43.072971],[-78.586708,43.072975],[-78.5868,43.073002],[-78.58691399999999,43.07304],[-78.587062,43.073161],[-78.58710499999999,43.073219],[-78.587189,43.073318],[-78.58786499999999,43.074412],[-78.588005,43.074589],[-78.588272,43.074783],[-78.588589,43.075018],[-78.589279,43.075443],[-78.590065,43.075867],[-78.59076899999999,43.076122],[-78.59090399999999,43.076157],[-78.591064,43.076122],[-78.591207,43.07604],[-78.591339,43.075893],[-78.591354,43.075806],[-78.591354,43.075725],[-78.591089,43.074896],[-78.59105700000001,43.074677],[-78.591095,43.074486],[-78.59116400000001,43.074326],[-78.5915,43.073916],[-78.591606,43.073711],[-78.59172100000001,43.073505],[-78.591759,43.073338],[-78.591774,43.07317],[-78.59178900000001,43.072186],[-78.591866,43.071709],[-78.591949,43.071365],[-78.592102,43.071014],[-78.59225499999999,43.070747],[-78.59234600000001,43.070614],[-78.592522,43.070393],[-78.592651,43.070267],[-78.592995,43.069984],[-78.593575,43.069664],[-78.593788,43.069584],[-78.59404000000001,43.0695],[-78.59431499999999,43.06945],[-78.594503,43.069425],[-78.594696,43.069424],[-78.59487900000001,43.069439],[-78.59504699999999,43.069477],[-78.595161,43.069523],[-78.59523,43.069561],[-78.59530599999999,43.069641],[-78.595406,43.069885],[-78.595421,43.069992],[-78.59541299999999,43.070141],[-78.59530599999999,43.070438],[-78.594818,43.071217],[-78.594666,43.071522],[-78.594658,43.071663],[-78.594719,43.07198],[-78.594849,43.072273],[-78.594948,43.07235],[-78.59526099999999,43.072453],[-78.595474,43.072468],[-78.59562699999999,43.072468],[-78.597229,43.072227],[-78.59815999999999,43.072121],[-78.598625,43.072075],[-78.59927399999999,43.072048],[-78.599937,43.07209],[-78.600388,43.072144],[-78.600662,43.072262],[-78.60092899999999,43.072498],[-78.601089,43.07275],[-78.601212,43.073074],[-78.60123400000001,43.07367],[-78.601265,43.073883],[-78.60131800000001,43.073936],[-78.60153200000001,43.073952],[-78.601707,43.073833],[-78.60178399999999,43.073696],[-78.602119,43.072773],[-78.602211,43.072594],[-78.60230300000001,43.072453],[-78.60256200000001,43.07225],[-78.602814,43.072124],[-78.60335499999999,43.071999],[-78.603989,43.072025],[-78.60543800000001,43.072411],[-78.606544,43.072674],[-78.606762,43.072836],[-78.606876,43.073113],[-78.60684999999999,43.073357],[-78.606689,43.073467],[-78.606247,43.073586],[-78.606003,43.073631],[-78.605225,43.073753],[-78.604485,43.07391],[-78.60422199999999,43.073983],[-78.603996,43.074081],[-78.603737,43.074211],[-78.603317,43.074448],[-78.60309599999999,43.074593],[-78.602203,43.075375],[-78.601479,43.075863],[-78.601349,43.076057],[-78.601355,43.076213],[-78.601479,43.076435],[-78.60163799999999,43.076544],[-78.601831,43.076636],[-78.602493,43.076694],[-78.603165,43.076614],[-78.603432,43.076569],[-78.603745,43.076481],[-78.60508,43.075848],[-78.605362,43.075752],[-78.605904,43.075584],[-78.606392,43.075531],[-78.607018,43.075592],[-78.607918,43.07579],[-78.60826900000001,43.075905],[-78.608879,43.076157],[-78.609669,43.076505],[-78.61168000000001,43.077733],[-78.61191599999999,43.077881],[-78.612088,43.077913],[-78.612267,43.077892],[-78.61245,43.077782],[-78.612578,43.077554],[-78.612605,43.077315],[-78.61256400000001,43.077129],[-78.61247299999999,43.076973],[-78.61215199999999,43.076595],[-78.61205699999999,43.076422],[-78.612053,43.076248],[-78.612129,43.076073],[-78.61219800000001,43.075974],[-78.612358,43.075863],[-78.612769,43.075768],[-78.61312100000001,43.0756],[-78.613579,43.075165],[-78.614075,43.074409],[-78.61417400000001,43.074291],[-78.614456,43.074135],[-78.614639,43.074097],[-78.61541099999999,43.074055],[-78.615842,43.074105],[-78.616074,43.0742],[-78.61629499999999,43.074486],[-78.616348,43.074638],[-78.61629499999999,43.07497],[-78.615723,43.075691],[-78.615448,43.076218],[-78.61541800000001,43.076581],[-78.615486,43.076698],[-78.616325,43.077194],[-78.616714,43.077408],[-78.617119,43.077736],[-78.61721,43.077892],[-78.61721199999999,43.078119],[-78.617149,43.078342],[-78.616844,43.07896],[-78.616158,43.080177],[-78.616028,43.080299],[-78.61586800000001,43.080406],[-78.615433,43.080547],[-78.61456699999999,43.080726],[-78.61436500000001,43.080826],[-78.61312100000001,43.081917],[-78.61277,43.082268],[-78.61251799999999,43.082752],[-78.61243399999999,43.083397],[-78.61245700000001,43.083557],[-78.612511,43.083645],[-78.612717,43.083809],[-78.61290700000001,43.083923],[-78.61325100000001,43.084061],[-78.613968,43.084225],[-78.61524199999999,43.084522],[-78.615578,43.084583],[-78.61582199999999,43.084656],[-78.616241,43.084801],[-78.61644699999999,43.084885],[-78.616615,43.084991],[-78.61676,43.085117],[-78.61687499999999,43.085239],[-78.616946,43.085342],[-78.617037,43.085484],[-78.617378,43.086285],[-78.617487,43.086459],[-78.617572,43.086553],[-78.61759600000001,43.086748],[-78.61767,43.087336],[-78.617695,43.087532],[-78.61771899999999,43.089664],[-78.617791,43.096063],[-78.61781499999999,43.098196],[-78.617823,43.099052],[-78.617848,43.101623],[-78.617857,43.10248],[-78.617856,43.103269],[-78.617856,43.105637],[-78.617856,43.106427],[-78.61785500000001,43.107836],[-78.61785500000001,43.112063],[-78.61785500000001,43.113473],[-78.617853,43.114239],[-78.61785,43.116536],[-78.61784900000001,43.117303],[-78.617908,43.119873],[-78.61808499999999,43.127586],[-78.618145,43.130157],[-78.618172,43.130712],[-78.618255,43.13238],[-78.61828300000001,43.132936],[-78.618312,43.133402],[-78.618399,43.134801],[-78.61842900000001,43.135268],[-78.618497,43.135489],[-78.618702,43.136155],[-78.618771,43.136377],[-78.618833,43.137072],[-78.619022,43.139158],[-78.619085,43.139854],[-78.61915,43.140547],[-78.619347,43.142627],[-78.61941299999999,43.143322]]],"type":"Polygon"}
}