{
  "id": "360810637001",
  "type": "Feature",
  "properties": {
    "area_land":261957,
    "area_water":0,
    "geoid":"360810637001",
    "name":"Block Group 1",
    "state":"ny"
},
  "bbox": [
    -73.863508,
    40.704746,
    -73.85594,
    40.7116
],
  "geometry": {"coordinates":[[[-73.863508,40.708911],[-73.861673,40.709857],[-73.860288,40.710565],[-73.859664,40.710621],[-73.859622,40.710347],[-73.858028,40.710504],[-73.85754799999999,40.710761],[-73.858187,40.7116],[-73.857298,40.711465],[-73.85714299999999,40.710991],[-73.856677,40.707692],[-73.85594,40.706395],[-73.85717200000001,40.705989],[-73.858215,40.705602],[-73.860156,40.704746],[-73.86069500000001,40.705417],[-73.86108299999999,40.705899],[-73.86153,40.706459],[-73.86175,40.70673],[-73.862162,40.707264],[-73.86228199999999,40.707377],[-73.86257500000001,40.707749],[-73.863041,40.708329],[-73.863508,40.708911]]],"type":"Polygon"}
}