{
  "id": "360550140013",
  "type": "Feature",
  "properties": {
    "area_land":1635329,
    "area_water":0,
    "geoid":"360550140013",
    "name":"Block Group 3",
    "state":"ny"
},
  "bbox": [
    -77.696735,
    43.230956,
    -77.671293,
    43.238472
],
  "geometry": {"coordinates":[[[-77.696726,43.233267],[-77.69669399999999,43.235273],[-77.696673,43.236695],[-77.69664899999999,43.238472],[-77.695919,43.238457],[-77.69439300000001,43.238451],[-77.692616,43.238443],[-77.691311,43.238441],[-77.690894,43.23844],[-77.690484,43.238435],[-77.687924,43.238408],[-77.68691099999999,43.2384],[-77.685934,43.238394],[-77.684747,43.238382],[-77.683134,43.238371],[-77.683001,43.238374],[-77.68265700000001,43.238381],[-77.68190199999999,43.238376],[-77.679344,43.23836],[-77.67927400000001,43.23836],[-77.674851,43.238349],[-77.67477599999999,43.238349],[-77.673818,43.238346],[-77.67222,43.238341],[-77.67205,43.238342],[-77.671353,43.238346],[-77.67129300000001,43.238347],[-77.671504,43.237702],[-77.671592,43.237359],[-77.671671,43.237055],[-77.67171999999999,43.236775],[-77.671769,43.236545],[-77.671803,43.236295],[-77.67183199999999,43.235976],[-77.671857,43.235476],[-77.67187199999999,43.235109],[-77.671891,43.23476],[-77.671896,43.234457],[-77.671921,43.234108],[-77.671935,43.233741],[-77.671955,43.233432],[-77.67197899999999,43.233084],[-77.67205300000001,43.232726],[-77.672107,43.232398],[-77.67217100000001,43.232049],[-77.672234,43.231706],[-77.67228299999999,43.231432],[-77.67236699999999,43.231099],[-77.672451,43.231099],[-77.674284,43.231088],[-77.67463100000001,43.231091],[-77.674706,43.231092],[-77.674813,43.231093],[-77.67494600000001,43.231094],[-77.676033,43.231107],[-77.676185,43.231109],[-77.677847,43.231149],[-77.67950999999999,43.231166],[-77.68222,43.231169],[-77.68266199999999,43.23117],[-77.683982,43.231137],[-77.68422700000001,43.231125],[-77.68494200000001,43.231074],[-77.685166,43.231048],[-77.68548699999999,43.231022],[-77.685787,43.231005],[-77.686955,43.230976],[-77.68839800000001,43.230956],[-77.689921,43.230958],[-77.69001900000001,43.230961],[-77.690744,43.230984],[-77.69138700000001,43.23103],[-77.693488,43.231132],[-77.694851,43.231158],[-77.695446,43.231161],[-77.696735,43.231166],[-77.696726,43.233267]]],"type":"Polygon"}
}