{
  "id": "360470159004",
  "type": "Feature",
  "properties": {
    "area_land":40200,
    "area_water":0,
    "geoid":"360470159004",
    "name":"Block Group 4",
    "state":"ny"
},
  "bbox": [
    -73.977102,
    40.675732,
    -73.973687,
    40.678065
],
  "geometry": {"coordinates":[[[-73.97661600000001,40.677431],[-73.97618,40.678065],[-73.973687,40.677078],[-73.974109,40.676452],[-73.974597,40.675732],[-73.977102,40.676707],[-73.97661600000001,40.677431]]],"type":"Polygon"}
}