{
  "id": "361031479021",
  "type": "Feature",
  "properties": {
    "area_land":1431631,
    "area_water":0,
    "geoid":"361031479021",
    "name":"Block Group 1",
    "state":"ny"
},
  "bbox": [
    -73.075348,
    40.735749,
    -73.053328,
    40.745788
],
  "geometry": {"coordinates":[[[-73.07534800000001,40.741597],[-73.07318100000001,40.741927],[-73.071743,40.742116],[-73.07065799999999,40.74226],[-73.06805799999999,40.743006],[-73.067571,40.743063],[-73.066496,40.743273],[-73.06618400000001,40.743335],[-73.063462,40.743866],[-73.062862,40.74398],[-73.05928299999999,40.744691],[-73.05449,40.745566],[-73.05332799999999,40.745788],[-73.053346,40.745622],[-73.053884,40.742531],[-73.054074,40.741441],[-73.054216,40.740612],[-73.054412,40.739471],[-73.054788,40.737283],[-73.054822,40.737149],[-73.05501,40.737089],[-73.05651400000001,40.736697],[-73.057089,40.736555],[-73.057371,40.736477],[-73.058093,40.736307],[-73.058635,40.73618],[-73.059482,40.735968],[-73.05963800000001,40.735957],[-73.06053799999999,40.736017],[-73.061916,40.7361],[-73.06279600000001,40.736149],[-73.06319000000001,40.736172],[-73.065258,40.736345],[-73.066985,40.736506],[-73.06721899999999,40.736522],[-73.06958400000001,40.736211],[-73.072671,40.735808],[-73.07324699999999,40.735749],[-73.07322499999999,40.735933],[-73.073526,40.736005],[-73.07363599999999,40.736178],[-73.073887,40.7365],[-73.074369,40.736725],[-73.074866,40.738403],[-73.075011,40.739525],[-73.07534800000001,40.741597]]],"type":"Polygon"}
}