{
  "id": "360610225001",
  "type": "Feature",
  "properties": {
    "area_land":144025,
    "area_water":0,
    "geoid":"360610225001",
    "name":"Block Group 1",
    "state":"ny"
},
  "bbox": [
    -73.959192,
    40.822876,
    -73.951853,
    40.82687
],
  "geometry": {"coordinates":[[[-73.95746200000001,40.82687],[-73.954989,40.825884],[-73.95488400000001,40.825834],[-73.954848,40.825817],[-73.954256,40.82555],[-73.953828,40.825372],[-73.953684,40.825312],[-73.951853,40.82451],[-73.952304,40.823887],[-73.95276200000001,40.823263],[-73.95483,40.824126],[-73.95532,40.82359],[-73.955352,40.823535],[-73.955697,40.822876],[-73.955731,40.822891],[-73.955769,40.822904],[-73.95634,40.823092],[-73.956515,40.82312],[-73.957083,40.823202],[-73.957222,40.823226],[-73.95741099999999,40.823273],[-73.959192,40.824342],[-73.95746200000001,40.82687]]],"type":"Polygon"}
}