{
  "id": "361031906015",
  "type": "Feature",
  "properties": {
    "area_land":1352594,
    "area_water":1100317,
    "geoid":"361031906015",
    "name":"Block Group 5",
    "state":"ny"
},
  "bbox": [
    -72.58805,
    40.826563,
    -72.56488,
    40.847765
],
  "geometry": {"coordinates":[[[-72.587813,40.836105],[-72.587217,40.836431],[-72.586281,40.836791],[-72.585515,40.837086],[-72.58473499999999,40.8374],[-72.584459,40.837517],[-72.584276,40.837607],[-72.584101,40.83771],[-72.58395299999999,40.837809],[-72.58364400000001,40.838093],[-72.583484,40.838271],[-72.583422,40.838337],[-72.582818,40.838961],[-72.582179,40.839649],[-72.581712,40.840171],[-72.581289,40.84063],[-72.581023,40.840943],[-72.580113,40.841969],[-72.579835,40.84228],[-72.579418,40.842735],[-72.579157,40.843075],[-72.578855,40.843478],[-72.57857199999999,40.844009],[-72.578492,40.844195],[-72.578425,40.844355],[-72.578384,40.84453],[-72.578337,40.844869],[-72.57831299999999,40.8453],[-72.57831400000001,40.845479],[-72.57834099999999,40.845707],[-72.578332,40.845971],[-72.578333,40.846246],[-72.578343,40.846498],[-72.578345,40.846837],[-72.57832000000001,40.846967],[-72.578261,40.847072],[-72.578175,40.847211],[-72.57808799999999,40.847336],[-72.57789699999999,40.847581],[-72.577747,40.847765],[-72.577626,40.84766],[-72.575847,40.846865],[-72.574639,40.846492],[-72.573537,40.846152],[-72.571775,40.845598],[-72.571195,40.845267],[-72.57093500000001,40.844945],[-72.57064099999999,40.844582],[-72.56998400000001,40.842901],[-72.569507,40.84179],[-72.56782699999999,40.837873],[-72.565912,40.832461],[-72.56488,40.829059],[-72.56633600000001,40.828611],[-72.57019200000001,40.827875],[-72.574,40.827059],[-72.576593,40.826563],[-72.580721,40.830899],[-72.58166300000001,40.831973],[-72.581745,40.832067],[-72.58230500000001,40.832659],[-72.582786,40.833075],[-72.58726799999999,40.835347],[-72.58805,40.835966],[-72.587813,40.836105]]],"type":"Polygon"}
}