{
  "id": "361031354033",
  "type": "Feature",
  "properties": {
    "area_land":1025062,
    "area_water":0,
    "geoid":"361031354033",
    "name":"Block Group 3",
    "state":"ny"
},
  "bbox": [
    -73.148576,
    40.82878,
    -73.134472,
    40.843215
],
  "geometry": {"coordinates":[[[-73.148567,40.829152],[-73.148483,40.829497],[-73.148368,40.829879],[-73.14813100000001,40.830699],[-73.14804599999999,40.83092],[-73.14782599999999,40.831233],[-73.147459,40.831718],[-73.147047,40.832209],[-73.146376,40.83303],[-73.146162,40.833335],[-73.145562,40.83411],[-73.145139,40.834523],[-73.14488799999999,40.834761],[-73.144407,40.835241],[-73.14383599999999,40.835949],[-73.14372,40.836093],[-73.14308,40.836768],[-73.142708,40.837186],[-73.14248499999999,40.837481],[-73.142347,40.837671],[-73.14173599999999,40.838451],[-73.14130400000001,40.839178],[-73.141014,40.839603],[-73.140563,40.840309],[-73.140407,40.840543],[-73.139974,40.841201],[-73.139599,40.841689],[-73.138937,40.842711],[-73.138503,40.843215],[-73.138113,40.842688],[-73.137511,40.842059],[-73.137372,40.841876],[-73.13709799999999,40.841338],[-73.13651900000001,40.840121],[-73.13607500000001,40.839255],[-73.135704,40.838439],[-73.135553,40.837869],[-73.135443,40.837477],[-73.135603,40.836531],[-73.135785,40.83562],[-73.135929,40.834889],[-73.135931,40.834636],[-73.135915,40.834105],[-73.135558,40.833537],[-73.135442,40.833373],[-73.135034,40.832789],[-73.134865,40.83251],[-73.134849,40.832335],[-73.13484,40.832244],[-73.134846,40.832162],[-73.134872,40.832093],[-73.135002,40.831792],[-73.13507,40.831572],[-73.135074,40.831421],[-73.13503900000001,40.831266],[-73.134753,40.830513],[-73.134716,40.830429],[-73.134472,40.829808],[-73.13511699999999,40.829757],[-73.135233,40.829748],[-73.13555599999999,40.829723],[-73.13640100000001,40.829663],[-73.13712700000001,40.829602],[-73.137242,40.829592],[-73.138079,40.829531],[-73.138564,40.829468],[-73.13893299999999,40.829475],[-73.139774,40.829415],[-73.140964,40.82934],[-73.14107799999999,40.829236],[-73.14198,40.829173],[-73.142437,40.829138],[-73.14281800000001,40.829116],[-73.14384099999999,40.829042],[-73.144505,40.828988],[-73.144667,40.828976],[-73.145201,40.828942],[-73.145644,40.828934],[-73.14607100000001,40.828909],[-73.14643,40.828922],[-73.148533,40.82878],[-73.14857600000001,40.829036],[-73.148567,40.829152]]],"type":"Polygon"}
}