{
  "id": "360470327002",
  "type": "Feature",
  "properties": {
    "area_land":78783,
    "area_water":0,
    "geoid":"360470327002",
    "name":"Block Group 2",
    "state":"ny"
},
  "bbox": [
    -73.960956,
    40.661734,
    -73.957044,
    40.664303
],
  "geometry": {"coordinates":[[[-73.960956,40.663285],[-73.960615,40.663303],[-73.960337,40.664108],[-73.959344,40.664176],[-73.957292,40.664303],[-73.95721,40.663517],[-73.957122,40.662737],[-73.957044,40.661965],[-73.96077,40.661734],[-73.960866,40.662506],[-73.96087900000001,40.662621],[-73.960956,40.663285]]],"type":"Polygon"}
}