{
  "id": "360470610032",
  "type": "Feature",
  "properties": {
    "area_land":43866,
    "area_water":0,
    "geoid":"360470610032",
    "name":"Block Group 2",
    "state":"ny"
},
  "bbox": [
    -73.960027,
    40.581171,
    -73.956536,
    40.583209
],
  "geometry": {"coordinates":[[[-73.960027,40.583209],[-73.959006,40.582866],[-73.95721399999999,40.583085],[-73.95716299999999,40.583037],[-73.956851,40.582859],[-73.95677499999999,40.582818],[-73.956536,40.582659],[-73.957205,40.582543],[-73.957329,40.58211],[-73.957668,40.581613],[-73.957919,40.581259],[-73.959885,40.581171],[-73.95990999999999,40.581513],[-73.959943,40.581959],[-73.959993,40.582634],[-73.960027,40.583209]]],"type":"Polygon"}
}