{
  "id": "361190020004",
  "type": "Feature",
  "properties": {
    "area_land":398290,
    "area_water":0,
    "geoid":"361190020004",
    "name":"Block Group 4",
    "state":"ny"
},
  "bbox": [
    -73.853434,
    40.952283,
    -73.845376,
    40.963553
],
  "geometry": {"coordinates":[[[-73.85339500000001,40.952778],[-73.85331100000001,40.953068],[-73.85325899999999,40.953248],[-73.85325,40.953278],[-73.852772,40.954242],[-73.852648,40.954448],[-73.85218500000001,40.955214],[-73.851842,40.955907],[-73.851764,40.956134],[-73.85167300000001,40.956506],[-73.851578,40.957044],[-73.851562,40.957303],[-73.851519,40.957258],[-73.851474,40.957219],[-73.85140199999999,40.957172],[-73.85133500000001,40.957212],[-73.85131,40.957302],[-73.851147,40.957314],[-73.85068800000001,40.959297],[-73.850449,40.960253],[-73.850369,40.960559],[-73.85033199999999,40.960679],[-73.850269,40.960884],[-73.850241,40.960975],[-73.849868,40.961866],[-73.849597,40.962378],[-73.849254,40.962893],[-73.84901000000001,40.963329],[-73.848907,40.963553],[-73.848629,40.963432],[-73.84826700000001,40.963077],[-73.848118,40.962888],[-73.847876,40.962533],[-73.847606,40.962124],[-73.84756400000001,40.962059],[-73.847478,40.961973],[-73.84685,40.961433],[-73.84621300000001,40.960948],[-73.84602099999999,40.960742],[-73.845856,40.960414],[-73.84582,40.960315],[-73.845634,40.959799],[-73.845589,40.959698],[-73.84541900000001,40.959312],[-73.845383,40.959197],[-73.845376,40.959122],[-73.84538999999999,40.959047],[-73.845451,40.958911],[-73.845716,40.958518],[-73.84595299999999,40.958138],[-73.84602099999999,40.958065],[-73.846222,40.957929],[-73.84668600000001,40.95773],[-73.84710099999999,40.957574],[-73.84732,40.957437],[-73.847506,40.957265],[-73.847668,40.957056],[-73.84781099999999,40.956805],[-73.847876,40.956658],[-73.847922,40.956515],[-73.84793999999999,40.956314],[-73.84791199999999,40.956136],[-73.847859,40.955989],[-73.847779,40.955875],[-73.84774299999999,40.955765],[-73.84774299999999,40.955665],[-73.847757,40.955561],[-73.847908,40.95495],[-73.848195,40.953907],[-73.848271,40.95349],[-73.848511,40.953422],[-73.85079500000001,40.952739],[-73.85151,40.95255],[-73.851927,40.952431],[-73.85199799999999,40.952411],[-73.85229200000001,40.952355],[-73.852456,40.952323],[-73.85262299999999,40.952311],[-73.852901,40.952293],[-73.85301200000001,40.952287],[-73.85305099999999,40.952284],[-73.85320299999999,40.952283],[-73.85343399999999,40.952296],[-73.85339500000001,40.952778]]],"type":"Polygon"}
}