{
  "id": "360610181001",
  "type": "Feature",
  "properties": {
    "area_land":23354,
    "area_water":0,
    "geoid":"360610181001",
    "name":"Block Group 1",
    "state":"ny"
},
  "bbox": [
    -73.970858,
    40.792185,
    -73.967524,
    40.794051
],
  "geometry": {"coordinates":[[[-73.97036799999999,40.794051],[-73.969832,40.793825],[-73.96933,40.793614],[-73.96831,40.793185],[-73.967524,40.792856],[-73.96801600000001,40.792185],[-73.970327,40.793157],[-73.97085800000001,40.79338],[-73.97036799999999,40.794051]]],"type":"Polygon"}
}