{
  "id": "360470539002",
  "type": "Feature",
  "properties": {
    "area_land":55682,
    "area_water":0,
    "geoid":"360470539002",
    "name":"Block Group 2",
    "state":"ny"
},
  "bbox": [
    -73.964426,
    40.701663,
    -73.960341,
    40.704786
],
  "geometry": {"coordinates":[[[-73.964426,40.703122],[-73.96352400000001,40.703705],[-73.961854,40.704786],[-73.961207,40.704211],[-73.960729,40.703782],[-73.960658,40.703718],[-73.96059099999999,40.703658],[-73.960341,40.703437],[-73.96067600000001,40.7029],[-73.96145199999999,40.701663],[-73.961749,40.701944],[-73.96239199999999,40.702506],[-73.963426,40.702789],[-73.964296,40.70301],[-73.964426,40.703122]]],"type":"Polygon"}
}