{
  "id": "360670036012",
  "type": "Feature",
  "properties": {
    "area_land":292336,
    "area_water":0,
    "geoid":"360670036012",
    "name":"Block Group 2",
    "state":"ny"
},
  "bbox": [
    -76.114753,
    43.044875,
    -76.103462,
    43.04858
],
  "geometry": {"coordinates":[[[-76.11475299999999,43.048209],[-76.113694,43.048192],[-76.11314900000001,43.048187],[-76.11291799999999,43.048186],[-76.112656,43.048195],[-76.11160099999999,43.048241],[-76.110564,43.048294],[-76.10938400000001,43.048354],[-76.108216,43.048406],[-76.105012,43.048519],[-76.10403100000001,43.04857],[-76.10366399999999,43.04858],[-76.10363099999999,43.048119],[-76.103589,43.047719],[-76.10355800000001,43.04733],[-76.10346199999999,43.046257],[-76.104208,43.046135],[-76.10478999999999,43.046044],[-76.105812,43.045882],[-76.107159,43.045661],[-76.107946,43.045536],[-76.109118,43.045344],[-76.110268,43.045162],[-76.110916,43.045045],[-76.11131399999999,43.044984],[-76.11161,43.044938],[-76.11187700000001,43.044907],[-76.112348,43.044875],[-76.112458,43.044906],[-76.113399,43.045068],[-76.114521,43.04524],[-76.114496,43.045418],[-76.114661,43.047219],[-76.11475299999999,43.048209]]],"type":"Polygon"}
}