{
  "id": "361190032002",
  "type": "Feature",
  "properties": {
    "area_land":166756,
    "area_water":0,
    "geoid":"361190032002",
    "name":"Block Group 2",
    "state":"ny"
},
  "bbox": [
    -73.832442,
    40.904888,
    -73.827567,
    40.909885
],
  "geometry": {"coordinates":[[[-73.832442,40.907441],[-73.831745,40.907604],[-73.83228800000001,40.909168],[-73.831383,40.909334],[-73.830355,40.909543],[-73.828739,40.909879],[-73.828611,40.909885],[-73.828484,40.90917],[-73.82825800000001,40.908423],[-73.828097,40.908208],[-73.82796399999999,40.908065],[-73.82782400000001,40.907932],[-73.827663,40.907721],[-73.827634,40.907631],[-73.827624,40.90755],[-73.82760500000001,40.907312],[-73.82760399999999,40.907244],[-73.82760399999999,40.907106],[-73.827608,40.906581],[-73.827591,40.905821],[-73.827567,40.905626],[-73.82894400000001,40.905383],[-73.82914,40.905345],[-73.8306,40.905064],[-73.83147200000001,40.904888],[-73.83192200000001,40.906099],[-73.832442,40.907441]]],"type":"Polygon"}
}