{
  "id": "360595175001",
  "type": "Feature",
  "properties": {
    "area_land":1087198,
    "area_water":0,
    "geoid":"360595175001",
    "name":"Block Group 1",
    "state":"ny"
},
  "bbox": [
    -73.64192,
    40.814862,
    -73.622017,
    40.830737
],
  "geometry": {"coordinates":[[[-73.641904,40.825357],[-73.64167,40.825396],[-73.64133699999999,40.825428],[-73.641091,40.825432],[-73.64087600000001,40.82542],[-73.64049199999999,40.8254],[-73.64018799999999,40.825399],[-73.63985599999999,40.825423],[-73.63949700000001,40.82546],[-73.638599,40.825539],[-73.63830799999999,40.825649],[-73.63779,40.82588],[-73.63736299999999,40.826055],[-73.637185,40.826109],[-73.636684,40.826226],[-73.636698,40.826075],[-73.636585,40.825588],[-73.634631,40.825842],[-73.632492,40.82612],[-73.630353,40.826401],[-73.630375,40.82651],[-73.630368,40.826631],[-73.63028,40.826795],[-73.630218,40.826949],[-73.630206,40.82707],[-73.630213,40.827157],[-73.630308,40.827553],[-73.630391,40.827968],[-73.629875,40.828136],[-73.6296,40.828209],[-73.629383,40.828242],[-73.629065,40.828246],[-73.628872,40.828272],[-73.628384,40.828397],[-73.628247,40.828438],[-73.626452,40.82911],[-73.62652799999999,40.829962],[-73.62654000000001,40.830099],[-73.626564,40.830209],[-73.626632,40.830407],[-73.6267,40.830537],[-73.626103,40.830696],[-73.62598199999999,40.830737],[-73.625827,40.829218],[-73.625725,40.82832],[-73.62564399999999,40.827484],[-73.625623,40.826813],[-73.625623,40.825626],[-73.62563,40.825522],[-73.62566200000001,40.825109],[-73.625715,40.824423],[-73.62578600000001,40.822916],[-73.62575200000001,40.822096],[-73.62577899999999,40.822068],[-73.62580800000001,40.822011],[-73.62585300000001,40.821709],[-73.62586899999999,40.821511],[-73.62587000000001,40.821379],[-73.625835,40.821193],[-73.625728,40.820874],[-73.625625,40.820511],[-73.62554,40.82016],[-73.625494,40.819906],[-73.625376,40.819786],[-73.625097,40.819725],[-73.625131,40.819427],[-73.62526,40.818521],[-73.62239599999999,40.819159],[-73.62213300000001,40.81857],[-73.622017,40.818311],[-73.622023,40.817255],[-73.622096,40.817272],[-73.622182,40.817261],[-73.623886,40.816821],[-73.625105,40.816506],[-73.625525,40.816393],[-73.62571,40.81636],[-73.62587000000001,40.816351],[-73.626424,40.814899],[-73.626497,40.814862],[-73.626605,40.814966],[-73.627084,40.815371],[-73.62735000000001,40.815573],[-73.627605,40.815771],[-73.628102,40.816038],[-73.62839,40.816061],[-73.63089600000001,40.817808],[-73.63103,40.817901],[-73.631602,40.8183],[-73.63440799999999,40.820307],[-73.635199,40.821793],[-73.636743,40.821977],[-73.64192,40.825355],[-73.641904,40.825357]]],"type":"Polygon"}
}