{
  "id": "360630243032",
  "type": "Feature",
  "properties": {
    "area_land":34153627,
    "area_water":0,
    "geoid":"360630243032",
    "name":"Block Group 2",
    "state":"ny"
},
  "bbox": [
    -78.825754,
    43.161386,
    -78.754353,
    43.220528
],
  "geometry": {"coordinates":[[[-78.82575199999999,43.204395],[-78.825748,43.208059],[-78.82575199999999,43.208503],[-78.825739,43.209209],[-78.82574200000001,43.210242],[-78.825738,43.210525],[-78.825729,43.211348],[-78.825732,43.212569],[-78.825726,43.21416],[-78.825711,43.218936],[-78.825706,43.220528],[-78.819306,43.220404],[-78.814201,43.220304],[-78.800106,43.220031],[-78.793706,43.219908],[-78.790834,43.21983],[-78.78222100000001,43.219599],[-78.78045400000001,43.219552],[-78.77934999999999,43.219551],[-78.779071,43.219549],[-78.778234,43.219546],[-78.777956,43.219545],[-78.774124,43.219504],[-78.76262800000001,43.219381],[-78.758796,43.219341],[-78.758088,43.219328],[-78.757992,43.219327],[-78.75558100000001,43.219321],[-78.754858,43.21932],[-78.75478099999999,43.219299],[-78.75468100000001,43.219225],[-78.75464599999999,43.219164],[-78.754639,43.219098],[-78.754639,43.218764],[-78.754642,43.217006],[-78.75464100000001,43.216982],[-78.754631,43.216388],[-78.75462899999999,43.216321],[-78.754623,43.216123],[-78.754621,43.216057],[-78.754599,43.214977],[-78.754547,43.212391],[-78.754542,43.211738],[-78.75454000000001,43.211437],[-78.754553,43.210957],[-78.754549,43.210659],[-78.754548,43.208788],[-78.754547,43.203178],[-78.754547,43.201343],[-78.754547,43.201308],[-78.754546,43.200559],[-78.754543,43.198314],[-78.754542,43.197566],[-78.754552,43.195595],[-78.754553,43.195429],[-78.754547,43.194951],[-78.754555,43.192579],[-78.754548,43.189685],[-78.754547,43.189107],[-78.754524,43.188612],[-78.754482,43.188309],[-78.75435299999999,43.187733],[-78.754368,43.18729],[-78.754414,43.185964],[-78.75443,43.185522],[-78.75451099999999,43.183898],[-78.754756,43.179028],[-78.754839,43.177405],[-78.754785,43.176664],[-78.754623,43.174444],[-78.754569,43.173705],[-78.75457,43.17344],[-78.75457400000001,43.172739],[-78.75457400000001,43.172648],[-78.754576,43.172385],[-78.756252,43.171663],[-78.756726,43.171477],[-78.75678499999999,43.171455],[-78.757975,43.171031],[-78.76041600000001,43.170139],[-78.76061,43.17006],[-78.760882,43.169963],[-78.763541,43.168997],[-78.764005,43.168829],[-78.765793,43.168175],[-78.766975,43.16773],[-78.77021499999999,43.166463],[-78.772672,43.165503],[-78.773157,43.165336],[-78.77691299999999,43.164329],[-78.777434,43.164193],[-78.780931,43.163251],[-78.78141100000001,43.163112],[-78.782619,43.162793],[-78.783344,43.162643],[-78.78387499999999,43.162562],[-78.784041,43.162538],[-78.784792,43.162466],[-78.786134,43.162382],[-78.78736600000001,43.162318],[-78.788605,43.162232],[-78.789129,43.162206],[-78.78975699999999,43.162162],[-78.790161,43.162142],[-78.790943,43.162086],[-78.791014,43.162082],[-78.792208,43.162015],[-78.797888,43.161658],[-78.79795799999999,43.161653],[-78.800296,43.161503],[-78.801688,43.161425],[-78.802031,43.161406],[-78.803433,43.161399],[-78.80405500000001,43.161386],[-78.804534,43.161394],[-78.80550599999999,43.161448],[-78.80586700000001,43.161485],[-78.807255,43.16163],[-78.80792,43.161699],[-78.809428,43.161856],[-78.809917,43.161911],[-78.810582,43.161986],[-78.811035,43.162062],[-78.811471,43.162159],[-78.811635,43.162198],[-78.811773,43.162231],[-78.8125,43.162429],[-78.81319999999999,43.16263],[-78.814746,43.163054],[-78.815783,43.16334],[-78.81639800000001,43.16351],[-78.81751300000001,43.16382],[-78.818054,43.163951],[-78.818252,43.163987],[-78.81887999999999,43.164104],[-78.818843,43.166311],[-78.818844,43.16683],[-78.81884599999999,43.167392],[-78.81885,43.168433],[-78.818872,43.169641],[-78.818882,43.171202],[-78.818907,43.171908],[-78.81891,43.172742],[-78.818921,43.173321],[-78.818895,43.174861],[-78.818899,43.175009],[-78.818911,43.175397],[-78.81889099999999,43.177736],[-78.819013,43.177726],[-78.819243,43.177709],[-78.81938,43.177695],[-78.819503,43.177684],[-78.81987700000001,43.179279],[-78.82032700000001,43.181062],[-78.820573,43.182034],[-78.821,43.183871],[-78.82191400000001,43.187503],[-78.82263500000001,43.189749],[-78.823082,43.191119],[-78.824163,43.194425],[-78.82425499999999,43.194701],[-78.82438500000001,43.195146],[-78.824414,43.195243],[-78.824596,43.196123],[-78.82473,43.196837],[-78.824822,43.197368],[-78.824951,43.198113],[-78.825092,43.198961],[-78.825096,43.198985],[-78.825478,43.201208],[-78.82552099999999,43.201507],[-78.825644,43.202359],[-78.825754,43.203211],[-78.82575199999999,43.204395]]],"type":"Polygon"}
}