{
  "id": "360595182041",
  "type": "Feature",
  "properties": {
    "area_land":2473817,
    "area_water":2905,
    "geoid":"360595182041",
    "name":"Block Group 1",
    "state":"ny"
},
  "bbox": [
    -73.469404,
    40.799442,
    -73.448763,
    40.819685
],
  "geometry": {"coordinates":[[[-73.468694,40.813116],[-73.468569,40.8134],[-73.468484,40.813663],[-73.468439,40.813883],[-73.468356,40.815012],[-73.468304,40.815995],[-73.46655199999999,40.816331],[-73.466111,40.816395],[-73.465723,40.816464],[-73.465405,40.816528],[-73.46507200000001,40.816609],[-73.46294399999999,40.81718],[-73.46087199999999,40.817742],[-73.45696100000001,40.818836],[-73.456367,40.818984],[-73.45574499999999,40.819091],[-73.452647,40.819569],[-73.45190100000001,40.819685],[-73.450005,40.8116],[-73.449766,40.810398],[-73.449635,40.809729],[-73.448768,40.805318],[-73.448763,40.804999],[-73.448909,40.805043],[-73.449529,40.805183],[-73.449809,40.805232],[-73.450042,40.805279],[-73.450576,40.805353],[-73.45106699999999,40.805402],[-73.451486,40.805426],[-73.45178900000001,40.805436],[-73.452324,40.805436],[-73.45280099999999,40.805413],[-73.453307,40.805372],[-73.453958,40.805293],[-73.454363,40.805234],[-73.455028,40.805117],[-73.45541900000001,40.805036],[-73.456244,40.804831],[-73.456881,40.804648],[-73.457577,40.804418],[-73.45808700000001,40.804222],[-73.45820500000001,40.804173],[-73.45862099999999,40.804],[-73.45912800000001,40.803747],[-73.459564,40.803505],[-73.46017399999999,40.80311],[-73.460617,40.802777],[-73.461039,40.802419],[-73.46144,40.802031],[-73.46199,40.801425],[-73.462267,40.801146],[-73.46262,40.800832],[-73.462813,40.800683],[-73.46301200000001,40.800529],[-73.46346200000001,40.800237],[-73.463927,40.799976],[-73.464347,40.799772],[-73.464811,40.799582],[-73.465215,40.799442],[-73.465344,40.800028],[-73.469404,40.811551],[-73.468694,40.813116]]],"type":"Polygon"}
}