{
  "id": "360259703001",
  "type": "Feature",
  "properties": {
    "area_land":46126928,
    "area_water":213954,
    "geoid":"360259703001",
    "name":"Block Group 1",
    "state":"ny"
},
  "bbox": [
    -75.205884,
    42.320068,
    -75.077007,
    42.424598
],
  "geometry": {"coordinates":[[[-75.20571099999999,42.324034],[-75.20566599999999,42.324224],[-75.20562,42.324413],[-75.20553,42.324784],[-75.205398,42.325178],[-75.205338,42.325403],[-75.204919,42.327087],[-75.20480499999999,42.327541],[-75.20453500000001,42.328623],[-75.202872,42.335296],[-75.200174,42.346118],[-75.19711599999999,42.358395],[-75.18871900000001,42.362993],[-75.18255600000001,42.366369],[-75.18136199999999,42.367026],[-75.18122099999999,42.367103],[-75.181186,42.367135],[-75.18113700000001,42.367185],[-75.181077,42.36723],[-75.18082099999999,42.367352],[-75.180476,42.367523],[-75.179822,42.367871],[-75.17948800000001,42.368054],[-75.167672,42.37436],[-75.167461,42.374554],[-75.166775,42.37508],[-75.15863899999999,42.379446],[-75.151849,42.38309],[-75.15178299999999,42.383125],[-75.147133,42.385662],[-75.143069,42.381401],[-75.131277,42.388507],[-75.13099,42.38868],[-75.130588,42.388922],[-75.130512,42.388968],[-75.12989399999999,42.389357],[-75.129561,42.389567],[-75.128975,42.389914],[-75.126921,42.391133],[-75.12412500000001,42.392927],[-75.122388,42.393963],[-75.122342,42.393989],[-75.122241,42.394048],[-75.122202,42.39407],[-75.12425399999999,42.396052],[-75.126762,42.398576],[-75.12461,42.399879],[-75.116771,42.405093],[-75.114818,42.406392],[-75.093408,42.420634],[-75.080251,42.42447],[-75.079813,42.424598],[-75.079835,42.424561],[-75.07987199999999,42.42448],[-75.079899,42.424398],[-75.07991699999999,42.424312],[-75.07992900000001,42.424227],[-75.079932,42.424118],[-75.079913,42.42403],[-75.079881,42.423922],[-75.079837,42.423813],[-75.07978199999999,42.423705],[-75.07959099999999,42.423394],[-75.079139,42.422775],[-75.07899,42.422565],[-75.07889900000001,42.422421],[-75.078782,42.422201],[-75.07871400000001,42.422045],[-75.07863500000001,42.42179],[-75.07823,42.42029],[-75.07812199999999,42.419909],[-75.078074,42.419775],[-75.078012,42.419644],[-75.07794,42.419515],[-75.077861,42.419389],[-75.077696,42.419148],[-75.077243,42.418585],[-75.07716499999999,42.418468],[-75.077101,42.418347],[-75.077056,42.418225],[-75.077027,42.418109],[-75.077012,42.417988],[-75.07700699999999,42.417859],[-75.077034,42.417742],[-75.07707499999999,42.41763],[-75.077128,42.417513],[-75.07727,42.417288],[-75.077427,42.417069],[-75.077702,42.416667],[-75.07808799999999,42.416104],[-75.07816800000001,42.415979],[-75.078238,42.415853],[-75.078295,42.415724],[-75.07839,42.415463],[-75.078429,42.415338],[-75.078484,42.415095],[-75.07852099999999,42.414858],[-75.07854,42.414638],[-75.07857199999999,42.41443],[-75.07858899999999,42.413764],[-75.078666,42.413284],[-75.078863,42.412613],[-75.079125,42.411981],[-75.07929300000001,42.411445],[-75.079414,42.411062],[-75.079463,42.410878],[-75.079527,42.410429],[-75.079598,42.410064],[-75.079635,42.409802],[-75.07983299999999,42.409251],[-75.080276,42.408006],[-75.08034000000001,42.407838],[-75.08044599999999,42.407601],[-75.08053200000001,42.407363],[-75.080634,42.407015],[-75.080714,42.406688],[-75.08077900000001,42.406366],[-75.080828,42.405938],[-75.080859,42.405621],[-75.080923,42.405244],[-75.080961,42.404889],[-75.080988,42.404677],[-75.081097,42.403966],[-75.08112800000001,42.40364],[-75.081131,42.403532],[-75.08111,42.403233],[-75.08108,42.403041],[-75.081014,42.402737],[-75.080984,42.402634],[-75.080913,42.402433],[-75.08062,42.401695],[-75.080539,42.401444],[-75.08051,42.401278],[-75.080505,42.401193],[-75.08050900000001,42.401113],[-75.08052000000001,42.401033],[-75.08055899999999,42.400876],[-75.080618,42.400725],[-75.080699,42.400582],[-75.080799,42.400448],[-75.08091400000001,42.400324],[-75.08111100000001,42.400154],[-75.081255,42.400052],[-75.081328,42.400007],[-75.081473,42.39991],[-75.08174,42.399714],[-75.081925,42.399564],[-75.08198,42.39951],[-75.082026,42.399453],[-75.082127,42.399355],[-75.082279,42.39915],[-75.082424,42.398887],[-75.08253999999999,42.398695],[-75.082564,42.398645],[-75.082596,42.398615],[-75.082617,42.398565],[-75.082652,42.398538],[-75.08274900000001,42.398369],[-75.08281700000001,42.398205],[-75.082887,42.398083],[-75.083338,42.397241],[-75.083367,42.397199],[-75.083406,42.397125],[-75.08344200000001,42.397055],[-75.083496,42.396953],[-75.08353099999999,42.396906],[-75.083657,42.396655],[-75.083714,42.396553],[-75.083753,42.396464],[-75.083872,42.396282],[-75.08393100000001,42.396168],[-75.08528,42.393783],[-75.085393,42.393652],[-75.08558499999999,42.393364],[-75.085663,42.393215],[-75.085714,42.393066],[-75.085942,42.392841],[-75.086172,42.392656],[-75.08644,42.39255],[-75.086991,42.392433],[-75.08749299999999,42.392354],[-75.088843,42.392114],[-75.089617,42.391965],[-75.09040400000001,42.391779],[-75.091069,42.391573],[-75.09117500000001,42.39154],[-75.091903,42.391247],[-75.09258199999999,42.390909],[-75.092769,42.390793],[-75.093209,42.390521],[-75.093777,42.390102],[-75.09387599999999,42.390013],[-75.094004,42.389898],[-75.094082,42.389828],[-75.094216,42.389707],[-75.094284,42.389646],[-75.094302,42.389627],[-75.09436700000001,42.389555],[-75.094734,42.389151],[-75.09517200000001,42.388637],[-75.096485,42.387046],[-75.096951,42.386524],[-75.097962,42.38551],[-75.098506,42.384964],[-75.09961800000001,42.383874],[-75.100173,42.383315],[-75.100728,42.382769],[-75.101271,42.382224],[-75.101817,42.381688],[-75.102367,42.381156],[-75.103494,42.380137],[-75.10401899999999,42.379641],[-75.10449800000001,42.37915],[-75.105463,42.378145],[-75.106449,42.377095],[-75.107338,42.376072],[-75.107843,42.375581],[-75.10842,42.375143],[-75.10898899999999,42.374742],[-75.110163,42.373903],[-75.11081,42.373475],[-75.11115700000001,42.37325],[-75.111486,42.373037],[-75.112138,42.372627],[-75.11274400000001,42.372208],[-75.113302,42.371761],[-75.11392600000001,42.371197],[-75.11435400000001,42.37081],[-75.11490999999999,42.370323],[-75.115477,42.369841],[-75.116044,42.369372],[-75.11659899999999,42.368925],[-75.117154,42.368466],[-75.118312,42.367478],[-75.11998,42.366008],[-75.120454,42.365558],[-75.120938,42.365116],[-75.121437,42.364692],[-75.121904,42.364246],[-75.12241299999999,42.363781],[-75.12295399999999,42.363313],[-75.12352,42.362871],[-75.12388300000001,42.362658],[-75.12392699999999,42.362632],[-75.12396,42.362613],[-75.124191,42.362478],[-75.124888,42.362104],[-75.125547,42.36172],[-75.126136,42.361265],[-75.126701,42.360796],[-75.12728199999999,42.360349],[-75.127911,42.360006],[-75.128604,42.359771],[-75.12864500000001,42.359762],[-75.128631,42.359749],[-75.12844,42.359632],[-75.128367,42.359596],[-75.12828399999999,42.359565],[-75.128191,42.359538],[-75.128066,42.359529],[-75.127835,42.359521],[-75.127813,42.35952],[-75.12722599999999,42.359521],[-75.12706799999999,42.35953],[-75.12691100000001,42.359571],[-75.12657299999999,42.35958],[-75.126222,42.359598],[-75.12604,42.359599],[-75.125269,42.359627],[-75.12463700000001,42.359636],[-75.124415,42.359636],[-75.124188,42.359641],[-75.123727,42.359637],[-75.123018,42.359638],[-75.122777,42.359647],[-75.12228899999999,42.359675],[-75.121801,42.359711],[-75.121557,42.359734],[-75.121075,42.359771],[-75.120588,42.359794],[-75.12033599999999,42.359798],[-75.119304,42.35975],[-75.11904,42.359732],[-75.118504,42.35971],[-75.117968,42.359702],[-75.117701,42.359702],[-75.117188,42.359716],[-75.116936,42.35973],[-75.116688,42.359757],[-75.11644200000001,42.359789],[-75.11522100000001,42.359993],[-75.11472500000001,42.360065],[-75.11447,42.360097],[-75.113693,42.36017],[-75.113433,42.360179],[-75.113176,42.360179],[-75.11292899999999,42.360166],[-75.11267700000001,42.360148],[-75.11243899999999,42.360113],[-75.11196099999999,42.360028],[-75.11187099999999,42.360008],[-75.111628,42.359952],[-75.11147699999999,42.359915],[-75.110998,42.359785],[-75.110766,42.359695],[-75.11054,42.359601],[-75.110091,42.359399],[-75.10987,42.359287],[-75.109652,42.35917],[-75.109438,42.359044],[-75.109021,42.358779],[-75.108422,42.35836],[-75.10803199999999,42.358077],[-75.107653,42.357789],[-75.10731199999999,42.357515],[-75.107006,42.357236],[-75.104322,42.354712],[-75.103995,42.354388],[-75.10319,42.353619],[-75.103031,42.353461],[-75.102412,42.352877],[-75.101968,42.352467],[-75.10119299999999,42.351801],[-75.100548,42.35128],[-75.100196,42.351041],[-75.100022,42.350915],[-75.09934,42.350461],[-75.099205,42.350375],[-75.098669,42.350034],[-75.09781099999999,42.349463],[-75.097449,42.349238],[-75.097082,42.349022],[-75.097003,42.34898],[-75.09692200000001,42.348725],[-75.09688300000001,42.348635],[-75.096726,42.348342],[-75.096519,42.347987],[-75.096492,42.347924],[-75.09648,42.347861],[-75.096487,42.347802],[-75.09650999999999,42.347739],[-75.09654999999999,42.347694],[-75.09660100000001,42.347658],[-75.09665800000001,42.347631],[-75.09672,42.347608],[-75.09678599999999,42.347595],[-75.096857,42.34759],[-75.096932,42.347595],[-75.097004,42.347595],[-75.097078,42.347622],[-75.09729,42.347752],[-75.097364,42.347793],[-75.097593,42.347896],[-75.097944,42.348008],[-75.09803599999999,42.348031],[-75.09821700000001,42.348094],[-75.098389,42.34817],[-75.09857,42.348242],[-75.098663,42.348273],[-75.098955,42.348354],[-75.099222,42.348421],[-75.09938200000001,42.348471],[-75.09945999999999,42.348502],[-75.099535,42.348525],[-75.099751,42.348633],[-75.100229,42.348925],[-75.100533,42.349087],[-75.10086699999999,42.349235],[-75.101237,42.34941],[-75.101309,42.349451],[-75.101382,42.349487],[-75.101786,42.349721],[-75.10252,42.350071],[-75.10277499999999,42.350206],[-75.102953,42.350287],[-75.10314099999999,42.350354],[-75.103319,42.350404],[-75.10349600000001,42.350444],[-75.103767,42.350516],[-75.10386,42.350534],[-75.104043,42.350579],[-75.104133,42.350592],[-75.10495,42.350758],[-75.105036,42.350735],[-75.10512,42.35074],[-75.105362,42.350726],[-75.105442,42.350712],[-75.105525,42.350708],[-75.10577600000001,42.350667],[-75.105861,42.350644],[-75.106071,42.350617],[-75.10641099999999,42.35059],[-75.106634,42.350563],[-75.106746,42.350545],[-75.106855,42.350522],[-75.10697,42.350508],[-75.10706999999999,42.350486],[-75.107254,42.350423],[-75.10751500000001,42.350341],[-75.10766099999999,42.350283],[-75.10778999999999,42.350219],[-75.10798,42.350111],[-75.10816800000001,42.349989],[-75.108237,42.349953],[-75.10898899999999,42.349511],[-75.109371,42.349299],[-75.109802,42.349078],[-75.10987299999999,42.349056],[-75.109944,42.349011],[-75.110147,42.348898],[-75.110287,42.34883],[-75.11035800000001,42.348789],[-75.110507,42.348717],[-75.110659,42.348636],[-75.110736,42.3486],[-75.110803,42.348541],[-75.11095299999999,42.348451],[-75.11102099999999,42.348402],[-75.11155100000001,42.347987],[-75.111684,42.347888],[-75.11187700000001,42.34773],[-75.111951,42.347665],[-75.11199499999999,42.347626],[-75.112148,42.347468],[-75.112461,42.347099],[-75.112497,42.347081],[-75.113029,42.346418],[-75.113625,42.345687],[-75.114069,42.345143],[-75.114211,42.344981],[-75.114389,42.344764],[-75.11474,42.344355],[-75.115222,42.343791],[-75.115348,42.343629],[-75.11543399999999,42.343556],[-75.115623,42.343412],[-75.11583400000001,42.343277],[-75.116061,42.343151],[-75.116292,42.343033],[-75.116411,42.342979],[-75.116451,42.342963],[-75.11665600000001,42.34288],[-75.116894,42.342794],[-75.117327,42.342622],[-75.118137,42.342315],[-75.11892,42.342013],[-75.11911600000001,42.341932],[-75.11948099999999,42.341769],[-75.119647,42.341701],[-75.11973500000001,42.341674],[-75.119827,42.341652],[-75.120015,42.341615],[-75.12038,42.341561],[-75.120462,42.341538],[-75.120535,42.341511],[-75.120597,42.341471],[-75.120645,42.341426],[-75.120679,42.341376],[-75.12070199999999,42.341322],[-75.120718,42.341268],[-75.120735,42.341155],[-75.120752,42.340867],[-75.120741,42.340719],[-75.12071899999999,42.340642],[-75.120695,42.340602],[-75.120661,42.34057],[-75.120598,42.340535],[-75.12074699999999,42.34057],[-75.12101199999999,42.34061],[-75.121431,42.340637],[-75.122204,42.340631],[-75.12252100000001,42.340609],[-75.122828,42.340572],[-75.12342700000001,42.340464],[-75.123581,42.340445],[-75.123901,42.340422],[-75.124067,42.340427],[-75.124235,42.340445],[-75.124402,42.340471],[-75.124567,42.340512],[-75.12488999999999,42.340611],[-75.125212,42.340727],[-75.12552599999999,42.340867],[-75.125974,42.341109],[-75.12611699999999,42.341195],[-75.12639,42.341383],[-75.126651,42.341577],[-75.127042,42.341892],[-75.127325,42.342098],[-75.127475,42.342193],[-75.127577,42.342249],[-75.12763,42.342278],[-75.127791,42.342359],[-75.12795800000001,42.342431],[-75.128129,42.342494],[-75.128649,42.342633],[-75.129171,42.342722],[-75.12952,42.342767],[-75.129693,42.342794],[-75.12986600000001,42.342816],[-75.130399,42.342896],[-75.130585,42.342928],[-75.131517,42.343057],[-75.13237100000001,42.343191],[-75.132713,42.343254],[-75.13341800000001,42.343402],[-75.13378,42.343473],[-75.134145,42.343554],[-75.13432899999999,42.343599],[-75.13470100000001,42.343702],[-75.134874,42.343769],[-75.13504500000001,42.343846],[-75.135361,42.344025],[-75.13566400000001,42.34421],[-75.135738,42.344247],[-75.135823,42.344291],[-75.13614699999999,42.344439],[-75.136477,42.34456],[-75.13664300000001,42.344605],[-75.13681200000001,42.344641],[-75.136985,42.344667],[-75.137163,42.344681],[-75.137913,42.344698],[-75.13830799999999,42.344702],[-75.13851,42.344693],[-75.13871,42.344674],[-75.13890499999999,42.344647],[-75.13909,42.344611],[-75.139261,42.344566],[-75.13942299999999,42.344516],[-75.139577,42.344462],[-75.139714,42.344394],[-75.139861,42.344331],[-75.141066,42.343784],[-75.14156800000001,42.343581],[-75.141751,42.343522],[-75.14193899999999,42.343468],[-75.14212999999999,42.343418],[-75.142326,42.343373],[-75.142526,42.343337],[-75.14273300000001,42.343305],[-75.142938,42.343282],[-75.143147,42.343264],[-75.14417400000001,42.343195],[-75.144569,42.343163],[-75.14476000000001,42.343154],[-75.145388,42.343108],[-75.145448,42.343107],[-75.14550800000001,42.3431],[-75.145709,42.343085],[-75.14627299999999,42.34303],[-75.14664399999999,42.343003],[-75.147013,42.342971],[-75.147378,42.342921],[-75.147559,42.342889],[-75.147738,42.342844],[-75.14809,42.34274],[-75.148264,42.342681],[-75.148602,42.342559],[-75.14877,42.342505],[-75.14893600000001,42.342446],[-75.14927900000001,42.342356],[-75.15010100000001,42.342161],[-75.150626,42.342021],[-75.151067,42.341898],[-75.151158,42.341867],[-75.1514,42.341799],[-75.151438,42.341758],[-75.151444,42.341745],[-75.15157600000001,42.341745],[-75.151634,42.341736],[-75.15187899999999,42.341672],[-75.15234700000001,42.341541],[-75.152478,42.341509],[-75.152855,42.341392],[-75.153243,42.341279],[-75.1538,42.341143],[-75.154417,42.340971],[-75.154702,42.34088],[-75.154848,42.34084],[-75.155413,42.340663],[-75.155799,42.340519],[-75.156043,42.34041],[-75.15641100000001,42.340261],[-75.15739000000001,42.339931],[-75.157642,42.33985],[-75.157766,42.339804],[-75.15789100000001,42.339764],[-75.158148,42.339669],[-75.158283,42.339624],[-75.158553,42.33952],[-75.15881400000001,42.339407],[-75.15893800000001,42.339339],[-75.159054,42.339267],[-75.15926399999999,42.339113],[-75.159374,42.339032],[-75.16010199999999,42.338455],[-75.160411,42.338225],[-75.160917,42.337891],[-75.161312,42.337616],[-75.16201700000001,42.337115],[-75.162407,42.336826],[-75.162499,42.336749],[-75.162684,42.336609],[-75.162772,42.336533],[-75.16322099999999,42.336176],[-75.163839,42.335676],[-75.16393600000001,42.335608],[-75.164035,42.335545],[-75.164252,42.335432],[-75.16448800000001,42.335346],[-75.164609,42.33531],[-75.165081,42.335188],[-75.165192,42.335156],[-75.165508,42.335083],[-75.16560800000001,42.33507],[-75.165706,42.335047],[-75.165999,42.334966],[-75.166095,42.334947],[-75.16618699999999,42.334907],[-75.16627800000001,42.334898],[-75.166428,42.334847],[-75.166533,42.334812],[-75.166607,42.334771],[-75.166833,42.33444],[-75.166791,42.334335],[-75.166747,42.334226],[-75.166489,42.333632],[-75.166403,42.333456],[-75.166329,42.333281],[-75.166217,42.332993],[-75.166191,42.332903],[-75.166123,42.332714],[-75.166072,42.332435],[-75.16604,42.332345],[-75.165931,42.331787],[-75.165903,42.331701],[-75.165786,42.331242],[-75.165751,42.331084],[-75.16573,42.3309],[-75.16570900000001,42.330814],[-75.165693,42.330571],[-75.16566899999999,42.330017],[-75.16564700000001,42.329851],[-75.16560800000001,42.329693],[-75.165581,42.329617],[-75.16551699999999,42.329464],[-75.165476,42.329392],[-75.165375,42.329248],[-75.164823,42.328564],[-75.16463,42.328308],[-75.164423,42.328051],[-75.164349,42.32797],[-75.164107,42.327741],[-75.163939,42.327597],[-75.16376200000001,42.327462],[-75.163583,42.327336],[-75.16339600000001,42.327215],[-75.163015,42.326986],[-75.162524,42.326698],[-75.16242200000001,42.326645],[-75.16231999999999,42.326586],[-75.162115,42.326478],[-75.161908,42.32638],[-75.16158,42.326245],[-75.161354,42.326169],[-75.160353,42.325805],[-75.159851,42.325608],[-75.159757,42.325577],[-75.15966299999999,42.325541],[-75.158891,42.32529],[-75.158715,42.32524],[-75.158562,42.325191],[-75.158333,42.32511],[-75.158198,42.32507],[-75.15827,42.324984],[-75.158389,42.324867],[-75.158591,42.3247],[-75.15874599999999,42.324592],[-75.15891999999999,42.324492],[-75.159021,42.324452],[-75.15981499999999,42.324221],[-75.16004100000001,42.324149],[-75.160144,42.324108],[-75.16023800000001,42.324063],[-75.16032,42.324009],[-75.160386,42.323955],[-75.16043500000001,42.323896],[-75.16051299999999,42.323761],[-75.160561,42.323698],[-75.160579,42.323616],[-75.164232,42.322945],[-75.164895,42.322827],[-75.165513,42.322794],[-75.166051,42.322929],[-75.166302,42.323092],[-75.166479,42.323207],[-75.166606,42.323312],[-75.16731,42.323895],[-75.16780300000001,42.324232],[-75.168336,42.324565],[-75.16888899999999,42.324901],[-75.169431,42.325243],[-75.16993100000001,42.325602],[-75.170367,42.325989],[-75.170759,42.326349],[-75.17105599999999,42.326722],[-75.17118600000001,42.327127],[-75.17117500000001,42.327586],[-75.171108,42.32805],[-75.170962,42.328474],[-75.170776,42.32887],[-75.17068500000001,42.329262],[-75.170687,42.329623],[-75.17073000000001,42.329898],[-75.170734,42.329924],[-75.170807,42.330181],[-75.17084699999999,42.330406],[-75.170857,42.330392],[-75.17087100000001,42.330369],[-75.17109600000001,42.330019],[-75.17136600000001,42.32959],[-75.171446,42.329477],[-75.171662,42.329153],[-75.17219799999999,42.32835],[-75.172332,42.328139],[-75.17258099999999,42.327697],[-75.17295900000001,42.32707],[-75.173214,42.326741],[-75.17351600000001,42.326448],[-75.173841,42.326182],[-75.17413999999999,42.325947],[-75.174403,42.325722],[-75.174633,42.325496],[-75.17486100000001,42.325239],[-75.175462,42.324513],[-75.17582400000001,42.32409],[-75.17626799999999,42.323657],[-75.17675699999999,42.323214],[-75.177263,42.322781],[-75.177826,42.322371],[-75.17846,42.322028],[-75.179146,42.321716],[-75.179875,42.321426],[-75.181088,42.320929],[-75.181406,42.320798],[-75.18203800000001,42.320549],[-75.182174,42.320495],[-75.18240900000001,42.320418],[-75.182937,42.320237],[-75.18333199999999,42.320166],[-75.18373800000001,42.320092],[-75.18454199999999,42.320068],[-75.185349,42.32013],[-75.18614599999999,42.320268],[-75.186958,42.320429],[-75.18776699999999,42.320612],[-75.188543,42.320814],[-75.189313,42.320988],[-75.190876,42.321373],[-75.191653,42.321556],[-75.19243,42.321748],[-75.193934,42.322074],[-75.194631,42.322231],[-75.195255,42.322491],[-75.195857,42.32281],[-75.196483,42.323083],[-75.19725200000001,42.323109],[-75.198024,42.323112],[-75.19879899999999,42.323129],[-75.19959,42.323164],[-75.200383,42.32318],[-75.20115199999999,42.323206],[-75.201902,42.323214],[-75.202895,42.323218],[-75.20403899999999,42.323228],[-75.204713,42.323267],[-75.205388,42.323329],[-75.205647,42.323328],[-75.205884,42.323357],[-75.20571099999999,42.324034]]],"type":"Polygon"}
}