{
  "id": "360850018001",
  "type": "Feature",
  "properties": {
    "area_land":909602,
    "area_water":0,
    "geoid":"360850018001",
    "name":"Block Group 1",
    "state":"ny"
},
  "bbox": [
    -74.065163,
    40.594082,
    -74.052999,
    40.608065
],
  "geometry": {"coordinates":[[[-74.065163,40.604201],[-74.06043,40.606354],[-74.060379,40.606277],[-74.05801099999999,40.607369],[-74.057787,40.607449],[-74.056808,40.608065],[-74.05673,40.607877],[-74.056797,40.607782],[-74.05647399999999,40.607265],[-74.05601799999999,40.606747],[-74.055744,40.606522],[-74.05547,40.60648],[-74.055348,40.606516],[-74.055239,40.606668],[-74.055184,40.606626],[-74.055148,40.606723],[-74.055014,40.606656],[-74.05504999999999,40.606559],[-74.05512299999999,40.606571],[-74.05520199999999,40.606407],[-74.05513500000001,40.606291],[-74.054795,40.606157],[-74.054557,40.60609],[-74.053839,40.60592],[-74.053639,40.605238],[-74.054034,40.60494],[-74.053864,40.604831],[-74.05377900000001,40.604679],[-74.053657,40.604441],[-74.053596,40.604198],[-74.05359,40.604076],[-74.05362,40.603997],[-74.05358200000001,40.603801],[-74.053522,40.60361],[-74.053371,40.603164],[-74.053416,40.602874],[-74.053316,40.602579],[-74.05326100000001,40.602257],[-74.05310299999999,40.602026],[-74.05309099999999,40.601819],[-74.053085,40.6016],[-74.05314,40.601247],[-74.05326700000001,40.601034],[-74.05333400000001,40.600778],[-74.05347399999999,40.600608],[-74.05348600000001,40.600444],[-74.05318200000001,40.600206],[-74.05309699999999,40.600133],[-74.052999,40.59998],[-74.053556,40.5995],[-74.05969399999999,40.594082],[-74.060046,40.594488],[-74.060451,40.594975],[-74.061877,40.596595],[-74.062076,40.596841],[-74.062482,40.597347],[-74.06289599999999,40.597862],[-74.063299,40.598363],[-74.063759,40.598935],[-74.06282,40.599246],[-74.06203600000001,40.599504],[-74.06192,40.599542],[-74.060985,40.599844],[-74.060935,40.599861],[-74.061812,40.60115],[-74.061956,40.601237],[-74.062742,40.601596],[-74.063176,40.60182],[-74.06376899999999,40.602127],[-74.063896,40.602484],[-74.063903,40.602503],[-74.06425900000001,40.602988],[-74.064363,40.60313],[-74.064761,40.603663],[-74.065163,40.604201]]],"type":"Polygon"}
}