{
  "id": "361031595121",
  "type": "Feature",
  "properties": {
    "area_land":2218593,
    "area_water":501273,
    "geoid":"361031595121",
    "name":"Block Group 1",
    "state":"ny"
},
  "bbox": [
    -72.850537,
    40.775959,
    -72.812202,
    40.78856
],
  "geometry": {"coordinates":[[[-72.850537,40.787258],[-72.84919499999999,40.787356],[-72.847829,40.787453],[-72.846479,40.787555],[-72.84532,40.787635],[-72.839803,40.788044],[-72.839212,40.788086],[-72.839217,40.787785],[-72.83962,40.787633],[-72.839203,40.786964],[-72.838612,40.786965],[-72.838185,40.787044],[-72.834371,40.787174],[-72.82831400000001,40.78803],[-72.825074,40.788396],[-72.823628,40.78856],[-72.823103,40.788022],[-72.81929,40.784103],[-72.818963,40.783767],[-72.814538,40.779218],[-72.812315,40.776979],[-72.812202,40.776866],[-72.812313,40.776875],[-72.813945,40.777012],[-72.814908,40.776539],[-72.821438,40.775959],[-72.822064,40.776035],[-72.82453599999999,40.77631],[-72.825543,40.77642],[-72.826825,40.776993],[-72.827015,40.777083],[-72.827305,40.777199],[-72.827617,40.777351],[-72.828816,40.777626],[-72.83119600000001,40.778133],[-72.83292899999999,40.778514],[-72.833699,40.778679],[-72.835759,40.779125],[-72.837018,40.779383],[-72.837774,40.779564],[-72.839445,40.779926],[-72.83991,40.780033],[-72.841573,40.780392],[-72.84181700000001,40.780445],[-72.843282,40.780764],[-72.84381500000001,40.780865],[-72.844953,40.781105],[-72.84544,40.781227],[-72.84696700000001,40.781555],[-72.847516,40.781658],[-72.848219,40.781811],[-72.848736,40.782894],[-72.84966799999999,40.784904],[-72.849988,40.785557],[-72.850056,40.785716],[-72.850137,40.785893],[-72.850263,40.786167],[-72.850314,40.786292],[-72.850362,40.786411],[-72.850461,40.786822],[-72.850537,40.787258]]],"type":"Polygon"}
}