{
  "id": "360359713001",
  "type": "Feature",
  "properties": {
    "area_land":1386469,
    "area_water":0,
    "geoid":"360359713001",
    "name":"Block Group 1",
    "state":"ny"
},
  "bbox": [
    -74.413446,
    42.987514,
    -74.375382,
    43.006302
],
  "geometry": {"coordinates":[[[-74.413127,42.988727],[-74.41273,42.98881],[-74.412171,42.989731],[-74.41122300000001,42.990583],[-74.410962,42.990852],[-74.410956,42.990885],[-74.410898,42.991228],[-74.410839,42.991569],[-74.410826,42.991608],[-74.410713,42.991942],[-74.411078,42.992154],[-74.41125599999999,42.992371],[-74.411344,42.992479],[-74.411348,42.992618],[-74.411143,42.992561],[-74.410815,42.992346],[-74.410691,42.99233],[-74.41043500000001,42.992205],[-74.41022100000001,42.992376],[-74.409938,42.992546],[-74.408474,42.992966],[-74.407658,42.993149],[-74.402619,42.994229],[-74.401962,42.994328],[-74.401438,42.994407],[-74.40134500000001,42.994553],[-74.400683,42.995607],[-74.400642,42.995682],[-74.399731,42.995053],[-74.399569,42.994942],[-74.399508,42.994961],[-74.39945,42.994979],[-74.397657,42.995504],[-74.39575600000001,42.996148],[-74.39211899999999,42.996658],[-74.388886,42.999384],[-74.38710399999999,43.000083],[-74.38691799999999,43.000003],[-74.386166,43.00003],[-74.386062,43.000031],[-74.38618099999999,43.000117],[-74.38609099999999,43.000924],[-74.385932,43.004173],[-74.385876,43.004196],[-74.385201,43.004464],[-74.383667,43.005109],[-74.38286100000001,43.005454],[-74.381815,43.005896],[-74.381488,43.006027],[-74.381381,43.006056],[-74.38109799999999,43.006105],[-74.38078400000001,43.006125],[-74.379741,43.006168],[-74.379447,43.006178],[-74.379064,43.00619],[-74.378444,43.006215],[-74.378372,43.006218],[-74.3783,43.006221],[-74.37799800000001,43.006233],[-74.377729,43.006242],[-74.375685,43.006302],[-74.375635,43.005198],[-74.37558300000001,43.004252],[-74.375489,43.002618],[-74.375382,43.000988],[-74.375784,43.000847],[-74.37695600000001,43.000347],[-74.377751,43.000024],[-74.378213,42.999843],[-74.37880699999999,42.999595],[-74.37894300000001,42.999544],[-74.379144,42.999506],[-74.37914499999999,42.999438],[-74.37915,42.999001],[-74.379136,42.998773],[-74.37907800000001,42.998306],[-74.37902200000001,42.997826],[-74.378913,42.99699],[-74.378899,42.996756],[-74.37891500000001,42.996563],[-74.37895899999999,42.996355],[-74.379001,42.996251],[-74.379147,42.995954],[-74.379394,42.995534],[-74.379554,42.995254],[-74.37969699999999,42.995],[-74.37980399999999,42.994809],[-74.380037,42.994405],[-74.38029899999999,42.993994],[-74.38084499999999,42.993248],[-74.380996,42.992685],[-74.38098599999999,42.992674],[-74.380875,42.99261],[-74.38077800000001,42.992592],[-74.380556,42.992625],[-74.38033,42.992682],[-74.37996800000001,42.992744],[-74.379355,42.992819],[-74.378981,42.992877],[-74.37881899999999,42.992876],[-74.377709,42.993132],[-74.377031,42.993301],[-74.37696200000001,42.992887],[-74.376859,42.992556],[-74.378827,42.992311],[-74.37949500000001,42.992231],[-74.379701,42.992196],[-74.37975900000001,42.992187],[-74.381246,42.992014],[-74.381451,42.992003],[-74.38175099999999,42.991979],[-74.38182,42.991913],[-74.38192100000001,42.991816],[-74.382119,42.991917],[-74.382209,42.991938],[-74.382304,42.991939],[-74.382643,42.991916],[-74.384726,42.991701],[-74.38475800000001,42.991774],[-74.385321,42.994637],[-74.385695,42.994631],[-74.386257,42.994637],[-74.38682,42.994651],[-74.387078,42.995639],[-74.38737999999999,42.996965],[-74.387441,42.996958],[-74.387939,42.996793],[-74.388047,42.997094],[-74.387507,42.997092],[-74.387709,42.997423],[-74.387557,42.998804],[-74.38758,42.998967],[-74.387659,42.99951],[-74.388007,42.999313],[-74.388096,42.999229],[-74.38814600000001,42.999132],[-74.38829699999999,42.998916],[-74.388435,42.998772],[-74.388734,42.998537],[-74.38886599999999,42.99846],[-74.38897299999999,42.99838],[-74.38903000000001,42.998356],[-74.389398,42.998264],[-74.389465,42.998236],[-74.38952399999999,42.998198],[-74.389562,42.998152],[-74.38962600000001,42.998007],[-74.389655,42.997876],[-74.389759,42.997566],[-74.38982799999999,42.997258],[-74.38997999999999,42.996905],[-74.390226,42.996575],[-74.39037,42.996353],[-74.390415,42.996315],[-74.390505,42.996271],[-74.390581,42.996218],[-74.39073999999999,42.996052],[-74.391035,42.995968],[-74.39129800000001,42.995866],[-74.391374,42.995823],[-74.391493,42.995712],[-74.39167500000001,42.995635],[-74.391773,42.99561],[-74.39201199999999,42.995568],[-74.392145,42.99556],[-74.39228199999999,42.995562],[-74.39250199999999,42.995544],[-74.39277,42.995498],[-74.392949,42.995489],[-74.39311499999999,42.995491],[-74.39317,42.995506],[-74.39325700000001,42.995559],[-74.393317,42.995579],[-74.393766,42.995659],[-74.394059,42.995679],[-74.394459,42.995648],[-74.39474800000001,42.995604],[-74.39502,42.995519],[-74.395206,42.995444],[-74.395321,42.995386],[-74.39546799999999,42.99528],[-74.39558100000001,42.995207],[-74.395831,42.995109],[-74.39601500000001,42.994978],[-74.396165,42.994886],[-74.396316,42.994775],[-74.396389,42.99467],[-74.39644699999999,42.99452],[-74.39649799999999,42.99444],[-74.396755,42.994242],[-74.396936,42.994059],[-74.397173,42.993746],[-74.39735,42.993584],[-74.397406,42.993553],[-74.397516,42.993511],[-74.39770300000001,42.993491],[-74.39791700000001,42.993427],[-74.398174,42.993316],[-74.39828300000001,42.993276],[-74.39842,42.99326],[-74.398538,42.993256],[-74.398646,42.993238],[-74.398872,42.993183],[-74.399557,42.993038],[-74.399648,42.992981],[-74.39974100000001,42.992963],[-74.40017899999999,42.992952],[-74.40062,42.992928],[-74.400857,42.992888],[-74.401039,42.992815],[-74.40116,42.992779],[-74.401481,42.99275],[-74.401601,42.992752],[-74.401836,42.992821],[-74.40194700000001,42.992843],[-74.402064,42.992823],[-74.402232,42.992846],[-74.40240900000001,42.992906],[-74.402776,42.993048],[-74.40309000000001,42.993218],[-74.403294,42.993291],[-74.403458,42.993329],[-74.403566,42.993336],[-74.40380500000001,42.993344],[-74.40391200000001,42.993322],[-74.40401799999999,42.993264],[-74.404189,42.993136],[-74.404246,42.993111],[-74.404399,42.993067],[-74.404673,42.992956],[-74.405108,42.992735],[-74.40539800000001,42.99254],[-74.405496,42.992489],[-74.40556599999999,42.992464],[-74.405642,42.992449],[-74.406589,42.992316],[-74.406987,42.992238],[-74.407217,42.99216],[-74.407324,42.992141],[-74.408024,42.99206],[-74.40857800000001,42.991976],[-74.409108,42.991921],[-74.409356,42.991881],[-74.40944,42.991845],[-74.409542,42.991768],[-74.409589,42.991713],[-74.40961799999999,42.991659],[-74.409644,42.991539],[-74.40964700000001,42.991259],[-74.409639,42.990872],[-74.40963600000001,42.990723],[-74.409651,42.990544],[-74.40964,42.990304],[-74.409702,42.989947],[-74.40979,42.989702],[-74.409848,42.989619],[-74.40991,42.989579],[-74.40995700000001,42.98956],[-74.410202,42.989539],[-74.410282,42.989502],[-74.41042,42.989364],[-74.410479,42.989285],[-74.410552,42.989213],[-74.410776,42.989038],[-74.410858,42.988994],[-74.411372,42.988855],[-74.41142499999999,42.98883],[-74.411525,42.988755],[-74.41173999999999,42.988504],[-74.411829,42.988291],[-74.41192599999999,42.988116],[-74.411997,42.988014],[-74.412043,42.98799],[-74.412143,42.987956],[-74.412161,42.987937],[-74.41221899999999,42.987749],[-74.41224699999999,42.987664],[-74.412305,42.987514],[-74.412368,42.987575],[-74.41344599999999,42.988659],[-74.413127,42.988727]]],"type":"Polygon"}
}