{
  "id": "360050372001",
  "type": "Feature",
  "properties": {
    "area_land":71979,
    "area_water":0,
    "geoid":"360050372001",
    "name":"Block Group 1",
    "state":"ny"
},
  "bbox": [
    -73.863332,
    40.871336,
    -73.860512,
    40.876011
],
  "geometry": {"coordinates":[[[-73.86318199999999,40.872175],[-73.863046,40.872857],[-73.86285599999999,40.873842],[-73.86269,40.874654],[-73.862559,40.87526],[-73.86212999999999,40.876011],[-73.861161,40.875701],[-73.860512,40.875494],[-73.861135,40.874477],[-73.861306,40.873673],[-73.861321,40.873123],[-73.861345,40.872525],[-73.86136500000001,40.871819],[-73.861379,40.871336],[-73.862392,40.871357],[-73.863332,40.871375],[-73.86318199999999,40.872175]]],"type":"Polygon"}
}