{
  "id": "360470550001",
  "type": "Feature",
  "properties": {
    "area_land":57314,
    "area_water":0,
    "geoid":"360470550001",
    "name":"Block Group 1",
    "state":"ny"
},
  "bbox": [
    -73.953544,
    40.608807,
    -73.950299,
    40.61125
],
  "geometry": {"coordinates":[[[-73.95354399999999,40.610653],[-73.95257700000001,40.611037],[-73.951633,40.611123],[-73.950706,40.61125],[-73.950299,40.609125],[-73.951229,40.609023],[-73.952158,40.608921],[-73.953192,40.608807],[-73.95354399999999,40.610653]]],"type":"Polygon"}
}