{
  "id": "360070016003",
  "type": "Feature",
  "properties": {
    "area_land":618774,
    "area_water":0,
    "geoid":"360070016003",
    "name":"Block Group 3",
    "state":"ny"
},
  "bbox": [
    -75.948184,
    42.083816,
    -75.933104,
    42.092135
],
  "geometry": {"coordinates":[[[-75.948184,42.092135],[-75.948058,42.092104],[-75.947671,42.092012],[-75.94777000000001,42.091858],[-75.946275,42.091579],[-75.946026,42.091474],[-75.944346,42.090725],[-75.944109,42.090603],[-75.943681,42.090337],[-75.94269,42.089742],[-75.941535,42.089186],[-75.939875,42.088413],[-75.938322,42.087681],[-75.9376,42.0874],[-75.935363,42.086514],[-75.935203,42.086452],[-75.934832,42.086339],[-75.93468,42.086303],[-75.934287,42.086235],[-75.933104,42.086091],[-75.933268,42.08528],[-75.933414,42.084596],[-75.93439100000001,42.084529],[-75.935793,42.084456],[-75.937355,42.084392],[-75.937754,42.084386],[-75.937974,42.084408],[-75.944672,42.083816],[-75.94504499999999,42.083826],[-75.945291,42.083834],[-75.94552899999999,42.083842],[-75.945926,42.083866],[-75.946416,42.083903],[-75.94655400000001,42.083914],[-75.946856,42.083985],[-75.947158,42.084089],[-75.94745899999999,42.084231],[-75.947447,42.085435],[-75.94752200000001,42.086114],[-75.947552,42.086391],[-75.947687,42.087287],[-75.94781,42.088462],[-75.947858,42.089157],[-75.94789900000001,42.08953],[-75.94796700000001,42.09019],[-75.948016,42.09049],[-75.948097,42.091363],[-75.948184,42.092135]]],"type":"Polygon"}
}