{
  "id": "360070133013",
  "type": "Feature",
  "properties": {
    "area_land":1089669,
    "area_water":0,
    "geoid":"360070133013",
    "name":"Block Group 3",
    "state":"ny"
},
  "bbox": [
    -76.089787,
    42.091752,
    -76.068812,
    42.105269
],
  "geometry": {"coordinates":[[[-76.089782,42.092695],[-76.08976699999999,42.092833],[-76.089732,42.092933],[-76.089586,42.093243],[-76.089513,42.093331],[-76.089455,42.093423],[-76.08943600000001,42.0935],[-76.08943600000001,42.093773],[-76.089417,42.093897],[-76.089347,42.094077],[-76.08937400000001,42.094218],[-76.089417,42.094333],[-76.08942399999999,42.094422],[-76.089417,42.094498],[-76.08936300000001,42.094625],[-76.089078,42.09512],[-76.088639,42.096014],[-76.088296,42.096595],[-76.088177,42.096768],[-76.088081,42.096887],[-76.087969,42.096987],[-76.087788,42.097079],[-76.08766900000001,42.097087],[-76.08758400000001,42.097071],[-76.087492,42.097021],[-76.08708,42.096727],[-76.08679100000001,42.096616],[-76.08657599999999,42.096612],[-76.086175,42.096697],[-76.085717,42.096764],[-76.085471,42.096783],[-76.085205,42.096791],[-76.084993,42.096825],[-76.08489299999999,42.096868],[-76.08481999999999,42.096918],[-76.084755,42.097006],[-76.084597,42.097333],[-76.08451599999999,42.097471],[-76.08414999999999,42.097931],[-76.08398099999999,42.098081],[-76.083831,42.098258],[-76.08358800000001,42.098595],[-76.083584,42.098633],[-76.083596,42.098675],[-76.083665,42.098737],[-76.083761,42.098779],[-76.083842,42.098802],[-76.08389200000001,42.098841],[-76.083927,42.098891],[-76.083939,42.098948],[-76.083927,42.099075],[-76.08388100000001,42.099164],[-76.083804,42.099237],[-76.083673,42.099322],[-76.083538,42.099371],[-76.082988,42.099481],[-76.082745,42.099497],[-76.08256,42.099523],[-76.082291,42.099608],[-76.082199,42.099654],[-76.08179,42.099966],[-76.081643,42.100138],[-76.08161,42.100186],[-76.08156700000001,42.100246],[-76.081521,42.100343],[-76.081416,42.10063],[-76.081305,42.100935],[-76.08072799999999,42.101868],[-76.079958,42.102804],[-76.079454,42.103262],[-76.079273,42.103404],[-76.0792,42.103427],[-76.078965,42.103462],[-76.078422,42.103435],[-76.078183,42.103435],[-76.07792499999999,42.103493],[-76.076694,42.103962],[-76.07620799999999,42.104081],[-76.07466599999999,42.104339],[-76.07371000000001,42.104494],[-76.073629,42.104508],[-76.072028,42.104791],[-76.06922900000001,42.105204],[-76.069048,42.105254],[-76.069012,42.105269],[-76.069018,42.104476],[-76.068935,42.103229],[-76.068882,42.10231],[-76.068838,42.101487],[-76.068836,42.101462],[-76.06881199999999,42.100987],[-76.071268,42.100911],[-76.073967,42.100828],[-76.073775,42.100147],[-76.073509,42.099216],[-76.073173,42.098039],[-76.073081,42.097717],[-76.07287100000001,42.096984],[-76.07286000000001,42.096946],[-76.075074,42.096364],[-76.07894,42.095348],[-76.080628,42.094889],[-76.08134,42.09467],[-76.08185400000001,42.09449],[-76.08260799999999,42.094183],[-76.083268,42.093875],[-76.08394199999999,42.093526],[-76.08456700000001,42.093152],[-76.084986,42.092878],[-76.08558600000001,42.092455],[-76.08628400000001,42.091927],[-76.086348,42.091924],[-76.086905,42.091896],[-76.088544,42.09181],[-76.08978,42.091752],[-76.089787,42.091866],[-76.089782,42.092695]]],"type":"Polygon"}
}