{
  "id": "360271500052",
  "type": "Feature",
  "properties": {
    "area_land":21810789,
    "area_water":253363,
    "geoid":"360271500052",
    "name":"Block Group 2",
    "state":"ny"
},
  "bbox": [
    -73.867758,
    41.971289,
    -73.811944,
    42.056687
],
  "geometry": {"coordinates":[[[-73.86775799999999,42.003623],[-73.86752799999999,42.003811],[-73.866958,42.004267],[-73.86639700000001,42.004693],[-73.865151,42.005581],[-73.865016,42.005679],[-73.864791,42.005803],[-73.864322,42.006025],[-73.863174,42.006528],[-73.862453,42.006834],[-73.86244000000001,42.006839],[-73.862419,42.006848],[-73.860535,42.007653],[-73.859933,42.007941],[-73.859313,42.00829],[-73.858718,42.008672],[-73.85781799999999,42.009231],[-73.857265,42.009563],[-73.856673,42.009973],[-73.85657399999999,42.010057],[-73.856161,42.010437],[-73.85579300000001,42.010849],[-73.85486299999999,42.012095],[-73.854468,42.012624],[-73.854215,42.013022],[-73.853982,42.013418],[-73.85387299999999,42.013604],[-73.85373,42.013846],[-73.85356299999999,42.01413],[-73.853126,42.014872],[-73.853008,42.015123],[-73.85290500000001,42.015369],[-73.85288199999999,42.015438],[-73.852814,42.015689],[-73.85271,42.016148],[-73.85265099999999,42.016434],[-73.85259499999999,42.016665],[-73.85254500000001,42.016826],[-73.852518,42.01687],[-73.85247,42.017022],[-73.85242100000001,42.01713],[-73.852289,42.017366],[-73.851985,42.017821],[-73.851831,42.018053],[-73.85138000000001,42.018706],[-73.851118,42.019088],[-73.85067600000001,42.019695],[-73.85011,42.020453],[-73.849948,42.020712],[-73.849872,42.020868],[-73.84980299999999,42.021052],[-73.84970800000001,42.021354],[-73.84932999999999,42.02251],[-73.849127,42.023072],[-73.848922,42.023445],[-73.84861100000001,42.023876],[-73.84831699999999,42.024312],[-73.84822800000001,42.024482],[-73.84816600000001,42.024625],[-73.848118,42.024748],[-73.848069,42.024907],[-73.84803100000001,42.025068],[-73.847995,42.02522],[-73.84797399999999,42.025314],[-73.847882,42.025729],[-73.84785100000001,42.025866],[-73.84774299999999,42.026382],[-73.84756,42.027204],[-73.847093,42.02936],[-73.847089,42.029376],[-73.84692200000001,42.030109],[-73.846903,42.030194],[-73.846647,42.031443],[-73.84661699999999,42.031677],[-73.846611,42.031833],[-73.846627,42.032282],[-73.84667,42.032523],[-73.84672399999999,42.032737],[-73.846808,42.03297],[-73.846856,42.03309],[-73.84686000000001,42.033101],[-73.846962,42.033312],[-73.847127,42.033589],[-73.84723200000001,42.033787],[-73.847775,42.03471],[-73.84812599999999,42.035338],[-73.84874499999999,42.036412],[-73.84889200000001,42.036723],[-73.849031,42.037193],[-73.849068,42.037415],[-73.849086,42.037761],[-73.848961,42.039353],[-73.84896000000001,42.039362],[-73.848904,42.039827],[-73.848821,42.040208],[-73.848608,42.040876],[-73.848467,42.04131],[-73.847849,42.043089],[-73.84765899999999,42.043646],[-73.847358,42.044743],[-73.847173,42.045456],[-73.84699999999999,42.046052],[-73.84598,42.049792],[-73.845952,42.049927],[-73.8459,42.050416],[-73.845862,42.051314],[-73.84568899999999,42.052662],[-73.845472,42.054273],[-73.845434,42.054681],[-73.845321,42.05545],[-73.845257,42.055789],[-73.845192,42.056046],[-73.845105,42.056343],[-73.845037,42.05655],[-73.84500300000001,42.056678],[-73.844999,42.056687],[-73.84218300000001,42.05561],[-73.84198600000001,42.055536],[-73.82153700000001,42.047862],[-73.821333,42.047785],[-73.821034,42.047678],[-73.82088299999999,42.047624],[-73.81975300000001,42.047194],[-73.818916,42.04688],[-73.818641,42.046778],[-73.818533,42.046739],[-73.818527,42.046695],[-73.818247,42.044493],[-73.818243,42.044462],[-73.817708,42.040245],[-73.817408,42.037878],[-73.817356,42.037544],[-73.815579,42.026125],[-73.815454,42.025224],[-73.815425,42.024457],[-73.815376,42.024103],[-73.814948,42.020977],[-73.81476000000001,42.019599],[-73.814297,42.016207],[-73.814132,42.015087],[-73.813926,42.013622],[-73.813316,42.009505],[-73.81202500000001,42.001076],[-73.811944,42.000321],[-73.815365,41.995088],[-73.817103,41.99197],[-73.81744500000001,41.991359],[-73.81923500000001,41.987979],[-73.817125,41.987882],[-73.817419,41.986345],[-73.817789,41.985865],[-73.818867,41.984776],[-73.819091,41.984488],[-73.81918899999999,41.9842],[-73.81929100000001,41.98204],[-73.819487,41.980806],[-73.81961699999999,41.980278],[-73.81998900000001,41.979445],[-73.82114799999999,41.977219],[-73.821434,41.972528],[-73.82140699999999,41.971289],[-73.821425,41.971314],[-73.821613,41.971554],[-73.821935,41.97197],[-73.822354,41.972491],[-73.82261800000001,41.972848],[-73.82290399999999,41.973205],[-73.823103,41.97346],[-73.823275,41.973683],[-73.82334,41.973772],[-73.823443,41.973918],[-73.82358499999999,41.974166],[-73.82375500000001,41.974464],[-73.82541399999999,41.977441],[-73.826058,41.978605],[-73.82642800000001,41.979262],[-73.82654599999999,41.979523],[-73.826722,41.979849],[-73.826874,41.980167],[-73.827189,41.980863],[-73.827899,41.982278],[-73.82812699999999,41.982656],[-73.82837600000001,41.983033],[-73.828805,41.98363],[-73.82915199999999,41.984078],[-73.83001299999999,41.985233],[-73.830322,41.985705],[-73.83055400000001,41.986103],[-73.830567,41.986127],[-73.830991,41.98698],[-73.83128499999999,41.987613],[-73.83140299999999,41.987826],[-73.831436,41.987885],[-73.83157799999999,41.988126],[-73.83179800000001,41.988459],[-73.831889,41.988581],[-73.831999,41.988704],[-73.832024,41.988741],[-73.832206,41.988944],[-73.83241200000001,41.989128],[-73.83268099999999,41.989348],[-73.833091,41.989632],[-73.83347999999999,41.989869],[-73.833822,41.990058],[-73.834262,41.990288],[-73.835179,41.990777],[-73.835886,41.991147],[-73.836012,41.991222],[-73.83676800000001,41.991619],[-73.83723999999999,41.991845],[-73.837311,41.991877],[-73.83762900000001,41.992002],[-73.83797300000001,41.992154],[-73.838556,41.992363],[-73.839513,41.992688],[-73.839894,41.992802],[-73.840249,41.992895],[-73.840506,41.992973],[-73.840864,41.993041],[-73.841303,41.993107],[-73.842536,41.99324],[-73.84293700000001,41.993277],[-73.843109,41.993293],[-73.84373600000001,41.993369],[-73.844707,41.993449],[-73.845152,41.993471],[-73.845524,41.993471],[-73.846124,41.993462],[-73.846681,41.993455],[-73.846917,41.993455],[-73.847404,41.993489],[-73.84756400000001,41.993503],[-73.84780499999999,41.993536],[-73.84806,41.993578],[-73.848252,41.993609],[-73.84841400000001,41.993641],[-73.848501,41.993655],[-73.848837,41.993734],[-73.849126,41.993811],[-73.849412,41.9939],[-73.849647,41.993979],[-73.849875,41.99407],[-73.849981,41.994115],[-73.85012399999999,41.994171],[-73.85033300000001,41.994267],[-73.850568,41.994368],[-73.850762,41.994453],[-73.851015,41.994564],[-73.85119299999999,41.994645],[-73.851463,41.994759],[-73.85181300000001,41.994898],[-73.852068,41.994987],[-73.852191,41.995022],[-73.852357,41.995076],[-73.85259000000001,41.995139],[-73.852813,41.995198],[-73.85300700000001,41.995236],[-73.85313499999999,41.995265],[-73.853343,41.995301],[-73.853527,41.995331],[-73.853724,41.995356],[-73.85391799999999,41.995382],[-73.854102,41.995398],[-73.854204,41.995402],[-73.85435099999999,41.99541],[-73.854544,41.995418],[-73.85485300000001,41.995429],[-73.855163,41.995433],[-73.85529699999999,41.995431],[-73.85597199999999,41.995429],[-73.856818,41.995437],[-73.85787000000001,41.995431],[-73.858462,41.995418],[-73.858679,41.995418],[-73.858976,41.995408],[-73.859583,41.995386],[-73.859838,41.995377],[-73.860237,41.995358],[-73.860502,41.995345],[-73.86069000000001,41.995333],[-73.861098,41.995317],[-73.861233,41.995312],[-73.86165699999999,41.99529],[-73.86191599999999,41.995271],[-73.86218599999999,41.995249],[-73.86242,41.995229],[-73.86268699999999,41.995201],[-73.86292899999999,41.99517],[-73.863113,41.995146],[-73.86327199999999,41.995128],[-73.863514,41.995091],[-73.86377899999999,41.995056],[-73.86466,41.994937],[-73.86502299999999,41.994882],[-73.865469,41.994827],[-73.86623299999999,41.994711],[-73.866327,41.994697],[-73.866534,41.994667],[-73.866501,41.994846],[-73.866383,41.995492],[-73.866345,41.995702],[-73.866285,41.996029],[-73.866195,41.996517],[-73.86609799999999,41.997049],[-73.86583899999999,41.998467],[-73.865807,41.99872],[-73.86578900000001,41.998738],[-73.865719,41.999121],[-73.865413,42.000792],[-73.865073,42.002653],[-73.865019,42.002944],[-73.86493,42.003431],[-73.86490000000001,42.003593],[-73.86489,42.003661],[-73.86554,42.003651],[-73.866294,42.003642],[-73.86754999999999,42.003626],[-73.86775799999999,42.003623]]],"type":"Polygon"}
}