{
  "id": "360710133001",
  "type": "Feature",
  "properties": {
    "area_land":22136784,
    "area_water":820826,
    "geoid":"360710133001",
    "name":"Block Group 1",
    "state":"ny"
},
  "bbox": [
    -74.236196,
    41.391252,
    -74.116709,
    41.432121
],
  "geometry": {"coordinates":[[[-74.23619100000001,41.400472],[-74.236186,41.400558],[-74.23617,41.400641],[-74.236164,41.400656],[-74.23606599999999,41.400881],[-74.235938,41.4011],[-74.234874,41.402569],[-74.23366300000001,41.404313],[-74.23350000000001,41.404547],[-74.23278500000001,41.405577],[-74.231837,41.406924],[-74.231618,41.407236],[-74.23109599999999,41.407938],[-74.23033,41.409026],[-74.229851,41.409731],[-74.229449,41.410277],[-74.229275,41.410542],[-74.229529,41.410683],[-74.229705,41.410762],[-74.230169,41.410951],[-74.23136100000001,41.411465],[-74.231686,41.411623],[-74.23199200000001,41.411805],[-74.232139,41.411904],[-74.232547,41.412242],[-74.232961,41.41263],[-74.233059,41.412722],[-74.23335,41.412984],[-74.233572,41.413192],[-74.23036999999999,41.41493],[-74.223518,41.418587],[-74.220296,41.420335],[-74.214741,41.423321],[-74.202736,41.429821],[-74.20132099999999,41.430584],[-74.20124300000001,41.430626],[-74.199949,41.431325],[-74.198475,41.432121],[-74.19838799999999,41.432039],[-74.19829900000001,41.431987],[-74.198187,41.431944],[-74.198058,41.431915],[-74.197897,41.431892],[-74.197149,41.431823],[-74.196744,41.431772],[-74.19647399999999,41.431726],[-74.195995,41.43162],[-74.195814,41.431591],[-74.195499,41.431559],[-74.19511799999999,41.431499],[-74.19501099999999,41.43147],[-74.19480900000001,41.431387],[-74.194737,41.431338],[-74.194203,41.430914],[-74.193082,41.43071],[-74.19121,41.430409],[-74.190887,41.430371],[-74.19061000000001,41.430357],[-74.19039100000001,41.430374],[-74.189955,41.430463],[-74.18929300000001,41.430693],[-74.18843,41.431022],[-74.188215,41.431074],[-74.18803200000001,41.43109],[-74.18798099999999,41.431094],[-74.18779499999999,41.431097],[-74.187715,41.431098],[-74.187453,41.431022],[-74.18741199999999,41.431011],[-74.186879,41.43087],[-74.18642699999999,41.430779],[-74.18607299999999,41.430687],[-74.185858,41.430556],[-74.185712,41.430422],[-74.185658,41.430305],[-74.185659,41.430196],[-74.185678,41.430094],[-74.18574700000001,41.429948],[-74.18589299999999,41.429686],[-74.18635,41.428742],[-74.18647799999999,41.428414],[-74.186598,41.427926],[-74.186606,41.427678],[-74.186533,41.42746],[-74.186336,41.427066],[-74.185472,41.425136],[-74.185187,41.424567],[-74.185031,41.424349],[-74.18471,41.424101],[-74.183922,41.423715],[-74.18306200000001,41.42327],[-74.182785,41.423183],[-74.182456,41.423117],[-74.182081,41.422986],[-74.180178,41.422061],[-74.179423,41.421616],[-74.179182,41.421383],[-74.178814,41.420789],[-74.178628,41.420494],[-74.17840200000001,41.420232],[-74.178161,41.420065],[-74.17773099999999,41.419875],[-74.17739899999999,41.419817],[-74.17668999999999,41.419749],[-74.175106,41.41955],[-74.175134,41.419355],[-74.175189,41.419033],[-74.175276,41.418788],[-74.174944,41.418708],[-74.17432700000001,41.418514],[-74.17406200000001,41.41843],[-74.173935,41.418406],[-74.173766,41.418391],[-74.173535,41.418406],[-74.173158,41.418455],[-74.173024,41.418462],[-74.172901,41.418455],[-74.172753,41.41843],[-74.17258200000001,41.418372],[-74.172124,41.418182],[-74.171875,41.418061],[-74.171728,41.417945],[-74.171656,41.417862],[-74.171611,41.417789],[-74.171137,41.416866],[-74.170822,41.416239],[-74.17071799999999,41.416075],[-74.17064999999999,41.416],[-74.17052099999999,41.415893],[-74.170451,41.415855],[-74.170193,41.415743],[-74.169685,41.415569],[-74.16865,41.417035],[-74.168505,41.417291],[-74.168149,41.417164],[-74.166484,41.416707],[-74.166442,41.416696],[-74.16619799999999,41.416626],[-74.166112,41.416602],[-74.165903,41.416541],[-74.16491499999999,41.416256],[-74.163482,41.415907],[-74.162942,41.415757],[-74.162477,41.415612],[-74.162145,41.415521],[-74.160769,41.415118],[-74.16047,41.415046],[-74.16035100000001,41.415031],[-74.160214,41.415026],[-74.15978,41.415034],[-74.159386,41.415058],[-74.158743,41.41513],[-74.158517,41.415168],[-74.15741199999999,41.415314],[-74.156729,41.415422],[-74.156032,41.415549],[-74.155784,41.41557],[-74.15516599999999,41.415588],[-74.154077,41.415669],[-74.15319100000001,41.415776],[-74.15292599999999,41.415832],[-74.152759,41.41589],[-74.152368,41.416074],[-74.151295,41.416626],[-74.149308,41.417889],[-74.148984,41.418082],[-74.148815,41.418176],[-74.148403,41.418388],[-74.148239,41.418458],[-74.148054,41.418536],[-74.14787800000001,41.4186],[-74.14760699999999,41.418664],[-74.146477,41.418827],[-74.145511,41.418977],[-74.145067,41.419032],[-74.14397,41.419146],[-74.14287,41.41923],[-74.142123,41.419275],[-74.13985700000001,41.419399],[-74.139132,41.419455],[-74.138353,41.419496],[-74.137919,41.419543],[-74.137787,41.419573],[-74.137424,41.419716],[-74.13700900000001,41.419915],[-74.13676100000001,41.420056],[-74.13649100000001,41.420193],[-74.135772,41.420586],[-74.13519700000001,41.420872],[-74.134468,41.421161],[-74.133966,41.421345],[-74.133053,41.421681],[-74.132656,41.421813],[-74.132373,41.421908],[-74.131709,41.422112],[-74.13131799999999,41.422213],[-74.13079999999999,41.422326],[-74.129868,41.422491],[-74.12941600000001,41.422588],[-74.12927000000001,41.422626],[-74.129136,41.422672],[-74.12891999999999,41.422777],[-74.12873999999999,41.42288],[-74.12845,41.423088],[-74.128322,41.4232],[-74.127968,41.423606],[-74.12752999999999,41.424201],[-74.127032,41.424913],[-74.12651099999999,41.42562],[-74.12618000000001,41.426021],[-74.125711,41.426556],[-74.124908,41.427412],[-74.12469900000001,41.427593],[-74.124568,41.427693],[-74.124269,41.427886],[-74.123752,41.428159],[-74.12343,41.428297],[-74.123001,41.42844],[-74.12245799999999,41.428568],[-74.12220600000001,41.428605],[-74.12168699999999,41.428649],[-74.12141800000001,41.428691],[-74.12070799999999,41.428868],[-74.120436,41.428906],[-74.119846,41.428962],[-74.11916100000001,41.428998],[-74.119229,41.42942],[-74.119317,41.430055],[-74.119361,41.430347],[-74.11941400000001,41.43069],[-74.119094,41.430676],[-74.11752199999999,41.430537],[-74.116709,41.430481],[-74.11676799999999,41.429901],[-74.11684099999999,41.429302],[-74.11693200000001,41.428497],[-74.117459,41.423828],[-74.117605,41.422575],[-74.11801199999999,41.419725],[-74.118742,41.416244],[-74.11932899999999,41.415702],[-74.119699,41.415425],[-74.11990900000001,41.415247],[-74.119969,41.415173],[-74.120192,41.415038],[-74.120375,41.414892],[-74.120802,41.414496],[-74.121408,41.413934],[-74.12166000000001,41.413659],[-74.121802,41.413479],[-74.122781,41.412225],[-74.12326,41.411613],[-74.123392,41.411309],[-74.12344400000001,41.411172],[-74.12344400000001,41.411094],[-74.123497,41.410859],[-74.12360099999999,41.410467],[-74.123653,41.410339],[-74.123758,41.410134],[-74.123856,41.410008],[-74.123902,41.409949],[-74.12417600000001,41.409645],[-74.12461500000001,41.409284],[-74.124965,41.409006],[-74.12506500000001,41.408915],[-74.125675,41.408489],[-74.125968,41.408263],[-74.126318,41.407948],[-74.12663999999999,41.407599],[-74.126784,41.407467],[-74.127003,41.407305],[-74.12710800000001,41.407239],[-74.127308,41.407131],[-74.127456,41.407068],[-74.127663,41.406994],[-74.128974,41.406717],[-74.129504,41.40659],[-74.129739,41.406529],[-74.130296,41.406385],[-74.130493,41.406331],[-74.13060400000001,41.406285],[-74.130764,41.406218],[-74.13090699999999,41.406137],[-74.13122,41.40592],[-74.131488,41.405711],[-74.131619,41.405609],[-74.132392,41.404986],[-74.13244400000001,41.404937],[-74.132544,41.404847],[-74.132831,41.404464],[-74.13319,41.403888],[-74.133413,41.403518],[-74.133534,41.403312],[-74.133719,41.402996],[-74.133807,41.402877],[-74.13523000000001,41.401641],[-74.135953,41.401088],[-74.13633900000001,41.40082],[-74.136471,41.400743],[-74.136762,41.400591],[-74.13724499999999,41.400435],[-74.137418,41.400398],[-74.13784,41.400328],[-74.138318,41.400303],[-74.138684,41.400284],[-74.139234,41.400218],[-74.13945099999999,41.40017],[-74.139815,41.40006],[-74.140278,41.39989],[-74.140654,41.399721],[-74.141143,41.399412],[-74.141451,41.399184],[-74.14165,41.399028],[-74.141946,41.398775],[-74.142338,41.398431],[-74.143153,41.397748],[-74.14392700000001,41.3971],[-74.144436,41.396709],[-74.144842,41.396443],[-74.145089,41.396291],[-74.146047,41.395722],[-74.147042,41.396417],[-74.14730400000001,41.396582],[-74.14757299999999,41.396752],[-74.148061,41.397043],[-74.148139,41.39709],[-74.14838399999999,41.397275],[-74.148543,41.39742],[-74.148673,41.397577],[-74.148747,41.397741],[-74.14883399999999,41.398012],[-74.148977,41.398569],[-74.149112,41.399067],[-74.149141,41.399322],[-74.149131,41.399629],[-74.14905,41.400034],[-74.148994,41.400167],[-74.14888999999999,41.40037],[-74.148522,41.400986],[-74.148391,41.401227],[-74.14832,41.401421],[-74.148235,41.401599],[-74.14818200000001,41.401752],[-74.14814200000001,41.40205],[-74.148128,41.402342],[-74.14808600000001,41.402611],[-74.14804100000001,41.40277],[-74.148008,41.402974],[-74.148004,41.403095],[-74.148034,41.403221],[-74.148071,41.403271],[-74.148135,41.403328],[-74.148315,41.403453],[-74.148527,41.403546],[-74.148715,41.403586],[-74.148944,41.403647],[-74.149317,41.403808],[-74.149846,41.404125],[-74.14997,41.40418],[-74.150083,41.404205],[-74.150305,41.404231],[-74.150437,41.404231],[-74.150834,41.404158],[-74.15111899999999,41.404133],[-74.15146900000001,41.404151],[-74.151646,41.404167],[-74.151797,41.404194],[-74.15203,41.404258],[-74.15279099999999,41.404504],[-74.15317400000001,41.404586],[-74.153414,41.404657],[-74.15356300000001,41.404724],[-74.153638,41.404771],[-74.153713,41.404842],[-74.154287,41.40564],[-74.154543,41.406016],[-74.154701,41.406285],[-74.154768,41.406473],[-74.154814,41.406657],[-74.15524000000001,41.406382],[-74.155558,41.406125],[-74.156024,41.405706],[-74.15607900000001,41.405637],[-74.156166,41.40549],[-74.156199,41.405335],[-74.15619100000001,41.404933],[-74.156149,41.404638],[-74.156126,41.404561],[-74.15588099999999,41.404222],[-74.155782,41.40404],[-74.155727,41.403887],[-74.155658,41.403569],[-74.15561599999999,41.403163],[-74.155607,41.402535],[-74.155648,41.402154],[-74.155615,41.401966],[-74.155576,41.401862],[-74.15552099999999,41.401778],[-74.155169,41.401323],[-74.15514400000001,41.40128],[-74.155136,41.401243],[-74.15515600000001,41.400818],[-74.155153,41.400613],[-74.15508,41.4002],[-74.155092,41.400102],[-74.155202,41.399888],[-74.15529100000001,41.39963],[-74.15534700000001,41.399545],[-74.15566200000001,41.399151],[-74.15573000000001,41.398967],[-74.155764,41.398787],[-74.155798,41.398457],[-74.15584800000001,41.398215],[-74.155907,41.398075],[-74.156113,41.397882],[-74.15802100000001,41.396006],[-74.158428,41.395619],[-74.15937,41.394718],[-74.160138,41.393906],[-74.16054099999999,41.393526],[-74.160904,41.393264],[-74.161235,41.392992],[-74.161905,41.392341],[-74.162145,41.392145],[-74.16292199999999,41.391682],[-74.163749,41.391287],[-74.16385699999999,41.391252],[-74.163929,41.391314],[-74.163985,41.391349],[-74.164079,41.391392],[-74.164548,41.391531],[-74.16499,41.391668],[-74.165319,41.391812],[-74.165559,41.391923],[-74.165763,41.391998],[-74.165898,41.392033],[-74.166465,41.392151],[-74.16673400000001,41.39224],[-74.16685699999999,41.392313],[-74.167276,41.392498],[-74.167407,41.392554],[-74.16768399999999,41.392671],[-74.16828700000001,41.392894],[-74.168402,41.392956],[-74.16855,41.393091],[-74.168618,41.393198],[-74.168684,41.393372],[-74.168762,41.393806],[-74.168801,41.39392],[-74.16886,41.394008],[-74.16913,41.3942],[-74.16965999999999,41.394526],[-74.169776,41.394584],[-74.17035300000001,41.394772],[-74.170795,41.394887],[-74.171256,41.394992],[-74.17178800000001,41.395152],[-74.172197,41.395291],[-74.172764,41.395513],[-74.17334200000001,41.395724],[-74.173805,41.395863],[-74.175453,41.396223],[-74.176314,41.396405],[-74.176621,41.396441],[-74.17724800000001,41.396483],[-74.177463,41.396522],[-74.177635,41.396568],[-74.177859,41.396603],[-74.17845800000001,41.396656],[-74.17886900000001,41.396705],[-74.17910999999999,41.396783],[-74.179193,41.396818],[-74.179329,41.396899],[-74.179501,41.397028],[-74.179855,41.397345],[-74.18006800000001,41.397499],[-74.180226,41.397587],[-74.180313,41.397612],[-74.180525,41.397634],[-74.180688,41.397629],[-74.18093,41.397593],[-74.181304,41.397522],[-74.182142,41.397365],[-74.182497,41.397333],[-74.18270200000001,41.397332],[-74.18288699999999,41.397363],[-74.183081,41.397424],[-74.18315699999999,41.397457],[-74.183566,41.397706],[-74.183847,41.397841],[-74.184423,41.398054],[-74.18471,41.398133],[-74.184915,41.398166],[-74.185102,41.398168],[-74.18523,41.398151],[-74.185408,41.398114],[-74.185652,41.398028],[-74.186082,41.397834],[-74.18660300000001,41.397597],[-74.186969,41.397454],[-74.187264,41.397367],[-74.18745,41.397352],[-74.18759900000001,41.397374],[-74.188016,41.39746],[-74.188399,41.397535],[-74.188688,41.39762],[-74.188903,41.397715],[-74.189196,41.397858],[-74.189386,41.397919],[-74.189671,41.397947],[-74.190667,41.397947],[-74.19106600000001,41.397967],[-74.192818,41.398117],[-74.193619,41.398212],[-74.194096,41.398258],[-74.194512,41.3983],[-74.19468999999999,41.398326],[-74.195009,41.398417],[-74.195401,41.398599],[-74.19561,41.398728],[-74.19580000000001,41.398873],[-74.196153,41.399199],[-74.196438,41.399518],[-74.19664299999999,41.399837],[-74.197019,41.400558],[-74.197338,41.401081],[-74.197862,41.402015],[-74.198052,41.402281],[-74.19832,41.402605],[-74.198657,41.402351],[-74.199105,41.402049],[-74.199573,41.401765],[-74.20040400000001,41.401237],[-74.200834,41.400933],[-74.20112,41.400698],[-74.20155699999999,41.400959],[-74.201617,41.400987],[-74.202144,41.401232],[-74.203992,41.402067],[-74.204611,41.402295],[-74.205062,41.402449],[-74.205941,41.402735],[-74.206355,41.40286],[-74.206647,41.402955],[-74.20694899999999,41.403044],[-74.20717500000001,41.403111],[-74.207514,41.403197],[-74.20809800000001,41.403346],[-74.208112,41.403349],[-74.20857700000001,41.403441],[-74.20880099999999,41.403471],[-74.209256,41.403549],[-74.209397,41.403574],[-74.20971299999999,41.403665],[-74.20983,41.403718],[-74.209952,41.403786],[-74.210131,41.403942],[-74.21021,41.404033],[-74.210658,41.404667],[-74.21098499999999,41.405062],[-74.21118300000001,41.405244],[-74.211663,41.405511],[-74.211837,41.4056],[-74.21211,41.405726],[-74.212307,41.405832],[-74.212549,41.405985],[-74.21290999999999,41.406251],[-74.21341,41.406564],[-74.21359,41.406634],[-74.213702,41.40665],[-74.21397,41.406655],[-74.214327,41.406632],[-74.214904,41.406558],[-74.215209,41.406481],[-74.21569100000001,41.40633],[-74.215903,41.406247],[-74.216115,41.406104],[-74.216662,41.405788],[-74.216976,41.405581],[-74.21727799999999,41.405357],[-74.21736300000001,41.405282],[-74.21750400000001,41.405109],[-74.217814,41.404613],[-74.21801000000001,41.404269],[-74.21862,41.40318],[-74.218751,41.402942],[-74.218962,41.402629],[-74.21905700000001,41.402527],[-74.219331,41.402272],[-74.219436,41.402196],[-74.219914,41.40189],[-74.22022,41.401657],[-74.220311,41.401598],[-74.22045,41.401533],[-74.22089099999999,41.401362],[-74.22133599999999,41.401169],[-74.221456,41.401099],[-74.22154,41.401037],[-74.221952,41.400684],[-74.222218,41.400491],[-74.222444,41.400371],[-74.223388,41.399843],[-74.22411,41.39942],[-74.224448,41.399234],[-74.225638,41.398564],[-74.22586,41.398454],[-74.226086,41.398371],[-74.226247,41.398327],[-74.226367,41.398312],[-74.22651999999999,41.398305],[-74.22667,41.398316],[-74.22722,41.398385],[-74.22793799999999,41.398513],[-74.228252,41.398553],[-74.228908,41.398575],[-74.22969999999999,41.398651],[-74.22991500000001,41.398688],[-74.23004899999999,41.39872],[-74.23017299999999,41.398764],[-74.23053400000001,41.398956],[-74.23089899999999,41.399174],[-74.23137800000001,41.399448],[-74.231442,41.399485],[-74.231573,41.399538],[-74.23177800000001,41.399606],[-74.232303,41.399719],[-74.23289,41.399813],[-74.233141,41.399842],[-74.233411,41.399861],[-74.233918,41.399919],[-74.23484000000001,41.400056],[-74.23543100000001,41.400149],[-74.236025,41.400276],[-74.23619600000001,41.400327],[-74.23619100000001,41.400472]]],"type":"Polygon"}
}