{
  "id": "360810467003",
  "type": "Feature",
  "properties": {
    "area_land":30964,
    "area_water":0,
    "geoid":"360810467003",
    "name":"Block Group 3",
    "state":"ny"
},
  "bbox": [
    -73.876282,
    40.743955,
    -73.873305,
    40.746066
],
  "geometry": {"coordinates":[[[-73.875827,40.745461],[-73.875362,40.746066],[-73.873305,40.745151],[-73.873771,40.744548],[-73.87422599999999,40.743955],[-73.876282,40.744869],[-73.875827,40.745461]]],"type":"Polygon"}
}