{
  "id": "360870130011",
  "type": "Feature",
  "properties": {
    "area_land":1080680,
    "area_water":105742,
    "geoid":"360870130011",
    "name":"Block Group 1",
    "state":"ny"
},
  "bbox": [
    -73.986472,
    41.054415,
    -73.964986,
    41.065701
],
  "geometry": {"coordinates":[[[-73.98642599999999,41.06224],[-73.98646599999999,41.062644],[-73.98596499999999,41.063843],[-73.985893,41.063914],[-73.983875,41.06469],[-73.983614,41.064771],[-73.983583,41.064695],[-73.982726,41.064104],[-73.982569,41.064895],[-73.981781,41.065],[-73.98213800000001,41.065197],[-73.98213800000001,41.065406],[-73.97973500000001,41.065594],[-73.979004,41.065652],[-73.97892899999999,41.065701],[-73.97875999999999,41.065404],[-73.978465,41.064927],[-73.978109,41.064437],[-73.977711,41.063964],[-73.977396,41.063625],[-73.97727999999999,41.063499],[-73.97645300000001,41.062671],[-73.975927,41.062219],[-73.975228,41.061656],[-73.97466300000001,41.06126],[-73.97429700000001,41.061019],[-73.972455,41.059888],[-73.97172500000001,41.059422],[-73.97077,41.05884],[-73.969624,41.058141],[-73.968926,41.057691],[-73.968165,41.057186],[-73.967427,41.056665],[-73.967009,41.056344],[-73.966404,41.055858],[-73.96616,41.055652],[-73.965834,41.055379],[-73.964986,41.054633],[-73.965795,41.054621],[-73.965937,41.05462],[-73.966053,41.054616],[-73.968197,41.054558],[-73.968951,41.054546],[-73.96973199999999,41.054547],[-73.969756,41.054546],[-73.96977,41.054546],[-73.969892,41.054547],[-73.971317,41.054553],[-73.972009,41.054556],[-73.97264199999999,41.054546],[-73.974124,41.054555],[-73.974768,41.054536],[-73.977429,41.054484],[-73.97763399999999,41.054481],[-73.978435,41.054467],[-73.978999,41.054449],[-73.98078599999999,41.054415],[-73.981313,41.05445],[-73.981987,41.05451],[-73.98198600000001,41.054724],[-73.981982,41.058195],[-73.98508200000001,41.059795],[-73.985482,41.060395],[-73.98563799999999,41.060551],[-73.985685,41.060598],[-73.985741,41.060637],[-73.985771,41.060619],[-73.98579599999999,41.060619],[-73.98605499999999,41.060805],[-73.986091,41.061117],[-73.98647200000001,41.061698],[-73.98642599999999,41.06224]]],"type":"Polygon"}
}