{
  "id": "360130372001",
  "type": "Feature",
  "properties": {
    "area_land":878230,
    "area_water":1492500,
    "geoid":"360130372001",
    "name":"Block Group 1",
    "state":"ny"
},
  "bbox": [
    -79.295414,
    42.100261,
    -79.270465,
    42.117992
],
  "geometry": {"coordinates":[[[-79.295402,42.117992],[-79.294732,42.117901],[-79.294631,42.117893],[-79.294552,42.117912],[-79.294319,42.11792],[-79.294162,42.117946],[-79.29370299999999,42.117953],[-79.29362999999999,42.117948],[-79.293328,42.117927],[-79.293035,42.117938],[-79.292704,42.117912],[-79.292329,42.117837],[-79.291837,42.117724],[-79.29151,42.117638],[-79.291014,42.117544],[-79.290571,42.117507],[-79.290454,42.117473],[-79.29029300000001,42.117391],[-79.290188,42.117327],[-79.290064,42.117293],[-79.28996600000001,42.1173],[-79.28992100000001,42.117315],[-79.28987600000001,42.117315],[-79.28984199999999,42.117304],[-79.289805,42.117267],[-79.289703,42.117027],[-79.289636,42.116951],[-79.289331,42.11682],[-79.289084,42.116726],[-79.288982,42.1167],[-79.28882400000001,42.116696],[-79.288633,42.116663],[-79.288599,42.116644],[-79.28848600000001,42.116546],[-79.288464,42.116516],[-79.288464,42.116441],[-79.288453,42.116415],[-79.288415,42.116389],[-79.28828,42.116336],[-79.288231,42.116329],[-79.288186,42.116336],[-79.28806899999999,42.116482],[-79.288039,42.116494],[-79.287949,42.116486],[-79.287667,42.116364],[-79.287532,42.116306],[-79.28722399999999,42.116141],[-79.286278,42.115548],[-79.286109,42.115432],[-79.28602600000001,42.115398],[-79.28583500000001,42.11536],[-79.28529399999999,42.115221],[-79.28514699999999,42.115184],[-79.284693,42.115094],[-79.284539,42.115075],[-79.28356599999999,42.115094],[-79.28321699999999,42.115075],[-79.28305899999999,42.115056],[-79.282804,42.114996],[-79.282571,42.114978],[-79.281102,42.114918],[-79.28092599999999,42.114895],[-79.28043,42.114805],[-79.280287,42.114767],[-79.280182,42.114726],[-79.280102,42.114656],[-79.28002499999999,42.114645],[-79.280001,42.114609],[-79.279901,42.114548],[-79.279793,42.114533],[-79.279813,42.114512],[-79.27969,42.114497],[-79.27966000000001,42.114475],[-79.279645,42.114449],[-79.279664,42.114377],[-79.279687,42.114336],[-79.27969,42.11431],[-79.27967200000001,42.114291],[-79.279668,42.114246],[-79.279679,42.114212],[-79.27972800000001,42.114156],[-79.27973900000001,42.114092],[-79.279713,42.11407],[-79.279668,42.114066],[-79.279619,42.114081],[-79.279517,42.11413],[-79.27943500000001,42.114118],[-79.279405,42.114081],[-79.279337,42.114039],[-79.279258,42.114028],[-79.279134,42.114028],[-79.279037,42.114073],[-79.278932,42.114141],[-79.278864,42.114163],[-79.278774,42.114167],[-79.278695,42.114156],[-79.278526,42.114101],[-79.278503,42.114095],[-79.278436,42.114077],[-79.27812400000001,42.113949],[-79.27757200000001,42.113807],[-79.27708800000001,42.113653],[-79.276735,42.11357],[-79.276235,42.113525],[-79.275998,42.11348],[-79.275841,42.113435],[-79.274778,42.113281],[-79.27440199999999,42.113233],[-79.273813,42.113184],[-79.27363200000001,42.113154],[-79.273414,42.11309],[-79.273118,42.113023],[-79.27292199999999,42.112989],[-79.272385,42.112921],[-79.272108,42.112876],[-79.271646,42.112771],[-79.271311,42.112681],[-79.27077,42.112553],[-79.270582,42.112522],[-79.270487,42.111647],[-79.270465,42.111041],[-79.270467,42.109712],[-79.270573,42.106061],[-79.27131900000001,42.106341],[-79.273225,42.107082],[-79.273583,42.107205],[-79.27366499999999,42.10723],[-79.273938,42.107314],[-79.274461,42.107443],[-79.27452599999999,42.107459],[-79.275239,42.10757],[-79.275593,42.107605],[-79.276014,42.107634],[-79.276465,42.107653],[-79.277,42.107626],[-79.27736400000001,42.107598],[-79.277506,42.107586],[-79.27789300000001,42.107526],[-79.27825199999999,42.10746],[-79.278313,42.107449],[-79.278678,42.107361],[-79.278868,42.107307],[-79.279152,42.107226],[-79.27956399999999,42.107084],[-79.280114,42.106857],[-79.280919,42.106471],[-79.28149000000001,42.106189],[-79.28276,42.105584],[-79.282918,42.105508],[-79.283192,42.105377],[-79.285127,42.104449],[-79.285161,42.104432],[-79.285904,42.104068],[-79.28720800000001,42.103447],[-79.288849,42.102653],[-79.291386,42.10144],[-79.292354,42.100997],[-79.29244799999999,42.10096],[-79.29266200000001,42.100878],[-79.29344500000001,42.100626],[-79.29421499999999,42.100426],[-79.294501,42.100367],[-79.294595,42.100347],[-79.29506000000001,42.100261],[-79.295057,42.100458],[-79.295063,42.100964],[-79.295321,42.109428],[-79.29541399999999,42.117881],[-79.295402,42.117992]]],"type":"Polygon"}
}