{
  "id": "360811059004",
  "type": "Feature",
  "properties": {
    "area_land":193637,
    "area_water":0,
    "geoid":"360811059004",
    "name":"Block Group 4",
    "state":"ny"
},
  "bbox": [
    -73.804418,
    40.771086,
    -73.797243,
    40.77561
],
  "geometry": {"coordinates":[[[-73.80427899999999,40.772061],[-73.804179,40.772771],[-73.804081,40.77348],[-73.803985,40.77419],[-73.803887,40.774901],[-73.80379000000001,40.77561],[-73.80099,40.775389],[-73.798543,40.775192],[-73.798233,40.774848],[-73.797854,40.774416],[-73.79724299999999,40.773894],[-73.79759300000001,40.773682],[-73.798456,40.773197],[-73.79871900000001,40.773054],[-73.799481,40.772671],[-73.79996199999999,40.772436],[-73.800481,40.772202],[-73.801484,40.771811],[-73.802825,40.771237],[-73.803455,40.771171],[-73.804418,40.771086],[-73.80427899999999,40.772061]]],"type":"Polygon"}
}