{
  "id": "360290069013",
  "type": "Feature",
  "properties": {
    "area_land":203371,
    "area_water":0,
    "geoid":"360290069013",
    "name":"Block Group 3",
    "state":"ny"
},
  "bbox": [
    -78.899713,
    42.908778,
    -78.890096,
    42.913457
],
  "geometry": {"coordinates":[[[-78.89970700000001,42.913043],[-78.899704,42.913065],[-78.898233,42.913457],[-78.897932,42.912947],[-78.897756,42.912936],[-78.89645299999999,42.912846],[-78.89625599999999,42.912833],[-78.895273,42.912768],[-78.894913,42.912745],[-78.894661,42.91273],[-78.89379,42.912672],[-78.89352599999999,42.912659],[-78.892776,42.912621],[-78.892701,42.91266],[-78.892387,42.912821],[-78.89159100000001,42.913229],[-78.89148,42.913109],[-78.890203,42.911758],[-78.890096,42.911643],[-78.89061599999999,42.911371],[-78.890964,42.911201],[-78.89122,42.911071],[-78.89141499999999,42.910973],[-78.89233400000001,42.910495],[-78.89344800000001,42.909927],[-78.89353699999999,42.909884],[-78.893891,42.909699],[-78.894251,42.909517],[-78.894541,42.909364],[-78.894569,42.90935],[-78.89502,42.909124],[-78.895278,42.908999],[-78.89542899999999,42.908921],[-78.895685,42.908778],[-78.89581800000001,42.90892],[-78.89600900000001,42.909119],[-78.89686500000001,42.910034],[-78.897058,42.910235],[-78.897167,42.91035],[-78.897434,42.910617],[-78.898111,42.911324],[-78.898128,42.911341],[-78.89861500000001,42.911853],[-78.89955,42.912827],[-78.89962800000001,42.912904],[-78.89971300000001,42.912979],[-78.89970700000001,42.913043]]],"type":"Polygon"}
}