{
  "id": "360470385003",
  "type": "Feature",
  "properties": {
    "area_land":43786,
    "area_water":0,
    "geoid":"360470385003",
    "name":"Block Group 3",
    "state":"ny"
},
  "bbox": [
    -73.929888,
    40.686366,
    -73.923542,
    40.687811
],
  "geometry": {"coordinates":[[[-73.92988800000001,40.6871],[-73.926967,40.687438],[-73.923689,40.687811],[-73.923542,40.687076],[-73.92681899999999,40.686702],[-73.92975,40.686366],[-73.92988800000001,40.6871]]],"type":"Polygon"}
}