{
  "id": "360595204013",
  "type": "Feature",
  "properties": {
    "area_land":507486,
    "area_water":0,
    "geoid":"360595204013",
    "name":"Block Group 3",
    "state":"ny"
},
  "bbox": [
    -73.459755,
    40.730684,
    -73.445889,
    40.737648
],
  "geometry": {"coordinates":[[[-73.459755,40.732242],[-73.459332,40.732419],[-73.45892600000001,40.732606],[-73.45874499999999,40.732699],[-73.45856000000001,40.732794],[-73.458144,40.733034],[-73.457746,40.73329],[-73.45756299999999,40.733407],[-73.45711300000001,40.733737],[-73.45699500000001,40.733846],[-73.45682600000001,40.733974],[-73.45663,40.734146],[-73.45629599999999,40.734463],[-73.45600399999999,40.734747],[-73.45575700000001,40.735007],[-73.455342,40.735476],[-73.45502399999999,40.735856],[-73.454733,40.736235],[-73.45461,40.73636],[-73.453937,40.736426],[-73.453851,40.736442],[-73.45372,40.736496],[-73.453611,40.736586],[-73.452581,40.737648],[-73.451905,40.737367],[-73.450895,40.736944],[-73.45083700000001,40.736899],[-73.45074700000001,40.736863],[-73.45045500000001,40.736835],[-73.450329,40.736872],[-73.450227,40.736924],[-73.450177,40.736929],[-73.449602,40.737031],[-73.4494,40.737052],[-73.449111,40.737067],[-73.448635,40.737051],[-73.448211,40.737002],[-73.44788,40.736946],[-73.446281,40.736312],[-73.446224,40.736172],[-73.44616000000001,40.734866],[-73.446156,40.73479],[-73.44615,40.734677],[-73.446144,40.734541],[-73.44588899999999,40.732908],[-73.446754,40.73278],[-73.446985,40.732747],[-73.44761099999999,40.732654],[-73.44799500000001,40.732593],[-73.449416,40.732356],[-73.450429,40.732187],[-73.450755,40.732143],[-73.451716,40.731997],[-73.452089,40.731944],[-73.452253,40.731921],[-73.453247,40.731781],[-73.453951,40.731662],[-73.455575,40.731382],[-73.455899,40.731326],[-73.456216,40.731288],[-73.45643800000001,40.73125],[-73.457156,40.731127],[-73.45844099999999,40.730882],[-73.459059,40.730764],[-73.459396,40.730684],[-73.45943200000001,40.730807],[-73.45964600000001,40.731714],[-73.459755,40.732242]]],"type":"Polygon"}
}