{
  "id": "360290130012",
  "type": "Feature",
  "properties": {
    "area_land":3087803,
    "area_water":855940,
    "geoid":"360290130012",
    "name":"Block Group 2",
    "state":"ny"
},
  "bbox": [
    -78.869143,
    42.76495,
    -78.841946,
    42.805422
],
  "geometry": {"coordinates":[[[-78.86914299999999,42.771294],[-78.867288,42.772674],[-78.865538,42.775402],[-78.86357,42.778559],[-78.86029000000001,42.782089],[-78.857957,42.783106],[-78.85613499999999,42.784871],[-78.85591599999999,42.787118],[-78.855698,42.791451],[-78.855771,42.79434],[-78.857957,42.799154],[-78.861456,42.79985],[-78.86342399999999,42.802685],[-78.864588,42.805422],[-78.862375,42.805379],[-78.85938,42.805332],[-78.856386,42.805284],[-78.855859,42.805275],[-78.854502,42.805254],[-78.853567,42.805239],[-78.853229,42.805233],[-78.852676,42.805225],[-78.851834,42.805211],[-78.851433,42.805205],[-78.850922,42.805197],[-78.850449,42.805189],[-78.850087,42.805183],[-78.849586,42.805175],[-78.849284,42.805171],[-78.848759,42.805162],[-78.848427,42.805157],[-78.84815999999999,42.805159],[-78.847892,42.80516],[-78.846159,42.805169],[-78.84262099999999,42.804991],[-78.841955,42.804958],[-78.841965,42.804674],[-78.84197500000001,42.8044],[-78.841959,42.800657],[-78.84195699999999,42.800307],[-78.84194599999999,42.797765],[-78.84196300000001,42.793697],[-78.841955,42.792475],[-78.841954,42.790109],[-78.841954,42.790008],[-78.844368,42.789986],[-78.845185,42.789988],[-78.845437,42.790086],[-78.845518,42.790108],[-78.84567300000001,42.79015],[-78.845839,42.790265],[-78.845967,42.790431],[-78.846056,42.79066],[-78.846037,42.790431],[-78.846031,42.790163],[-78.84605000000001,42.789939],[-78.84609500000001,42.789665],[-78.846146,42.789486],[-78.846273,42.789275],[-78.846363,42.789192],[-78.84658,42.789078],[-78.84684799999999,42.788975],[-78.846988,42.788966],[-78.84704600000001,42.788963],[-78.84719200000001,42.788969],[-78.84723099999999,42.788382],[-78.847275,42.788018],[-78.84732,42.787303],[-78.84735000000001,42.787123],[-78.84742199999999,42.786697],[-78.84755,42.786193],[-78.847657,42.785856],[-78.848226,42.784948],[-78.848992,42.784054],[-78.84941999999999,42.783601],[-78.850499,42.782555],[-78.851951,42.781189],[-78.85245999999999,42.780471],[-78.853279,42.779712],[-78.853454,42.779565],[-78.85380000000001,42.779212],[-78.85419400000001,42.778796],[-78.854794,42.778218],[-78.856127,42.777097],[-78.85693000000001,42.776427],[-78.857905,42.775576],[-78.858318,42.775178],[-78.85884799999999,42.774664],[-78.858784,42.7743],[-78.858885,42.773975],[-78.859222,42.773769],[-78.85949100000001,42.774002],[-78.859853,42.773552],[-78.860264,42.77303],[-78.860772,42.772408],[-78.859809,42.772207],[-78.859302,42.772127],[-78.856689,42.772117],[-78.855733,42.772113],[-78.85496999999999,42.772111],[-78.85377800000001,42.772106],[-78.855076,42.771232],[-78.86439799999999,42.76495],[-78.864628,42.765321],[-78.86530999999999,42.76642],[-78.865424,42.766689],[-78.865459,42.766948],[-78.865408,42.767228],[-78.86569900000001,42.767288],[-78.865835,42.767352],[-78.86598499999999,42.767511],[-78.866131,42.76782],[-78.866686,42.768921],[-78.867216,42.77],[-78.868369,42.769677],[-78.86846199999999,42.769655],[-78.868661,42.770057],[-78.86914299999999,42.771294]],[[-78.851266,42.799277],[-78.851257,42.798838],[-78.85124,42.7981],[-78.85124,42.797297],[-78.85124399999999,42.796447],[-78.851241,42.795717],[-78.851236,42.794971],[-78.851231,42.794228],[-78.848209,42.794238],[-78.846833,42.794247],[-78.84683200000001,42.794197],[-78.846166,42.794445],[-78.846028,42.794394],[-78.845821,42.794286],[-78.845732,42.794253],[-78.845675,42.794239],[-78.845513,42.794217],[-78.84531800000001,42.794204],[-78.845037,42.7942],[-78.844887,42.794208],[-78.844739,42.794226],[-78.844562,42.794264],[-78.844408,42.794315],[-78.844264,42.79438],[-78.844133,42.794459],[-78.843673,42.794835],[-78.84451799999999,42.795393],[-78.844908,42.795647],[-78.84530100000001,42.795912],[-78.84630900000001,42.796597],[-78.84685,42.796595],[-78.84684900000001,42.797347],[-78.84684900000001,42.797431],[-78.84681,42.797786],[-78.846779,42.798114],[-78.846752,42.798373],[-78.846712,42.798852],[-78.846664,42.799288],[-78.846627,42.799606],[-78.84872,42.799599],[-78.851269,42.799581],[-78.851266,42.799277]]],"type":"Polygon"}
}