{
  "id": "360610291004",
  "type": "Feature",
  "properties": {
    "area_land":50536,
    "area_water":0,
    "geoid":"360610291004",
    "name":"Block Group 4",
    "state":"ny"
},
  "bbox": [
    -73.927269,
    40.863575,
    -73.923767,
    40.866336
],
  "geometry": {"coordinates":[[[-73.927269,40.865535],[-73.92610500000001,40.865945],[-73.925872,40.866025],[-73.925005,40.866336],[-73.924385,40.865365],[-73.923767,40.864403],[-73.926011,40.863575],[-73.92662,40.864525],[-73.927269,40.865535]]],"type":"Polygon"}
}