{
  "id": "360810073003",
  "type": "Feature",
  "properties": {
    "area_land":49513,
    "area_water":0,
    "geoid":"360810073003",
    "name":"Block Group 3",
    "state":"ny"
},
  "bbox": [
    -73.928556,
    40.764725,
    -73.923539,
    40.767616
],
  "geometry": {"coordinates":[[[-73.928375,40.766935],[-73.92782099999999,40.767616],[-73.92596500000001,40.766745],[-73.924339,40.765981],[-73.92353900000001,40.765604],[-73.924092,40.764922],[-73.92425299999999,40.764725],[-73.924841,40.764996],[-73.925061,40.765097],[-73.925237,40.765178],[-73.92570000000001,40.765391],[-73.926438,40.765733],[-73.928556,40.766714],[-73.928375,40.766935]]],"type":"Polygon"}
}