{
  "id": "360810058002",
  "type": "Feature",
  "properties": {
    "area_land":120466,
    "area_water":0,
    "geoid":"360810058002",
    "name":"Block Group 2",
    "state":"ny"
},
  "bbox": [
    -73.847994,
    40.669278,
    -73.842572,
    40.673099
],
  "geometry": {"coordinates":[[[-73.847994,40.672372],[-73.847926,40.673065],[-73.847714,40.673065],[-73.846165,40.672457],[-73.84573899999999,40.673075],[-73.844471,40.672574],[-73.843801,40.672295],[-73.843508,40.672968],[-73.843397,40.673099],[-73.843356,40.672569],[-73.84330799999999,40.672256],[-73.843277,40.672114],[-73.84307699999999,40.67135],[-73.842912,40.67064],[-73.842726,40.66981],[-73.842572,40.669284],[-73.842714,40.669278],[-73.84288599999999,40.669285],[-73.843056,40.669306],[-73.843211,40.669319],[-73.845825,40.670144],[-73.846901,40.670473],[-73.847414,40.67063],[-73.846999,40.671239],[-73.847821,40.671557],[-73.847962,40.67222],[-73.847994,40.672372]]],"type":"Polygon"}
}