{
  "id": "360610163002",
  "type": "Feature",
  "properties": {
    "area_land":26818,
    "area_water":0,
    "geoid":"360610163002",
    "name":"Block Group 2",
    "state":"ny"
},
  "bbox": [
    -73.985072,
    40.781126,
    -73.98259,
    40.783192
],
  "geometry": {"coordinates":[[[-73.98477800000001,40.782483],[-73.984452,40.783192],[-73.98259,40.782393],[-73.983053,40.78176],[-73.983515,40.781126],[-73.985072,40.78178],[-73.98477800000001,40.782483]]],"type":"Polygon"}
}