{
  "id": "360273000002",
  "type": "Feature",
  "properties": {
    "area_land":953438,
    "area_water":0,
    "geoid":"360273000002",
    "name":"Block Group 2",
    "state":"ny"
},
  "bbox": [
    -73.921089,
    41.589294,
    -73.90146,
    41.599676
],
  "geometry": {"coordinates":[[[-73.920338,41.591103],[-73.920239,41.59134],[-73.919867,41.592208],[-73.919859,41.592226],[-73.91956399999999,41.592919],[-73.919183,41.593812],[-73.91917100000001,41.593839],[-73.91884,41.594593],[-73.91878,41.594731],[-73.918772,41.594749],[-73.918385,41.595631],[-73.91795999999999,41.596603],[-73.917951,41.596624],[-73.917897,41.596749],[-73.917655,41.597314],[-73.917597,41.597291],[-73.91739699999999,41.597256],[-73.91713300000001,41.597236],[-73.91622099999999,41.597209],[-73.916102,41.597203],[-73.915032,41.597172],[-73.91462799999999,41.597149],[-73.914192,41.597116],[-73.913729,41.597056],[-73.913113,41.596922],[-73.91253399999999,41.596774],[-73.912133,41.596701],[-73.911947,41.596679],[-73.91175800000001,41.596676],[-73.91178499999999,41.596876],[-73.911776,41.596937],[-73.911462,41.597465],[-73.911379,41.597563],[-73.91139099999999,41.598286],[-73.91123399999999,41.598326],[-73.91117199999999,41.598333],[-73.910948,41.598393],[-73.910844,41.598435],[-73.910692,41.598578],[-73.910427,41.598828],[-73.910228,41.599051],[-73.91013100000001,41.599159],[-73.910022,41.599264],[-73.90985999999999,41.599394],[-73.909544,41.599676],[-73.908957,41.599453],[-73.908731,41.59935],[-73.908629,41.599266],[-73.908407,41.598987],[-73.907777,41.59814],[-73.90723300000001,41.597405],[-73.90676000000001,41.596781],[-73.906699,41.5966],[-73.90660099999999,41.595978],[-73.906745,41.595925],[-73.906617,41.595201],[-73.90650100000001,41.595244],[-73.906482,41.59511],[-73.90641100000001,41.594616],[-73.904218,41.595485],[-73.903629,41.595717],[-73.903116,41.595095],[-73.902961,41.594908],[-73.90294,41.594882],[-73.902675,41.594539],[-73.90236400000001,41.5941],[-73.902334,41.594059],[-73.90146,41.592857],[-73.901946,41.592511],[-73.902207,41.592283],[-73.902109,41.591936],[-73.90194700000001,41.591319],[-73.90194200000001,41.5913],[-73.901934,41.591272],[-73.901776,41.590692],[-73.901724,41.5905],[-73.90166499999999,41.590286],[-73.90155,41.58981],[-73.901537,41.589646],[-73.901849,41.589623],[-73.902936,41.589531],[-73.903853,41.589458],[-73.90477300000001,41.589294],[-73.904855,41.589427],[-73.90513,41.589819],[-73.90558299999999,41.590465],[-73.905604,41.590495],[-73.905635,41.590538],[-73.90594299999999,41.590977],[-73.906165,41.591314],[-73.90649500000001,41.59187],[-73.906719,41.59223],[-73.90689399999999,41.592282],[-73.907117,41.592348],[-73.907228,41.592382],[-73.907382,41.592429],[-73.908928,41.592897],[-73.90915200000001,41.592965],[-73.909261,41.592998],[-73.90938300000001,41.593047],[-73.909502,41.59307],[-73.90973200000001,41.593144],[-73.909918,41.592966],[-73.909982,41.592904],[-73.91005199999999,41.592848],[-73.910155,41.592809],[-73.91018800000001,41.592796],[-73.910342,41.592742],[-73.91041300000001,41.592717],[-73.910517,41.592681],[-73.910595,41.592653],[-73.910611,41.592647],[-73.910792,41.592584],[-73.91083,41.59257],[-73.910955,41.592526],[-73.91145299999999,41.592351],[-73.911722,41.592254],[-73.911804,41.592188],[-73.911911,41.592086],[-73.91203899999999,41.591962],[-73.912406,41.591607],[-73.912429,41.591585],[-73.912538,41.59148],[-73.912691,41.591333],[-73.912753,41.591273],[-73.912789,41.591239],[-73.91287,41.591161],[-73.91292799999999,41.591108],[-73.91299600000001,41.591045],[-73.913073,41.590975],[-73.913111,41.590941],[-73.913223,41.590839],[-73.913302,41.590766],[-73.91336699999999,41.590707],[-73.91343000000001,41.590659],[-73.913574,41.59068],[-73.913613,41.590687],[-73.91380599999999,41.590716],[-73.913838,41.590721],[-73.91391900000001,41.590733],[-73.91397499999999,41.590742],[-73.914002,41.590746],[-73.91403200000001,41.590751],[-73.914193,41.590775],[-73.91433000000001,41.590795],[-73.914388,41.590804],[-73.914508,41.590821],[-73.914626,41.590839],[-73.914654,41.590843],[-73.914683,41.590847],[-73.914739,41.590855],[-73.914798,41.590864],[-73.91485299999999,41.590872],[-73.914874,41.590875],[-73.914948,41.590886],[-73.915322,41.590941],[-73.915356,41.590946],[-73.915413,41.590944],[-73.915558,41.590615],[-73.915644,41.590419],[-73.915654,41.590397],[-73.91573099999999,41.590224],[-73.915766,41.590143],[-73.915795,41.590075],[-73.91581600000001,41.590028],[-73.91585499999999,41.589942],[-73.91589999999999,41.589953],[-73.915924,41.589959],[-73.91651,41.59014],[-73.91669,41.590172],[-73.91760499999999,41.590404],[-73.917776,41.590445],[-73.918688,41.59014],[-73.918921,41.590064],[-73.91912000000001,41.589998],[-73.91915299999999,41.589987],[-73.919214,41.589966],[-73.919365,41.589915],[-73.91961000000001,41.589832],[-73.91982899999999,41.589757],[-73.919895,41.589735],[-73.92108899999999,41.589336],[-73.920338,41.591103]]],"type":"Polygon"}
}