{
  "id": "361031459022",
  "type": "Feature",
  "properties": {
    "area_land":1624676,
    "area_water":0,
    "geoid":"361031459022",
    "name":"Block Group 2",
    "state":"ny"
},
  "bbox": [
    -73.280102,
    40.74307,
    -73.261586,
    40.764266
],
  "geometry": {"coordinates":[[[-73.27949599999999,40.743996],[-73.27924400000001,40.744525],[-73.27910199999999,40.744897],[-73.27902899999999,40.745138],[-73.27895100000001,40.745555],[-73.278868,40.745968],[-73.27890499999999,40.746664],[-73.278998,40.74711],[-73.279483,40.748627],[-73.279596,40.749058],[-73.279623,40.74916],[-73.27968799999999,40.749635],[-73.27973900000001,40.75458],[-73.278454,40.754545],[-73.277672,40.754529],[-73.277496,40.754488],[-73.277219,40.754526],[-73.27631100000001,40.754653],[-73.275414,40.754768],[-73.274298,40.754946],[-73.273633,40.755042],[-73.27221900000001,40.755248],[-73.27166200000001,40.755335],[-73.270938,40.755445],[-73.27025399999999,40.755544],[-73.26878600000001,40.755755],[-73.268309,40.755825],[-73.267921,40.755887],[-73.269198,40.760724],[-73.270005,40.763859],[-73.270118,40.764266],[-73.26986599999999,40.764082],[-73.269599,40.763939],[-73.26937700000001,40.763841],[-73.268642,40.763624],[-73.268289,40.763547],[-73.268095,40.763531],[-73.26788500000001,40.76354],[-73.26770500000001,40.763563],[-73.26746199999999,40.763602],[-73.265539,40.763422],[-73.26158599999999,40.763073],[-73.261664,40.762435],[-73.261673,40.762309],[-73.26181,40.761189],[-73.26189599999999,40.760423],[-73.26195,40.759953],[-73.261987,40.759671],[-73.262068,40.759181],[-73.262128,40.758727],[-73.26214899999999,40.758565],[-73.26219500000001,40.75823],[-73.262242,40.757896],[-73.26228,40.757509],[-73.26234100000001,40.757048],[-73.262429,40.756414],[-73.26244199999999,40.756275],[-73.262607,40.755037],[-73.26276799999999,40.753805],[-73.262855,40.75302],[-73.26291500000001,40.752582],[-73.263068,40.75139],[-73.26322999999999,40.750201],[-73.263234,40.750039],[-73.263203,40.749974],[-73.263234,40.749592],[-73.263251,40.749376],[-73.263283,40.749189],[-73.263291,40.749122],[-73.26342,40.749141],[-73.263571,40.749163],[-73.263786,40.749197],[-73.26454099999999,40.749285],[-73.265749,40.749358],[-73.265991,40.749366],[-73.266777,40.749362],[-73.26745,40.74935],[-73.26786300000001,40.749328],[-73.269249,40.749195],[-73.26990000000001,40.749101],[-73.27091900000001,40.748903],[-73.270883,40.748745],[-73.27140799999999,40.748623],[-73.27227000000001,40.748378],[-73.27295599999999,40.748094],[-73.273449,40.747933],[-73.273884,40.747748],[-73.27476299999999,40.747272],[-73.275716,40.746811],[-73.276158,40.746549],[-73.27654699999999,40.746309],[-73.276737,40.746163],[-73.27694700000001,40.746002],[-73.27717699999999,40.745825],[-73.27748099999999,40.745639],[-73.278048,40.745151],[-73.278756,40.744512],[-73.279319,40.743937],[-73.280102,40.74307],[-73.27949599999999,40.743996]]],"type":"Polygon"}
}