{
  "id": "360359705004",
  "type": "Feature",
  "properties": {
    "area_land":78367105,
    "area_water":107878,
    "geoid":"360359705004",
    "name":"Block Group 4",
    "state":"ny"
},
  "bbox": [
    -74.715237,
    43.003979,
    -74.606611,
    43.123758
],
  "geometry": {"coordinates":[[[-74.715142,43.03487],[-74.71511099999999,43.034912],[-74.714696,43.035481],[-74.71431200000001,43.03604],[-74.71423900000001,43.036201],[-74.714179,43.036419],[-74.713779,43.039113],[-74.713717,43.039329],[-74.713593,43.03957],[-74.712812,43.040829],[-74.711467,43.042822],[-74.710561,43.044132],[-74.70986000000001,43.045178],[-74.709273,43.046099],[-74.708668,43.046984],[-74.708123,43.047746],[-74.707911,43.047978],[-74.707751,43.048096],[-74.707632,43.048173],[-74.707432,43.048254],[-74.706965,43.048405],[-74.706695,43.048526],[-74.706148,43.048821],[-74.705645,43.048992],[-74.705521,43.049054],[-74.705439,43.049136],[-74.705354,43.049275],[-74.705339,43.049416],[-74.70537899999999,43.04954],[-74.705439,43.04963],[-74.70575700000001,43.050029],[-74.705851,43.050188],[-74.70590300000001,43.05035],[-74.705918,43.050511],[-74.705913,43.050819],[-74.705871,43.050978],[-74.705769,43.051191],[-74.705657,43.051388],[-74.705275,43.051936],[-74.70375199999999,43.054178],[-74.70327399999999,43.054866],[-74.702957,43.055327],[-74.701854,43.056934],[-74.701171,43.057897],[-74.700337,43.059122],[-74.70008900000001,43.059443],[-74.699748,43.059838],[-74.699337,43.060252],[-74.699032,43.060561],[-74.69887900000001,43.060725],[-74.69879299999999,43.060844],[-74.698713,43.061004],[-74.69865,43.061246],[-74.698627,43.061635],[-74.698607,43.062677],[-74.698587,43.062968],[-74.69856900000001,43.063034],[-74.69844500000001,43.063253],[-74.698305,43.063551],[-74.698106,43.063897],[-74.69562999999999,43.067726],[-74.695027,43.068698],[-74.693776,43.070597],[-74.693146,43.071606],[-74.692576,43.072466],[-74.69168000000001,43.073835],[-74.691372,43.074395],[-74.690729,43.075327],[-74.689498,43.077166],[-74.68767699999999,43.080067],[-74.687476,43.080419],[-74.687028,43.081108],[-74.68646099999999,43.082028],[-74.68554,43.083471],[-74.685345,43.083665],[-74.68518,43.083801],[-74.68512200000001,43.083849],[-74.684978,43.083939],[-74.68521800000001,43.084206],[-74.685365,43.084369],[-74.68546000000001,43.084462],[-74.686111,43.085001],[-74.68678199999999,43.085536],[-74.687181,43.085903],[-74.687251,43.086011],[-74.68728,43.086125],[-74.68728,43.086207],[-74.687226,43.08639],[-74.686774,43.087247],[-74.686387,43.088138],[-74.686226,43.088408],[-74.68595000000001,43.088757],[-74.68567,43.089061],[-74.685304,43.08935],[-74.684776,43.089897],[-74.68366399999999,43.091428],[-74.68347199999999,43.091793],[-74.68341700000001,43.091897],[-74.68331000000001,43.092198],[-74.683273,43.092348],[-74.683252,43.092613],[-74.683306,43.093115],[-74.68339899999999,43.093863],[-74.683437,43.094168],[-74.68355699999999,43.09485],[-74.683582,43.095362],[-74.683697,43.096453],[-74.683722,43.097178],[-74.683577,43.098147],[-74.683421,43.098781],[-74.683386,43.098992],[-74.683232,43.099931],[-74.68307900000001,43.100681],[-74.68287599999999,43.10168],[-74.682784,43.10207],[-74.68270200000001,43.10229],[-74.682638,43.102407],[-74.682343,43.102853],[-74.68159300000001,43.103936],[-74.68059599999999,43.105466],[-74.67997,43.106388],[-74.679388,43.107301],[-74.67881,43.108159],[-74.67749000000001,43.110264],[-74.67728,43.110555],[-74.67699,43.110865],[-74.676558,43.11131],[-74.675369,43.112643],[-74.675172,43.112818],[-74.674965,43.112979],[-74.67411,43.113563],[-74.674001,43.113668],[-74.67391600000001,43.113781],[-74.673738,43.114159],[-74.673687,43.114265],[-74.673213,43.114905],[-74.67260899999999,43.115825],[-74.672219,43.116483],[-74.671967,43.116872],[-74.671796,43.117136],[-74.671359,43.117707],[-74.671132,43.1181],[-74.67106,43.118202],[-74.67099899999999,43.118266],[-74.67094899999999,43.118303],[-74.67080900000001,43.118377],[-74.67069600000001,43.11842],[-74.667773,43.119385],[-74.666102,43.119954],[-74.664919,43.12037],[-74.66452200000001,43.12051],[-74.662986,43.12098],[-74.662486,43.12112],[-74.66134099999999,43.121516],[-74.659594,43.122009],[-74.65790800000001,43.122431],[-74.65724,43.122614],[-74.656475,43.122767],[-74.653289,43.123255],[-74.653064,43.123296],[-74.65149700000001,43.123477],[-74.650246,43.123621],[-74.648844,43.123736],[-74.64863,43.123758],[-74.63895599999999,43.120454],[-74.63662600000001,43.119641],[-74.62736700000001,43.116482],[-74.62428300000001,43.115441],[-74.613749,43.112249],[-74.613111,43.112071],[-74.612926,43.111939],[-74.612422,43.111669],[-74.61196200000001,43.111435],[-74.611717,43.11133],[-74.610625,43.110937],[-74.610536,43.108029],[-74.61038000000001,43.104875],[-74.610242,43.101726],[-74.610148,43.099234],[-74.60991300000001,43.093586],[-74.60966500000001,43.087563],[-74.609303,43.078808],[-74.608836,43.068112],[-74.608779,43.067377],[-74.608716,43.065995],[-74.608693,43.065505],[-74.60862400000001,43.063702],[-74.608588,43.062856],[-74.60825,43.055399],[-74.60809,43.051848],[-74.608058,43.051137],[-74.607653,43.040761],[-74.60713199999999,43.02803],[-74.606826,43.021501],[-74.606711,43.018941],[-74.606611,43.003979],[-74.624627,43.008975],[-74.62593099999999,43.009326],[-74.62599,43.009342],[-74.626476,43.009498],[-74.629368,43.010409],[-74.62950600000001,43.010441],[-74.630253,43.010616],[-74.636662,43.012341],[-74.63830299999999,43.012783],[-74.638347,43.012792],[-74.646265,43.015156],[-74.64813700000001,43.015686],[-74.660948,43.019315],[-74.661458,43.019459],[-74.673147,43.022774],[-74.675787,43.023529],[-74.676033,43.0236],[-74.69804600000001,43.029853],[-74.699079,43.030146],[-74.712631,43.033991],[-74.715237,43.034733],[-74.715142,43.03487]]],"type":"Polygon"}
}