{
  "id": "360830409002",
  "type": "Feature",
  "properties": {
    "area_land":434958,
    "area_water":0,
    "geoid":"360830409002",
    "name":"Block Group 2",
    "state":"ny"
},
  "bbox": [
    -73.694468,
    42.711304,
    -73.684379,
    42.71979
],
  "geometry": {"coordinates":[[[-73.69402599999999,42.714113],[-73.69396,42.714304],[-73.693663,42.714676],[-73.693507,42.71489],[-73.693302,42.715173],[-73.693054,42.715492],[-73.69265799999999,42.715956],[-73.692064,42.715685],[-73.69178700000001,42.715965],[-73.691706,42.716067],[-73.69165700000001,42.716173],[-73.69154,42.716518],[-73.69150399999999,42.716677],[-73.69148,42.716883],[-73.690826,42.71681],[-73.690634,42.718364],[-73.69060500000001,42.718378],[-73.690577,42.718424],[-73.69051,42.718606],[-73.6904,42.719104],[-73.690276,42.719577],[-73.690899,42.719639],[-73.69084700000001,42.71979],[-73.69061499999999,42.719761],[-73.690466,42.719764],[-73.690243,42.71972],[-73.690038,42.719727],[-73.689847,42.719674],[-73.689656,42.719639],[-73.689469,42.719628],[-73.6892,42.719628],[-73.689083,42.719608],[-73.68895999999999,42.719572],[-73.688716,42.719528],[-73.688564,42.719528],[-73.688327,42.719478],[-73.688132,42.719468],[-73.68777300000001,42.719424],[-73.68750199999999,42.719413],[-73.686385,42.719291],[-73.686213,42.719284],[-73.686071,42.719291],[-73.685914,42.71931],[-73.685214,42.719441],[-73.68498,42.719462],[-73.68475599999999,42.719355],[-73.68437900000001,42.719211],[-73.685909,42.716121],[-73.685991,42.716049],[-73.68611799999999,42.715878],[-73.68620199999999,42.715736],[-73.686279,42.715565],[-73.686308,42.715455],[-73.68632100000001,42.7153],[-73.68634299999999,42.713268],[-73.686356,42.713165],[-73.68640000000001,42.713062],[-73.686435,42.713013],[-73.68673800000001,42.712396],[-73.686959,42.711945],[-73.687051,42.711759],[-73.687532,42.711304],[-73.687573,42.711384],[-73.687637,42.711416],[-73.688365,42.711591],[-73.688648,42.711671],[-73.690308,42.712135],[-73.690507,42.71219],[-73.691636,42.712487],[-73.693049,42.712851],[-73.69356399999999,42.71299],[-73.69373400000001,42.713038],[-73.694468,42.713252],[-73.69402599999999,42.714113]]],"type":"Polygon"}
}