{
  "id": "361190036001",
  "type": "Feature",
  "properties": {
    "area_land":199139,
    "area_water":0,
    "geoid":"361190036001",
    "name":"Block Group 1",
    "state":"ny"
},
  "bbox": [
    -73.841193,
    40.911288,
    -73.835335,
    40.917651
],
  "geometry": {"coordinates":[[[-73.841193,40.917147],[-73.841007,40.917217],[-73.840788,40.917282],[-73.840613,40.917317],[-73.84025,40.917357],[-73.840081,40.917364],[-73.839372,40.917389],[-73.839135,40.917398],[-73.83848500000001,40.917427],[-73.838256,40.917437],[-73.83810800000001,40.917446],[-73.837954,40.91745],[-73.837716,40.917464],[-73.837531,40.917475],[-73.837316,40.917489],[-73.837248,40.917494],[-73.835515,40.917651],[-73.835335,40.916187],[-73.835825,40.916182],[-73.83657700000001,40.916172],[-73.837045,40.916164],[-73.837463,40.916157],[-73.837384,40.914381],[-73.837301,40.912722],[-73.837288,40.912383],[-73.837262,40.912136],[-73.837216,40.912012],[-73.83716200000001,40.911881],[-73.83797199999999,40.911666],[-73.83810200000001,40.911621],[-73.83875,40.911394],[-73.83900800000001,40.911288],[-73.839066,40.911404],[-73.83908700000001,40.91144],[-73.839324,40.911711],[-73.839839,40.912334],[-73.840001,40.912534],[-73.84002700000001,40.912659],[-73.84009,40.913498],[-73.84013,40.914262],[-73.84101800000001,40.914232],[-73.841121,40.916043],[-73.841193,40.917147]]],"type":"Polygon"}
}