{
  "id": "360930331022",
  "type": "Feature",
  "properties": {
    "area_land":52822677,
    "area_water":741786,
    "geoid":"360930331022",
    "name":"Block Group 2",
    "state":"ny"
},
  "bbox": [
    -74.264759,
    42.760355,
    -74.155476,
    42.850632
],
  "geometry": {"coordinates":[[[-74.264732,42.799033],[-74.264706,42.799119],[-74.264672,42.799659],[-74.264286,42.800116],[-74.263645,42.800328],[-74.262922,42.800449],[-74.261802,42.800757],[-74.260757,42.801138],[-74.25951000000001,42.801788],[-74.25874399999999,42.802271],[-74.258528,42.802386],[-74.25789399999999,42.803166],[-74.257634,42.803486],[-74.256784,42.804375],[-74.256619,42.804553],[-74.255916,42.805312],[-74.255709,42.805457],[-74.255323,42.806064],[-74.254918,42.807143],[-74.254778,42.808479],[-74.254896,42.809414],[-74.254947,42.809815],[-74.25555199999999,42.810658],[-74.25644200000001,42.8119],[-74.256829,42.812214],[-74.256546,42.812351],[-74.256255,42.812493],[-74.246678,42.817302],[-74.24655799999999,42.817363],[-74.24636099999999,42.817465],[-74.24497,42.818129],[-74.24135800000001,42.819924],[-74.238328,42.821432],[-74.230493,42.825311],[-74.21271400000001,42.83409],[-74.20754599999999,42.836553],[-74.202585,42.839073],[-74.20100100000001,42.839689],[-74.19920999999999,42.840576],[-74.192633,42.843834],[-74.192206,42.844046],[-74.191586,42.84435],[-74.19103800000001,42.84462],[-74.190336,42.844965],[-74.186414,42.846893],[-74.179098,42.85049],[-74.17882299999999,42.850626],[-74.178673,42.850632],[-74.1786,42.850623],[-74.178552,42.850592],[-74.178549,42.850562],[-74.178561,42.850541],[-74.178595,42.850515],[-74.17867,42.850477],[-74.17833299999999,42.848518],[-74.17826599999999,42.848219],[-74.177409,42.844414],[-74.17729,42.843859],[-74.17729,42.843406],[-74.17724200000001,42.842411],[-74.176081,42.841064],[-74.175505,42.840991],[-74.173467,42.839264],[-74.173045,42.839278],[-74.172702,42.839252],[-74.172427,42.839226],[-74.17225500000001,42.83915],[-74.172067,42.838935],[-74.172016,42.838682],[-74.172017,42.838467],[-74.172155,42.838139],[-74.172448,42.837697],[-74.172827,42.837242],[-74.173378,42.836737],[-74.173877,42.836485],[-74.174221,42.836359],[-74.175303,42.836158],[-74.175595,42.836058],[-74.175819,42.835944],[-74.175991,42.835793],[-74.17607700000001,42.835578],[-74.17575600000001,42.833757],[-74.17573899999999,42.833592],[-74.17570499999999,42.833264],[-74.175775,42.832936],[-74.175844,42.832696],[-74.17617199999999,42.832266],[-74.17617199999999,42.832102],[-74.17619000000001,42.831887],[-74.17615600000001,42.831698],[-74.176002,42.831495],[-74.17577900000001,42.831343],[-74.17538500000001,42.831153],[-74.17505800000001,42.831089],[-74.174834,42.831026],[-74.174735,42.830932],[-74.174887,42.830684],[-74.17519299999999,42.830026],[-74.175173,42.829747],[-74.174565,42.825575],[-74.17448899999999,42.825192],[-74.17434900000001,42.824489],[-74.17422999999999,42.824136],[-74.174131,42.823886],[-74.174012,42.823622],[-74.173973,42.823401],[-74.17403299999999,42.823211],[-74.17407300000001,42.823034],[-74.174193,42.822844],[-74.174373,42.822712],[-74.175432,42.822214],[-74.175692,42.822038],[-74.175832,42.821891],[-74.175892,42.821701],[-74.175892,42.821539],[-74.175738,42.820392],[-74.178359,42.819927],[-74.179249,42.819769],[-74.179625,42.819702],[-74.181286,42.819407],[-74.18240400000001,42.819209],[-74.18235,42.818855],[-74.18231400000001,42.818621],[-74.182219,42.817994],[-74.18204799999999,42.817056],[-74.181924,42.816466],[-74.181783,42.816142],[-74.18140699999999,42.815632],[-74.18081100000001,42.815088],[-74.18016799999999,42.814612],[-74.179604,42.814172],[-74.17954899999999,42.814117],[-74.17928999999999,42.813859],[-74.179039,42.813477],[-74.178814,42.813084],[-74.178459,42.81185],[-74.178077,42.810965],[-74.177402,42.809919],[-74.17666,42.808799],[-74.17635199999999,42.808375],[-74.17569399999999,42.807722],[-74.170332,42.802228],[-74.16882699999999,42.800664],[-74.16854600000001,42.800282],[-74.168503,42.80012],[-74.168358,42.799579],[-74.16779699999999,42.796938],[-74.16740900000001,42.794834],[-74.16728000000001,42.794018],[-74.167018,42.793652],[-74.16679999999999,42.793491],[-74.16453199999999,42.792402],[-74.16278699999999,42.791609],[-74.16238800000001,42.791424],[-74.160295,42.790061],[-74.160071,42.78995],[-74.157726,42.789579],[-74.157527,42.789542],[-74.157377,42.78945],[-74.157319,42.789284],[-74.15715400000001,42.788806],[-74.15715400000001,42.788714],[-74.157402,42.788248],[-74.157983,42.787153],[-74.158033,42.786987],[-74.158034,42.786775],[-74.158034,42.786712],[-74.15754200000001,42.784229],[-74.157184,42.782316],[-74.15696699999999,42.781155],[-74.15671399999999,42.77983],[-74.15663600000001,42.77942],[-74.156508,42.778753],[-74.156131,42.776778],[-74.15609499999999,42.776334],[-74.156066,42.775864],[-74.15602800000001,42.775237],[-74.155833,42.773419],[-74.155518,42.770465],[-74.15547599999999,42.769892],[-74.155522,42.768849],[-74.15553800000001,42.76857],[-74.156744,42.768763],[-74.16015400000001,42.769106],[-74.165334,42.769346],[-74.170311,42.769578],[-74.17130400000001,42.769564],[-74.172196,42.769506],[-74.172439,42.769476],[-74.174527,42.769136],[-74.17852999999999,42.768553],[-74.18204799999999,42.768041],[-74.18452000000001,42.767568],[-74.18538100000001,42.767422],[-74.18586500000001,42.767356],[-74.187782,42.767096],[-74.190315,42.766748],[-74.191119,42.766637],[-74.200301,42.765247],[-74.20092,42.765151],[-74.204444,42.764674],[-74.20915599999999,42.763995],[-74.20988699999999,42.763891],[-74.212844,42.763493],[-74.21749,42.763176],[-74.22022200000001,42.762999],[-74.223393,42.762819],[-74.22391399999999,42.76279],[-74.223994,42.762784],[-74.225967,42.762629],[-74.230327,42.762336],[-74.235878,42.761966],[-74.239592,42.761632],[-74.24338299999999,42.761286],[-74.245824,42.760977],[-74.245977,42.760959],[-74.24745299999999,42.760785],[-74.250078,42.760533],[-74.251175,42.76038],[-74.252045,42.760355],[-74.252814,42.760417],[-74.254463,42.76062],[-74.255098,42.760684],[-74.255292,42.760701],[-74.255234,42.760755],[-74.255077,42.760996],[-74.255005,42.761106],[-74.254746,42.761438],[-74.254288,42.761827],[-74.253899,42.762189],[-74.253502,42.762643],[-74.25318900000001,42.763044],[-74.252815,42.76349],[-74.25168600000001,42.765306],[-74.251549,42.765649],[-74.25148,42.766096],[-74.251487,42.766121],[-74.25158500000001,42.766493],[-74.25168600000001,42.766874],[-74.252022,42.767606],[-74.25251799999999,42.768404],[-74.252548,42.768447],[-74.252922,42.768972],[-74.25348700000001,42.770082],[-74.25396000000001,42.7712],[-74.25440999999999,42.772237],[-74.254608,42.772852],[-74.254723,42.773656],[-74.2547,42.774709],[-74.25458500000001,42.775274],[-74.25451200000001,42.775534],[-74.254379,42.776006],[-74.25411200000001,42.776453],[-74.253502,42.77725],[-74.252968,42.778356],[-74.252602,42.779089],[-74.252236,42.779695],[-74.251633,42.780889],[-74.25116,42.781526],[-74.250649,42.782133],[-74.25026699999999,42.782453],[-74.249573,42.782877],[-74.248986,42.783518],[-74.24865699999999,42.783807],[-74.248306,42.784242],[-74.248062,42.78457],[-74.247788,42.78507],[-74.247775,42.785165],[-74.24773399999999,42.785474],[-74.24794,42.786352],[-74.248131,42.786886],[-74.248306,42.787153],[-74.24852,42.78737],[-74.248741,42.78758],[-74.24916899999999,42.787889],[-74.249573,42.788267],[-74.251808,42.789117],[-74.252,42.789242],[-74.252762,42.789739],[-74.253266,42.790178],[-74.253433,42.790533],[-74.25361700000001,42.79268],[-74.253739,42.793809],[-74.253884,42.794504],[-74.25411099999999,42.794827],[-74.254442,42.795297],[-74.25488900000001,42.79551],[-74.255425,42.795671],[-74.256063,42.795808],[-74.256547,42.79587],[-74.25740500000001,42.795797],[-74.258968,42.795325],[-74.259103,42.795301],[-74.25965100000001,42.795204],[-74.260457,42.79512],[-74.261161,42.795194],[-74.26190200000001,42.795451],[-74.26298300000001,42.796227],[-74.263204,42.796422],[-74.26331399999999,42.796534],[-74.263459,42.796634],[-74.263632,42.796753],[-74.26405699999999,42.797376],[-74.264376,42.798063],[-74.26448600000001,42.798317],[-74.264611,42.798606],[-74.264759,42.798948],[-74.264732,42.799033]]],"type":"Polygon"}
}