{
  "id": "360610253006",
  "type": "Feature",
  "properties": {
    "area_land":35489,
    "area_water":0,
    "geoid":"360610253006",
    "name":"Block Group 6",
    "state":"ny"
},
  "bbox": [
    -73.942013,
    40.841681,
    -73.939177,
    40.844049
],
  "geometry": {"coordinates":[[[-73.941948,40.842976],[-73.941862,40.843137],[-73.941757,40.843291],[-73.94163399999999,40.843437],[-73.941142,40.844049],[-73.939177,40.843223],[-73.939255,40.842436],[-73.939334,40.841681],[-73.942013,40.84281],[-73.941948,40.842976]]],"type":"Polygon"}
}