{
  "id": "360811191001",
  "type": "Feature",
  "properties": {
    "area_land":124551,
    "area_water":0,
    "geoid":"360811191001",
    "name":"Block Group 1",
    "state":"ny"
},
  "bbox": [
    -73.810123,
    40.756399,
    -73.804207,
    40.759192
],
  "geometry": {"coordinates":[[[-73.810014,40.757631],[-73.809905,40.758416],[-73.809799,40.759192],[-73.80886700000001,40.759115],[-73.80794,40.759043],[-73.807006,40.758968],[-73.806073,40.758895],[-73.805138,40.758822],[-73.80420700000001,40.758747],[-73.804528,40.756399],[-73.805458,40.756472],[-73.806394,40.756545],[-73.807322,40.756621],[-73.808257,40.756692],[-73.80918699999999,40.756767],[-73.810123,40.756839],[-73.810014,40.757631]]],"type":"Polygon"}
}