{
  "id": "360470545002",
  "type": "Feature",
  "properties": {
    "area_land":26009,
    "area_water":0,
    "geoid":"360470545002",
    "name":"Block Group 2",
    "state":"ny"
},
  "bbox": [
    -73.968389,
    40.704256,
    -73.966325,
    40.707002
],
  "geometry": {"coordinates":[[[-73.968389,40.706829],[-73.96728899999999,40.707002],[-73.96702000000001,40.706284],[-73.96672700000001,40.705523],[-73.966325,40.70483],[-73.96720999999999,40.704256],[-73.96761600000001,40.704961],[-73.967951,40.705731],[-73.968389,40.706829]]],"type":"Polygon"}
}