{
  "id": "360894928002",
  "type": "Feature",
  "properties": {
    "area_land":65053584,
    "area_water":14271674,
    "geoid":"360894928002",
    "name":"Block Group 2",
    "state":"ny"
},
  "bbox": [
    -75.706707,
    44.438173,
    -75.546416,
    44.601714
],
  "geometry": {"coordinates":[[[-75.70670699999999,44.501199],[-75.705084,44.502426],[-75.704472,44.502905],[-75.702483,44.504425],[-75.702313,44.504554],[-75.702116,44.504705],[-75.701977,44.504811],[-75.701577,44.505108],[-75.700931,44.5056],[-75.699631,44.506542],[-75.69817500000001,44.507592],[-75.697233,44.508244],[-75.69443,44.510236],[-75.69360500000001,44.510835],[-75.692958,44.511346],[-75.691621,44.512447],[-75.690839,44.513119],[-75.690288,44.513629],[-75.690112,44.513779],[-75.689245,44.514504],[-75.687995,44.51549],[-75.68737,44.515963],[-75.68679,44.516413],[-75.68569100000001,44.517268],[-75.683543,44.518896],[-75.683018,44.519271],[-75.68243200000001,44.519647],[-75.680969,44.520649],[-75.679703,44.521614],[-75.67912099999999,44.522074],[-75.67652,44.524085],[-75.672769,44.526998],[-75.672326,44.527288],[-75.672138,44.527407],[-75.67201900000001,44.527473],[-75.67011100000001,44.528526],[-75.669561,44.528819],[-75.669105,44.529002],[-75.668819,44.529081],[-75.667103,44.529397],[-75.66411600000001,44.529988],[-75.66381,44.530014],[-75.663017,44.530068],[-75.662947,44.531168],[-75.662941,44.531403],[-75.66293,44.531588],[-75.66278,44.533999],[-75.662766,44.53439],[-75.66180199999999,44.53435],[-75.656896,44.53411],[-75.65642699999999,44.534111],[-75.656013,44.534138],[-75.65553199999999,44.534208],[-75.655276,44.534263],[-75.65303400000001,44.534994],[-75.64970099999999,44.536104],[-75.649593,44.536146],[-75.64937999999999,44.536227],[-75.649131,44.536345],[-75.64878,44.536552],[-75.64844100000001,44.536817],[-75.64827,44.53698],[-75.647464,44.537953],[-75.646692,44.538923],[-75.641772,44.545184],[-75.641718,44.545248],[-75.641413,44.545579],[-75.64121799999999,44.545752],[-75.64105000000001,44.545878],[-75.63924900000001,44.547048],[-75.638687,44.547391],[-75.63831399999999,44.547591],[-75.63776799999999,44.547823],[-75.635107,44.548857],[-75.63284899999999,44.54977],[-75.63211800000001,44.550056],[-75.631412,44.550351],[-75.630696,44.550636],[-75.629271,44.551208],[-75.62857,44.551507],[-75.6281,44.551756],[-75.62598,44.553133],[-75.624863,44.553872],[-75.621522,44.556064],[-75.621123,44.556375],[-75.620161,44.557165],[-75.61964399999999,44.557602],[-75.618548,44.558561],[-75.617982,44.559036],[-75.617454,44.559495],[-75.61629499999999,44.560456],[-75.61591,44.56087],[-75.615447,44.561389],[-75.615036,44.561876],[-75.61424100000001,44.562911],[-75.614046,44.563144],[-75.613893,44.56328],[-75.613697,44.563416],[-75.613575,44.563487],[-75.61339599999999,44.563573],[-75.612459,44.563955],[-75.61279399999999,44.564343],[-75.61414499999999,44.56597],[-75.61430300000001,44.566217],[-75.61436,44.566339],[-75.614389,44.566464],[-75.614391,44.566555],[-75.614363,44.56672],[-75.61423000000001,44.567065],[-75.61405499999999,44.567429],[-75.61394,44.567606],[-75.61380200000001,44.567754],[-75.613603,44.567899],[-75.613305,44.568068],[-75.611037,44.569097],[-75.610325,44.569431],[-75.60995800000001,44.569615],[-75.60981700000001,44.569711],[-75.609707,44.569829],[-75.609627,44.569951],[-75.60959699999999,44.570106],[-75.609613,44.570233],[-75.609736,44.570475],[-75.609861,44.570644],[-75.61174099999999,44.572843],[-75.61217600000001,44.57334],[-75.61300799999999,44.57432],[-75.613221,44.574556],[-75.61181000000001,44.575224],[-75.609532,44.576288],[-75.60877600000001,44.576633],[-75.606782,44.577563],[-75.605619,44.578092],[-75.605386,44.578206],[-75.60513400000001,44.578361],[-75.604966,44.578524],[-75.604885,44.578615],[-75.60458300000001,44.579046],[-75.604007,44.57993],[-75.603077,44.58141],[-75.602834,44.581787],[-75.599535,44.586791],[-75.599208,44.587273],[-75.598904,44.587753],[-75.598203,44.588718],[-75.59755800000001,44.589681],[-75.59688199999999,44.590647],[-75.596529,44.591131],[-75.596199,44.591619],[-75.595169,44.593088],[-75.593818,44.595042],[-75.592544,44.596786],[-75.592377,44.59701],[-75.591179,44.598511],[-75.590425,44.599431],[-75.58931200000001,44.600891],[-75.588779,44.601604],[-75.588694,44.601714],[-75.583344,44.595664],[-75.578986,44.590737],[-75.570735,44.581422],[-75.565938,44.576248],[-75.55875,44.567794],[-75.556848,44.565421],[-75.554919,44.563045],[-75.549922,44.557118],[-75.549105,44.556187],[-75.548891,44.555916],[-75.548884,44.555907],[-75.548385,44.555285],[-75.54641599999999,44.552965],[-75.547623,44.552318],[-75.56015499999999,44.543688],[-75.5703,44.536052],[-75.58343499999999,44.52623],[-75.586794,44.523509],[-75.586634,44.523218],[-75.58831499999999,44.521951],[-75.589107,44.521291],[-75.589338,44.521077],[-75.589618,44.520879],[-75.59038,44.520263],[-75.591137,44.519823],[-75.59196900000001,44.519026],[-75.591971,44.518747],[-75.591903,44.518676],[-75.592544,44.518668],[-75.601647,44.509668],[-75.60633,44.503877],[-75.60689000000001,44.503184],[-75.607761,44.500977],[-75.608324,44.50006],[-75.609055,44.499674],[-75.610133,44.498946],[-75.611507,44.497879],[-75.61241699999999,44.497201],[-75.61339099999999,44.496289],[-75.613601,44.496142],[-75.614609,44.495278],[-75.61608,44.493942],[-75.61712799999999,44.492648],[-75.61798400000001,44.491364],[-75.618707,44.490171],[-75.619491,44.488644],[-75.620017,44.487718],[-75.62052,44.486897],[-75.620771,44.486305],[-75.620986,44.48572],[-75.621235,44.484933],[-75.621611,44.483813],[-75.621724,44.483067],[-75.621837,44.482427],[-75.621863,44.481836],[-75.621871,44.481593],[-75.622017,44.480854],[-75.622182,44.479841],[-75.62237,44.478859],[-75.622405,44.478163],[-75.622461,44.477344],[-75.622519,44.476656],[-75.62250400000001,44.47565],[-75.622472,44.475075],[-75.62237399999999,44.474419],[-75.622243,44.473958],[-75.62204199999999,44.473221],[-75.621735,44.472584],[-75.62176100000001,44.472509],[-75.621748,44.472386],[-75.62161399999999,44.472243],[-75.621489,44.472083],[-75.62129899999999,44.471793],[-75.62092800000001,44.471457],[-75.620468,44.471016],[-75.620187,44.470656],[-75.619951,44.470255],[-75.61986,44.470046],[-75.619703,44.469662],[-75.619433,44.469091],[-75.619264,44.468633],[-75.618939,44.468064],[-75.618849,44.467679],[-75.618781,44.467477],[-75.618691,44.466995],[-75.618635,44.46665],[-75.618511,44.466272],[-75.618229,44.465605],[-75.618105,44.465028],[-75.618026,44.464352],[-75.617677,44.463501],[-75.617474,44.462625],[-75.617272,44.461863],[-75.617035,44.460988],[-75.616877,44.460224],[-75.616831,44.45954],[-75.616697,44.45872],[-75.616527,44.457619],[-75.61644800000001,44.456533],[-75.61640199999999,44.456229],[-75.616704,44.455358],[-75.616916,44.454248],[-75.61712900000001,44.453089],[-75.617553,44.4518],[-75.617593,44.451679],[-75.61796699999999,44.450576],[-75.61840599999999,44.449939],[-75.619011,44.448963],[-75.620346,44.447279],[-75.620738,44.446682],[-75.621568,44.445803],[-75.622163,44.445151],[-75.622747,44.444481],[-75.623487,44.443578],[-75.623834,44.443046],[-75.623856,44.442958],[-75.62464799999999,44.442337],[-75.626931,44.439773],[-75.628394,44.438173],[-75.629559,44.439315],[-75.62977600000001,44.439558],[-75.63555700000001,44.445526],[-75.64331,44.45358],[-75.64682000000001,44.457238],[-75.65762100000001,44.468499],[-75.659065,44.470169],[-75.659932,44.471178],[-75.673008,44.48742],[-75.673074,44.487332],[-75.673455,44.487826],[-75.67358,44.487935],[-75.67398300000001,44.488375],[-75.67453999999999,44.489037],[-75.676078,44.490806],[-75.677756,44.492764],[-75.678168,44.493267],[-75.679017,44.494239],[-75.680297,44.495724],[-75.681605,44.497168],[-75.68183399999999,44.497416],[-75.68204299999999,44.497643],[-75.68292,44.498641],[-75.68348,44.499278],[-75.684139,44.500054],[-75.684956,44.500966],[-75.68620900000001,44.502355],[-75.686882,44.503069],[-75.687563,44.503814],[-75.688303,44.504666],[-75.68844,44.504796],[-75.688565,44.504899],[-75.688766,44.505037],[-75.68913000000001,44.505244],[-75.689364,44.505354],[-75.68986,44.505556],[-75.690113,44.505116],[-75.690124,44.505076],[-75.69013099999999,44.504904],[-75.690102,44.504806],[-75.68999599999999,44.504675],[-75.689949,44.50458],[-75.689865,44.504154],[-75.689832,44.504063],[-75.689763,44.503983],[-75.68950700000001,44.503852],[-75.68940499999999,44.503788],[-75.689331,44.503722],[-75.689303,44.503652],[-75.689289,44.503546],[-75.689324,44.503459],[-75.68942300000001,44.503395],[-75.68951,44.503378],[-75.690009,44.503423],[-75.690192,44.503431],[-75.69028,44.503416],[-75.690336,44.50339],[-75.690378,44.503355],[-75.690417,44.503302],[-75.69042399999999,44.503264],[-75.690406,44.503141],[-75.690361,44.503074],[-75.69023799999999,44.502951],[-75.69018800000001,44.502888],[-75.690157,44.502765],[-75.690174,44.502674],[-75.69032900000001,44.502537],[-75.690382,44.502453],[-75.690392,44.502323],[-75.690343,44.502162],[-75.690347,44.502113],[-75.690364,44.502077],[-75.69042399999999,44.502046],[-75.690494,44.502035],[-75.690628,44.50206],[-75.690828,44.50212],[-75.690877,44.502121],[-75.690944,44.502107],[-75.69098200000001,44.502061],[-75.690989,44.501991],[-75.69095799999999,44.501928],[-75.690895,44.501872],[-75.690747,44.501788],[-75.690399,44.501546],[-75.690242,44.501421],[-75.690174,44.501342],[-75.690133,44.501267],[-75.69012499999999,44.501155],[-75.690175,44.500958],[-75.69024,44.500822],[-75.690326,44.500741],[-75.690363,44.500728],[-75.69050300000001,44.500705],[-75.69058200000001,44.500671],[-75.69061600000001,44.500624],[-75.690613,44.500554],[-75.69059,44.50051],[-75.69036,44.500371],[-75.690324,44.500317],[-75.690321,44.500239],[-75.69049,44.499998],[-75.690549,44.49986],[-75.69058200000001,44.49974],[-75.69061600000001,44.499279],[-75.690656,44.499166],[-75.69072199999999,44.499099],[-75.69079600000001,44.499072],[-75.691118,44.499083],[-75.691318,44.499076],[-75.69143200000001,44.499029],[-75.691472,44.498989],[-75.691492,44.498936],[-75.691492,44.498882],[-75.69146499999999,44.498816],[-75.691405,44.498742],[-75.69133100000001,44.498702],[-75.690817,44.498562],[-75.690703,44.498495],[-75.69067699999999,44.498442],[-75.690697,44.498328],[-75.690777,44.498188],[-75.691151,44.497795],[-75.691365,44.497628],[-75.691732,44.497434],[-75.691772,44.497374],[-75.69179200000001,44.497261],[-75.691779,44.497154],[-75.691712,44.49695],[-75.691666,44.49687],[-75.691619,44.496836],[-75.691151,44.496636],[-75.690877,44.496469],[-75.690764,44.496349],[-75.690744,44.496276],[-75.69074999999999,44.496169],[-75.690837,44.496062],[-75.69096399999999,44.495969],[-75.692515,44.495324],[-75.69292799999999,44.495069],[-75.69301299999999,44.495008],[-75.693037,44.494911],[-75.692989,44.494814],[-75.692612,44.494401],[-75.692515,44.494256],[-75.692527,44.494134],[-75.692624,44.494049],[-75.69279400000001,44.493964],[-75.69324400000001,44.493916],[-75.693457,44.493852],[-75.693487,44.493843],[-75.693827,44.493624],[-75.693888,44.493551],[-75.69391299999999,44.493503],[-75.693896,44.493433],[-75.69389,44.493407],[-75.693864,44.493345],[-75.693815,44.493284],[-75.69309800000001,44.492847],[-75.693001,44.492762],[-75.69295200000001,44.492568],[-75.692965,44.492373],[-75.69302500000001,44.492215],[-75.693186,44.49203],[-75.693353,44.491839],[-75.693499,44.491718],[-75.693684,44.491639],[-75.69381799999999,44.491651],[-75.694912,44.491955],[-75.695775,44.492125],[-75.69611500000001,44.492125],[-75.696297,44.492052],[-75.69640699999999,44.491943],[-75.69647999999999,44.491785],[-75.696613,44.491032],[-75.696724,44.49073],[-75.705676,44.500131],[-75.70670699999999,44.501199]]],"type":"Polygon"}
}