{
  "id": "360050051001",
  "type": "Feature",
  "properties": {
    "area_land":276223,
    "area_water":0,
    "geoid":"360050051001",
    "name":"Block Group 1",
    "state":"ny"
},
  "bbox": [
    -73.93263,
    40.807876,
    -73.925185,
    40.81856
],
  "geometry": {"coordinates":[[[-73.93263,40.810606],[-73.932605,40.811517],[-73.932602,40.811988],[-73.93249299999999,40.812884],[-73.93242499999999,40.813566],[-73.932417,40.814025],[-73.93241,40.81406],[-73.932401,40.814151],[-73.932158,40.814154],[-73.931353,40.813833],[-73.93127200000001,40.813707],[-73.93116000000001,40.813652],[-73.93102,40.813579],[-73.93057,40.813373],[-73.93027600000001,40.813256],[-73.92885699999999,40.81488],[-73.928218,40.816535],[-73.927313,40.81856],[-73.92635799999999,40.818321],[-73.925794,40.818173],[-73.92538500000001,40.818066],[-73.925185,40.818013],[-73.92622,40.816759],[-73.926444,40.816458],[-73.926627,40.816119],[-73.92742200000001,40.815046],[-73.92818,40.813959],[-73.929192,40.81252],[-73.92894800000001,40.812338],[-73.92854199999999,40.812038],[-73.92812499999999,40.811725],[-73.92734799999999,40.811124],[-73.927288,40.811078],[-73.927121,40.810949],[-73.927673,40.810235],[-73.927773,40.810108],[-73.928135,40.809622],[-73.92880599999999,40.809899],[-73.929219,40.809564],[-73.929332,40.809471],[-73.92944,40.809384],[-73.92952200000001,40.809322],[-73.930108,40.808877],[-73.930938,40.808253],[-73.93180099999999,40.807876],[-73.931825,40.807902],[-73.932112,40.808182],[-73.932346,40.808586],[-73.93247700000001,40.808864],[-73.93257,40.809256],[-73.932586,40.809676],[-73.932615,40.810015],[-73.93263,40.810606]]],"type":"Polygon"}
}