{
  "id": "360470854002",
  "type": "Feature",
  "properties": {
    "area_land":82473,
    "area_water":0,
    "geoid":"360470854002",
    "name":"Block Group 2",
    "state":"ny"
},
  "bbox": [
    -73.945988,
    40.643424,
    -73.937284,
    40.644905
],
  "geometry": {"coordinates":[[[-73.945988,40.644534],[-73.945016,40.644568],[-73.944079,40.644594],[-73.943107,40.644637],[-73.94260800000001,40.644662],[-73.942137,40.644683],[-73.94119999999999,40.64472],[-73.940268,40.644768],[-73.939329,40.644815],[-73.93836,40.644857],[-73.937383,40.644905],[-73.93728400000001,40.643958],[-73.938255,40.643896],[-73.93922600000001,40.643838],[-73.94015899999999,40.64378],[-73.941092,40.64372],[-73.94202900000001,40.643664],[-73.94299599999999,40.643604],[-73.94396500000001,40.643543],[-73.944901,40.643484],[-73.945869,40.643424],[-73.945988,40.644534]]],"type":"Polygon"}
}