{
  "id": "360470112001",
  "type": "Feature",
  "properties": {
    "area_land":68744,
    "area_water":0,
    "geoid":"360470112001",
    "name":"Block Group 1",
    "state":"ny"
},
  "bbox": [
    -73.996844,
    40.6406,
    -73.991929,
    40.644827
],
  "geometry": {"coordinates":[[[-73.99626600000001,40.644827],[-73.994241,40.643603],[-73.994077,40.643503],[-73.991929,40.642205],[-73.992644,40.641728],[-73.993363,40.641248],[-73.994077,40.64077],[-73.994331,40.6406],[-73.99431,40.640914],[-73.995812,40.641816],[-73.99522899999999,40.642375],[-73.99464,40.642939],[-73.996844,40.644266],[-73.99626600000001,40.644827]]],"type":"Polygon"}
}