{
  "id": "361031461021",
  "type": "Feature",
  "properties": {
    "area_land":865619,
    "area_water":0,
    "geoid":"361031461021",
    "name":"Block Group 1",
    "state":"ny"
},
  "bbox": [
    -73.246204,
    40.752089,
    -73.228101,
    40.763162
],
  "geometry": {"coordinates":[[[-73.24620400000001,40.763162],[-73.24480800000001,40.762569],[-73.243156,40.761858],[-73.242608,40.76165],[-73.241822,40.761366],[-73.24115999999999,40.761122],[-73.240375,40.760786],[-73.240058,40.760668],[-73.238846,40.760148],[-73.238692,40.76009],[-73.237933,40.759766],[-73.237407,40.759529],[-73.23718100000001,40.759419],[-73.23650000000001,40.759134],[-73.23627,40.759029],[-73.23554300000001,40.758739],[-73.234734,40.758409],[-73.23454099999999,40.758323],[-73.23429,40.75822],[-73.233366,40.757837],[-73.232105,40.757325],[-73.23129900000001,40.756985],[-73.23079,40.756787],[-73.230206,40.756559],[-73.22972300000001,40.75641],[-73.229547,40.756282],[-73.22946399999999,40.756224],[-73.22931,40.756108],[-73.228977,40.755769],[-73.22883400000001,40.755587],[-73.228101,40.754762],[-73.231865,40.754599],[-73.232848,40.754521],[-73.23521700000001,40.75425],[-73.235873,40.75415],[-73.238559,40.753596],[-73.239914,40.753226],[-73.241248,40.752831],[-73.242592,40.752399],[-73.24348000000001,40.752089],[-73.243788,40.752956],[-73.243882,40.753272],[-73.24408200000001,40.753912],[-73.244147,40.754077],[-73.244266,40.754395],[-73.244432,40.754876],[-73.24470700000001,40.755667],[-73.24476199999999,40.75585],[-73.244986,40.756462],[-73.245103,40.756816],[-73.24527,40.757258],[-73.24534,40.757476],[-73.24544,40.758066],[-73.245559,40.758889],[-73.245687,40.759709],[-73.245816,40.760537],[-73.245935,40.761354],[-73.246066,40.762173],[-73.246191,40.762997],[-73.24620400000001,40.763162]]],"type":"Polygon"}
}