{
  "id": "360550101005",
  "type": "Feature",
  "properties": {
    "area_land":344947,
    "area_water":316500,
    "geoid":"360550101005",
    "name":"Block Group 5",
    "state":"ny"
},
  "bbox": [
    -77.606791,
    43.247233,
    -77.588313,
    43.258592
],
  "geometry": {"coordinates":[[[-77.606745,43.253109],[-77.60669300000001,43.25321],[-77.60663599999999,43.253321],[-77.60659,43.25338],[-77.606543,43.253438],[-77.606512,43.253477],[-77.605985,43.254129],[-77.605147,43.253933],[-77.60491500000001,43.253877],[-77.60430100000001,43.253731],[-77.604206,43.253859],[-77.603916,43.25425],[-77.603798,43.254409],[-77.603674,43.254781],[-77.60366399999999,43.254808],[-77.603559,43.255089],[-77.60352,43.2552],[-77.603498,43.255262],[-77.603426,43.255543],[-77.60341699999999,43.255577],[-77.60203799999999,43.257084],[-77.600149,43.258592],[-77.588313,43.252496],[-77.590045,43.250685],[-77.590175,43.250705],[-77.59036399999999,43.250899],[-77.590658,43.251275],[-77.590811,43.251423],[-77.59098,43.25149],[-77.59107400000001,43.251496],[-77.59145100000001,43.251619],[-77.592254,43.251801],[-77.593182,43.252113],[-77.594106,43.252421],[-77.595108,43.252821],[-77.59607,43.253078],[-77.597024,43.252962],[-77.59698899999999,43.252679],[-77.596962,43.252639],[-77.59695499999999,43.252586],[-77.596881,43.250187],[-77.59685399999999,43.249477],[-77.596818,43.248517],[-77.596811,43.248361],[-77.596763,43.247262],[-77.59708999999999,43.247233],[-77.59710800000001,43.24739],[-77.59727100000001,43.248268],[-77.597323,43.248549],[-77.59762000000001,43.249828],[-77.606791,43.252996],[-77.606745,43.253109]]],"type":"Polygon"}
}