{
  "id": "360811093001",
  "type": "Feature",
  "properties": {
    "area_land":253594,
    "area_water":0,
    "geoid":"360811093001",
    "name":"Block Group 1",
    "state":"ny"
},
  "bbox": [
    -73.784593,
    40.771361,
    -73.778444,
    40.777664
],
  "geometry": {"coordinates":[[[-73.784593,40.776141],[-73.784414,40.776192],[-73.784076,40.776289],[-73.782798,40.776666],[-73.780362,40.777387],[-73.779477,40.777664],[-73.77910900000001,40.775961],[-73.77875299999999,40.774343],[-73.77844399999999,40.772895],[-73.778858,40.772799],[-73.78056100000001,40.772301],[-73.78231100000001,40.771783],[-73.78322199999999,40.771511],[-73.78355500000001,40.771411],[-73.783727,40.771361],[-73.78389,40.771731],[-73.784009,40.772004],[-73.78413399999999,40.77237],[-73.784199,40.772602],[-73.784329,40.773138],[-73.784378,40.773342],[-73.784418,40.773553],[-73.784481,40.773951],[-73.78452799999999,40.774409],[-73.78453399999999,40.774575],[-73.784537,40.774657],[-73.78455599999999,40.775231],[-73.784593,40.776141]]],"type":"Polygon"}
}