{
  "id": "360610160014",
  "type": "Feature",
  "properties": {
    "area_land":25699,
    "area_water":0,
    "geoid":"360610160014",
    "name":"Block Group 4",
    "state":"ny"
},
  "bbox": [
    -73.956718,
    40.785925,
    -73.954163,
    40.787914
],
  "geometry": {"coordinates":[[[-73.956262,40.787223],[-73.955778,40.787914],[-73.95416299999999,40.787227],[-73.954656,40.786552],[-73.95511399999999,40.785925],[-73.956718,40.786601],[-73.956262,40.787223]]],"type":"Polygon"}
}