{
  "id": "360050332011",
  "type": "Feature",
  "properties": {
    "area_land":36991,
    "area_water":0,
    "geoid":"360050332011",
    "name":"Block Group 1",
    "state":"ny"
},
  "bbox": [
    -73.871083,
    40.857266,
    -73.867588,
    40.858989
],
  "geometry": {"coordinates":[[[-73.871083,40.857377],[-73.871033,40.857808],[-73.870977,40.858197],[-73.870884,40.858895],[-73.869516,40.858869],[-73.868576,40.858828],[-73.867835,40.85852],[-73.86759499999999,40.858989],[-73.867588,40.85783],[-73.86838299999999,40.857812],[-73.868613,40.85777],[-73.86954900000001,40.857726],[-73.87084900000001,40.857291],[-73.870898,40.85727],[-73.870952,40.857266],[-73.870997,40.857275],[-73.871036,40.857294],[-73.87107,40.857328],[-73.871081,40.857359],[-73.871083,40.857377]]],"type":"Polygon"}
}