{
  "id": "360471522002",
  "type": "Feature",
  "properties": {
    "area_land":74999,
    "area_water":0,
    "geoid":"360471522002",
    "name":"Block Group 2",
    "state":"ny"
},
  "bbox": [
    -73.969484,
    40.639256,
    -73.966174,
    40.644099
],
  "geometry": {"coordinates":[[[-73.96948399999999,40.64169],[-73.968328,40.641819],[-73.967401,40.64192],[-73.967793,40.643998],[-73.96686699999999,40.644099],[-73.96682300000001,40.643869],[-73.966306,40.641134],[-73.966174,40.640431],[-73.967044,40.64004],[-73.967917,40.63965],[-73.968791,40.639256],[-73.968914,40.639757],[-73.969399,40.641383],[-73.96948399999999,40.64169]]],"type":"Polygon"}
}