{
  "id": "360470134003",
  "type": "Feature",
  "properties": {
    "area_land":82214,
    "area_water":0,
    "geoid":"360470134003",
    "name":"Block Group 3",
    "state":"ny"
},
  "bbox": [
    -74.022959,
    40.626296,
    -74.018639,
    40.630988
],
  "geometry": {"coordinates":[[[-74.022638,40.629486],[-74.022296,40.630323],[-74.022024,40.630988],[-74.01955,40.629855],[-74.01966,40.629576],[-74.019829,40.629168],[-74.019958,40.628838],[-74.02027699999999,40.628062],[-74.01863899999999,40.627071],[-74.018961,40.626296],[-74.0206,40.627277],[-74.022959,40.628701],[-74.022638,40.629486]]],"type":"Polygon"}
}