{
  "id": "361031246024",
  "type": "Feature",
  "properties": {
    "area_land":439214,
    "area_water":0,
    "geoid":"361031246024",
    "name":"Block Group 4",
    "state":"ny"
},
  "bbox": [
    -73.323161,
    40.696593,
    -73.313045,
    40.704597
],
  "geometry": {"coordinates":[[[-73.323094,40.696705],[-73.32306,40.697211],[-73.322768,40.698634],[-73.32262799999999,40.699294],[-73.32252,40.699844],[-73.32244300000001,40.700194],[-73.32238599999999,40.700461],[-73.322247,40.701217],[-73.321392,40.701528],[-73.32055200000001,40.701834],[-73.320125,40.701989],[-73.32003899999999,40.702021],[-73.319952,40.702052],[-73.319554,40.702198],[-73.314864,40.704301],[-73.314161,40.704597],[-73.31393199999999,40.704528],[-73.313667,40.704448],[-73.313624,40.70411],[-73.31319000000001,40.703016],[-73.313045,40.70206],[-73.314414,40.70047],[-73.31491,40.699508],[-73.31571099999999,40.698651],[-73.316794,40.69725],[-73.316891,40.697135],[-73.317035,40.697003],[-73.317356,40.697035],[-73.31769,40.697081],[-73.31788400000001,40.697027],[-73.319204,40.697132],[-73.31954899999999,40.697095],[-73.319588,40.697074],[-73.320072,40.697039],[-73.320266,40.697048],[-73.32116499999999,40.696985],[-73.323161,40.696593],[-73.323094,40.696705]]],"type":"Polygon"}
}