{
  "id": "361031120011",
  "type": "Feature",
  "properties": {
    "area_land":1059540,
    "area_water":0,
    "geoid":"361031120011",
    "name":"Block Group 1",
    "state":"ny"
},
  "bbox": [
    -73.422211,
    40.814673,
    -73.41014,
    40.828677
],
  "geometry": {"coordinates":[[[-73.422211,40.823986],[-73.42212000000001,40.82418],[-73.421983,40.824298],[-73.421333,40.824744],[-73.42119599999999,40.824851],[-73.42109000000001,40.824962],[-73.42100600000001,40.825081],[-73.420967,40.825203],[-73.420967,40.825728],[-73.421052,40.827667],[-73.42109000000001,40.828677],[-73.420013,40.828655],[-73.41785400000001,40.828621],[-73.41693100000001,40.828597],[-73.41602399999999,40.828583],[-73.415161,40.828559],[-73.411518,40.828423],[-73.41171900000001,40.827732],[-73.41189300000001,40.827056],[-73.412091,40.826383],[-73.412273,40.825685],[-73.41241100000001,40.825141],[-73.41248400000001,40.824764],[-73.41228700000001,40.824735],[-73.412307,40.824604],[-73.412342,40.824196],[-73.412341,40.823403],[-73.412256,40.822351],[-73.412193,40.821692],[-73.412127,40.821214],[-73.412074,40.820945],[-73.411995,40.820551],[-73.41195399999999,40.820347],[-73.411759,40.819633],[-73.41175200000001,40.819609],[-73.410982,40.817249],[-73.410963,40.81719],[-73.410617,40.816309],[-73.410293,40.815263],[-73.410229,40.815054],[-73.41014,40.814673],[-73.410371,40.814808],[-73.41049599999999,40.814881],[-73.410865,40.815013],[-73.41181899999999,40.815497],[-73.41230899999999,40.816749],[-73.413223,40.816607],[-73.414475,40.816425],[-73.415587,40.816253],[-73.417244,40.816017],[-73.417518,40.816028],[-73.41776299999999,40.816078],[-73.418792,40.816406],[-73.419151,40.816673],[-73.419411,40.81707],[-73.419526,40.81752],[-73.41970000000001,40.817917],[-73.420159,40.818497],[-73.420327,40.818722],[-73.42038100000001,40.818878],[-73.420419,40.819103],[-73.420464,40.819279],[-73.420883,40.819668],[-73.421143,40.819861],[-73.42134799999999,40.820201],[-73.42139299999999,40.820373],[-73.421464,40.820598],[-73.42150100000001,40.820815],[-73.42151699999999,40.821003],[-73.421516,40.821159],[-73.421502,40.821392],[-73.421516,40.821598],[-73.421539,40.821742],[-73.421616,40.821979],[-73.4217,40.822197],[-73.421746,40.82241],[-73.421814,40.822552],[-73.421768,40.822716],[-73.4217,40.82291],[-73.42167000000001,40.823074],[-73.421662,40.823215],[-73.4217,40.823337],[-73.421798,40.823448],[-73.42203499999999,40.82368],[-73.422134,40.823822],[-73.422211,40.823986]]],"type":"Polygon"}
}