{
  "id": "361090010001",
  "type": "Feature",
  "properties": {
    "area_land":27563406,
    "area_water":123994,
    "geoid":"361090010001",
    "name":"Block Group 1",
    "state":"ny"
},
  "bbox": [
    -76.603858,
    42.38242,
    -76.514173,
    42.441064
],
  "geometry": {"coordinates":[[[-76.60359800000001,42.400462],[-76.602958,42.400484],[-76.602638,42.400489],[-76.602316,42.400502],[-76.60153800000001,42.400524],[-76.599799,42.400573],[-76.599552,42.400586],[-76.596166,42.400682],[-76.595455,42.400702],[-76.595045,42.400703],[-76.59471600000001,42.400712],[-76.594223,42.400719],[-76.593813,42.400733],[-76.59358,42.400747],[-76.59332499999999,42.400763],[-76.593245,42.400759],[-76.59308299999999,42.400766],[-76.593007,42.400776],[-76.59293599999999,42.400795],[-76.59286899999999,42.400823],[-76.592803,42.400856],[-76.59275,42.400897],[-76.59271200000001,42.400951],[-76.592663,42.401069],[-76.592596,42.401277],[-76.59251999999999,42.401445],[-76.592445,42.401568],[-76.592401,42.401622],[-76.592347,42.401672],[-76.592286,42.401718],[-76.59221599999999,42.40176],[-76.59206,42.401834],[-76.591809,42.401928],[-76.591758,42.401964],[-76.591713,42.40201],[-76.591893,42.402052],[-76.59213,42.402117],[-76.592247,42.402156],[-76.592364,42.40219],[-76.592589,42.402272],[-76.592856,42.40239],[-76.593114,42.402517],[-76.59346600000001,42.402711],[-76.593975,42.403028],[-76.594393,42.403283],[-76.594886,42.403591],[-76.59513200000001,42.40375],[-76.595213,42.403798],[-76.595585,42.404045],[-76.59586,42.404204],[-76.596039,42.404314],[-76.596217,42.404433],[-76.59646100000001,42.404614],[-76.596683,42.4048],[-76.596818,42.404929],[-76.596901,42.405018],[-76.597055,42.4052],[-76.59736700000001,42.405628],[-76.597465,42.405771],[-76.597725,42.40618],[-76.59774,42.406203],[-76.59806,42.40669],[-76.598185,42.406855],[-76.598339,42.407015],[-76.59850400000001,42.407152],[-76.59859,42.407209],[-76.598871,42.407367],[-76.59908,42.407473],[-76.599132,42.407495],[-76.59965,42.407713],[-76.59996,42.40783],[-76.59960100000001,42.407799],[-76.59943,42.407792],[-76.599338,42.407784],[-76.599244,42.407781],[-76.598996,42.407762],[-76.598922,42.40775],[-76.598765,42.407732],[-76.598654,42.407719],[-76.598314,42.407659],[-76.59804699999999,42.407645],[-76.597776,42.407649],[-76.5977,42.407659],[-76.597621,42.407664],[-76.597219,42.407706],[-76.597133,42.407721],[-76.596962,42.407732],[-76.596874,42.407733],[-76.59676,42.407726],[-76.596645,42.407709],[-76.596598,42.407704],[-76.596386,42.407682],[-76.59623999999999,42.407661],[-76.59598699999999,42.407647],[-76.59588100000001,42.407648],[-76.59531699999999,42.407669],[-76.594645,42.407679],[-76.59448999999999,42.407676],[-76.594351,42.407669],[-76.594026,42.40766],[-76.59327,42.407626],[-76.593048,42.407611],[-76.5926,42.40759],[-76.592254,42.407581],[-76.59201,42.407585],[-76.591887,42.407582],[-76.591644,42.40759],[-76.591334,42.407612],[-76.59117999999999,42.407614],[-76.591099,42.407606],[-76.59102300000001,42.407598],[-76.590987,42.407594],[-76.59080899999999,42.407575],[-76.590649,42.407532],[-76.590479,42.407466],[-76.590396,42.407423],[-76.59012300000001,42.407296],[-76.58970100000001,42.407072],[-76.589448,42.406963],[-76.58915399999999,42.406845],[-76.589005,42.406793],[-76.588925,42.406772],[-76.588908,42.406997],[-76.58890599999999,42.407326],[-76.588892,42.407678],[-76.588866,42.407709],[-76.588847,42.407773],[-76.588857,42.40789],[-76.588962,42.408568],[-76.589018,42.40904],[-76.589037,42.409274],[-76.589038,42.409931],[-76.589083,42.41121],[-76.589167,42.412267],[-76.58920999999999,42.413302],[-76.589251,42.413589],[-76.58931,42.413886],[-76.589327,42.414039],[-76.58932,42.414178],[-76.589269,42.414282],[-76.589163,42.414428],[-76.589068,42.414605],[-76.589088,42.414816],[-76.589134,42.41496],[-76.58923,42.415134],[-76.58930599999999,42.415304],[-76.58934600000001,42.415439],[-76.589367,42.415564],[-76.589378,42.415884],[-76.589398,42.416136],[-76.58946,42.417558],[-76.589482,42.418508],[-76.58949699999999,42.418751],[-76.589541,42.419205],[-76.58957100000001,42.419691],[-76.589634,42.420933],[-76.58965600000001,42.421815],[-76.58966599999999,42.422044],[-76.589682,42.422224],[-76.58968400000001,42.422346],[-76.589657,42.422508],[-76.58946899999999,42.422515],[-76.58931200000001,42.422517],[-76.58901,42.422522],[-76.58665499999999,42.422581],[-76.58650799999999,42.422588],[-76.586376,42.42259],[-76.58585600000001,42.422606],[-76.585458,42.422625],[-76.585201,42.422633],[-76.584689,42.422658],[-76.584176,42.422688],[-76.58390900000001,42.422714],[-76.58356499999999,42.42275],[-76.583208,42.4228],[-76.582537,42.422881],[-76.582489,42.422887],[-76.582397,42.422892],[-76.582144,42.422896],[-76.58189900000001,42.422881],[-76.58172500000001,42.422861],[-76.581632,42.422844],[-76.581541,42.422832],[-76.581124,42.422761],[-76.580966,42.422746],[-76.58080699999999,42.422739],[-76.580726,42.422731],[-76.58049699999999,42.422725],[-76.580196,42.422729],[-76.579746,42.422744],[-76.57879699999999,42.42276],[-76.578363,42.422768],[-76.57811100000001,42.422771],[-76.576258,42.422819],[-76.575976,42.422824],[-76.575412,42.42284],[-76.57511100000001,42.422844],[-76.574804,42.422853],[-76.574507,42.422857],[-76.57324,42.422892],[-76.571668,42.422932],[-76.571163,42.422948],[-76.57065799999999,42.422959],[-76.570567,42.422963],[-76.570308,42.422973],[-76.56996599999999,42.422978],[-76.570003,42.42351],[-76.57000499999999,42.423536],[-76.570109,42.425966],[-76.570156,42.427212],[-76.57023599999999,42.428962],[-76.570263,42.429895],[-76.570356,42.431794],[-76.570436,42.433188],[-76.570533,42.435029],[-76.567583,42.435109],[-76.567172,42.435121],[-76.56642100000001,42.435143],[-76.566064,42.435153],[-76.564128,42.435206],[-76.56232199999999,42.435249],[-76.562248,42.435254],[-76.559287,42.435331],[-76.555876,42.435431],[-76.554507,42.435459],[-76.554433,42.435464],[-76.55415600000001,42.435472],[-76.55390800000001,42.435471],[-76.553833,42.435454],[-76.553748,42.43542],[-76.553658,42.435565],[-76.553607,42.435669],[-76.553568,42.435814],[-76.55347,42.436378],[-76.553408,42.436676],[-76.553358,42.436816],[-76.55333,42.436875],[-76.553296,42.43693],[-76.55319,42.437044],[-76.55309699999999,42.437108],[-76.55297,42.437182],[-76.552813,42.437242],[-76.552547,42.437313],[-76.55229,42.437358],[-76.552162,42.437373],[-76.551558,42.437399],[-76.551467,42.437409],[-76.55117300000001,42.437454],[-76.550696,42.437519],[-76.550448,42.43754],[-76.550343,42.437541],[-76.549948,42.437556],[-76.549745,42.437584],[-76.54969199999999,42.437591],[-76.549431,42.437608],[-76.549222,42.437539],[-76.54904500000001,42.437437],[-76.548906,42.437336],[-76.548663,42.437105],[-76.548597,42.437025],[-76.548359,42.436843],[-76.54826799999999,42.436786],[-76.548182,42.436738],[-76.548027,42.436672],[-76.54793600000001,42.436646],[-76.547777,42.436608],[-76.547624,42.436583],[-76.547202,42.436539],[-76.54701900000001,42.436542],[-76.546922,42.436552],[-76.546779,42.436585],[-76.545563,42.436935],[-76.54534,42.436983],[-76.545102,42.437013],[-76.545005,42.437019],[-76.544737,42.437023],[-76.542416,42.436905],[-76.542074,42.436865],[-76.541994,42.436848],[-76.54188000000001,42.436814],[-76.54179600000001,42.436783],[-76.541709,42.436744],[-76.541646,42.436709],[-76.541478,42.436598],[-76.541397,42.436532],[-76.54123,42.436377],[-76.54101900000001,42.436199],[-76.54081600000001,42.436049],[-76.540672,42.43597],[-76.54049999999999,42.435914],[-76.54041599999999,42.435901],[-76.54031500000001,42.435894],[-76.540085,42.435888],[-76.537503,42.435954],[-76.53641399999999,42.435987],[-76.53378499999999,42.436067],[-76.533541,42.43607],[-76.53270999999999,42.436099],[-76.532279,42.436105],[-76.530587,42.436146],[-76.529669,42.436162],[-76.529011,42.436181],[-76.528105,42.436206],[-76.52603499999999,42.436242],[-76.525616,42.436243],[-76.52521299999999,42.436267],[-76.524615,42.436275],[-76.523726,42.4363],[-76.523223,42.43632],[-76.52310799999999,42.436331],[-76.523005,42.436355],[-76.522921,42.436387],[-76.522571,42.436541],[-76.52222399999999,42.436703],[-76.52187600000001,42.43686],[-76.521356,42.437106],[-76.520087,42.43769],[-76.519386,42.438019],[-76.51884200000001,42.438265],[-76.518641,42.438362],[-76.518563,42.438399],[-76.518388,42.438496],[-76.51814400000001,42.438652],[-76.51795,42.438817],[-76.51791900000001,42.438858],[-76.51778400000001,42.439117],[-76.517622,42.439344],[-76.51708600000001,42.439891],[-76.516876,42.440083],[-76.516772,42.440166],[-76.51643900000001,42.440445],[-76.51601599999999,42.440779],[-76.515759,42.44099],[-76.515653,42.44104],[-76.515603,42.441055],[-76.51554400000001,42.441064],[-76.51548099999999,42.441056],[-76.515382,42.441022],[-76.515569,42.440852],[-76.51564399999999,42.440766],[-76.515748,42.44062],[-76.516181,42.439872],[-76.51652900000001,42.439273],[-76.51766499999999,42.437259],[-76.518125,42.436428],[-76.51822199999999,42.436267],[-76.51837,42.436033],[-76.51855999999999,42.435752],[-76.51989399999999,42.433951],[-76.520186,42.433573],[-76.52026499999999,42.433477],[-76.520369,42.433355],[-76.52052999999999,42.433177],[-76.52065399999999,42.433054],[-76.52078,42.432926],[-76.52100799999999,42.432707],[-76.52120600000001,42.432538],[-76.521648,42.432235],[-76.522409,42.431752],[-76.52257,42.431637],[-76.523854,42.430706],[-76.524413,42.430275],[-76.524778,42.42995],[-76.524906,42.429836],[-76.52496600000001,42.429786],[-76.52545499999999,42.429343],[-76.52616999999999,42.428689],[-76.52630000000001,42.428571],[-76.526573,42.428279],[-76.526748,42.428042],[-76.526892,42.427792],[-76.526967,42.427634],[-76.52703700000001,42.427468],[-76.52709,42.42728],[-76.527153,42.427037],[-76.52719500000001,42.426849],[-76.527216,42.42672],[-76.52724499999999,42.426599],[-76.52736,42.426124],[-76.52743599999999,42.425809],[-76.527559,42.425361],[-76.527618,42.425212],[-76.527829,42.42479],[-76.528187,42.424178],[-76.528403,42.423798],[-76.528796,42.423107],[-76.52906900000001,42.422599],[-76.529155,42.422439],[-76.529201,42.422353],[-76.529231,42.422297],[-76.529262,42.42224],[-76.529776,42.421304],[-76.529966,42.420941],[-76.530045,42.420724],[-76.530123,42.420426],[-76.530192,42.420068],[-76.530198,42.419959],[-76.530478,42.418406],[-76.53055000000001,42.418012],[-76.530829,42.416487],[-76.530877,42.416286],[-76.53094400000001,42.415939],[-76.53096499999999,42.415761],[-76.531008,42.415607],[-76.531074,42.415429],[-76.531148,42.415279],[-76.53125,42.415108],[-76.531442,42.414863],[-76.53148299999999,42.414798],[-76.531496,42.414728],[-76.531477,42.414655],[-76.531435,42.414583],[-76.531386,42.414481],[-76.530428,42.414889],[-76.53036299999999,42.414915],[-76.530248,42.414959],[-76.53017800000001,42.414986],[-76.530117,42.415015],[-76.53004900000001,42.415036],[-76.529562,42.415228],[-76.529488,42.415262],[-76.52749,42.416062],[-76.52700900000001,42.416268],[-76.52619199999999,42.416576],[-76.52503299999999,42.417062],[-76.524186,42.417399],[-76.524095,42.417376],[-76.52402499999999,42.417348],[-76.523979,42.417336],[-76.523927,42.417309],[-76.52390200000001,42.417307],[-76.523881,42.417294],[-76.523706,42.417249],[-76.52368300000001,42.417227],[-76.523653,42.417227],[-76.523574,42.417198],[-76.52349700000001,42.41718],[-76.52347399999999,42.41717],[-76.523273,42.417145],[-76.523219,42.417129],[-76.523122,42.417119],[-76.52310199999999,42.417106],[-76.52304700000001,42.4171],[-76.52292300000001,42.417066],[-76.522893,42.417048],[-76.52281499999999,42.417031],[-76.522792,42.41702],[-76.52265199999999,42.416979],[-76.522597,42.416968],[-76.522578,42.416953],[-76.52255100000001,42.416951],[-76.522532,42.416938],[-76.522481,42.416928],[-76.522458,42.41691],[-76.52243300000001,42.416907],[-76.52230299999999,42.416859],[-76.522218,42.416813],[-76.522187,42.416813],[-76.52216300000001,42.416795],[-76.522071,42.41676],[-76.521967,42.416706],[-76.52191000000001,42.416676],[-76.521873,42.416676],[-76.521873,42.416665],[-76.521518,42.416429],[-76.52148099999999,42.416379],[-76.521458,42.416363],[-76.521443,42.416363],[-76.520977,42.416236],[-76.520867,42.416172],[-76.520844,42.416165],[-76.520725,42.416055],[-76.520651,42.415995],[-76.520555,42.41594],[-76.52052500000001,42.41594],[-76.520481,42.415912],[-76.52045099999999,42.415912],[-76.52043399999999,42.415899],[-76.520377,42.415885],[-76.520355,42.415874],[-76.520259,42.415846],[-76.520236,42.415836],[-76.520185,42.41583],[-76.52010900000001,42.41578],[-76.520088,42.41577],[-76.519577,42.415358],[-76.519496,42.415298],[-76.519488,42.415281],[-76.519415,42.415209],[-76.519392,42.415144],[-76.519355,42.415105],[-76.519355,42.415061],[-76.519333,42.415045],[-76.519333,42.415023],[-76.519311,42.414995],[-76.519267,42.414886],[-76.519267,42.414847],[-76.519249,42.414834],[-76.51922999999999,42.414777],[-76.51922999999999,42.414759],[-76.51921400000001,42.414745],[-76.51920699999999,42.41471],[-76.519178,42.414639],[-76.519156,42.414622],[-76.519156,42.4146],[-76.519143,42.41458],[-76.51912,42.414557],[-76.519111,42.41454],[-76.519082,42.414507],[-76.519074,42.41449],[-76.518979,42.414398],[-76.518978,42.41438],[-76.51894900000001,42.414359],[-76.518941,42.414342],[-76.518868,42.414261],[-76.518867,42.414243],[-76.51882999999999,42.414194],[-76.51880800000001,42.414139],[-76.518601,42.413947],[-76.51852700000001,42.413866],[-76.51852599999999,42.413848],[-76.518489,42.41382],[-76.51849,42.413798],[-76.518467,42.413782],[-76.518462,42.413764],[-76.518424,42.413718],[-76.518423,42.4137],[-76.51838600000001,42.413672],[-76.51838600000001,42.41365],[-76.518371,42.413623],[-76.518337,42.413597],[-76.518334,42.413579],[-76.51828999999999,42.413524],[-76.518261,42.413503],[-76.51826,42.413485],[-76.518083,42.413311],[-76.51808200000001,42.413293],[-76.51801,42.413229],[-76.51800799999999,42.413211],[-76.51798599999999,42.413189],[-76.51796400000001,42.413134],[-76.517949,42.413118],[-76.51788999999999,42.412997],[-76.517875,42.41298],[-76.517853,42.412914],[-76.51781800000001,42.412878],[-76.517816,42.41286],[-76.517779,42.412821],[-76.517779,42.412794],[-76.517757,42.412777],[-76.517735,42.412695],[-76.517713,42.412678],[-76.517712,42.412656],[-76.517692,42.412644],[-76.517675,42.412624],[-76.51767599999999,42.412602],[-76.51764,42.412565],[-76.51763800000001,42.412547],[-76.51760299999999,42.41251],[-76.51759300000001,42.412474],[-76.517528,42.41242],[-76.517527,42.412398],[-76.51749100000001,42.412372],[-76.51749,42.412354],[-76.51746199999999,42.412318],[-76.517461,42.4123],[-76.51742400000001,42.412272],[-76.51742400000001,42.412249],[-76.517409,42.412234],[-76.517408,42.412216],[-76.517387,42.412195],[-76.517365,42.41214],[-76.517298,42.41208],[-76.51730499999999,42.412058],[-76.51725399999999,42.411998],[-76.51723200000001,42.411965],[-76.517195,42.411932],[-76.517157,42.411882],[-76.517009,42.411718],[-76.51692799999999,42.411536],[-76.51690600000001,42.411514],[-76.516884,42.41147],[-76.516713,42.411322],[-76.516676,42.411295],[-76.51657299999999,42.41124],[-76.516514,42.411218],[-76.516469,42.41119],[-76.51643900000001,42.41119],[-76.51636499999999,42.411152],[-76.516003,42.411048],[-76.51597599999999,42.411033],[-76.515951,42.411031],[-76.515877,42.410993],[-76.515788,42.410954],[-76.51574599999999,42.410929],[-76.515721,42.410927],[-76.515669,42.410899],[-76.515558,42.410872],[-76.515469,42.410855],[-76.51545,42.410836],[-76.51542499999999,42.410833],[-76.515406,42.410821],[-76.51532899999999,42.410795],[-76.515225,42.410767],[-76.51504300000001,42.41073],[-76.515018,42.410729],[-76.514751,42.410663],[-76.514662,42.410635],[-76.51451400000001,42.410542],[-76.514411,42.410466],[-76.514403,42.410449],[-76.51436699999999,42.410411],[-76.514359,42.410394],[-76.514264,42.410291],[-76.514262,42.410273],[-76.514233,42.410256],[-76.514225,42.410229],[-76.51419,42.410192],[-76.514188,42.410174],[-76.514173,42.410154],[-76.514297,42.41012],[-76.514465,42.410099],[-76.514551,42.410098],[-76.51471100000001,42.410114],[-76.515483,42.410293],[-76.51561100000001,42.410309],[-76.51576300000001,42.410303],[-76.515839,42.410288],[-76.51598,42.41025],[-76.516244,42.41013],[-76.51632499999999,42.410084],[-76.51644899999999,42.409996],[-76.516502,42.40995],[-76.51658399999999,42.409878],[-76.516679,42.409773],[-76.516733,42.409691],[-76.516783,42.409596],[-76.516938,42.409107],[-76.517019,42.40894],[-76.517122,42.408776],[-76.517248,42.408626],[-76.51736099999999,42.408517],[-76.517416,42.408457],[-76.517678,42.408197],[-76.51779000000001,42.408065],[-76.517858,42.407952],[-76.517911,42.407834],[-76.51794599999999,42.407716],[-76.518002,42.407324],[-76.518013,42.407038],[-76.518017,42.406935],[-76.518021,42.406842],[-76.51802499999999,42.40641],[-76.518038,42.405045],[-76.518047,42.404774],[-76.518056,42.404722],[-76.51809900000001,42.404477],[-76.51818400000001,42.404205],[-76.518356,42.403805],[-76.518519,42.403426],[-76.518649,42.403123],[-76.519358,42.401522],[-76.51996699999999,42.400147],[-76.521535,42.396574],[-76.52162199999999,42.396316],[-76.521699,42.395937],[-76.521905,42.39456],[-76.52190899999999,42.394439],[-76.522586,42.394421],[-76.52418900000001,42.394395],[-76.524683,42.394388],[-76.52620400000001,42.394368],[-76.53032,42.394295],[-76.53052099999999,42.394297],[-76.530832,42.394311],[-76.530905,42.394319],[-76.532455,42.394212],[-76.536185,42.393879],[-76.536219,42.392051],[-76.536243,42.390697],[-76.536253,42.390109],[-76.536278,42.388074],[-76.536411,42.384326],[-76.536439,42.38242],[-76.53664499999999,42.382463],[-76.53781600000001,42.38283],[-76.538127,42.382929],[-76.538568,42.383036],[-76.538704,42.38307],[-76.53945299999999,42.383285],[-76.539731,42.383385],[-76.540004,42.383512],[-76.540294,42.383684],[-76.54071500000001,42.383926],[-76.54114800000001,42.384199],[-76.54120899999999,42.384243],[-76.541256,42.384283],[-76.541314,42.384357],[-76.541359,42.384435],[-76.541616,42.385296],[-76.54167099999999,42.385408],[-76.541741,42.385515],[-76.54182400000001,42.385613],[-76.541948,42.385733],[-76.542067,42.385857],[-76.542224,42.386062],[-76.54235199999999,42.386281],[-76.54245899999999,42.386532],[-76.542542,42.386756],[-76.542575,42.386787],[-76.54262,42.386813],[-76.542672,42.386822],[-76.542727,42.386825],[-76.54277999999999,42.386811],[-76.54282499999999,42.386788],[-76.54341100000001,42.386348],[-76.544318,42.385723],[-76.544656,42.385457],[-76.544979,42.385138],[-76.545123,42.384988],[-76.54523399999999,42.384905],[-76.54633800000001,42.384125],[-76.546402,42.384074],[-76.546513,42.383973],[-76.546648,42.38385],[-76.54704700000001,42.38344],[-76.547225,42.383217],[-76.547259,42.383184],[-76.547304,42.383152],[-76.547354,42.383125],[-76.54746400000001,42.383078],[-76.547583,42.383054],[-76.547708,42.383048],[-76.547832,42.38306],[-76.547893,42.383072],[-76.54811599999999,42.383132],[-76.548585,42.383216],[-76.548721,42.383255],[-76.549131,42.383353],[-76.549205,42.383365],[-76.54927499999999,42.383382],[-76.54938900000001,42.383399],[-76.54958499999999,42.383401],[-76.549937,42.383391],[-76.55007999999999,42.383394],[-76.550162,42.383406],[-76.550242,42.383423],[-76.550319,42.383445],[-76.550528,42.383519],[-76.550794,42.383591],[-76.551343,42.383688],[-76.551599,42.383738],[-76.551841,42.383807],[-76.552003,42.383859],[-76.55229,42.383941],[-76.55262500000001,42.384003],[-76.552717,42.384013],[-76.552969,42.384039],[-76.55322700000001,42.384049],[-76.5538,42.384046],[-76.55389099999999,42.385324],[-76.553921,42.385754],[-76.553978,42.386439],[-76.553988,42.386492],[-76.554014,42.386938],[-76.553973,42.387412],[-76.55393599999999,42.387606],[-76.55389599999999,42.387761],[-76.554236,42.387782],[-76.55425,42.387822],[-76.554374,42.387942],[-76.554408,42.387987],[-76.55445,42.388058],[-76.554512,42.388193],[-76.554534,42.38826],[-76.554548,42.388327],[-76.554551,42.388395],[-76.55454400000001,42.388467],[-76.554528,42.38853],[-76.554503,42.388598],[-76.554445,42.388693],[-76.55417300000001,42.38908],[-76.554132,42.389157],[-76.554113,42.389211],[-76.554098,42.38931],[-76.554074,42.389941],[-76.55408799999999,42.390054],[-76.554106,42.390123],[-76.554118,42.390166],[-76.55427299999999,42.390542],[-76.554312,42.390663],[-76.554339,42.390816],[-76.55432999999999,42.391522],[-76.55429100000001,42.391784],[-76.554272,42.391978],[-76.554292,42.39223],[-76.554534,42.392563],[-76.554563,42.392665],[-76.55460600000001,42.392738],[-76.55468,42.392805],[-76.554761,42.392859],[-76.55556,42.392249],[-76.55600099999999,42.391919],[-76.556325,42.39174],[-76.55661600000001,42.391581],[-76.556819,42.391448],[-76.55695299999999,42.391393],[-76.55735,42.391252],[-76.55771300000001,42.391152],[-76.558106,42.391062],[-76.55865,42.390978],[-76.559201,42.390934],[-76.55975599999999,42.39094],[-76.55996399999999,42.390951],[-76.560192,42.39097],[-76.560299,42.390973],[-76.560709,42.391],[-76.560917,42.391014],[-76.561313,42.391054],[-76.561643,42.391081],[-76.562164,42.39111],[-76.562687,42.391121],[-76.56288499999999,42.391118],[-76.563266,42.391086],[-76.56361099999999,42.391032],[-76.563846,42.390979],[-76.563934,42.390969],[-76.563959,42.391004],[-76.563993,42.391036],[-76.564041,42.391062],[-76.56408399999999,42.391079],[-76.564139,42.391091],[-76.564211,42.391091],[-76.564279,42.391081],[-76.564836,42.391001],[-76.565046,42.390976],[-76.565358,42.390954],[-76.56577,42.390948],[-76.565926,42.390941],[-76.56683,42.390929],[-76.56707400000001,42.390921],[-76.56732,42.390918],[-76.567554,42.390924],[-76.5694,42.391043],[-76.56957800000001,42.391049],[-76.570818,42.391122],[-76.57150300000001,42.391153],[-76.572003,42.391169],[-76.572305,42.391183],[-76.572439,42.391185],[-76.573132,42.391221],[-76.57328699999999,42.391223],[-76.573752,42.391244],[-76.57457100000001,42.39126],[-76.575936,42.391255],[-76.576414,42.391248],[-76.576627,42.391236],[-76.57710400000001,42.391198],[-76.57857,42.390957],[-76.578968,42.390884],[-76.579435,42.390788],[-76.580123,42.390625],[-76.580551,42.390516],[-76.581317,42.390298],[-76.582212,42.390024],[-76.582739,42.389873],[-76.583253,42.389735],[-76.583628,42.389645],[-76.584137,42.389511],[-76.584374,42.389459],[-76.584807,42.389358],[-76.585133,42.389264],[-76.585241,42.389226],[-76.58534899999999,42.389193],[-76.58565900000001,42.389082],[-76.5857,42.389067],[-76.586111,42.388899],[-76.586386,42.388782],[-76.58669500000001,42.388661],[-76.587003,42.388535],[-76.587429,42.388367],[-76.58766300000001,42.388283],[-76.587777,42.388236],[-76.588138,42.388105],[-76.58865,42.387909],[-76.588774,42.387858],[-76.588909,42.387811],[-76.58904099999999,42.387759],[-76.589305,42.387657],[-76.589437,42.38761],[-76.589572,42.387559],[-76.589662,42.38753],[-76.589754,42.387498],[-76.589844,42.387465],[-76.58993599999999,42.387436],[-76.590029,42.387408],[-76.590121,42.387384],[-76.590234,42.387351],[-76.59050000000001,42.387285],[-76.590951,42.387197],[-76.591083,42.387182],[-76.591649,42.387097],[-76.59182199999999,42.387077],[-76.591995,42.387052],[-76.592168,42.387032],[-76.592642,42.386958],[-76.59277,42.386933],[-76.592899,42.386914],[-76.593155,42.386865],[-76.593282,42.386832],[-76.59338200000001,42.386812],[-76.593874,42.386675],[-76.59405700000001,42.386609],[-76.594202,42.386567],[-76.59434,42.386511],[-76.594425,42.386555],[-76.59445599999999,42.386613],[-76.59448,42.386675],[-76.59449499999999,42.386738],[-76.59452400000001,42.387981],[-76.59452400000001,42.388808],[-76.594525,42.389957],[-76.594508,42.390529],[-76.594527,42.39075],[-76.594549,42.39084],[-76.594573,42.39088],[-76.59461899999999,42.390929],[-76.59467600000001,42.390973],[-76.594785,42.391039],[-76.594939,42.3911],[-76.595186,42.391164],[-76.595403,42.391192],[-76.595705,42.391242],[-76.595933,42.391284],[-76.595986,42.391297],[-76.59609399999999,42.391313],[-76.596197,42.391339],[-76.59632999999999,42.391387],[-76.596407,42.391422],[-76.596478,42.391461],[-76.59652800000001,42.391501],[-76.596654,42.391625],[-76.596959,42.391977],[-76.596994,42.392012],[-76.597117,42.392119],[-76.59718100000001,42.392158],[-76.59724199999999,42.392189],[-76.597302,42.392206],[-76.597369,42.392219],[-76.59741699999999,42.392218],[-76.59739399999999,42.392907],[-76.597398,42.393002],[-76.597418,42.393091],[-76.597435,42.39313],[-76.59747400000001,42.393221],[-76.59763599999999,42.393498],[-76.597672,42.393601],[-76.597705,42.393668],[-76.597734,42.393713],[-76.597808,42.393798],[-76.597891,42.393882],[-76.597984,42.393957],[-76.59809199999999,42.394028],[-76.598203,42.394094],[-76.598426,42.394248],[-76.59875700000001,42.394509],[-76.599047,42.394757],[-76.599688,42.395343],[-76.60026999999999,42.395853],[-76.60084500000001,42.396331],[-76.601299,42.396685],[-76.60162699999999,42.396959],[-76.601947,42.397243],[-76.602507,42.397712],[-76.602712,42.397894],[-76.60278700000001,42.39797],[-76.602868,42.398068],[-76.602949,42.398192],[-76.603016,42.398318],[-76.603278,42.398962],[-76.603858,42.400458],[-76.60359800000001,42.400462]]],"type":"Polygon"}
}