{
  "id": "360470365011",
  "type": "Feature",
  "properties": {
    "area_land":84325,
    "area_water":0,
    "geoid":"360470365011",
    "name":"Block Group 1",
    "state":"ny"
},
  "bbox": [
    -73.914004,
    40.673152,
    -73.910926,
    40.676495
],
  "geometry": {"coordinates":[[[-73.91392,40.67413],[-73.91384600000001,40.674908],[-73.913783,40.675619],[-73.913777,40.675687],[-73.913768,40.675772],[-73.913763,40.675819],[-73.913696,40.676495],[-73.912767,40.676445],[-73.911866,40.676397],[-73.911119,40.676355],[-73.910926,40.676345],[-73.911002,40.675544],[-73.911011,40.67544],[-73.911075,40.674757],[-73.911152,40.673979],[-73.911224,40.673152],[-73.91400400000001,40.67324],[-73.91392,40.67413]]],"type":"Polygon"}
}