{
  "id": "360050265004",
  "type": "Feature",
  "properties": {
    "area_land":38407,
    "area_water":0,
    "geoid":"360050265004",
    "name":"Block Group 4",
    "state":"ny"
},
  "bbox": [
    -73.901945,
    40.863788,
    -73.898873,
    40.866342
],
  "geometry": {"coordinates":[[[-73.901945,40.864553],[-73.900586,40.866342],[-73.899801,40.865998],[-73.89887299999999,40.865584],[-73.89960600000001,40.864646],[-73.90027600000001,40.863788],[-73.90118200000001,40.864183],[-73.901945,40.864553]]],"type":"Polygon"}
}