{
  "id": "360810113002",
  "type": "Feature",
  "properties": {
    "area_land":57260,
    "area_water":0,
    "geoid":"360810113002",
    "name":"Block Group 2",
    "state":"ny"
},
  "bbox": [
    -73.910698,
    40.774861,
    -73.906677,
    40.777961
],
  "geometry": {"coordinates":[[[-73.910698,40.776132],[-73.90846500000001,40.777961],[-73.90789599999999,40.777558],[-73.90738,40.777197],[-73.90702400000001,40.776944],[-73.906677,40.776696],[-73.908903,40.774861],[-73.909252,40.775107],[-73.909617,40.775366],[-73.91026100000001,40.77583],[-73.910698,40.776132]]],"type":"Polygon"}
}