{
  "id": "361130706021",
  "type": "Feature",
  "properties": {
    "area_land":33474004,
    "area_water":99419,
    "geoid":"361130706021",
    "name":"Block Group 1",
    "state":"ny"
},
  "bbox": [
    -73.701699,
    43.369312,
    -73.612528,
    43.451225
],
  "geometry": {"coordinates":[[[-73.701699,43.379571],[-73.694113,43.380292],[-73.692654,43.380454],[-73.69405399999999,43.386861],[-73.67921200000001,43.388566],[-73.679923,43.392997],[-73.68207099999999,43.392621],[-73.682478,43.394668],[-73.689357,43.394054],[-73.684031,43.401385],[-73.68431699999999,43.402906],[-73.68586999999999,43.410591],[-73.686841,43.415388],[-73.685153,43.422074],[-73.685124,43.422178],[-73.680976,43.437722],[-73.680823,43.438258],[-73.679615,43.442697],[-73.679526,43.443032],[-73.67894099999999,43.445175],[-73.679001,43.445746],[-73.678894,43.445705],[-73.678802,43.445577],[-73.67877,43.445522],[-73.67872800000001,43.445434],[-73.678719,43.445351],[-73.67864299999999,43.445336],[-73.67854800000001,43.445235],[-73.678516,43.445143],[-73.6785,43.445077],[-73.678423,43.444981],[-73.67829500000001,43.444919],[-73.678127,43.444843],[-73.677954,43.444802],[-73.677772,43.444736],[-73.677609,43.444701],[-73.67743900000001,43.444696],[-73.677307,43.444703],[-73.67718000000001,43.444787],[-73.67710599999999,43.444875],[-73.677032,43.445037],[-73.676967,43.445094],[-73.676868,43.445287],[-73.676787,43.445374],[-73.67671799999999,43.445594],[-73.676709,43.445716],[-73.676675,43.4459],[-73.676661,43.446063],[-73.67656100000001,43.446215],[-73.676535,43.446389],[-73.676496,43.446446],[-73.676484,43.446581],[-73.676436,43.446737],[-73.676408,43.446825],[-73.676316,43.446884],[-73.676242,43.446965],[-73.67617,43.44705],[-73.67609299999999,43.447145],[-73.676047,43.447208],[-73.675977,43.447295],[-73.675893,43.447389],[-73.67582899999999,43.447447],[-73.675747,43.447515],[-73.67564,43.447594],[-73.67557100000001,43.447646],[-73.675467,43.447697],[-73.675331,43.447766],[-73.675011,43.44792],[-73.674823,43.448081],[-73.67464099999999,43.448237],[-73.67453,43.448308],[-73.67444,43.448381],[-73.67437099999999,43.448424],[-73.67424200000001,43.448489],[-73.674128,43.448542],[-73.673962,43.448583],[-73.67388800000001,43.448597],[-73.673817,43.448607],[-73.67376400000001,43.448593],[-73.67365599999999,43.448553],[-73.673542,43.4485],[-73.67347700000001,43.448429],[-73.67339200000001,43.448364],[-73.67328999999999,43.448179],[-73.673236,43.448055],[-73.673226,43.448013],[-73.67321,43.448],[-73.673204,43.447962],[-73.67321,43.447936],[-73.673162,43.447773],[-73.673106,43.447709],[-73.673137,43.447665],[-73.67314,43.447607],[-73.67313,43.447563],[-73.67310500000001,43.447492],[-73.67309,43.447409],[-73.673011,43.447266],[-73.672973,43.447225],[-73.67291299999999,43.447233],[-73.672849,43.447163],[-73.67282,43.447125],[-73.67265399999999,43.447008],[-73.67249200000001,43.446922],[-73.672245,43.44686],[-73.6721,43.446853],[-73.671717,43.446836],[-73.671536,43.446802],[-73.671421,43.446761],[-73.671274,43.446764],[-73.671009,43.44679],[-73.670858,43.44679],[-73.670744,43.446797],[-73.67052700000001,43.44684],[-73.670322,43.446883],[-73.67021,43.446907],[-73.66995799999999,43.446988],[-73.669895,43.447007],[-73.669696,43.447036],[-73.66954200000001,43.447072],[-73.669434,43.447104],[-73.66933899999999,43.447152],[-73.66928799999999,43.447179],[-73.669256,43.447234],[-73.669258,43.44729],[-73.66923,43.447342],[-73.66916399999999,43.447401],[-73.669082,43.447484],[-73.669014,43.447535],[-73.668947,43.447586],[-73.668824,43.447627],[-73.668555,43.447712],[-73.668352,43.447775],[-73.668278,43.447798],[-73.66817500000001,43.447818],[-73.668092,43.447825],[-73.66802300000001,43.4479],[-73.66801,43.447925],[-73.66793,43.447959],[-73.667891,43.447969],[-73.667846,43.447969],[-73.667783,43.447956],[-73.667744,43.44794],[-73.667686,43.447928],[-73.66763400000001,43.447892],[-73.66760499999999,43.44788],[-73.66755999999999,43.447873],[-73.66749900000001,43.447875],[-73.667461,43.447866],[-73.667294,43.447911],[-73.667108,43.447959],[-73.667057,43.447956],[-73.667002,43.447976],[-73.666951,43.44798],[-73.66687899999999,43.447961],[-73.666754,43.447884],[-73.666678,43.447844],[-73.666634,43.447836],[-73.666524,43.44783],[-73.666445,43.447811],[-73.666381,43.44779],[-73.66628900000001,43.447708],[-73.66624400000001,43.447672],[-73.666168,43.44763],[-73.666095,43.447622],[-73.666044,43.447615],[-73.665977,43.447596],[-73.665919,43.447591],[-73.665868,43.447579],[-73.665881,43.447448],[-73.665885,43.447342],[-73.66583,43.44724],[-73.665795,43.447128],[-73.665824,43.447118],[-73.665786,43.447013],[-73.665728,43.446959],[-73.665584,43.446858],[-73.665479,43.446825],[-73.66526399999999,43.446764],[-73.665136,43.446738],[-73.665041,43.446742],[-73.664974,43.446773],[-73.66492599999999,43.446892],[-73.664929,43.447003],[-73.664913,43.447125],[-73.664891,43.447218],[-73.664794,43.447255],[-73.664722,43.447398],[-73.66464499999999,43.447492],[-73.66442499999999,43.447607],[-73.664265,43.447681],[-73.66416599999999,43.447697],[-73.664064,43.447636],[-73.663974,43.447611],[-73.66393600000001,43.447611],[-73.663872,43.447582],[-73.663706,43.44762],[-73.663535,43.447656],[-73.66334500000001,43.447786],[-73.663118,43.447898],[-73.66291699999999,43.447978],[-73.66272499999999,43.448055],[-73.66259100000001,43.448115],[-73.662409,43.448216],[-73.66216300000001,43.448369],[-73.662025,43.448455],[-73.66199,43.448526],[-73.661936,43.448548],[-73.661767,43.448663],[-73.661646,43.448788],[-73.66154899999999,43.448906],[-73.661479,43.448979],[-73.661367,43.449056],[-73.6613,43.449056],[-73.661146,43.449095],[-73.660999,43.449113],[-73.660776,43.449141],[-73.660624,43.449136],[-73.660557,43.44913],[-73.660472,43.449079],[-73.66034000000001,43.449011],[-73.660265,43.448973],[-73.660096,43.448886],[-73.659994,43.448834],[-73.660017,43.448825],[-73.660009,43.448807],[-73.659986,43.448787],[-73.659944,43.448779],[-73.659899,43.448779],[-73.659818,43.448783],[-73.659696,43.448819],[-73.659564,43.448821],[-73.659469,43.448833],[-73.65934,43.448849],[-73.659193,43.448888],[-73.65899899999999,43.448939],[-73.658675,43.449025],[-73.65858,43.449011],[-73.65848200000001,43.448955],[-73.658333,43.448869],[-73.658303,43.448852],[-73.65828999999999,43.448824],[-73.65831900000001,43.448756],[-73.658295,43.448699],[-73.658252,43.448667],[-73.658106,43.448626],[-73.657917,43.448602],[-73.65782299999999,43.448598],[-73.657775,43.448571],[-73.657664,43.448495],[-73.657539,43.448387],[-73.65746300000001,43.448304],[-73.657432,43.448221],[-73.65722700000001,43.448167],[-73.657179,43.448186],[-73.657107,43.448224],[-73.65701300000001,43.448143],[-73.656961,43.448141],[-73.65689500000001,43.448139],[-73.656899,43.44819],[-73.65683300000001,43.448183],[-73.656812,43.448136],[-73.656774,43.448179],[-73.656691,43.448204],[-73.65661799999999,43.448155],[-73.65659100000001,43.448131],[-73.656611,43.44809],[-73.65653500000001,43.448061],[-73.65647300000001,43.448096],[-73.656435,43.448089],[-73.656369,43.448093],[-73.65633099999999,43.448076],[-73.65626899999999,43.448044],[-73.656234,43.448006],[-73.65617899999999,43.447968],[-73.65613399999999,43.447879],[-73.656092,43.447809],[-73.65606099999999,43.447767],[-73.656047,43.447715],[-73.655974,43.447688],[-73.655895,43.447722],[-73.655857,43.447688],[-73.655844,43.447653],[-73.655765,43.447619],[-73.65567900000001,43.447562],[-73.655586,43.447475],[-73.655548,43.447421],[-73.655451,43.447411],[-73.655399,43.447421],[-73.655373,43.447363],[-73.655314,43.447342],[-73.655154,43.447328],[-73.654946,43.447296],[-73.65478899999999,43.447224],[-73.654703,43.447165],[-73.654658,43.447002],[-73.65465500000001,43.446933],[-73.65465399999999,43.446906],[-73.654595,43.446857],[-73.654538,43.446864],[-73.65452000000001,43.446823],[-73.65456500000001,43.446791],[-73.654554,43.446761],[-73.654495,43.446727],[-73.65447899999999,43.446739],[-73.654472,43.446718],[-73.654438,43.446707],[-73.654397,43.446691],[-73.654392,43.446675],[-73.65436,43.446673],[-73.65434399999999,43.446666],[-73.65432199999999,43.446659],[-73.654292,43.44665],[-73.654281,43.446659],[-73.654217,43.446643],[-73.654203,43.446609],[-73.65423699999999,43.4466],[-73.654214,43.44657],[-73.65419900000001,43.446556],[-73.65416,43.446554],[-73.654117,43.44654],[-73.654062,43.446511],[-73.654039,43.446506],[-73.654023,43.446481],[-73.654021,43.446445],[-73.653982,43.446417],[-73.653948,43.446383],[-73.653927,43.446404],[-73.653921,43.446415],[-73.653891,43.446406],[-73.65386599999999,43.446388],[-73.653868,43.446363],[-73.65388900000001,43.446329],[-73.653915,43.446303],[-73.653916,43.446283],[-73.653864,43.446292],[-73.653823,43.446294],[-73.653779,43.446269],[-73.65376999999999,43.446249],[-73.653747,43.446249],[-73.653727,43.446219],[-73.653745,43.446199],[-73.65375,43.446169],[-73.653757,43.446142],[-73.65378200000001,43.446137],[-73.653784,43.446106],[-73.653745,43.446009],[-73.65372600000001,43.445963],[-73.653706,43.44589],[-73.653648,43.445822],[-73.65356199999999,43.445713],[-73.653526,43.445639],[-73.65350100000001,43.445556],[-73.65347,43.445526],[-73.65347199999999,43.445443],[-73.653465,43.445382],[-73.65346,43.445291],[-73.653435,43.445215],[-73.653344,43.445236],[-73.65334,43.445184],[-73.65332100000001,43.445156],[-73.653305,43.445138],[-73.653294,43.445125],[-73.653344,43.445072],[-73.653378,43.445045],[-73.653374,43.445008],[-73.65334,43.444965],[-73.65339299999999,43.444942],[-73.65339,43.444888],[-73.65339899999999,43.444837],[-73.653463,43.444826],[-73.65345600000001,43.444803],[-73.653442,43.444755],[-73.65353899999999,43.444666],[-73.653527,43.444585],[-73.653516,43.444531],[-73.65347199999999,43.444498],[-73.65346700000001,43.444443],[-73.65348400000001,43.444405],[-73.653477,43.444358],[-73.653475,43.444298],[-73.653488,43.444216],[-73.653526,43.444035],[-73.653537,43.443988],[-73.653567,43.443915],[-73.653597,43.443836],[-73.65358999999999,43.443791],[-73.65362399999999,43.443747],[-73.653637,43.443626],[-73.653665,43.443508],[-73.653712,43.443435],[-73.65375899999999,43.443328],[-73.653773,43.443283],[-73.653786,43.443251],[-73.65375899999999,43.44323],[-73.65369,43.44323],[-73.653665,43.4432],[-73.65362399999999,43.44315],[-73.65362,43.443105],[-73.65355599999999,43.443071],[-73.653515,43.443048],[-73.653469,43.443016],[-73.653417,43.442931],[-73.653385,43.442919],[-73.653381,43.442892],[-73.653424,43.442878],[-73.653474,43.442874],[-73.65351099999999,43.442869],[-73.653524,43.442855],[-73.653542,43.442821],[-73.653597,43.442823],[-73.653611,43.442805],[-73.653639,43.442735],[-73.653661,43.442673],[-73.653668,43.442614],[-73.653702,43.44258],[-73.65374799999999,43.442569],[-73.653775,43.442555],[-73.653841,43.442543],[-73.65385499999999,43.44253],[-73.653802,43.442523],[-73.653768,43.442536],[-73.653682,43.442526],[-73.65364,43.442532],[-73.653604,43.442518],[-73.653595,43.442495],[-73.653604,43.442477],[-73.65358500000001,43.442445],[-73.65352900000001,43.442461],[-73.653499,43.442463],[-73.653474,43.442461],[-73.653469,43.442432],[-73.653486,43.442422],[-73.65348400000001,43.442405],[-73.653454,43.442384],[-73.65343300000001,43.442361],[-73.653406,43.442343],[-73.653378,43.442324],[-73.653279,43.442282],[-73.653285,43.442177],[-73.653323,43.441788],[-73.653356,43.441657],[-73.653451,43.441419],[-73.65357899999999,43.44128],[-73.65366,43.441145],[-73.653768,43.440904],[-73.653837,43.44068],[-73.653965,43.440337],[-73.653976,43.440202],[-73.65394499999999,43.439554],[-73.653927,43.439441],[-73.653898,43.439375],[-73.65386100000001,43.439331],[-73.65382099999999,43.439309],[-73.65373700000001,43.439302],[-73.653638,43.439309],[-73.653085,43.439492],[-73.652804,43.439569],[-73.65259500000001,43.439613],[-73.65235199999999,43.439631],[-73.652103,43.439613],[-73.65196,43.439562],[-73.65182799999999,43.439456],[-73.651748,43.439306],[-73.65160899999999,43.438918],[-73.651543,43.438659],[-73.651523,43.438297],[-73.65155900000001,43.438183],[-73.65160299999999,43.438114],[-73.651695,43.438041],[-73.651856,43.437964],[-73.65270099999999,43.437737],[-73.65280199999999,43.437701],[-73.65293699999999,43.437635],[-73.653104,43.437504],[-73.653159,43.437351],[-73.653149,43.437268],[-73.65311199999999,43.437212],[-73.653029,43.437138],[-73.652835,43.437045],[-73.652547,43.436971],[-73.651325,43.436851],[-73.65110199999999,43.436823],[-73.650982,43.436796],[-73.65075,43.436684],[-73.650676,43.436629],[-73.650639,43.436536],[-73.650639,43.436444],[-73.650695,43.436259],[-73.65084299999999,43.43612],[-73.650954,43.436083],[-73.651195,43.436037],[-73.651371,43.43599],[-73.651426,43.435963],[-73.651454,43.435925],[-73.651482,43.435851],[-73.651473,43.435777],[-73.651445,43.435694],[-73.65138,43.43562],[-73.65112999999999,43.435259],[-73.651112,43.435167],[-73.651121,43.435055],[-73.651158,43.434972],[-73.651543,43.43454],[-73.651563,43.434472],[-73.65155300000001,43.434326],[-73.65151400000001,43.434258],[-73.651426,43.43419],[-73.651028,43.434063],[-73.65029800000001,43.433908],[-73.64983100000001,43.43385],[-73.649646,43.433762],[-73.649608,43.433694],[-73.64961700000001,43.43349],[-73.649734,43.433286],[-73.649822,43.433169],[-73.64989,43.433033],[-73.65001599999999,43.432829],[-73.650074,43.432683],[-73.65008400000001,43.432586],[-73.65005499999999,43.432499],[-73.650006,43.432411],[-73.64993800000001,43.432334],[-73.649841,43.432266],[-73.649462,43.43211],[-73.64908200000001,43.431984],[-73.648625,43.431896],[-73.648343,43.431828],[-73.648168,43.43176],[-73.64788,43.431586],[-73.647837,43.431556],[-73.647779,43.431459],[-73.64776000000001,43.431352],[-73.64776500000001,43.431133],[-73.647785,43.431026],[-73.647853,43.430822],[-73.647863,43.430618],[-73.64780399999999,43.430482],[-73.647717,43.430404],[-73.647649,43.430375],[-73.647318,43.430326],[-73.647201,43.430326],[-73.646725,43.430501],[-73.646627,43.430521],[-73.646472,43.430531],[-73.64626699999999,43.430521],[-73.64615999999999,43.430501],[-73.646063,43.430453],[-73.645946,43.430375],[-73.64569400000001,43.430152],[-73.645567,43.430074],[-73.645168,43.429947],[-73.645061,43.429899],[-73.644867,43.429831],[-73.64475,43.429734],[-73.644721,43.429646],[-73.644721,43.429559],[-73.64474,43.429471],[-73.644857,43.429151],[-73.64487699999999,43.429063],[-73.64487699999999,43.429005],[-73.64483799999999,43.428927],[-73.64476000000001,43.428859],[-73.64462399999999,43.42883],[-73.644361,43.42881],[-73.64387499999999,43.428733],[-73.64379700000001,43.428713],[-73.64366099999999,43.428597],[-73.64362199999999,43.428499],[-73.64362199999999,43.428412],[-73.64365100000001,43.428325],[-73.643787,43.42813],[-73.64388099999999,43.427972],[-73.643907,43.427896],[-73.64388099999999,43.427807],[-73.643818,43.427756],[-73.643716,43.427692],[-73.64358799999999,43.427629],[-73.643512,43.42754],[-73.643486,43.427451],[-73.643486,43.427247],[-73.643563,43.427043],[-73.643525,43.426419],[-73.643576,43.426292],[-73.64398300000001,43.425592],[-73.644085,43.425452],[-73.644302,43.425223],[-73.644353,43.425121],[-73.64436600000001,43.425019],[-73.64434,43.424892],[-73.64425,43.424833],[-73.643804,43.424795],[-73.643664,43.424744],[-73.64358799999999,43.424668],[-73.643486,43.424528],[-73.643269,43.424184],[-73.642989,43.423598],[-73.64296299999999,43.423484],[-73.64296299999999,43.423356],[-73.643002,43.423178],[-73.64306500000001,43.423089],[-73.643193,43.422809],[-73.643282,43.422542],[-73.643282,43.422427],[-73.643244,43.422338],[-73.64318,43.422249],[-73.643091,43.422198],[-73.642912,43.42216],[-73.64219900000001,43.421982],[-73.642021,43.42188],[-73.641778,43.421663],[-73.641702,43.421561],[-73.641638,43.421421],[-73.64107300000001,43.421522],[-73.64085300000001,43.421519],[-73.640621,43.4215],[-73.640293,43.421451],[-73.64024000000001,43.421474],[-73.640199,43.421504],[-73.64013199999999,43.421534],[-73.640057,43.421534],[-73.640001,43.421519],[-73.639923,43.42147],[-73.639807,43.421429],[-73.639583,43.42141],[-73.639449,43.421407],[-73.63905699999999,43.42131],[-73.63896,43.4213],[-73.638881,43.421326],[-73.638784,43.421338],[-73.638665,43.421334],[-73.63844400000001,43.421277],[-73.638195,43.421377],[-73.637995,43.421484],[-73.637873,43.421584],[-73.63675000000001,43.422742],[-73.636493,43.422942],[-73.636219,43.423098],[-73.635901,43.423311],[-73.635363,43.423382],[-73.634754,43.423417],[-73.634373,43.423302],[-73.633892,43.423083],[-73.633396,43.422792],[-73.633031,43.422529],[-73.632864,43.422313],[-73.632705,43.422152],[-73.63164399999999,43.420707],[-73.631378,43.420949],[-73.631158,43.421134],[-73.631013,43.421236],[-73.630887,43.421307],[-73.630684,43.42138],[-73.629875,43.421553],[-73.62940399999999,43.421663],[-73.628967,43.421769],[-73.628438,43.421833],[-73.627048,43.421972],[-73.62704600000001,43.42217],[-73.627015,43.422456],[-73.626971,43.422669],[-73.626848,43.42301],[-73.626667,43.423347],[-73.62659600000001,43.423451],[-73.626484,43.423604],[-73.62627999999999,43.423841],[-73.626051,43.424057],[-73.625562,43.424447],[-73.625201,43.424759],[-73.624894,43.425109],[-73.624668,43.425457],[-73.62460900000001,43.425563],[-73.624466,43.425917],[-73.624397,43.426167],[-73.624084,43.427482],[-73.62403,43.427871],[-73.624028,43.427968],[-73.624054,43.428233],[-73.624156,43.428978],[-73.62437300000001,43.430214],[-73.624751,43.432363],[-73.624934,43.433345],[-73.625744,43.438131],[-73.6258,43.438464],[-73.625809,43.438516],[-73.625924,43.439071],[-73.625933,43.439103],[-73.62598,43.439261],[-73.626166,43.439651],[-73.626345,43.439936],[-73.62654499999999,43.440206],[-73.62704100000001,43.440731],[-73.62713100000001,43.440841],[-73.62749599999999,43.441411],[-73.627613,43.441651],[-73.627695,43.441891],[-73.627757,43.442196],[-73.62777800000001,43.442476],[-73.627723,43.442951],[-73.627599,43.443771],[-73.62759200000001,43.444116],[-73.627633,43.444591],[-73.627709,43.444891],[-73.62787400000001,43.445426],[-73.627971,43.445781],[-73.628012,43.446121],[-73.62801899999999,43.446336],[-73.628005,43.446721],[-73.62795,43.447021],[-73.627854,43.447376],[-73.627695,43.447791],[-73.627516,43.448136],[-73.626869,43.449196],[-73.62558799999999,43.451135],[-73.625533,43.451225],[-73.624484,43.450854],[-73.624306,43.450811],[-73.62409100000001,43.450784],[-73.62250400000001,43.450635],[-73.62213800000001,43.450602],[-73.621121,43.445145],[-73.619736,43.437654],[-73.618484,43.430921],[-73.618109,43.428902],[-73.618044,43.428554],[-73.61766,43.426485],[-73.61743300000001,43.425263],[-73.61734800000001,43.424804],[-73.617318,43.424642],[-73.61708900000001,43.423409],[-73.614706,43.410392],[-73.613316,43.402998],[-73.612542,43.398877],[-73.612528,43.398782],[-73.61268699999999,43.398733],[-73.612818,43.398693],[-73.612944,43.398661],[-73.613482,43.398524],[-73.61428100000001,43.398353],[-73.614845,43.398253],[-73.615645,43.398137],[-73.617709,43.397931],[-73.62000399999999,43.397727],[-73.620819,43.397651],[-73.623115,43.397435],[-73.624999,43.397263],[-73.628297,43.396986],[-73.630436,43.396801],[-73.632722,43.396604],[-73.63470599999999,43.396425],[-73.63478600000001,43.396418],[-73.635745,43.396332],[-73.636348,43.396278],[-73.637068,43.39612],[-73.637501,43.395998],[-73.63811099999999,43.395754],[-73.638555,43.395531],[-73.639083,43.395193],[-73.639444,43.394898],[-73.639809,43.394541],[-73.64026,43.393955],[-73.64086500000001,43.393229],[-73.641143,43.39294],[-73.64145600000001,43.392648],[-73.641605,43.392532],[-73.642127,43.392177],[-73.64361599999999,43.39124],[-73.64409999999999,43.390931],[-73.644538,43.390591],[-73.64521499999999,43.389848],[-73.646024,43.388885],[-73.646337,43.388532],[-73.646457,43.388397],[-73.64682000000001,43.388024],[-73.647164,43.387713],[-73.64752799999999,43.387425],[-73.648205,43.38694],[-73.64955500000001,43.38597],[-73.650983,43.384946],[-73.651545,43.384612],[-73.652379,43.384339],[-73.65316199999999,43.384096],[-73.653751,43.383894],[-73.65454200000001,43.38352],[-73.654999,43.383234],[-73.656043,43.382568],[-73.657408,43.381615],[-73.657796,43.381259],[-73.658315,43.380694],[-73.65885900000001,43.380066],[-73.65951,43.379321],[-73.660189,43.378651],[-73.66044100000001,43.378363],[-73.66065399999999,43.378185],[-73.660918,43.377985],[-73.662414,43.376911],[-73.662673,43.376746],[-73.663189,43.37648],[-73.663676,43.376283],[-73.664068,43.376156],[-73.66439699999999,43.376075],[-73.66481,43.375986],[-73.665171,43.375936],[-73.666804,43.375782],[-73.67010399999999,43.375276],[-73.670473,43.375214],[-73.671817,43.375073],[-73.672802,43.375026],[-73.674324,43.374933],[-73.67529500000001,43.374789],[-73.67568300000001,43.374698],[-73.676001,43.374615],[-73.676536,43.374492],[-73.67804599999999,43.374131],[-73.678719,43.373963],[-73.679427,43.373775],[-73.680488,43.373485],[-73.68153100000001,43.3732],[-73.681972,43.373086],[-73.68254899999999,43.372963],[-73.683982,43.372713],[-73.684279,43.372654],[-73.68477900000001,43.372546],[-73.68561099999999,43.372312],[-73.68613999999999,43.372152],[-73.68765999999999,43.371713],[-73.688232,43.371547],[-73.68901700000001,43.37134],[-73.689504,43.371229],[-73.68984399999999,43.371157],[-73.690443,43.371041],[-73.691322,43.37087],[-73.69163,43.370813],[-73.692854,43.370615],[-73.693348,43.370528],[-73.693782,43.370418],[-73.694401,43.370184],[-73.694495,43.370148],[-73.69492099999999,43.369964],[-73.695064,43.369902],[-73.695322,43.36979],[-73.695779,43.369609],[-73.696202,43.369483],[-73.69648599999999,43.369425],[-73.696955,43.369365],[-73.69759999999999,43.369322],[-73.698055,43.369312],[-73.697901,43.369886],[-73.69785,43.370235],[-73.697856,43.370745],[-73.697924,43.371214],[-73.697975,43.371405],[-73.69811,43.371785],[-73.698256,43.372094],[-73.698593,43.372682],[-73.699635,43.374427],[-73.69977900000001,43.374692],[-73.700023,43.37518],[-73.70032399999999,43.375891],[-73.701564,43.3792],[-73.701699,43.379571]]],"type":"Polygon"}
}