{
  "id": "360594132001",
  "type": "Feature",
  "properties": {
    "area_land":218809,
    "area_water":0,
    "geoid":"360594132001",
    "name":"Block Group 1",
    "state":"ny"
},
  "bbox": [
    -73.653669,
    40.631418,
    -73.640748,
    40.634615
],
  "geometry": {"coordinates":[[[-73.65366899999999,40.633616],[-73.65134999999999,40.633968],[-73.648984,40.634324],[-73.647667,40.634529],[-73.647364,40.634572],[-73.64721900000001,40.634582],[-73.647082,40.634615],[-73.646463,40.634584],[-73.646804,40.634027],[-73.646901,40.633857],[-73.646821,40.633855],[-73.646625,40.63385],[-73.645121,40.633777],[-73.641644,40.633609],[-73.6417,40.632897],[-73.640748,40.632852],[-73.640863,40.631418],[-73.641025,40.631434],[-73.64181499999999,40.631471],[-73.641758,40.632186],[-73.64524299999999,40.63235],[-73.64722399999999,40.632448],[-73.647318,40.632376],[-73.647368,40.632357],[-73.648651,40.632164],[-73.65079900000001,40.63184],[-73.653097,40.63149],[-73.65328599999999,40.632185],[-73.653476,40.632885],[-73.65358500000001,40.633284],[-73.65361,40.633427],[-73.65366899999999,40.633616]]],"type":"Polygon"}
}