{
  "id": "360610048005",
  "type": "Feature",
  "properties": {
    "area_land":44392,
    "area_water":0,
    "geoid":"360610048005",
    "name":"Block Group 5",
    "state":"ny"
},
  "bbox": [
    -73.984941,
    40.731361,
    -73.981127,
    40.733923
],
  "geometry": {"coordinates":[[[-73.984441,40.733033],[-73.983879,40.732797],[-73.98364599999999,40.732699],[-73.983176,40.73334],[-73.982753,40.733923],[-73.981127,40.733242],[-73.981562,40.732643],[-73.982022,40.732012],[-73.982564,40.731361],[-73.98494100000001,40.732347],[-73.984441,40.733033]]],"type":"Polygon"}
}