{
  "id": "360811010010",
  "type": "Feature",
  "properties": {
    "area_land":0,
    "area_water":210562,
    "geoid":"360811010010",
    "name":"Block Group 0",
    "state":"ny"
},
  "bbox": [
    -73.752589,
    40.587965,
    -73.74338,
    40.59468
],
  "geometry": {"coordinates":[[[-73.752589,40.590181],[-73.75237,40.591232],[-73.752251,40.591253],[-73.752095,40.591273],[-73.751885,40.591299],[-73.751763,40.591338],[-73.751649,40.591376],[-73.75158399999999,40.591406],[-73.75152199999999,40.591441],[-73.751366,40.591574],[-73.75132600000001,40.591613],[-73.751158,40.591806],[-73.751037,40.591967],[-73.75093099999999,40.592116],[-73.75084,40.592245],[-73.75074499999999,40.592338],[-73.750664,40.592398],[-73.75037399999999,40.592615],[-73.750235,40.592726],[-73.74981,40.59292],[-73.74964,40.593016],[-73.749364,40.593158],[-73.74923800000001,40.593235],[-73.74918599999999,40.593285],[-73.74895100000001,40.593413],[-73.748531,40.593548],[-73.748305,40.593598],[-73.748148,40.593618],[-73.74805600000001,40.593669],[-73.74793,40.593779],[-73.747827,40.59379],[-73.747754,40.593855],[-73.747658,40.593894],[-73.74754299999999,40.593951],[-73.74736799999999,40.594063],[-73.747241,40.594065],[-73.747129,40.594094],[-73.74701399999999,40.594101],[-73.74692400000001,40.594124],[-73.746843,40.594223],[-73.74675999999999,40.594258],[-73.746629,40.594301],[-73.746431,40.594325],[-73.74607,40.594369],[-73.745947,40.59438],[-73.745887,40.59439],[-73.745773,40.594414],[-73.74539799999999,40.594497],[-73.74525199999999,40.594534],[-73.745153,40.594563],[-73.745075,40.594585],[-73.744726,40.594648],[-73.744625,40.594662],[-73.744525,40.594668],[-73.744153,40.59468],[-73.743994,40.594679],[-73.743591,40.594665],[-73.74338,40.592847],[-73.743604,40.592859],[-73.74382900000001,40.592871],[-73.744469,40.592904],[-73.747749,40.591503],[-73.750978,40.589049],[-73.752121,40.588182],[-73.752371,40.587965],[-73.752589,40.590181]]],"type":"Polygon"}
}