{
  "id": "360810964000",
  "type": "Feature",
  "properties": {
    "area_land":0,
    "area_water":359850,
    "geoid":"360810964000",
    "name":"Block Group 0",
    "state":"ny"
},
  "bbox": [
    -73.795549,
    40.581332,
    -73.787867,
    40.587646
],
  "geometry": {"coordinates":[[[-73.79554899999999,40.586471],[-73.795382,40.586477],[-73.795226,40.586483],[-73.795005,40.586524],[-73.794805,40.586591],[-73.79468900000001,40.586661],[-73.79445,40.586733],[-73.79434500000001,40.586757],[-73.794141,40.586774],[-73.79394000000001,40.586811],[-73.79379400000001,40.586786],[-73.793584,40.586838],[-73.793477,40.58691],[-73.79326399999999,40.586948],[-73.793138,40.586954],[-73.792981,40.586976],[-73.79281,40.586996],[-73.792518,40.587043],[-73.79230800000001,40.587126],[-73.792005,40.58723],[-73.79171599999999,40.587283],[-73.791511,40.587297],[-73.791281,40.587274],[-73.79105800000001,40.587296],[-73.790916,40.587343],[-73.79055200000001,40.587436],[-73.789963,40.587535],[-73.78983700000001,40.587556],[-73.789635,40.587588],[-73.789451,40.587623],[-73.78929599999999,40.587629],[-73.789034,40.587517],[-73.788875,40.587473],[-73.788816,40.587458],[-73.788589,40.587508],[-73.78842299999999,40.587646],[-73.788667,40.586845],[-73.78786700000001,40.581944],[-73.787954,40.581932],[-73.794189,40.58145],[-73.794785,40.581332],[-73.795531,40.585795],[-73.79554899999999,40.586471]]],"type":"Polygon"}
}