{
  "id": "361090008002",
  "type": "Feature",
  "properties": {
    "area_land":371139,
    "area_water":0,
    "geoid":"361090008002",
    "name":"Block Group 2",
    "state":"ny"
},
  "bbox": [
    -76.508613,
    42.440114,
    -76.494578,
    42.444632
],
  "geometry": {"coordinates":[[[-76.508613,42.444317],[-76.50698,42.444365],[-76.50688599999999,42.444376],[-76.506833,42.444381],[-76.50642999999999,42.444391],[-76.506303,42.444388],[-76.50590800000001,42.444397],[-76.504949,42.444428],[-76.504187,42.444452],[-76.50371,42.444467],[-76.50354799999999,42.444469],[-76.502172,42.44451],[-76.50197900000001,42.444517],[-76.500996,42.444543],[-76.500766,42.44455],[-76.499413,42.444591],[-76.499269,42.444597],[-76.499269,42.444632],[-76.499252,42.444626],[-76.49911899999999,42.444549],[-76.498904,42.444471],[-76.498178,42.444195],[-76.498107,42.444174],[-76.498048,42.444153],[-76.49803300000001,42.444147],[-76.497978,42.44411],[-76.49729000000001,42.443857],[-76.497021,42.443757],[-76.49663200000001,42.443623],[-76.496307,42.443506],[-76.49608499999999,42.443424],[-76.495908,42.443373],[-76.495879,42.44336],[-76.49582700000001,42.443345],[-76.495694,42.443305],[-76.49547099999999,42.44325],[-76.495271,42.443228],[-76.494834,42.44319],[-76.494589,42.443136],[-76.494578,42.44283],[-76.49460000000001,42.442749],[-76.49462,42.442713],[-76.49579199999999,42.442675],[-76.49696400000001,42.44265],[-76.49804,42.442623],[-76.49885500000001,42.442599],[-76.498929,42.442593],[-76.499167,42.44259],[-76.500894,42.442541],[-76.500832,42.441263],[-76.500784,42.440349],[-76.501766,42.440318],[-76.503969,42.440249],[-76.505208,42.440215],[-76.50617800000001,42.440184],[-76.508386,42.440114],[-76.50843399999999,42.441023],[-76.508504,42.442323],[-76.508554,42.443228],[-76.508613,42.444317]]],"type":"Polygon"}
}