{
  "id": "360070121013",
  "type": "Feature",
  "properties": {
    "area_land":1845677,
    "area_water":0,
    "geoid":"360070121013",
    "name":"Block Group 3",
    "state":"ny"
},
  "bbox": [
    -75.861241,
    42.187663,
    -75.833592,
    42.197958
],
  "geometry": {"coordinates":[[[-75.861131,42.189226],[-75.860838,42.189522],[-75.86068,42.189695],[-75.860366,42.190037],[-75.859655,42.190813],[-75.85946199999999,42.191073],[-75.859347,42.191276],[-75.85923699999999,42.191565],[-75.859191,42.191821],[-75.859193,42.192152],[-75.859399,42.194502],[-75.859402,42.194555],[-75.859481,42.195529],[-75.859489,42.196079],[-75.859472,42.196272],[-75.85944499999999,42.196566],[-75.859374,42.197161],[-75.8593,42.197777],[-75.859286,42.197946],[-75.858913,42.197956],[-75.858543,42.197958],[-75.85832000000001,42.197942],[-75.858085,42.197913],[-75.857606,42.197811],[-75.85562299999999,42.197337],[-75.853425,42.196823],[-75.85289400000001,42.196729],[-75.852757,42.196719],[-75.852407,42.196703],[-75.85185799999999,42.196723],[-75.84984799999999,42.196832],[-75.842361,42.197221],[-75.84177800000001,42.197243],[-75.83967,42.197346],[-75.83865400000001,42.197391],[-75.838402,42.197404],[-75.838375,42.197405],[-75.838134,42.197418],[-75.837228,42.197457],[-75.836752,42.197473],[-75.836462,42.197465],[-75.836404,42.197463],[-75.836105,42.197417],[-75.83596300000001,42.197386],[-75.83571999999999,42.197304],[-75.83543899999999,42.197171],[-75.835222,42.197029],[-75.834954,42.196783],[-75.83485400000001,42.196634],[-75.834479,42.19586],[-75.833978,42.194699],[-75.833894,42.194424],[-75.833669,42.193343],[-75.83361499999999,42.193022],[-75.833592,42.192797],[-75.833642,42.189201],[-75.834131,42.189267],[-75.83510699999999,42.189455],[-75.83569199999999,42.189563],[-75.83594100000001,42.189579],[-75.836299,42.189583],[-75.836603,42.189557],[-75.83686299999999,42.189501],[-75.837199,42.189365],[-75.837773,42.189095],[-75.838094,42.188974],[-75.83840600000001,42.188884],[-75.83868699999999,42.188822],[-75.839485,42.18867],[-75.841438,42.188294],[-75.84310499999999,42.187963],[-75.843542,42.187888],[-75.84383800000001,42.187858],[-75.845377,42.187814],[-75.84701800000001,42.187745],[-75.848949,42.187663],[-75.84895299999999,42.188134],[-75.849001,42.189541],[-75.849063,42.190285],[-75.849076,42.190649],[-75.849097,42.190886],[-75.849165,42.191063],[-75.849211,42.191118],[-75.849825,42.191605],[-75.86124100000001,42.18913],[-75.861131,42.189226]]],"type":"Polygon"}
}