{
  "id": "361119537004",
  "type": "Feature",
  "properties": {
    "area_land":7224538,
    "area_water":1523959,
    "geoid":"361119537004",
    "name":"Block Group 4",
    "state":"ny"
},
  "bbox": [
    -73.999586,
    41.668826,
    -73.942482,
    41.708289
],
  "geometry": {"coordinates":[[[-73.99948500000001,41.692459],[-73.99926499999999,41.692648],[-73.998987,41.692812],[-73.99864700000001,41.692991],[-73.998507,41.693092],[-73.99833599999999,41.693264],[-73.997962,41.693711],[-73.997793,41.693888],[-73.997676,41.693992],[-73.99751000000001,41.694114],[-73.99733500000001,41.694222],[-73.995919,41.694968],[-73.994876,41.695507],[-73.99405899999999,41.69593],[-73.99385599999999,41.696013],[-73.99373,41.69605],[-73.993664,41.696059],[-73.993477,41.69607],[-73.993285,41.69605],[-73.99309700000001,41.696021],[-73.99272499999999,41.695927],[-73.99221900000001,41.695778],[-73.99198800000001,41.695698],[-73.991711,41.695565],[-73.991637,41.695524],[-73.991046,41.695193],[-73.990008,41.694606],[-73.98889800000001,41.693998],[-73.98874000000001,41.693919],[-73.988445,41.693809],[-73.988266,41.693769],[-73.988106,41.693755],[-73.987938,41.693772],[-73.987774,41.693806],[-73.987377,41.693953],[-73.98657900000001,41.694316],[-73.986468,41.694358],[-73.985609,41.694596],[-73.985466,41.694663],[-73.985412,41.694701],[-73.98531800000001,41.694777],[-73.985246,41.694873],[-73.985187,41.695004],[-73.985129,41.695189],[-73.984996,41.695729],[-73.98493499999999,41.695896],[-73.984774,41.696238],[-73.984644,41.696458],[-73.984488,41.696664],[-73.98430999999999,41.696816],[-73.984154,41.696902],[-73.98378700000001,41.69706],[-73.983425,41.697234],[-73.98325699999999,41.697339],[-73.983132,41.697454],[-73.983037,41.697586],[-73.982961,41.697755],[-73.982894,41.69821],[-73.982873,41.698404],[-73.982136,41.697506],[-73.98189499999999,41.696954],[-73.981163,41.695808],[-73.981118,41.695735],[-73.98088300000001,41.695177],[-73.980375,41.692234],[-73.980102,41.692134],[-73.979857,41.692064],[-73.979657,41.692025],[-73.979405,41.69201],[-73.979133,41.69202],[-73.978392,41.692116],[-73.978047,41.692172],[-73.977923,41.692201],[-73.977028,41.692472],[-73.976707,41.692549],[-73.976505,41.692582],[-73.97571499999999,41.692711],[-73.97506199999999,41.692875],[-73.97466900000001,41.692991],[-73.974355,41.693098],[-73.973625,41.693327],[-73.973061,41.693483],[-73.972044,41.693703],[-73.970918,41.693973],[-73.97032900000001,41.694094],[-73.97009799999999,41.694167],[-73.969926,41.694287],[-73.96957399999999,41.694658],[-73.96895499999999,41.695198],[-73.96863399999999,41.695466],[-73.96815100000001,41.695857],[-73.96794800000001,41.696013],[-73.967619,41.696257],[-73.96741299999999,41.696386],[-73.96730100000001,41.696474],[-73.96700800000001,41.696707],[-73.966767,41.696918],[-73.966613,41.697054],[-73.966461,41.697171],[-73.966444,41.697183],[-73.965999,41.697492],[-73.96532500000001,41.697926],[-73.96513400000001,41.698013],[-73.96485,41.698098],[-73.964584,41.698155],[-73.96434600000001,41.698235],[-73.964254,41.698284],[-73.96410299999999,41.698405],[-73.964026,41.698498],[-73.963921,41.698682],[-73.963819,41.698893],[-73.963747,41.698961],[-73.963689,41.69899],[-73.96360799999999,41.699005],[-73.963503,41.698996],[-73.96340600000001,41.698965],[-73.96327100000001,41.69889],[-73.963154,41.698789],[-73.962923,41.698554],[-73.96258400000001,41.698305],[-73.962002,41.697902],[-73.961489,41.697612],[-73.95938700000001,41.69653],[-73.95515,41.702831],[-73.95481700000001,41.702988],[-73.954595,41.703145],[-73.954407,41.703633],[-73.9532,41.707735],[-73.953115,41.708181],[-73.95309399999999,41.708289],[-73.953064,41.708264],[-73.952799,41.707974],[-73.95264400000001,41.707765],[-73.952586,41.707673],[-73.95234000000001,41.707163],[-73.952292,41.707003],[-73.952236,41.706772],[-73.952196,41.706565],[-73.95220399999999,41.706381],[-73.952212,41.706079],[-73.952268,41.705792],[-73.952348,41.705528],[-73.952459,41.705273],[-73.952555,41.705074],[-73.95266599999999,41.704843],[-73.95272199999999,41.704707],[-73.95277,41.704604],[-73.952794,41.704516],[-73.95281,41.704357],[-73.95281,41.704269],[-73.95280200000001,41.704165],[-73.952738,41.704054],[-73.952611,41.703886],[-73.952467,41.703775],[-73.95226,41.703663],[-73.95209199999999,41.703602],[-73.951992,41.703579],[-73.951866,41.703565],[-73.951778,41.703512],[-73.951511,41.703481],[-73.95117,41.703442],[-73.951072,41.703432],[-73.95069100000001,41.703392],[-73.95056200000001,41.703379],[-73.94606899999999,41.702886],[-73.946078,41.702826],[-73.946082,41.702793],[-73.946682,41.699396],[-73.946595,41.699027],[-73.94578199999999,41.695593],[-73.943482,41.690293],[-73.942482,41.684093],[-73.943282,41.679393],[-73.945182,41.675893],[-73.946755,41.669887],[-73.947033,41.668826],[-73.94731400000001,41.668937],[-73.951262,41.670525],[-73.951519,41.670703],[-73.951581,41.670729],[-73.951649,41.670761],[-73.952781,41.671561],[-73.953227,41.671632],[-73.953292,41.671672],[-73.953399,41.671689],[-73.953518,41.671685],[-73.953711,41.671694],[-73.95388699999999,41.671738],[-73.95447299999999,41.671965],[-73.954915,41.672148],[-73.95522,41.672298],[-73.95527300000001,41.672353],[-73.955302,41.672412],[-73.955414,41.67242],[-73.95553099999999,41.67245],[-73.95589099999999,41.672615],[-73.956892,41.673087],[-73.957532,41.673402],[-73.958491,41.673864],[-73.959948,41.674491],[-73.96265099999999,41.675604],[-73.96293300000001,41.675706],[-73.96379899999999,41.676046],[-73.964573,41.676348],[-73.965863,41.67694],[-73.971317,41.679443],[-73.975686,41.681448],[-73.978786,41.682881],[-73.979124,41.683009],[-73.986858,41.686164],[-73.986965,41.686207],[-73.99185300000001,41.688406],[-73.998434,41.691761],[-73.99944499999999,41.692281],[-73.99958599999999,41.692364],[-73.99948500000001,41.692459]]],"type":"Polygon"}
}