{
  "id": "360050230002",
  "type": "Feature",
  "properties": {
    "area_land":72659,
    "area_water":0,
    "geoid":"360050230002",
    "name":"Block Group 2",
    "state":"ny"
},
  "bbox": [
    -73.866343,
    40.84759,
    -73.862509,
    40.850611
],
  "geometry": {"coordinates":[[[-73.866107,40.848537],[-73.865813,40.849692],[-73.86572,40.850066],[-73.865651,40.850335],[-73.865605,40.850318],[-73.86522100000001,40.850178],[-73.86304,40.850611],[-73.86278900000001,40.849238],[-73.862509,40.848362],[-73.863373,40.848162],[-73.864244,40.847981],[-73.865118,40.847801],[-73.865995,40.847633],[-73.866343,40.84759],[-73.866107,40.848537]]],"type":"Polygon"}
}