{
  "id": "361231505001",
  "type": "Feature",
  "properties": {
    "area_land":81198646,
    "area_water":43783,
    "geoid":"361231505001",
    "name":"Block Group 1",
    "state":"ny"
},
  "bbox": [
    -77.092918,
    42.483947,
    -76.989329,
    42.615786
],
  "geometry": {"coordinates":[[[-77.092793,42.484193],[-77.09241299999999,42.48491],[-77.090887,42.487793],[-77.09053900000001,42.488453],[-77.09038700000001,42.488759],[-77.089631,42.490215],[-77.089083,42.491273],[-77.088122,42.493173],[-77.08739199999999,42.4946],[-77.086676,42.496001],[-77.08664400000001,42.496061],[-77.086573,42.496196],[-77.086361,42.4966],[-77.086291,42.496736],[-77.086027,42.497239],[-77.085453,42.498335],[-77.08522499999999,42.498743],[-77.085117,42.498938],[-77.084943,42.49917],[-77.08490399999999,42.499209],[-77.084751,42.499351],[-77.084587,42.499473],[-77.084236,42.499683],[-77.084174,42.499721],[-77.08207899999999,42.500879],[-77.08136,42.501278],[-77.081042,42.501454],[-77.08009,42.501982],[-77.079773,42.502159],[-77.076508,42.503972],[-77.076455,42.504001],[-77.073277,42.505792],[-77.070075,42.50771],[-77.066647,42.509777],[-77.066535,42.509845],[-77.06500200000001,42.51081],[-77.064663,42.511052],[-77.06441,42.511284],[-77.064263,42.51147],[-77.064171,42.51164],[-77.063969,42.512142],[-77.063928,42.512256],[-77.063715,42.512835],[-77.06307700000001,42.514573],[-77.062865,42.515153],[-77.062207,42.516904],[-77.061528,42.518536],[-77.061206,42.519312],[-77.06084,42.520298],[-77.060008,42.522653],[-77.058959,42.525553],[-77.057767,42.528783],[-77.05736400000001,42.529877],[-77.056665,42.531791],[-77.05654199999999,42.53221],[-77.056152,42.534221],[-77.055633,42.536901],[-77.055603,42.53713],[-77.055599,42.537556],[-77.055824,42.540307],[-77.055892,42.541125],[-77.05597400000001,42.542351],[-77.056023,42.543256],[-77.056038,42.543524],[-77.05612000000001,42.545976],[-77.056136,42.546432],[-77.056158,42.546883],[-77.05620399999999,42.547574],[-77.056348,42.549651],[-77.05638,42.550102],[-77.056387,42.550344],[-77.056394,42.551035],[-77.056383,42.551356],[-77.056279,42.55439],[-77.056265,42.554819],[-77.056217,42.555401],[-77.056144,42.556123],[-77.05592799999999,42.558292],[-77.05589500000001,42.558629],[-77.05587800000001,42.559017],[-77.05588299999999,42.559283],[-77.055885,42.559348],[-77.055944,42.560078],[-77.055966,42.560345],[-77.055992,42.560618],[-77.056073,42.56144],[-77.0561,42.561715],[-77.05619299999999,42.562596],[-77.05623799999999,42.562904],[-77.05667099999999,42.565852],[-77.05672800000001,42.566442],[-77.056729,42.566464],[-77.056814,42.56766],[-77.05688499999999,42.568706],[-77.056963,42.569811],[-77.057079,42.571846],[-77.05711599999999,42.572479],[-77.057114,42.572894],[-77.057067,42.573944],[-77.056955,42.576516],[-77.056922,42.577096],[-77.056865,42.578146],[-77.05685699999999,42.578286],[-77.05685099999999,42.578393],[-77.056811,42.579136],[-77.056799,42.579384],[-77.05679499999999,42.579457],[-77.05678399999999,42.579682],[-77.056783,42.579757],[-77.056781,42.579837],[-77.056777,42.580082],[-77.056776,42.580164],[-77.05677,42.580525],[-77.056785,42.580909],[-77.056854,42.581455],[-77.056871,42.581586],[-77.056963,42.582068],[-77.05720700000001,42.583011],[-77.057772,42.58505],[-77.05783099999999,42.585215],[-77.05788200000001,42.585356],[-77.05833800000001,42.58641],[-77.05847799999999,42.586751],[-77.058604,42.587055],[-77.058679,42.587358],[-77.05873099999999,42.587823],[-77.058757,42.588191],[-77.058812,42.589009],[-77.058947,42.590986],[-77.058993,42.591463],[-77.059074,42.59228],[-77.059089,42.592439],[-77.059135,42.592918],[-77.059151,42.593078],[-77.059231,42.593941],[-77.05936199999999,42.595344],[-77.059467,42.596532],[-77.059544,42.597396],[-77.059777,42.59992],[-77.060025,42.602608],[-77.06045899999999,42.607498],[-77.060542,42.60841],[-77.06068999999999,42.610024],[-77.060709,42.610254],[-77.060767,42.610949],[-77.060787,42.611181],[-77.060839,42.611721],[-77.060997,42.613344],[-77.06104999999999,42.613885],[-77.06108500000001,42.614249],[-77.06119200000001,42.615342],[-77.061228,42.615707],[-77.061037,42.615731],[-77.05949699999999,42.615785],[-77.05883,42.615786],[-77.058359,42.615762],[-77.057632,42.615682],[-77.056685,42.615539],[-77.05647,42.615507],[-77.05077900000001,42.614689],[-77.049908,42.614581],[-77.049526,42.614564],[-77.044111,42.61468],[-77.04307300000001,42.614714],[-77.040458,42.6148],[-77.038945,42.61483],[-77.038515,42.614854],[-77.03626,42.614934],[-77.03594099999999,42.614946],[-77.034437,42.61499],[-77.02949099999999,42.615097],[-77.027237,42.615147],[-77.024953,42.615195],[-77.022509,42.615248],[-77.019198,42.615292],[-77.01810399999999,42.615314],[-77.015821,42.615364],[-77.01480599999999,42.615385],[-77.01176100000001,42.615448],[-77.010746,42.615469],[-77.009777,42.615489],[-77.008145,42.615523],[-77.006872,42.615544],[-77.005904,42.615561],[-77.005371,42.61557],[-77.00377400000001,42.615597],[-77.003242,42.615607],[-77.00305299999999,42.615609],[-77.00248999999999,42.615617],[-77.002303,42.615621],[-77.001486,42.615632],[-77.000221,42.615652],[-76.999037,42.615683],[-76.998875,42.615688],[-76.998221,42.615696],[-76.99816300000001,42.614643],[-76.997989,42.611484],[-76.99793200000001,42.610431],[-76.997935,42.610287],[-76.997936,42.610266],[-76.99797700000001,42.610041],[-76.998037,42.609868],[-76.998041,42.609859],[-76.99810600000001,42.609743],[-76.99818399999999,42.609633],[-76.998285,42.609522],[-76.998451,42.609342],[-76.99888799999999,42.608914],[-76.999093,42.608715],[-77.0,42.607834],[-77.00019899999999,42.607641],[-77.002499,42.605424],[-77.002959,42.60497],[-77.00311000000001,42.604779],[-77.003182,42.604632],[-77.003229,42.60443],[-77.00323299999999,42.60426],[-77.003238,42.604121],[-77.003136,42.602723],[-77.003084,42.602095],[-77.003077,42.602003],[-77.002915,42.599845],[-77.00286199999999,42.599126],[-77.002844,42.598904],[-77.002793,42.598242],[-77.002776,42.598021],[-77.002764,42.597807],[-77.002729,42.597165],[-77.002718,42.596952],[-77.002708,42.596776],[-77.002679,42.596248],[-77.00266999999999,42.596072],[-77.002666,42.596022],[-77.00265899999999,42.59592],[-77.002655,42.595874],[-77.002652,42.595825],[-77.00261999999999,42.595383],[-77.00252399999999,42.594063],[-77.002492,42.593624],[-77.00248499999999,42.593531],[-77.002466,42.593252],[-77.00246,42.59316],[-77.002458,42.593136],[-77.002448,42.592987],[-77.00241699999999,42.59247],[-77.00240700000001,42.592298],[-77.002385,42.591952],[-77.00232200000001,42.590915],[-77.002301,42.59057],[-77.002269,42.589959],[-77.00217499999999,42.588127],[-77.002144,42.587517],[-77.002104,42.586895],[-77.001986,42.585034],[-77.001948,42.584414],[-77.00194399999999,42.584368],[-77.00193899999999,42.584293],[-77.00193299999999,42.584233],[-77.001931,42.58419],[-77.001915,42.583981],[-77.00187,42.583357],[-77.00185500000001,42.583149],[-77.001845,42.583015],[-77.001803,42.582327],[-77.001807,42.582249],[-77.001824,42.582],[-77.001864,42.581792],[-77.00196200000001,42.581525],[-77.002351,42.580789],[-77.002422,42.580562],[-77.002498,42.580074],[-77.002554,42.579684],[-77.002683,42.578792],[-77.00230999999999,42.578776],[-77.00134199999999,42.578782],[-76.997325,42.578809],[-76.996683,42.578814],[-76.996398,42.578798],[-76.996242,42.578761],[-76.996099,42.578702],[-76.99601800000001,42.578649],[-76.995952,42.578585],[-76.995895,42.578492],[-76.99587,42.578379],[-76.995818,42.577518],[-76.99579799999999,42.577237],[-76.995514,42.572866],[-76.99550000000001,42.572637],[-76.995423,42.57141],[-76.995384,42.570792],[-76.99538099999999,42.570752],[-76.995248,42.568778],[-76.995233,42.568544],[-76.995204,42.568121],[-76.99517899999999,42.567765],[-76.99510600000001,42.566698],[-76.995082,42.566343],[-76.995013,42.565352],[-76.994912,42.56388],[-76.994809,42.56238],[-76.994741,42.56139],[-76.994737,42.561341],[-76.994725,42.561195],[-76.994721,42.561147],[-76.99469499999999,42.560824],[-76.994658,42.560359],[-76.99464399999999,42.560189],[-76.994562,42.559073],[-76.99450400000001,42.558444],[-76.994438,42.557511],[-76.994421,42.557316],[-76.994338,42.556359],[-76.99430099999999,42.555855],[-76.994191,42.554342],[-76.99415500000001,42.553839],[-76.99408099999999,42.552848],[-76.99405299999999,42.552465],[-76.99399200000001,42.551876],[-76.993826,42.54998],[-76.993819,42.549879],[-76.993758,42.548888],[-76.993707,42.548072],[-76.9937,42.547992],[-76.993607,42.546921],[-76.993497,42.545308],[-76.99342799999999,42.544414],[-76.99342,42.54432],[-76.993398,42.544038],[-76.993391,42.543944],[-76.99317499999999,42.540755],[-76.993103,42.539677],[-76.992975,42.538292],[-76.99297300000001,42.538236],[-76.99274800000001,42.535809],[-76.99237599999999,42.531202],[-76.99233700000001,42.53071],[-76.99214000000001,42.528016],[-76.992131,42.527898],[-76.992108,42.52757],[-76.992018,42.526236],[-76.991989,42.525792],[-76.99197100000001,42.525685],[-76.99194799999999,42.525417],[-76.991855,42.524293],[-76.99182399999999,42.523918],[-76.99181799999999,42.523852],[-76.99180200000001,42.523655],[-76.99179700000001,42.52359],[-76.991776,42.523333],[-76.991736,42.522837],[-76.991725,42.522681],[-76.991657,42.521636],[-76.99155,42.519953],[-76.99154,42.519785],[-76.991522,42.519043],[-76.991502,42.518763],[-76.991443,42.517925],[-76.99142399999999,42.517646],[-76.991181,42.514463],[-76.991164,42.51421],[-76.990894,42.510133],[-76.99082300000001,42.509181],[-76.990696,42.507182],[-76.99063599999999,42.506316],[-76.990493,42.503895],[-76.990409,42.502447],[-76.990298,42.500455],[-76.990273,42.500116],[-76.99020899999999,42.499204],[-76.9902,42.4991],[-76.990172,42.498762],[-76.990162,42.498585],[-76.990132,42.498056],[-76.990123,42.497882],[-76.99010199999999,42.497558],[-76.99004499999999,42.496593],[-76.990028,42.496271],[-76.989925,42.494828],[-76.98985500000001,42.49383],[-76.989648,42.490502],[-76.989559,42.48906],[-76.98950499999999,42.488212],[-76.98943,42.48697],[-76.989372,42.485668],[-76.989347,42.485081],[-76.989329,42.484821],[-76.989988,42.484814],[-76.99196499999999,42.484797],[-76.992626,42.484791],[-76.993106,42.484787],[-76.99454799999999,42.484776],[-76.99503,42.484773],[-76.995479,42.484769],[-76.996826,42.484759],[-76.997276,42.484756],[-76.99854999999999,42.484747],[-77.00237799999999,42.484725],[-77.00365499999999,42.484718],[-77.003889,42.484719],[-77.005628,42.484718],[-77.00868800000001,42.484717],[-77.01041600000001,42.484723],[-77.01154699999999,42.484733],[-77.01327000000001,42.484753],[-77.013521,42.484742],[-77.01367399999999,42.484733],[-77.014133,42.484711],[-77.014287,42.484704],[-77.014792,42.484692],[-77.01492399999999,42.484691],[-77.016842,42.484702],[-77.017482,42.484707],[-77.017763,42.484705],[-77.01860499999999,42.4847],[-77.018888,42.484699],[-77.01890400000001,42.484697],[-77.019119,42.484697],[-77.019814,42.484694],[-77.02004700000001,42.484691],[-77.02048499999999,42.48469],[-77.021807,42.484683],[-77.022248,42.484681],[-77.022941,42.484674],[-77.025023,42.484654],[-77.025717,42.484648],[-77.026208,42.484642],[-77.027682,42.484628],[-77.02817400000001,42.484624],[-77.0282,42.484624],[-77.029169,42.484607],[-77.02952399999999,42.484602],[-77.03058299999999,42.484579],[-77.03122999999999,42.48457],[-77.032157,42.48457],[-77.03306499999999,42.484571],[-77.033154,42.484572],[-77.03346999999999,42.484572],[-77.034418,42.484572],[-77.03469800000001,42.484572],[-77.034735,42.484573],[-77.035133,42.484573],[-77.036327,42.484574],[-77.036495,42.484575],[-77.036669,42.484584],[-77.036725,42.484594],[-77.036788,42.484591],[-77.03698,42.484585],[-77.03704500000001,42.484584],[-77.037083,42.484582],[-77.037817,42.484582],[-77.04014100000001,42.484587],[-77.040918,42.48459],[-77.041079,42.48459],[-77.042799,42.484567],[-77.048446,42.484497],[-77.04981600000001,42.484481],[-77.050329,42.484475],[-77.05056500000001,42.484471],[-77.051278,42.48446],[-77.051518,42.484459],[-77.054559,42.484421],[-77.06368399999999,42.484307],[-77.066727,42.48427],[-77.068895,42.484243],[-77.0754,42.484162],[-77.077569,42.484137],[-77.07826799999999,42.484128],[-77.080367,42.484102],[-77.081067,42.484094],[-77.08208999999999,42.484081],[-77.083437,42.484064],[-77.090547,42.483976],[-77.092918,42.483947],[-77.092793,42.484193]]],"type":"Polygon"}
}