{
  "id": "360050264003",
  "type": "Feature",
  "properties": {
    "area_land":116503,
    "area_water":0,
    "geoid":"360050264003",
    "name":"Block Group 3",
    "state":"ny"
},
  "bbox": [
    -73.837301,
    40.838107,
    -73.831541,
    40.84143
],
  "geometry": {"coordinates":[[[-73.83705,40.840109],[-73.83708900000001,40.840656],[-73.837058,40.841339],[-73.834673,40.841391],[-73.83289499999999,40.84143],[-73.83252899999999,40.84095],[-73.83206199999999,40.84038],[-73.831541,40.839747],[-73.833265,40.83893],[-73.835007,40.838107],[-73.83568,40.838677],[-73.835801,40.838776],[-73.83628299999999,40.839171],[-73.837002,40.83977],[-73.837301,40.840019],[-73.83705,40.840109]]],"type":"Polygon"}
}