{
  "id": "360650216021",
  "type": "Feature",
  "properties": {
    "area_land":1181452,
    "area_water":0,
    "geoid":"360650216021",
    "name":"Block Group 1",
    "state":"ny"
},
  "bbox": [
    -75.233755,
    43.11484,
    -75.210714,
    43.132438
],
  "geometry": {"coordinates":[[[-75.23368499999999,43.123151],[-75.23356699999999,43.123325],[-75.233457,43.123488],[-75.23268899999999,43.124625],[-75.22990799999999,43.128469],[-75.22865299999999,43.13017],[-75.227108,43.132269],[-75.226973,43.132438],[-75.226094,43.132088],[-75.225206,43.131672],[-75.225084,43.131607],[-75.224104,43.131131],[-75.223606,43.130879],[-75.22353,43.130849],[-75.223463,43.130822],[-75.223315,43.130774],[-75.22305900000001,43.130691],[-75.21880400000001,43.129192],[-75.217546,43.128816],[-75.217675,43.12878],[-75.217833,43.128689],[-75.218025,43.128519],[-75.218402,43.128074],[-75.218616,43.127799],[-75.219084,43.127223],[-75.219323,43.126971],[-75.21983899999999,43.126332],[-75.22003100000001,43.126125],[-75.220561,43.12551],[-75.220894,43.125098],[-75.221459,43.124427],[-75.222689,43.122935],[-75.22368899999999,43.121742],[-75.223996,43.121347],[-75.223153,43.121035],[-75.22232099999999,43.120727],[-75.220625,43.120104],[-75.219658,43.119745],[-75.218667,43.119378],[-75.21757700000001,43.118971],[-75.216589,43.118606],[-75.21563500000001,43.118253],[-75.21555600000001,43.118223],[-75.213982,43.117641],[-75.213792,43.117571],[-75.212349,43.117039],[-75.212346,43.116879],[-75.212338,43.116784],[-75.212007,43.116801],[-75.21172,43.116784],[-75.211454,43.116714],[-75.21089000000001,43.116509],[-75.210714,43.116443],[-75.210854,43.116287],[-75.211259,43.115799],[-75.21137299999999,43.115669],[-75.211935,43.11518],[-75.21207800000001,43.115073],[-75.212272,43.114927],[-75.212388,43.11484],[-75.21245999999999,43.114871],[-75.21348,43.115316],[-75.21451500000001,43.115765],[-75.216341,43.116572],[-75.21813899999999,43.11729],[-75.223957,43.119435],[-75.224726,43.119712],[-75.225268,43.119914],[-75.22626099999999,43.120285],[-75.227974,43.120912],[-75.230498,43.121847],[-75.23083699999999,43.12197],[-75.230891,43.121989],[-75.233526,43.122963],[-75.233755,43.123047],[-75.23368499999999,43.123151]]],"type":"Polygon"}
}