{
  "id": "360610213033",
  "type": "Feature",
  "properties": {
    "area_land":26553,
    "area_water":0,
    "geoid":"360610213033",
    "name":"Block Group 3",
    "state":"ny"
},
  "bbox": [
    -73.95311,
    40.81294,
    -73.95086,
    40.81507
],
  "geometry": {"coordinates":[[[-73.953075,40.814299],[-73.952974,40.81507],[-73.95086000000001,40.814187],[-73.951322,40.813567],[-73.95177,40.81294],[-73.95311,40.813495],[-73.953075,40.814299]]],"type":"Polygon"}
}