{
  "id": "360050399024",
  "type": "Feature",
  "properties": {
    "area_land":13880,
    "area_water":0,
    "geoid":"360050399024",
    "name":"Block Group 4",
    "state":"ny"
},
  "bbox": [
    -73.896425,
    40.860744,
    -73.894825,
    40.862258
],
  "geometry": {"coordinates":[[[-73.895884,40.862258],[-73.894825,40.862065],[-73.895376,40.860744],[-73.89642499999999,40.860997],[-73.895884,40.862258]]],"type":"Polygon"}
}