{
  "id": "361190035002",
  "type": "Feature",
  "properties": {
    "area_land":253956,
    "area_water":0,
    "geoid":"361190035002",
    "name":"Block Group 2",
    "state":"ny"
},
  "bbox": [
    -73.853528,
    40.907073,
    -73.845758,
    40.914801
],
  "geometry": {"coordinates":[[[-73.853069,40.908021],[-73.85271400000001,40.908446],[-73.852369,40.90888],[-73.85207800000001,40.908887],[-73.852046,40.908959],[-73.851872,40.909159],[-73.851812,40.909229],[-73.851634,40.909426],[-73.851484,40.909592],[-73.851123,40.910009],[-73.85137899999999,40.910044],[-73.85218399999999,40.909515],[-73.852678,40.909899],[-73.851119,40.911194],[-73.851282,40.911503],[-73.85128,40.911857],[-73.85128,40.912476],[-73.851259,40.912506],[-73.85063,40.913343],[-73.850297,40.91375],[-73.85025,40.913814],[-73.850049,40.914062],[-73.849103,40.914592],[-73.848916,40.914658],[-73.848827,40.914688],[-73.848313,40.914801],[-73.848159,40.914731],[-73.84766399999999,40.914501],[-73.847478,40.914413],[-73.84653400000001,40.913964],[-73.845758,40.913585],[-73.84711,40.91199],[-73.846261,40.911573],[-73.847409,40.910166],[-73.847863,40.909573],[-73.84796799999999,40.909401],[-73.84826099999999,40.909322],[-73.84960100000001,40.908831],[-73.85005700000001,40.908639],[-73.85087300000001,40.908258],[-73.851054,40.908162],[-73.851901,40.907666],[-73.852453,40.907304],[-73.85279,40.907073],[-73.853528,40.907465],[-73.853069,40.908021]]],"type":"Polygon"}
}