{
  "id": "360290088003",
  "type": "Feature",
  "properties": {
    "area_land":505584,
    "area_water":0,
    "geoid":"360290088003",
    "name":"Block Group 3",
    "state":"ny"
},
  "bbox": [
    -78.88949,
    42.958572,
    -78.878726,
    42.964229
],
  "geometry": {"coordinates":[[[-78.88949,42.958915],[-78.88915900000001,42.959224],[-78.889034,42.959916],[-78.88892,42.960537],[-78.888875,42.960779],[-78.888847,42.960931],[-78.88878800000001,42.961248],[-78.888671,42.961937],[-78.888499,42.962878],[-78.88841499999999,42.963334],[-78.888279,42.964081],[-78.885403,42.96412],[-78.88211,42.964172],[-78.878745,42.964229],[-78.87873999999999,42.963569],[-78.87873999999999,42.963487],[-78.87873500000001,42.962782],[-78.87873500000001,42.962761],[-78.87873,42.962092],[-78.87872900000001,42.961871],[-78.878726,42.961393],[-78.878728,42.960925],[-78.878728,42.960701],[-78.878731,42.960159],[-78.878731,42.960079],[-78.87873399999999,42.959389],[-78.878737,42.958634],[-78.879368,42.958629],[-78.880381,42.958623],[-78.8814,42.958616],[-78.88195399999999,42.958612],[-78.882357,42.958611],[-78.88258500000001,42.95861],[-78.882761,42.95861],[-78.883422,42.958604],[-78.88404800000001,42.958599],[-78.885233,42.958597],[-78.885805,42.958593],[-78.887106,42.958588],[-78.88916999999999,42.958575],[-78.88924900000001,42.958572],[-78.889287,42.958572],[-78.88949,42.958915]]],"type":"Polygon"}
}