{
  "id": "360550069001",
  "type": "Feature",
  "properties": {
    "area_land":176090,
    "area_water":0,
    "geoid":"360550069001",
    "name":"Block Group 1",
    "state":"ny"
},
  "bbox": [
    -77.63605,
    43.131027,
    -77.628847,
    43.13648
],
  "geometry": {"coordinates":[[[-77.63603999999999,43.131092],[-77.636032,43.132074],[-77.636028,43.132582],[-77.636028,43.133072],[-77.63603000000001,43.133826],[-77.63603000000001,43.134381],[-77.63602299999999,43.135034],[-77.632498,43.135038],[-77.63249999999999,43.135264],[-77.63250600000001,43.135919],[-77.629797,43.135904],[-77.628928,43.13648],[-77.628911,43.135373],[-77.628894,43.135261],[-77.62884699999999,43.135101],[-77.62953,43.134637],[-77.62990600000001,43.134389],[-77.63031599999999,43.134118],[-77.630849,43.133757],[-77.63163,43.133227],[-77.63202800000001,43.132933],[-77.632412,43.132684],[-77.63258500000001,43.132579],[-77.632666,43.13254],[-77.633673,43.132127],[-77.633775,43.132081],[-77.63381,43.132056],[-77.634913,43.131088],[-77.635019,43.131061],[-77.63515099999999,43.131037],[-77.63535400000001,43.131027],[-77.635689,43.131037],[-77.63593400000001,43.131048],[-77.63605,43.131069],[-77.63603999999999,43.131092]]],"type":"Polygon"}
}