{
  "id": "360390801001",
  "type": "Feature",
  "properties": {
    "area_land":63247344,
    "area_water":867095,
    "geoid":"360390801001",
    "name":"Block Group 1",
    "state":"ny"
},
  "bbox": [
    -73.949209,
    42.380723,
    -73.8366,
    42.456097
],
  "geometry": {"coordinates":[[[-73.94914300000001,42.388145],[-73.949085,42.390302],[-73.949051,42.391637],[-73.949049,42.391735],[-73.948937,42.395338],[-73.948882,42.398743],[-73.948671,42.401841],[-73.94860199999999,42.40337],[-73.948392,42.407021],[-73.948268,42.410516],[-73.948216,42.412315],[-73.948234,42.413193],[-73.94822499999999,42.413488],[-73.948159,42.416191],[-73.948099,42.419562],[-73.948099,42.42322],[-73.94809100000001,42.424904],[-73.94808500000001,42.427099],[-73.948024,42.431202],[-73.948094,42.434033],[-73.94800499999999,42.437634],[-73.94799999999999,42.438175],[-73.947996,42.440468],[-73.948003,42.443204],[-73.94761200000001,42.443243],[-73.94231000000001,42.443794],[-73.93997299999999,42.44405],[-73.939837,42.444063],[-73.937867,42.444281],[-73.93326,42.444814],[-73.931701,42.445044],[-73.93149099999999,42.445075],[-73.93136800000001,42.445093],[-73.930699,42.445192],[-73.929697,42.445341],[-73.92714700000001,42.445718],[-73.920097,42.446628],[-73.915632,42.447295],[-73.91353599999999,42.447608],[-73.90791900000001,42.44839],[-73.907754,42.448413],[-73.907085,42.448507],[-73.90558,42.44874],[-73.905478,42.448756],[-73.90382700000001,42.448967],[-73.903599,42.448999],[-73.901037,42.449362],[-73.89490000000001,42.450216],[-73.892771,42.45055],[-73.892719,42.450558],[-73.889765,42.451008],[-73.886126,42.451507],[-73.885986,42.451526],[-73.884536,42.451726],[-73.879131,42.452458],[-73.878651,42.452528],[-73.878505,42.452549],[-73.87661199999999,42.452803],[-73.876035,42.452881],[-73.874571,42.453078],[-73.86570399999999,42.454355],[-73.86559,42.454372],[-73.85407600000001,42.456095],[-73.854061,42.456097],[-73.854068,42.456065],[-73.854153,42.455774],[-73.85486299999999,42.454682],[-73.855035,42.454439],[-73.85509,42.454296],[-73.85512799999999,42.454166],[-73.855132,42.454025],[-73.85506700000001,42.453778],[-73.85501600000001,42.453693],[-73.854923,42.453518],[-73.854325,42.452709],[-73.853995,42.452372],[-73.853295,42.45176],[-73.852943,42.451463],[-73.8524,42.450994],[-73.852025,42.4507],[-73.85106500000001,42.449985],[-73.85090700000001,42.449896],[-73.850703,42.449814],[-73.85037699999999,42.449741],[-73.84972,42.449582],[-73.84878399999999,42.449366],[-73.847889,42.449199],[-73.847495,42.449103],[-73.846975,42.448959],[-73.846428,42.448775],[-73.846266,42.448703],[-73.846042,42.448579],[-73.845657,42.448342],[-73.845471,42.448204],[-73.845311,42.448063],[-73.84521100000001,42.447944],[-73.845142,42.447851],[-73.845077,42.447697],[-73.845035,42.447485],[-73.845012,42.447327],[-73.844965,42.44719],[-73.844905,42.447053],[-73.844792,42.446904],[-73.844578,42.446713],[-73.843952,42.446237],[-73.843512,42.445871],[-73.843345,42.445765],[-73.843146,42.445659],[-73.84303,42.445608],[-73.842867,42.445557],[-73.842691,42.445516],[-73.84254300000001,42.445494],[-73.84237899999999,42.44548],[-73.842218,42.445483],[-73.84205900000001,42.445505],[-73.841551,42.445612],[-73.841326,42.445653],[-73.840929,42.445678],[-73.84075199999999,42.445677],[-73.840352,42.445653],[-73.83999799999999,42.445619],[-73.839647,42.445598],[-73.83945300000001,42.445598],[-73.83926099999999,42.445612],[-73.838919,42.44566],[-73.838525,42.445726],[-73.838572,42.445404],[-73.838617,42.445256],[-73.838678,42.445103],[-73.838774,42.444934],[-73.838981,42.444617],[-73.839134,42.44437],[-73.839281,42.44409],[-73.839478,42.443791],[-73.83965999999999,42.443549],[-73.839832,42.443258],[-73.84004400000001,42.442933],[-73.840266,42.442523],[-73.840458,42.442145],[-73.840608,42.441803],[-73.84062,42.441777],[-73.840667,42.441653],[-73.840675,42.441497],[-73.840675,42.441208],[-73.840626,42.440664],[-73.840593,42.440421],[-73.840525,42.440142],[-73.840476,42.440018],[-73.840401,42.439863],[-73.840265,42.439648],[-73.840097,42.439369],[-73.83981799999999,42.43903],[-73.839527,42.438646],[-73.83945900000001,42.438536],[-73.839409,42.438436],[-73.839372,42.43833],[-73.839366,42.438243],[-73.839372,42.438143],[-73.83938999999999,42.437987],[-73.839451,42.437713],[-73.83950900000001,42.437509],[-73.839578,42.437309],[-73.83971099999999,42.436977],[-73.839831,42.436719],[-73.839927,42.436478],[-73.83995,42.436373],[-73.83996399999999,42.436251],[-73.839973,42.436037],[-73.83996399999999,42.435881],[-73.839973,42.435559],[-73.84005500000001,42.435212],[-73.84013299999999,42.434937],[-73.840315,42.434482],[-73.840408,42.434284],[-73.840549,42.433942],[-73.84060100000001,42.433762],[-73.84060700000001,42.433613],[-73.840591,42.433558],[-73.84056099999999,42.433503],[-73.840498,42.433433],[-73.840121,42.433117],[-73.839822,42.432847],[-73.839573,42.432566],[-73.839336,42.432254],[-73.839189,42.431987],[-73.839145,42.431854],[-73.839023,42.431443],[-73.838893,42.43073],[-73.83886099999999,42.430245],[-73.838883,42.429908],[-73.838967,42.428924],[-73.839051,42.428495],[-73.839175,42.428109],[-73.839288,42.427651],[-73.839302,42.427458],[-73.839282,42.427132],[-73.839271,42.426979],[-73.839271,42.426242],[-73.839258,42.426085],[-73.83926700000001,42.425932],[-73.83929000000001,42.425823],[-73.83932299999999,42.425745],[-73.83937299999999,42.42567],[-73.839433,42.425602],[-73.839534,42.425514],[-73.839809,42.425304],[-73.839865,42.425246],[-73.839957,42.425087],[-73.840003,42.424985],[-73.840306,42.42418],[-73.84030300000001,42.424155],[-73.840339,42.424078],[-73.840389,42.423816],[-73.840478,42.42322],[-73.840475,42.42297],[-73.840395,42.422675],[-73.84016,42.421926],[-73.840099,42.421787],[-73.84006100000001,42.421738],[-73.840018,42.421716],[-73.840048,42.421588],[-73.840057,42.421445],[-73.840068,42.41937],[-73.840063,42.41913],[-73.840068,42.419061],[-73.84004,42.418971],[-73.840003,42.418903],[-73.83993599999999,42.418841],[-73.83964,42.418674],[-73.83955,42.418612],[-73.83947999999999,42.418556],[-73.83938999999999,42.418461],[-73.839336,42.418394],[-73.839287,42.418312],[-73.83923799999999,42.418218],[-73.83922800000001,42.418194],[-73.83917099999999,42.418057],[-73.83913,42.417897],[-73.83908,42.417658],[-73.83902999999999,42.417382],[-73.838999,42.417144],[-73.839011,42.416835],[-73.83902999999999,42.41668],[-73.83907000000001,42.41644],[-73.839097,42.416298],[-73.839195,42.415788],[-73.839235,42.41554],[-73.83924,42.415446],[-73.83917599999999,42.414597],[-73.83917,42.414342],[-73.839163,42.414275],[-73.839135,42.414181],[-73.83879,42.413732],[-73.838627,42.413617],[-73.83824,42.413299],[-73.83815199999999,42.413208],[-73.83811,42.413158],[-73.838064,42.41309],[-73.838021,42.413015],[-73.837992,42.412933],[-73.83796700000001,42.412817],[-73.83796100000001,42.412665],[-73.83804000000001,42.412062],[-73.83804600000001,42.411888],[-73.83804000000001,42.411615],[-73.837991,42.411047],[-73.83797300000001,42.410453],[-73.837979,42.409805],[-73.838033,42.409252],[-73.83803899999999,42.408984],[-73.838021,42.408877],[-73.83799,42.408761],[-73.837936,42.408609],[-73.83782100000001,42.408332],[-73.837681,42.407955],[-73.837633,42.407725],[-73.837621,42.40756],[-73.837638,42.407424],[-73.83766799999999,42.40708],[-73.83781500000001,42.406108],[-73.837869,42.405666],[-73.83792800000001,42.405273],[-73.83799,42.405029],[-73.838297,42.404251],[-73.838365,42.404002],[-73.838413,42.40377],[-73.838431,42.4036],[-73.838437,42.403207],[-73.83839999999999,42.402841],[-73.838309,42.401779],[-73.838261,42.401472],[-73.838206,42.401257],[-73.83816400000001,42.401119],[-73.837181,42.398594],[-73.836986,42.397955],[-73.836901,42.397628],[-73.836822,42.397392],[-73.836742,42.397218],[-73.83665000000001,42.396976],[-73.836625,42.39686],[-73.836631,42.395695],[-73.8366,42.395468],[-73.83714999999999,42.395563],[-73.83745500000001,42.395609],[-73.837643,42.395626],[-73.838065,42.395639],[-73.838326,42.395632],[-73.83889000000001,42.395602],[-73.8391,42.395614],[-73.83928,42.395663],[-73.83946899999999,42.395758],[-73.839642,42.395895],[-73.839831,42.396081],[-73.840138,42.396326],[-73.84027,42.396403],[-73.84059000000001,42.396526],[-73.841345,42.396774],[-73.84147400000001,42.396834],[-73.84160900000001,42.396916],[-73.841735,42.397014],[-73.841813,42.397118],[-73.841883,42.397263],[-73.841948,42.397477],[-73.841993,42.3977],[-73.841993,42.39786],[-73.841977,42.397954],[-73.84192400000001,42.39812],[-73.841899,42.398268],[-73.841891,42.398398],[-73.841903,42.398501],[-73.841944,42.398661],[-73.84201899999999,42.398841],[-73.842146,42.399011],[-73.84247000000001,42.399352],[-73.842673,42.399494],[-73.842833,42.399592],[-73.84299799999999,42.399668],[-73.843163,42.399732],[-73.843362,42.399771],[-73.844498,42.399809],[-73.84603199999999,42.399866],[-73.84614500000001,42.399283],[-73.846214,42.398973],[-73.846266,42.398843],[-73.84634200000001,42.39868],[-73.846452,42.398504],[-73.84667,42.39819],[-73.846887,42.397923],[-73.847146,42.397671],[-73.84733300000001,42.397468],[-73.847534,42.397208],[-73.84808099999999,42.396358],[-73.848202,42.3962],[-73.848288,42.396127],[-73.84842500000001,42.396027],[-73.848625,42.395918],[-73.84965,42.395449],[-73.849836,42.395339],[-73.85000100000001,42.395225],[-73.850284,42.394998],[-73.85062000000001,42.394742],[-73.850762,42.394591],[-73.851105,42.394145],[-73.85123900000001,42.393948],[-73.85137,42.393677],[-73.851428,42.393502],[-73.851575,42.392932],[-73.851686,42.392595],[-73.85179100000001,42.39232],[-73.852008,42.391593],[-73.852045,42.391425],[-73.852052,42.391299],[-73.852036,42.391191],[-73.85202200000001,42.391156],[-73.851867,42.39078],[-73.85183499999999,42.390688],[-73.851814,42.390501],[-73.85182500000001,42.390258],[-73.851838,42.390151],[-73.85184099999999,42.390127],[-73.851873,42.390007],[-73.852019,42.389646],[-73.852031,42.389616],[-73.852075,42.389461],[-73.852166,42.388831],[-73.85221,42.388683],[-73.852301,42.388464],[-73.85269599999999,42.387738],[-73.852982,42.387303],[-73.85308999999999,42.387188],[-73.85335499999999,42.386936],[-73.853469,42.386817],[-73.853571,42.386701],[-73.85377099999999,42.38649],[-73.854052,42.386203],[-73.85415999999999,42.386067],[-73.854257,42.385928],[-73.8545,42.385401],[-73.854624,42.38519],[-73.854732,42.385062],[-73.855073,42.384755],[-73.855127,42.384688],[-73.855279,42.384453],[-73.855462,42.38407],[-73.85554399999999,42.383922],[-73.855754,42.383588],[-73.856094,42.383097],[-73.856376,42.382638],[-73.856477,42.382415],[-73.856531,42.382265],[-73.85680499999999,42.381743],[-73.85709199999999,42.381127],[-73.857214,42.380723],[-73.869483,42.381416],[-73.872675,42.381587],[-73.873891,42.381645],[-73.879514,42.381919],[-73.886073,42.382343],[-73.888937,42.382493],[-73.895194,42.382944],[-73.89802,42.383106],[-73.900552,42.38325],[-73.908293,42.383697],[-73.91607500000001,42.384171],[-73.917057,42.384228],[-73.922906,42.384576],[-73.92643200000001,42.384803],[-73.92753,42.384888],[-73.92915499999999,42.385002],[-73.93560600000001,42.385293],[-73.94138,42.38565],[-73.945035,42.385887],[-73.946012,42.385954],[-73.947864,42.386082],[-73.949209,42.38616],[-73.94914300000001,42.388145]]],"type":"Polygon"}
}