{
  "id": "360271407005",
  "type": "Feature",
  "properties": {
    "area_land":2889497,
    "area_water":14413,
    "geoid":"360271407005",
    "name":"Block Group 5",
    "state":"ny"
},
  "bbox": [
    -73.919016,
    41.624898,
    -73.898522,
    41.649108
],
  "geometry": {"coordinates":[[[-73.919016,41.640134],[-73.918998,41.640179],[-73.918897,41.640261],[-73.918592,41.640427],[-73.918499,41.640513],[-73.918446,41.640654],[-73.918452,41.640721],[-73.918508,41.640924],[-73.918502,41.640969],[-73.91848,41.640997],[-73.918435,41.641014],[-73.918339,41.641031],[-73.918308,41.641026],[-73.918192,41.641008],[-73.917922,41.640845],[-73.917849,41.640817],[-73.917798,41.640817],[-73.91774700000001,41.640839],[-73.917753,41.641143],[-73.91771900000001,41.641346],[-73.917652,41.641436],[-73.917607,41.641458],[-73.91755000000001,41.64147],[-73.91730800000001,41.641442],[-73.917239,41.64141],[-73.91722300000001,41.641391],[-73.91721200000001,41.641352],[-73.91721800000001,41.641295],[-73.917207,41.641048],[-73.91713900000001,41.640828],[-73.91711100000001,41.640789],[-73.917055,41.640777],[-73.91696399999999,41.640777],[-73.91692999999999,41.6408],[-73.91687400000001,41.640958],[-73.91677300000001,41.64107],[-73.91670499999999,41.641115],[-73.91668300000001,41.641171],[-73.91668300000001,41.641425],[-73.91665999999999,41.64147],[-73.91662100000001,41.641486],[-73.91657600000001,41.641492],[-73.91653100000001,41.641486],[-73.91631700000001,41.641408],[-73.91620899999999,41.641402],[-73.91614199999999,41.641419],[-73.91610799999999,41.641447],[-73.91609699999999,41.641486],[-73.916135,41.641759],[-73.916146,41.64204],[-73.916078,41.642074],[-73.915797,41.64208],[-73.915718,41.642091],[-73.915695,41.642153],[-73.915797,41.64226],[-73.915819,41.642316],[-73.915819,41.64249],[-73.91578,41.642569],[-73.915594,41.642749],[-73.91556,41.642811],[-73.91556,41.642856],[-73.915605,41.642924],[-73.915903,41.643022],[-73.915982,41.643073],[-73.916027,41.643163],[-73.916044,41.643276],[-73.916005,41.643613],[-73.915965,41.643754],[-73.915926,41.643788],[-73.915869,41.643805],[-73.915565,41.643839],[-73.915452,41.643872],[-73.915379,41.643923],[-73.915368,41.643968],[-73.915351,41.644458],[-73.915396,41.644581],[-73.915464,41.644694],[-73.915638,41.644865],[-73.915734,41.645011],[-73.915762,41.645163],[-73.915745,41.645225],[-73.915464,41.645462],[-73.91539,41.645557],[-73.91526,41.645853],[-73.915063,41.645966],[-73.915007,41.646028],[-73.914962,41.646208],[-73.914832,41.646326],[-73.914787,41.646354],[-73.91477,41.646399],[-73.91477,41.64645],[-73.914877,41.646596],[-73.915091,41.646788],[-73.915119,41.646861],[-73.915114,41.646923],[-73.91508,41.646979],[-73.915069,41.647063],[-73.915046,41.647119],[-73.914905,41.64721],[-73.91486,41.647277],[-73.91482600000001,41.647356],[-73.914703,41.647491],[-73.91461200000001,41.647626],[-73.914584,41.647736],[-73.91448200000001,41.647939],[-73.91442000000001,41.648006],[-73.91434700000001,41.648029],[-73.91426800000001,41.648034],[-73.91401500000001,41.647995],[-73.913713,41.64791],[-73.913667,41.647995],[-73.91354200000001,41.648067],[-73.913481,41.648087],[-73.913416,41.648087],[-73.91336800000001,41.648245],[-73.913344,41.64839],[-73.913352,41.648455],[-73.9134,41.648572],[-73.91338,41.648601],[-73.913315,41.648629],[-73.913218,41.648712],[-73.913149,41.648748],[-73.913056,41.648768],[-73.912931,41.64878],[-73.91273700000001,41.648772],[-73.91266,41.6488],[-73.912599,41.648845],[-73.912462,41.648906],[-73.912397,41.648966],[-73.91230400000001,41.649083],[-73.912263,41.649108],[-73.911604,41.648587],[-73.910049,41.6487],[-73.907864,41.647348],[-73.904329,41.645547],[-73.903903,41.645415],[-73.90373700000001,41.645205],[-73.902106,41.644456],[-73.90128,41.643993],[-73.89914,41.643302],[-73.898875,41.643198],[-73.898522,41.643065],[-73.90027499999999,41.638225],[-73.90034,41.637949],[-73.90040500000001,41.637639],[-73.900417,41.637487],[-73.90039299999999,41.637397],[-73.90032100000001,41.637272],[-73.900177,41.637147],[-73.900057,41.637057],[-73.90030899999999,41.636734],[-73.90046100000001,41.636446],[-73.900505,41.636351],[-73.900536,41.636249],[-73.900569,41.636041],[-73.900856,41.635877],[-73.900982,41.635785],[-73.901641,41.635186],[-73.901747,41.635146],[-73.902083,41.635054],[-73.902328,41.634967],[-73.902484,41.634893],[-73.902728,41.634718],[-73.902895,41.63454],[-73.90294400000001,41.63445],[-73.902986,41.634341],[-73.903187,41.633971],[-73.903272,41.633763],[-73.903307,41.633529],[-73.903261,41.633005],[-73.903278,41.632553],[-73.903265,41.632429],[-73.903245,41.632374],[-73.903165,41.632261],[-73.903127,41.632208],[-73.90249900000001,41.631506],[-73.90203700000001,41.631031],[-73.901568,41.630498],[-73.901241,41.630146],[-73.90216700000001,41.62964],[-73.902056,41.629579],[-73.90189700000001,41.629473],[-73.901786,41.62938],[-73.901392,41.62896],[-73.901178,41.628697],[-73.90093899999999,41.628465],[-73.901113,41.62837],[-73.901498,41.628122],[-73.901849,41.627883],[-73.902252,41.627617],[-73.90249300000001,41.627434],[-73.902675,41.627243],[-73.902895,41.626974],[-73.90306699999999,41.626792],[-73.903308,41.626504],[-73.90385999999999,41.625875],[-73.904719,41.624898],[-73.90502600000001,41.625077],[-73.905278,41.625239],[-73.905907,41.625673],[-73.90625199999999,41.62593],[-73.907056,41.626593],[-73.907381,41.626868],[-73.908085,41.627418],[-73.90834,41.627579],[-73.908621,41.627721],[-73.908953,41.627864],[-73.909229,41.627952],[-73.90928700000001,41.627958],[-73.909452,41.627976],[-73.909733,41.627956],[-73.910487,41.627821],[-73.91098100000001,41.627762],[-73.911438,41.627746],[-73.911682,41.627754],[-73.913073,41.627829],[-73.91367200000001,41.627895],[-73.913943,41.627926],[-73.91532100000001,41.628113],[-73.915862,41.628181],[-73.916087,41.628222],[-73.916327,41.628281],[-73.916421,41.628303],[-73.916509,41.628327],[-73.916327,41.628738],[-73.916195,41.629164],[-73.916116,41.6295],[-73.91606400000001,41.629869],[-73.91604,41.630301],[-73.91607999999999,41.630874],[-73.916128,41.631161],[-73.91618200000001,41.631428],[-73.91627200000001,41.631748],[-73.91645800000001,41.632253],[-73.916641,41.632678],[-73.916872,41.633088],[-73.91730699999999,41.633822],[-73.918207,41.635246],[-73.918547,41.63583],[-73.91875899999999,41.636172],[-73.91890600000001,41.636447],[-73.918938,41.636537],[-73.918818,41.636749],[-73.918701,41.636941],[-73.91861,41.63704],[-73.918515,41.637099],[-73.91856799999999,41.637167],[-73.918594,41.637261],[-73.918757,41.637662],[-73.918761,41.637749],[-73.91874900000001,41.637781],[-73.91864700000001,41.637867],[-73.918572,41.637897],[-73.918246,41.637942],[-73.91820800000001,41.637961],[-73.918132,41.638056],[-73.917996,41.638101],[-73.917947,41.638101],[-73.917817,41.638637],[-73.91775699999999,41.638769],[-73.917607,41.639047],[-73.91758900000001,41.639223],[-73.917602,41.639296],[-73.91763,41.639368],[-73.917698,41.639419],[-73.917762,41.639441],[-73.91789900000001,41.639446],[-73.918099,41.639387],[-73.91825,41.639359],[-73.91835500000001,41.639355],[-73.91856,41.639396],[-73.918806,41.639482],[-73.918875,41.639528],[-73.918925,41.639633],[-73.918925,41.639829],[-73.918952,41.639927],[-73.919011,41.640084],[-73.919016,41.640134]]],"type":"Polygon"}
}