{
  "id": "360050360002",
  "type": "Feature",
  "properties": {
    "area_land":83969,
    "area_water":0,
    "geoid":"360050360002",
    "name":"Block Group 2",
    "state":"ny"
},
  "bbox": [
    -73.847198,
    40.865211,
    -73.842836,
    40.867555
],
  "geometry": {"coordinates":[[[-73.84719800000001,40.867555],[-73.846174,40.867503],[-73.845234,40.867484],[-73.844292,40.867466],[-73.84321300000001,40.867445],[-73.84283600000001,40.867489],[-73.84298,40.867117],[-73.843281,40.866348],[-73.84335400000001,40.865211],[-73.84436599999999,40.86523],[-73.845305,40.865248],[-73.84624700000001,40.865266],[-73.847185,40.865283],[-73.84719800000001,40.867555]]],"type":"Polygon"}
}