{
  "id": "360470549001",
  "type": "Feature",
  "properties": {
    "area_land":44430,
    "area_water":0,
    "geoid":"360470549001",
    "name":"Block Group 1",
    "state":"ny"
},
  "bbox": [
    -73.968524,
    40.709352,
    -73.962292,
    40.71082
],
  "geometry": {"coordinates":[[[-73.968524,40.71082],[-73.967657,40.710724],[-73.96677800000001,40.710627],[-73.965492,40.710482],[-73.963875,40.710297],[-73.96313499999999,40.710204],[-73.96229200000001,40.709921],[-73.962414,40.709352],[-73.964027,40.709534],[-73.96564100000001,40.709717],[-73.966949,40.709865],[-73.968524,40.710046],[-73.968524,40.71082]]],"type":"Polygon"}
}