{
  "id": "360430112001",
  "type": "Feature",
  "properties": {
    "area_land":794055,
    "area_water":87489,
    "geoid":"360430112001",
    "name":"Block Group 1",
    "state":"ny"
},
  "bbox": [
    -74.989213,
    43.026562,
    -74.974473,
    43.045909
],
  "geometry": {"coordinates":[[[-74.98921300000001,43.031433],[-74.98909999999999,43.031499],[-74.988975,43.031612],[-74.98887000000001,43.031746],[-74.988829,43.031805],[-74.988264,43.032762],[-74.987826,43.033494],[-74.98742,43.034171],[-74.98731600000001,43.034354],[-74.986968,43.034931],[-74.98665,43.035457],[-74.986529,43.03567],[-74.98643800000001,43.035831],[-74.986187,43.036319],[-74.986086,43.036531],[-74.98658500000001,43.037388],[-74.98675900000001,43.037699],[-74.986919,43.038073],[-74.98701699999999,43.038458],[-74.987047,43.038728],[-74.987028,43.039124],[-74.986898,43.039894],[-74.98652300000001,43.042041],[-74.986492,43.04223],[-74.98646100000001,43.042445],[-74.986182,43.044027],[-74.985682,43.044343],[-74.985557,43.045591],[-74.98430999999999,43.045516],[-74.983908,43.045546],[-74.983797,43.045546],[-74.983777,43.045604],[-74.983583,43.045696],[-74.983268,43.045909],[-74.983142,43.045475],[-74.98298,43.044471],[-74.982935,43.043388],[-74.983859,43.041915],[-74.98402299999999,43.04163],[-74.98416400000001,43.041384],[-74.98398400000001,43.039157],[-74.98362299999999,43.037315],[-74.982885,43.035237],[-74.98126600000001,43.033757],[-74.979962,43.032877],[-74.978919,43.032414],[-74.978301,43.032139],[-74.975892,43.030442],[-74.974932,43.029613],[-74.974473,43.02925],[-74.974923,43.029183],[-74.975548,43.029093],[-74.976293,43.02898],[-74.976703,43.028884],[-74.978042,43.028463],[-74.978566,43.028282],[-74.979775,43.027844],[-74.98005499999999,43.027743],[-74.98050000000001,43.027579],[-74.980869,43.027439],[-74.981635,43.027153],[-74.98253,43.0268],[-74.982952,43.026631],[-74.983124,43.026562],[-74.98327999999999,43.0267],[-74.98339900000001,43.026694],[-74.983503,43.026656],[-74.98355100000001,43.026656],[-74.983592,43.026676],[-74.983672,43.026742],[-74.98392800000001,43.027047],[-74.984019,43.027275],[-74.984184,43.027538],[-74.984306,43.027665],[-74.984397,43.02769],[-74.98459200000001,43.027696],[-74.98464800000001,43.027722],[-74.984798,43.027903],[-74.98451900000001,43.028059],[-74.98499700000001,43.028465],[-74.985738,43.029066],[-74.98551500000001,43.029173],[-74.987015,43.030924],[-74.987871,43.030501],[-74.988139,43.030668],[-74.988298,43.030782],[-74.98874600000001,43.031113],[-74.98891,43.031236],[-74.98915,43.031411],[-74.98921300000001,43.031433]]],"type":"Polygon"}
}