{
  "id": "360710116022",
  "type": "Feature",
  "properties": {
    "area_land":54962563,
    "area_water":1009418,
    "geoid":"360710116022",
    "name":"Block Group 2",
    "state":"ny"
},
  "bbox": [
    -74.740238,
    41.446979,
    -74.56092,
    41.5006
],
  "geometry": {"coordinates":[[[-74.74023800000001,41.494139],[-74.729703,41.494521],[-74.729631,41.494524],[-74.721774,41.49481],[-74.72160599999999,41.494816],[-74.721097,41.494835],[-74.717214,41.494976],[-74.697836,41.495678],[-74.67365599999999,41.496556],[-74.66552299999999,41.496851],[-74.665454,41.496853],[-74.648414,41.497472],[-74.648381,41.497473],[-74.646899,41.497527],[-74.646002,41.49756],[-74.6455,41.497579],[-74.645335,41.497585],[-74.64309299999999,41.497667],[-74.642742,41.497678],[-74.642634,41.497682],[-74.624605,41.498298],[-74.62047200000001,41.498421],[-74.620059,41.498433],[-74.61975099999999,41.498446],[-74.619202,41.498454],[-74.613533,41.498658],[-74.60184700000001,41.499079],[-74.601749,41.499082],[-74.595793,41.499241],[-74.59566700000001,41.499246],[-74.59284,41.499356],[-74.592761,41.499359],[-74.575379,41.500093],[-74.57189700000001,41.500093],[-74.56092,41.5006],[-74.560956,41.500539],[-74.561155,41.500261],[-74.561317,41.500073],[-74.561423,41.49995],[-74.56209,41.49926],[-74.562364,41.499007],[-74.56253599999999,41.498868],[-74.562777,41.498713],[-74.562872,41.498661],[-74.563125,41.498566],[-74.56373000000001,41.498404],[-74.564296,41.498244],[-74.564702,41.49811],[-74.565275,41.497867],[-74.56576099999999,41.497633],[-74.56586799999999,41.497572],[-74.56593100000001,41.497534],[-74.566098,41.497394],[-74.566321,41.497169],[-74.566378,41.497094],[-74.567474,41.49565],[-74.567696,41.495358],[-74.56839600000001,41.494413],[-74.56864899999999,41.494107],[-74.56887,41.493801],[-74.56905500000001,41.493484],[-74.569537,41.492583],[-74.569676,41.492349],[-74.569846,41.492096],[-74.57033,41.491465],[-74.57046,41.491321],[-74.57070299999999,41.491115],[-74.57091200000001,41.490965],[-74.57132799999999,41.490689],[-74.571592,41.490498],[-74.57175700000001,41.490372],[-74.571928,41.490204],[-74.572148,41.489932],[-74.572672,41.489202],[-74.57299399999999,41.488783],[-74.573441,41.488241],[-74.57365,41.487965],[-74.57402399999999,41.487459],[-74.57455400000001,41.486768],[-74.575194,41.486037],[-74.576267,41.484897],[-74.576564,41.484599],[-74.57693,41.484296],[-74.57723900000001,41.484082],[-74.577488,41.48394],[-74.57767200000001,41.483841],[-74.57793599999999,41.483722],[-74.578227,41.483611],[-74.57893199999999,41.483389],[-74.57952899999999,41.483186],[-74.579919,41.483023],[-74.58146600000001,41.482326],[-74.581695,41.482204],[-74.58202300000001,41.481983],[-74.582109,41.481925],[-74.582139,41.481905],[-74.58345,41.480847],[-74.583848,41.48046],[-74.584109,41.480159],[-74.58467,41.479425],[-74.58511,41.478817],[-74.585273,41.478622],[-74.585438,41.478401],[-74.58567499999999,41.478151],[-74.58580600000001,41.478036],[-74.585965,41.477922],[-74.586152,41.477804],[-74.586921,41.477368],[-74.587243,41.477177],[-74.587369,41.477096],[-74.587549,41.476961],[-74.587869,41.476678],[-74.588183,41.476322],[-74.58840600000001,41.475973],[-74.58877200000001,41.475271],[-74.588911,41.474898],[-74.589191,41.474095],[-74.58926599999999,41.473879],[-74.58951500000001,41.473124],[-74.589572,41.472965],[-74.58969999999999,41.472667],[-74.589879,41.472358],[-74.590114,41.472024],[-74.591077,41.470727],[-74.591229,41.470521],[-74.591729,41.469847],[-74.591798,41.469748],[-74.591897,41.469607],[-74.59211000000001,41.469308],[-74.592934,41.468155],[-74.593435,41.467473],[-74.593524,41.467324],[-74.593609,41.467182],[-74.593642,41.467114],[-74.593689,41.467013],[-74.593765,41.466788],[-74.593763,41.46677],[-74.593795,41.466627],[-74.59381399999999,41.466436],[-74.593807,41.466205],[-74.593751,41.465795],[-74.593536,41.464898],[-74.59343699999999,41.46447],[-74.593412,41.464207],[-74.59343699999999,41.463672],[-74.593558,41.462753],[-74.593622,41.46247],[-74.59375199999999,41.462193],[-74.593846,41.462047],[-74.594196,41.461668],[-74.595879,41.459983],[-74.59734899999999,41.458501],[-74.597421,41.45843],[-74.598775,41.457086],[-74.599298,41.456556],[-74.599469,41.456397],[-74.5996,41.456291],[-74.599847,41.456134],[-74.60041200000001,41.45581],[-74.600776,41.455615],[-74.60122,41.455395],[-74.60146400000001,41.455603],[-74.601519,41.455641],[-74.601519,41.455665],[-74.601544,41.455722],[-74.601631,41.455828],[-74.60271899999999,41.456993],[-74.60299500000001,41.45727],[-74.603101,41.457352],[-74.603212,41.457413],[-74.60330500000001,41.45745],[-74.60333,41.457455],[-74.603791,41.457551],[-74.60390099999999,41.457584],[-74.60397399999999,41.457604],[-74.60404800000001,41.457637],[-74.604178,41.457743],[-74.60449,41.458085],[-74.60471800000001,41.458281],[-74.604882,41.458378],[-74.605138,41.458488],[-74.606388,41.458928],[-74.6066,41.459022],[-74.606949,41.459197],[-74.607398,41.459458],[-74.608042,41.459873],[-74.60820699999999,41.460024],[-74.60843199999999,41.460305],[-74.60865200000001,41.460517],[-74.609104,41.460855],[-74.60981200000001,41.461433],[-74.610107,41.461633],[-74.610585,41.461951],[-74.611127,41.462338],[-74.611368,41.462464],[-74.611566,41.46255],[-74.61188799999999,41.46266],[-74.612353,41.462774],[-74.612548,41.462811],[-74.612752,41.462839],[-74.613452,41.46288],[-74.613812,41.462876],[-74.61444299999999,41.462896],[-74.614638,41.462916],[-74.61499000000001,41.46297],[-74.61521500000001,41.463014],[-74.615629,41.46312],[-74.616783,41.463511],[-74.61698699999999,41.463548],[-74.617073,41.463548],[-74.617171,41.463535],[-74.617293,41.463499],[-74.61748299999999,41.463426],[-74.617923,41.463234],[-74.618229,41.463132],[-74.61854099999999,41.462994],[-74.618871,41.46281],[-74.61899,41.462761],[-74.61921,41.462692],[-74.61963799999999,41.462587],[-74.620818,41.462316],[-74.6215,41.462167],[-74.622022,41.462035],[-74.622452,41.461934],[-74.622925,41.461849],[-74.62338800000001,41.461796],[-74.62371400000001,41.461747],[-74.62403999999999,41.461684],[-74.624713,41.461527],[-74.62595,41.461214],[-74.626389,41.461086],[-74.62661300000001,41.461014],[-74.62796,41.46054],[-74.628412,41.460391],[-74.628733,41.460296],[-74.629296,41.460162],[-74.630132,41.459975],[-74.630312,41.459928],[-74.63061999999999,41.459815],[-74.63176199999999,41.459232],[-74.631885,41.459182],[-74.632025,41.459159],[-74.63266299999999,41.459165],[-74.632773,41.459167],[-74.63370399999999,41.459152],[-74.633821,41.459163],[-74.633996,41.459218],[-74.634749,41.459578],[-74.63510599999999,41.459716],[-74.63534,41.459779],[-74.635447,41.45979],[-74.63569099999999,41.459753],[-74.63602,41.459629],[-74.63639499999999,41.459469],[-74.63711000000001,41.459145],[-74.63736,41.458999],[-74.637411,41.458966],[-74.63748200000001,41.458936],[-74.63771699999999,41.458868],[-74.638099,41.458827],[-74.63825799999999,41.458813],[-74.63865199999999,41.458777],[-74.63908600000001,41.458722],[-74.63928300000001,41.458678],[-74.639634,41.458576],[-74.639696,41.458576],[-74.639995,41.458613],[-74.640575,41.458726],[-74.642008,41.45893],[-74.64211400000001,41.458946],[-74.642623,41.459028],[-74.643142,41.459119],[-74.643286,41.459137],[-74.64346999999999,41.45916],[-74.64402200000001,41.45921],[-74.644226,41.45925],[-74.64474800000001,41.459385],[-74.645015,41.459435],[-74.64524900000001,41.45944],[-74.645439,41.459411],[-74.645504,41.459385],[-74.64558100000001,41.459312],[-74.645687,41.459123],[-74.64578899999999,41.459006],[-74.64596,41.458897],[-74.646106,41.45885],[-74.646255,41.458813],[-74.64661700000001,41.458747],[-74.64782700000001,41.458551],[-74.648173,41.458507],[-74.648552,41.458478],[-74.648948,41.458478],[-74.650291,41.458569],[-74.651006,41.458609],[-74.651669,41.458657],[-74.652038,41.458693],[-74.65224000000001,41.458719],[-74.652497,41.458767],[-74.653571,41.459008],[-74.65434,41.459221],[-74.654599,41.459269],[-74.655083,41.459324],[-74.655682,41.459403],[-74.656441,41.459524],[-74.656764,41.45957],[-74.65716500000001,41.459588],[-74.65764900000001,41.459599],[-74.657872,41.459604],[-74.658418,41.459633],[-74.65946700000001,41.459713],[-74.660121,41.459734],[-74.660887,41.459807],[-74.661407,41.459826],[-74.66201100000001,41.459832],[-74.662412,41.459851],[-74.662766,41.459897],[-74.663166,41.459991],[-74.66337,41.460011],[-74.663982,41.460034],[-74.66412800000001,41.460036],[-74.66470200000001,41.460055],[-74.66555700000001,41.459982],[-74.66567999999999,41.459963],[-74.666438,41.459772],[-74.666712,41.459676],[-74.66692,41.459641],[-74.667663,41.459582],[-74.668021,41.459528],[-74.66824800000001,41.459459],[-74.66843799999999,41.459381],[-74.66896800000001,41.459176],[-74.66936800000001,41.459045],[-74.669641,41.458918],[-74.669855,41.45879],[-74.67014899999999,41.458663],[-74.67040299999999,41.45857],[-74.67095,41.458401],[-74.671504,41.458172],[-74.671643,41.458118],[-74.671785,41.45808],[-74.672363,41.457964],[-74.67286,41.457813],[-74.67299800000001,41.457782],[-74.673456,41.45772],[-74.674361,41.457705],[-74.674446,41.457682],[-74.67452299999999,41.457643],[-74.674677,41.457493],[-74.674746,41.457443],[-74.67483799999999,41.457397],[-74.675085,41.457307],[-74.675335,41.45723],[-74.675574,41.457111],[-74.67595799999999,41.456886],[-74.676174,41.456782],[-74.67626300000001,41.456755],[-74.676374,41.456736],[-74.676678,41.456732],[-74.676959,41.456701],[-74.67743299999999,41.456578],[-74.677722,41.456536],[-74.678873,41.456588],[-74.678969,41.45658],[-74.67903800000001,41.456561],[-74.679211,41.456443],[-74.67930800000001,41.456393],[-74.679462,41.456336],[-74.67970800000001,41.456297],[-74.679885,41.456278],[-74.68064,41.456103],[-74.68126700000001,41.455889],[-74.681899,41.455766],[-74.681963,41.455742],[-74.682136,41.455627],[-74.682192,41.455582],[-74.68230699999999,41.455521],[-74.683015,41.455234],[-74.683646,41.455022],[-74.68377099999999,41.45497],[-74.684217,41.454753],[-74.68473899999999,41.454497],[-74.685017,41.454413],[-74.685413,41.45432],[-74.685733,41.454261],[-74.68633699999999,41.454185],[-74.68784100000001,41.453946],[-74.688495,41.453892],[-74.688844,41.453848],[-74.689105,41.45375],[-74.689294,41.453641],[-74.68951199999999,41.453522],[-74.689759,41.453413],[-74.690151,41.453184],[-74.690383,41.452945],[-74.690674,41.452683],[-74.691334,41.452123],[-74.69177000000001,41.451818],[-74.692322,41.451513],[-74.692598,41.451252],[-74.693135,41.450828],[-74.69344,41.450654],[-74.693658,41.450566],[-74.694123,41.450414],[-74.69419000000001,41.450386],[-74.694384,41.450305],[-74.694602,41.450186],[-74.694918,41.450042],[-74.69581700000001,41.44977],[-74.695759,41.449542],[-74.695773,41.449455],[-74.696398,41.448943],[-74.69765700000001,41.4482],[-74.697991,41.44796],[-74.698165,41.447829],[-74.698347,41.447661],[-74.698441,41.447541],[-74.698482,41.447454],[-74.69883400000001,41.446979],[-74.699361,41.447153],[-74.700002,41.447335],[-74.700289,41.447405],[-74.700491,41.447433],[-74.701419,41.447515],[-74.703226,41.447794],[-74.70431000000001,41.447886],[-74.70606600000001,41.447995],[-74.70615599999999,41.448005],[-74.706631,41.448074],[-74.70742,41.448247],[-74.70777099999999,41.448297],[-74.707909,41.448307],[-74.70817099999999,41.448297],[-74.708316,41.448283],[-74.70864899999999,41.448215],[-74.708933,41.448113],[-74.709219,41.447957],[-74.70939300000001,41.447833],[-74.709542,41.447741],[-74.70985400000001,41.44761],[-74.709942,41.447585],[-74.710087,41.447543],[-74.71022499999999,41.447522],[-74.71051199999999,41.447493],[-74.710626,41.447493],[-74.71082800000001,41.447518],[-74.71162200000001,41.447737],[-74.71168900000001,41.447781],[-74.711743,41.447841],[-74.711754,41.448497],[-74.711778,41.449044],[-74.711851,41.449478],[-74.71196399999999,41.449823],[-74.71205399999999,41.450023],[-74.712097,41.450115],[-74.712329,41.450478],[-74.71258400000001,41.450782],[-74.71268600000001,41.450886],[-74.712779,41.450981],[-74.71306300000001,41.451221],[-74.71314,41.451287],[-74.713284,41.451385],[-74.713379,41.45145],[-74.713723,41.451658],[-74.714921,41.452223],[-74.715294,41.452425],[-74.715566,41.452598],[-74.715813,41.452765],[-74.71627599999999,41.453126],[-74.71635999999999,41.453208],[-74.71647,41.453312],[-74.71771,41.45463],[-74.717771,41.45469],[-74.71782399999999,41.454742],[-74.718112,41.454992],[-74.719044,41.455734],[-74.719666,41.456307],[-74.71994100000001,41.456586],[-74.72088599999999,41.457546],[-74.721281,41.457978],[-74.721721,41.458539],[-74.722009,41.458925],[-74.722666,41.459816],[-74.723653,41.461135],[-74.72402,41.461689],[-74.724799,41.46316],[-74.724975,41.463441],[-74.72524900000001,41.46376],[-74.72535499999999,41.46387],[-74.725605,41.464081],[-74.725826,41.464251],[-74.725998,41.464359],[-74.727075,41.464925],[-74.72782100000001,41.465306],[-74.728081,41.465467],[-74.728291,41.465625],[-74.728517,41.465819],[-74.728632,41.465934],[-74.728857,41.466205],[-74.729022,41.466468],[-74.729123,41.46667],[-74.729201,41.466883],[-74.729249,41.467076],[-74.729383,41.467516],[-74.729438,41.467762],[-74.72957100000001,41.468242],[-74.729738,41.468833],[-74.72983499999999,41.469087],[-74.73012900000001,41.469712],[-74.730245,41.469908],[-74.730689,41.470579],[-74.731005,41.471102],[-74.73122600000001,41.471542],[-74.73131100000001,41.471773],[-74.73145700000001,41.4723],[-74.731498,41.472513],[-74.731525,41.472763],[-74.73153000000001,41.473438],[-74.73151900000001,41.473765],[-74.73153000000001,41.474096],[-74.731583,41.47459],[-74.731621,41.474821],[-74.731762,41.475327],[-74.73217200000001,41.47659],[-74.732283,41.476879],[-74.73245300000001,41.47724],[-74.732612,41.477542],[-74.733153,41.478375],[-74.73343,41.478767],[-74.733694,41.479058],[-74.733971,41.479296],[-74.73414099999999,41.479423],[-74.734422,41.479611],[-74.73564399999999,41.480352],[-74.735856,41.480494],[-74.736392,41.48094],[-74.736526,41.481059],[-74.736873,41.481416],[-74.737073,41.481663],[-74.737199,41.481842],[-74.737561,41.482394],[-74.737638,41.482533],[-74.737906,41.483177],[-74.737993,41.483475],[-74.73804800000001,41.483669],[-74.73817699999999,41.484433],[-74.738291,41.484788],[-74.738444,41.485127],[-74.738816,41.485861],[-74.739086,41.48639],[-74.739217,41.486713],[-74.73949,41.48754],[-74.739689,41.488493],[-74.739819,41.489416],[-74.740004,41.49131],[-74.74000599999999,41.491326],[-74.740173,41.493215],[-74.740219,41.493954],[-74.74023800000001,41.494139]]],"type":"Polygon"}
}