{
  "id": "361190079006",
  "type": "Feature",
  "properties": {
    "area_land":124685,
    "area_water":0,
    "geoid":"361190079006",
    "name":"Block Group 6",
    "state":"ny"
},
  "bbox": [
    -73.673627,
    40.99854,
    -73.668782,
    41.004209
],
  "geometry": {"coordinates":[[[-73.673627,40.999702],[-73.67357699999999,41.000063],[-73.67349900000001,41.000268],[-73.673357,41.000536],[-73.672973,41.001153],[-73.672459,41.002007],[-73.67199100000001,41.002818],[-73.671637,41.003436],[-73.671195,41.004209],[-73.67073000000001,41.004027],[-73.670366,41.00389],[-73.67003099999999,41.003761],[-73.669561,41.003556],[-73.66916399999999,41.003383],[-73.66878199999999,41.003217],[-73.66928799999999,41.002363],[-73.669905,41.001371],[-73.670534,41.000323],[-73.670699,40.999997],[-73.671075,40.999355],[-73.671685,40.99854],[-73.67233400000001,40.999088],[-73.67268300000001,40.999372],[-73.672793,40.999413],[-73.67298,40.999422],[-73.673036,40.999422],[-73.67359,40.999422],[-73.673627,40.999702]]],"type":"Polygon"}
}