{
  "id": "361031227071",
  "type": "Feature",
  "properties": {
    "area_land":620191,
    "area_water":0,
    "geoid":"361031227071",
    "name":"Block Group 1",
    "state":"ny"
},
  "bbox": [
    -73.320608,
    40.767206,
    -73.314316,
    40.779822
],
  "geometry": {"coordinates":[[[-73.32057399999999,40.770142],[-73.32056,40.770819],[-73.320544,40.771511],[-73.320528,40.772197],[-73.320514,40.772883],[-73.320503,40.773569],[-73.32048899999999,40.774255],[-73.320481,40.774937],[-73.320475,40.775623],[-73.320459,40.776318],[-73.320446,40.777003],[-73.320437,40.777652],[-73.32043299999999,40.778379],[-73.31793399999999,40.779071],[-73.317601,40.779108],[-73.316614,40.77922],[-73.31579000000001,40.779552],[-73.31567699999999,40.779603],[-73.315365,40.779736],[-73.315214,40.779775],[-73.31505900000001,40.779807],[-73.314896,40.779788],[-73.31431600000001,40.779822],[-73.314403,40.779718],[-73.314509,40.779548],[-73.314605,40.779416],[-73.31468099999999,40.779297],[-73.31473800000001,40.779159],[-73.314761,40.779061],[-73.31477,40.776999],[-73.314768,40.776686],[-73.314769,40.773943],[-73.314767,40.773563],[-73.314764,40.771397],[-73.31476000000001,40.770781],[-73.314772,40.770126],[-73.314767,40.769674],[-73.314769,40.768994],[-73.31476000000001,40.768802],[-73.314713,40.768629],[-73.314521,40.768084],[-73.315676,40.767909],[-73.315979,40.767871],[-73.31661,40.767778],[-73.31686999999999,40.767736],[-73.317544,40.767651],[-73.318521,40.767508],[-73.31950399999999,40.767362],[-73.32060799999999,40.767206],[-73.32057399999999,40.770142]]],"type":"Polygon"}
}