{
  "id": "360259702001",
  "type": "Feature",
  "properties": {
    "area_land":80821503,
    "area_water":100278,
    "geoid":"360259702001",
    "name":"Block Group 1",
    "state":"ny"
},
  "bbox": [
    -74.887806,
    42.31453,
    -74.733497,
    42.472752
],
  "geometry": {"coordinates":[[[-74.887806,42.430285],[-74.883332,42.430984],[-74.879344,42.431607],[-74.878832,42.43168],[-74.8746,42.43228],[-74.87454,42.432293],[-74.87161500000001,42.432946],[-74.869236,42.433357],[-74.851415,42.436318],[-74.85014099999999,42.436522],[-74.835262,42.438996],[-74.829081,42.442244],[-74.809899,42.45237],[-74.789399,42.463175],[-74.787211,42.464299],[-74.787189,42.46431],[-74.771123,42.472752],[-74.764268,42.465695],[-74.762913,42.464303],[-74.76176,42.463113],[-74.751076,42.452127],[-74.75067199999999,42.451713],[-74.74978400000001,42.450797],[-74.743478,42.444385],[-74.73666,42.437462],[-74.733515,42.434269],[-74.733497,42.43425],[-74.733632,42.434264],[-74.73418700000001,42.434342],[-74.734464,42.434392],[-74.73502499999999,42.4345],[-74.73558,42.434636],[-74.736132,42.434803],[-74.73640399999999,42.434894],[-74.73667500000001,42.434993],[-74.73694399999999,42.435097],[-74.73720899999999,42.435205],[-74.737999,42.435558],[-74.73889,42.435969],[-74.739018,42.436028],[-74.739099,42.436036],[-74.73914499999999,42.436044],[-74.739305,42.436058],[-74.739357,42.436058],[-74.73943199999999,42.436076],[-74.739693,42.436104],[-74.73979300000001,42.436118],[-74.739902,42.436127],[-74.740241,42.436168],[-74.74113699999999,42.43631],[-74.741609,42.436374],[-74.741843,42.43641],[-74.74283,42.436548],[-74.743432,42.436635],[-74.743617,42.436662],[-74.743678,42.436676],[-74.743949,42.436712],[-74.744158,42.436735],[-74.74450299999999,42.436786],[-74.744725,42.436831],[-74.74484099999999,42.43684],[-74.745158,42.4369],[-74.74527,42.4369],[-74.74536999999999,42.436927],[-74.745683,42.437022],[-74.745752,42.437045],[-74.74590499999999,42.437081],[-74.745942,42.437086],[-74.74607,42.437122],[-74.74613100000001,42.437145],[-74.746196,42.437181],[-74.746278,42.437199],[-74.746315,42.437214],[-74.746437,42.437263],[-74.746516,42.437271],[-74.746655,42.437284],[-74.746872,42.437282],[-74.747198,42.437255],[-74.74726699999999,42.437244],[-74.747302,42.437238],[-74.747409,42.437211],[-74.74763900000001,42.437144],[-74.747742,42.437099],[-74.748064,42.436929],[-74.74839900000001,42.436736],[-74.748711,42.436547],[-74.748817,42.436489],[-74.74892,42.43644],[-74.74925500000001,42.436292],[-74.749591,42.43613],[-74.74969900000001,42.436068],[-74.74980499999999,42.436018],[-74.749893,42.435969],[-74.749979,42.435915],[-74.750122,42.435839],[-74.750322,42.435803],[-74.750365,42.435767],[-74.75102,42.43576],[-74.751032,42.435742],[-74.7517,42.435631],[-74.751803,42.435617],[-74.75189399999999,42.435622],[-74.752014,42.435618],[-74.752347,42.435587],[-74.75247400000001,42.435565],[-74.752591,42.43557],[-74.75273,42.435583],[-74.75308699999999,42.435629],[-74.75321,42.435652],[-74.75333999999999,42.435666],[-74.753471,42.435671],[-74.753739,42.435662],[-74.754008,42.435627],[-74.75427000000001,42.435587],[-74.754411,42.435582],[-74.754558,42.435592],[-74.75482,42.435592],[-74.754966,42.435602],[-74.75511299999999,42.435606],[-74.75525500000001,42.435629],[-74.755402,42.435643],[-74.755563,42.435688],[-74.755686,42.435716],[-74.755923,42.435784],[-74.756027,42.43582],[-74.756148,42.435856],[-74.756259,42.435884],[-74.75648700000001,42.435934],[-74.756745,42.436023],[-74.75707800000001,42.436138],[-74.75719100000001,42.436165],[-74.75730299999999,42.43621],[-74.757411,42.436233],[-74.75752199999999,42.436265],[-74.75800099999999,42.436468],[-74.758132,42.436554],[-74.758197,42.436573],[-74.75841699999999,42.43664],[-74.758562,42.436667],[-74.758697,42.436681],[-74.75896400000001,42.4367],[-74.759491,42.436618],[-74.760266,42.436496],[-74.760982,42.436384],[-74.761487,42.43621],[-74.761826,42.436107],[-74.762147,42.436047],[-74.762609,42.43596],[-74.763323,42.435732],[-74.76384899999999,42.435548],[-74.764207,42.435418],[-74.764718,42.435244],[-74.765017,42.435128],[-74.76509799999999,42.435096],[-74.76545900000001,42.434935],[-74.765833,42.434755],[-74.766091,42.434643],[-74.76635,42.43454],[-74.76647800000001,42.4345],[-74.76684299999999,42.434397],[-74.76696099999999,42.434375],[-74.767616,42.434165],[-74.767741,42.434111],[-74.767858,42.434052],[-74.76807100000001,42.433927],[-74.768281,42.433792],[-74.768384,42.43372],[-74.76849,42.433657],[-74.76871,42.433536],[-74.769176,42.433317],[-74.769454,42.433185],[-74.76967,42.433079],[-74.769935,42.432949],[-74.77031700000001,42.432756],[-74.770439,42.432689],[-74.77055900000001,42.43263],[-74.770799,42.432491],[-74.77105400000001,42.432361],[-74.77154,42.432137],[-74.771861,42.432007],[-74.772229,42.431868],[-74.772447,42.431797],[-74.772701,42.43173],[-74.772972,42.431645],[-74.773403,42.431519],[-74.774056,42.431336],[-74.774218,42.431282],[-74.774394,42.431238],[-74.774902,42.431086],[-74.775065,42.431032],[-74.77538,42.430915],[-74.775831,42.4307],[-74.775971,42.430619],[-74.776121,42.430539],[-74.776518,42.430278],[-74.777024,42.429923],[-74.777145,42.429829],[-74.777276,42.429739],[-74.777479,42.42958],[-74.777653,42.429443],[-74.777852,42.429279],[-74.77789799999999,42.429241],[-74.77803,42.429142],[-74.77855099999999,42.428724],[-74.779419,42.428041],[-74.780468,42.427228],[-74.780674,42.42708],[-74.78102199999999,42.426856],[-74.78126399999999,42.426712],[-74.781931,42.426362],[-74.782205,42.426232],[-74.78317199999999,42.425824],[-74.78343700000001,42.425703],[-74.783688,42.425582],[-74.783967,42.425461],[-74.78416799999999,42.425371],[-74.78452799999999,42.425187],[-74.784761,42.425057],[-74.784874,42.424985],[-74.78532800000001,42.424716],[-74.785905,42.424384],[-74.786615,42.423984],[-74.787226,42.423625],[-74.787914,42.423194],[-74.788338,42.422911],[-74.78888999999999,42.422569],[-74.78927899999999,42.422328],[-74.78963299999999,42.422103],[-74.78985900000001,42.42195],[-74.79018499999999,42.421717],[-74.790831,42.421218],[-74.791228,42.420877],[-74.79159199999999,42.420522],[-74.79184100000001,42.420243],[-74.79207700000001,42.419951],[-74.79225599999999,42.419762],[-74.792526,42.419488],[-74.792688,42.419299],[-74.792833,42.419105],[-74.79295500000001,42.418903],[-74.79361900000001,42.417706],[-74.793699,42.417544],[-74.793814,42.417274],[-74.794037,42.416788],[-74.79412600000001,42.41664],[-74.794192,42.416561],[-74.794134,42.416541],[-74.79417100000001,42.416528],[-74.794192,42.416516],[-74.794207,42.416501],[-74.79422700000001,42.416433],[-74.794329,42.415965],[-74.794363,42.415828],[-74.794483,42.415326],[-74.79464,42.414745],[-74.794783,42.414273],[-74.79510000000001,42.413301],[-74.79524600000001,42.412796],[-74.795377,42.412292],[-74.795523,42.411631],[-74.795745,42.410474],[-74.795818,42.41001],[-74.79584800000001,42.409722],[-74.795875,42.409317],[-74.795877,42.409051],[-74.7959,42.40879],[-74.79594,42.408547],[-74.795973,42.408425],[-74.795992,42.408308],[-74.795993,42.408191],[-74.79598799999999,42.40815],[-74.79598,42.408074],[-74.79594899999999,42.407966],[-74.795896,42.407862],[-74.795821,42.407759],[-74.79573000000001,42.40765],[-74.79551499999999,42.407429],[-74.79505899999999,42.406933],[-74.794937,42.406807],[-74.794562,42.406401],[-74.794296,42.406121],[-74.794208,42.406026],[-74.794039,42.405842],[-74.79330400000001,42.405066],[-74.792931,42.404691],[-74.791903,42.403672],[-74.791524,42.40327],[-74.791201,42.402916],[-74.791158,42.402869],[-74.790795,42.402481],[-74.79046200000001,42.402102],[-74.79037,42.401971],[-74.790294,42.401845],[-74.79024099999999,42.40171],[-74.790211,42.40157],[-74.79020199999999,42.401426],[-74.790211,42.401278],[-74.79033,42.400314],[-74.79038799999999,42.399738],[-74.79043299999999,42.399171],[-74.790423,42.399013],[-74.79039,42.39886],[-74.790341,42.398707],[-74.790283,42.398558],[-74.790091,42.398112],[-74.790031,42.39795],[-74.78992700000001,42.397666],[-74.78983599999999,42.397346],[-74.7898,42.397184],[-74.78974100000001,42.396855],[-74.789699,42.396526],[-74.789699,42.396512],[-74.78969499999999,42.396359],[-74.789705,42.396188],[-74.789753,42.395837],[-74.78984699999999,42.395292],[-74.789873,42.395108],[-74.78989,42.394923],[-74.789896,42.394369],[-74.789897,42.394339],[-74.789905,42.394185],[-74.78992100000001,42.394],[-74.78994400000001,42.393816],[-74.790026,42.393275],[-74.79004,42.393161],[-74.790069,42.392915],[-74.790075,42.392735],[-74.790069,42.39256],[-74.790054,42.392413],[-74.79005100000001,42.392384],[-74.790026,42.392208],[-74.789934,42.391681],[-74.78986500000001,42.39133],[-74.789771,42.390978],[-74.789715,42.390807],[-74.789613,42.390519],[-74.789534,42.390294],[-74.789494,42.390168],[-74.78948,42.390122],[-74.78944199999999,42.389951],[-74.78942600000001,42.38978],[-74.78943,42.389609],[-74.78945400000001,42.389433],[-74.789494,42.389258],[-74.789545,42.389082],[-74.789603,42.388911],[-74.789672,42.38874],[-74.789682,42.388719],[-74.78991600000001,42.388232],[-74.789993,42.388061],[-74.790059,42.38789],[-74.790116,42.387714],[-74.790162,42.387539],[-74.79019,42.387408],[-74.790255,42.387017],[-74.790273,42.386841],[-74.790295,42.386494],[-74.790294,42.38644],[-74.79028599999999,42.386134],[-74.79019599999999,42.38458],[-74.790183,42.384405],[-74.790165,42.384166],[-74.79013500000001,42.383963],[-74.790093,42.383761],[-74.79003899999999,42.383562],[-74.789973,42.383373],[-74.789896,42.383184],[-74.78980799999999,42.382999],[-74.789709,42.382823],[-74.789625,42.382689],[-74.789599,42.382648],[-74.78948200000001,42.382476],[-74.78935799999999,42.382314],[-74.78896400000001,42.381845],[-74.78874500000001,42.38158],[-74.788319,42.381065],[-74.787345,42.379864],[-74.787254,42.379752],[-74.786993,42.379414],[-74.78687600000001,42.379243],[-74.786773,42.379071],[-74.786756,42.379035],[-74.786686,42.378891],[-74.78661200000001,42.378711],[-74.786556,42.378526],[-74.78651600000001,42.378341],[-74.786513,42.378318],[-74.786492,42.378157],[-74.786485,42.377968],[-74.786495,42.377779],[-74.786552,42.377207],[-74.78664999999999,42.376437],[-74.786715,42.376054],[-74.78675699999999,42.375861],[-74.786806,42.375667],[-74.786862,42.375474],[-74.78699400000001,42.375091],[-74.78707,42.374902],[-74.787154,42.374713],[-74.787342,42.374335],[-74.787436,42.374171],[-74.787553,42.373966],[-74.787671,42.373785],[-74.78778699999999,42.373607],[-74.78867099999999,42.372311],[-74.789906,42.370535],[-74.790126,42.370202],[-74.790356,42.369878],[-74.79048,42.369716],[-74.790611,42.369559],[-74.79089399999999,42.369244],[-74.791042,42.369092],[-74.791195,42.368943],[-74.791667,42.368507],[-74.792145,42.368085],[-74.792253,42.367995],[-74.792631,42.36768],[-74.79296600000001,42.36742],[-74.79330899999999,42.367164],[-74.793656,42.366921],[-74.79400200000001,42.366688],[-74.79451899999999,42.366351],[-74.79504900000001,42.366023],[-74.795221,42.365911],[-74.79538700000001,42.36579],[-74.795545,42.365668],[-74.79583599999999,42.365408],[-74.796093,42.365138],[-74.79631500000001,42.36485],[-74.79651699999999,42.364553],[-74.796694,42.364243],[-74.79720500000001,42.363289],[-74.79796899999999,42.361814],[-74.79847100000001,42.360824],[-74.798703,42.360324],[-74.799272,42.359132],[-74.799764,42.35812],[-74.80001300000001,42.357625],[-74.800271,42.357134],[-74.80062599999999,42.3565],[-74.800899,42.356055],[-74.801193,42.355618],[-74.802091,42.3544],[-74.802496,42.35386],[-74.80306299999999,42.353077],[-74.803274,42.35283],[-74.80338500000001,42.352709],[-74.80360899999999,42.352452],[-74.80417799999999,42.351841],[-74.80452200000001,42.351504],[-74.804892,42.351167],[-74.80544500000001,42.350681],[-74.80633899999999,42.349939],[-74.80638,42.349906],[-74.80640699999999,42.349882],[-74.80643499999999,42.349859],[-74.806562,42.349742],[-74.80668300000001,42.349616],[-74.80679000000001,42.34949],[-74.806878,42.349355],[-74.807205,42.348775],[-74.80746600000001,42.34833],[-74.807892,42.347664],[-74.808117,42.347313],[-74.80815699999999,42.347243],[-74.808278,42.34703],[-74.80835,42.346886],[-74.808915,42.345684],[-74.80935100000001,42.344793],[-74.810112,42.343345],[-74.81052099999999,42.342625],[-74.81059399999999,42.342485],[-74.810654,42.342337],[-74.810699,42.342193],[-74.81072500000001,42.34204],[-74.810734,42.341891],[-74.810733,42.341738],[-74.810715,42.341292],[-74.810699,42.341144],[-74.810675,42.340995],[-74.810635,42.340851],[-74.81061200000001,42.340789],[-74.81058299999999,42.340711],[-74.810513,42.340558],[-74.81044900000001,42.340432],[-74.810371,42.340301],[-74.809804,42.339422],[-74.80958200000001,42.339066],[-74.809442,42.338827],[-74.80932,42.338593],[-74.809212,42.338349],[-74.80903600000001,42.337998],[-74.808975,42.33789],[-74.808857,42.337703],[-74.808847,42.337687],[-74.808707,42.337497],[-74.808578,42.337313],[-74.80846099999999,42.337119],[-74.808361,42.33692],[-74.808271,42.336709],[-74.80794299999999,42.335866],[-74.807789,42.335497],[-74.80764600000001,42.335177],[-74.80743699999999,42.334631],[-74.80736899999999,42.334429],[-74.80731900000001,42.334235],[-74.807261,42.333965],[-74.807258,42.333929],[-74.807255,42.333879],[-74.807219,42.333717],[-74.807158,42.333478],[-74.807108,42.333167],[-74.80701999999999,42.333167],[-74.80671,42.33314],[-74.80655400000001,42.333121],[-74.806493,42.333109],[-74.806411,42.333036],[-74.806391,42.333008],[-74.806307,42.332932],[-74.806256,42.332878],[-74.80606899999999,42.332706],[-74.805936,42.332571],[-74.805601,42.332273],[-74.80541599999999,42.332129],[-74.805333,42.332052],[-74.805246,42.33198],[-74.805077,42.331826],[-74.804997,42.331741],[-74.804925,42.331655],[-74.80485899999999,42.331562],[-74.804805,42.331466],[-74.804706,42.331263],[-74.80466199999999,42.331155],[-74.804585,42.330934],[-74.80452200000001,42.330691],[-74.804491,42.330574],[-74.80444799999999,42.330321],[-74.804416,42.330191],[-74.80433600000001,42.329929],[-74.804171,42.329519],[-74.804107,42.329388],[-74.804041,42.329253],[-74.803996,42.329173],[-74.803968,42.329123],[-74.803957,42.329105],[-74.804102,42.329112],[-74.80465599999999,42.328883],[-74.80479800000001,42.328624],[-74.80488200000001,42.328472],[-74.804965,42.328319],[-74.80511799999999,42.328138],[-74.805361,42.328048],[-74.806636,42.32796],[-74.809065,42.327469],[-74.81076400000001,42.327472],[-74.811492,42.327563],[-74.81161299999999,42.327653],[-74.812099,42.327654],[-74.813069,42.327881],[-74.813615,42.327927],[-74.813858,42.328017],[-74.81509,42.328057],[-74.81536,42.327971],[-74.815618,42.327885],[-74.815922,42.327615],[-74.815983,42.327435],[-74.816593,42.326626],[-74.816959,42.325726],[-74.817081,42.325591],[-74.81734400000001,42.325034],[-74.81756900000001,42.324556],[-74.81757,42.324421],[-74.817814,42.324016],[-74.817814,42.323881],[-74.817936,42.323746],[-74.817936,42.323566],[-74.818119,42.323296],[-74.818242,42.322846],[-74.818425,42.322531],[-74.818487,42.322036],[-74.818609,42.321946],[-74.818673,42.32082],[-74.818916,42.32055],[-74.818916,42.32046],[-74.81995000000001,42.319696],[-74.81995000000001,42.319606],[-74.820193,42.319427],[-74.820255,42.319292],[-74.820863,42.318842],[-74.821348,42.318708],[-74.821774,42.318348],[-74.821836,42.318078],[-74.821957,42.317988],[-74.82201999999999,42.317313],[-74.822142,42.317133],[-74.822993,42.316504],[-74.823661,42.316235],[-74.82401400000001,42.316009],[-74.824153,42.315935],[-74.824274,42.315821],[-74.82431099999999,42.315791],[-74.824877,42.315336],[-74.82512,42.315246],[-74.825605,42.315247],[-74.825969,42.315563],[-74.826151,42.315608],[-74.826643,42.315621],[-74.827061,42.315339],[-74.82712100000001,42.315153],[-74.827119,42.315076],[-74.827147,42.315024],[-74.827184,42.314844],[-74.827549,42.31453],[-74.828762,42.314531],[-74.829066,42.314622],[-74.829854,42.314713],[-74.83046,42.314894],[-74.83062700000001,42.314888],[-74.830691,42.314954],[-74.832325,42.316648],[-74.83327199999999,42.317641],[-74.83359799999999,42.317983],[-74.84034699999999,42.324971],[-74.840538,42.325159],[-74.841403,42.325992],[-74.84289,42.327602],[-74.843509,42.328242],[-74.86443,42.349883],[-74.864642,42.350103],[-74.86426,42.350306],[-74.856858,42.354173],[-74.85003399999999,42.357753],[-74.849198,42.358178],[-74.83987,42.363072],[-74.837628,42.364248],[-74.828853,42.368813],[-74.833924,42.374288],[-74.83928400000001,42.380074],[-74.841832,42.382824],[-74.849074,42.390486],[-74.851215,42.392762],[-74.85219600000001,42.393805],[-74.852407,42.394028],[-74.853112,42.394776],[-74.853268,42.394941],[-74.85432,42.396055],[-74.86000300000001,42.402131],[-74.862976,42.405283],[-74.864581,42.406979],[-74.86754500000001,42.410124],[-74.86914899999999,42.411838],[-74.86940199999999,42.412107],[-74.87112399999999,42.413942],[-74.87393299999999,42.416934],[-74.87398,42.416984],[-74.874562,42.417497],[-74.881187,42.423858],[-74.881377,42.42404],[-74.881928,42.424549],[-74.88760000000001,42.430088],[-74.887806,42.430285]]],"type":"Polygon"}
}