{
  "id": "360810677002",
  "type": "Feature",
  "properties": {
    "area_land":94658,
    "area_water":0,
    "geoid":"360810677002",
    "name":"Block Group 2",
    "state":"ny"
},
  "bbox": [
    -73.877941,
    40.717205,
    -73.871296,
    40.720526
],
  "geometry": {"coordinates":[[[-73.87794100000001,40.717898],[-73.87714,40.718269],[-73.876338,40.718642],[-73.87553699999999,40.719012],[-73.87470500000001,40.719398],[-73.873875,40.719785],[-73.87336999999999,40.720018],[-73.872272,40.720526],[-73.87178400000001,40.719917],[-73.871296,40.719308],[-73.87209,40.71894],[-73.872711,40.718654],[-73.872392,40.717831],[-73.873209,40.717741],[-73.874402,40.717575],[-73.87536799999999,40.717452],[-73.87627999999999,40.717342],[-73.87638699999999,40.717329],[-73.87721999999999,40.717226],[-73.877385,40.717205],[-73.87794100000001,40.717898]]],"type":"Polygon"}
}