{
  "id": "360290079053",
  "type": "Feature",
  "properties": {
    "area_land":822934,
    "area_water":0,
    "geoid":"360290079053",
    "name":"Block Group 3",
    "state":"ny"
},
  "bbox": [
    -78.834682,
    43.005698,
    -78.822253,
    43.01965
],
  "geometry": {"coordinates":[[[-78.83465200000001,43.009507],[-78.83462,43.010329],[-78.83349800000001,43.010599],[-78.832386,43.010875],[-78.83228200000001,43.013256],[-78.83224199999999,43.01431],[-78.832212,43.015101],[-78.832212,43.015167],[-78.832218,43.015205],[-78.832252,43.015299],[-78.832309,43.015395],[-78.83319899999999,43.016335],[-78.832686,43.016595],[-78.8322,43.016846],[-78.831891,43.017006],[-78.831664,43.017123],[-78.83159499999999,43.017158],[-78.83156,43.017178],[-78.831119,43.017434],[-78.829875,43.018181],[-78.829097,43.018838],[-78.828157,43.01965],[-78.827173,43.019028],[-78.827302,43.018918],[-78.827422,43.018841],[-78.827563,43.018772],[-78.827727,43.018711],[-78.82784100000001,43.018651],[-78.827921,43.018594],[-78.829019,43.01766],[-78.82787399999999,43.016787],[-78.82744700000001,43.01646],[-78.82676600000001,43.015939],[-78.826673,43.015888],[-78.826572,43.015846],[-78.826476,43.015825],[-78.826352,43.015812],[-78.826016,43.015815],[-78.826024,43.014962],[-78.824941,43.014958],[-78.82385499999999,43.014955],[-78.822253,43.014949],[-78.82226799999999,43.013422],[-78.82228000000001,43.012432],[-78.82229100000001,43.011518],[-78.82229100000001,43.011485],[-78.822295,43.010615],[-78.822299,43.009905],[-78.822299,43.009851],[-78.82230800000001,43.009495],[-78.822323,43.008933],[-78.82232999999999,43.00749],[-78.824358,43.007489],[-78.824983,43.007489],[-78.826403,43.007487],[-78.827033,43.007265],[-78.830299,43.006068],[-78.831311,43.005698],[-78.831596,43.006137],[-78.83161800000001,43.006202],[-78.831619,43.00628],[-78.83159999999999,43.006345],[-78.83157,43.006396],[-78.83152,43.006452],[-78.83145500000001,43.006499],[-78.83136399999999,43.00654],[-78.829031,43.007385],[-78.82794800000001,43.007788],[-78.827907,43.007823],[-78.827882,43.00787],[-78.827878,43.007905],[-78.827888,43.007944],[-78.828284,43.008522],[-78.828768,43.009236],[-78.82881,43.009273],[-78.82887100000001,43.009308],[-78.828942,43.009331],[-78.829007,43.009341],[-78.831334,43.009386],[-78.831406,43.009384],[-78.831616,43.009369],[-78.831845,43.009334],[-78.83403800000001,43.008786],[-78.834231,43.008753],[-78.834397,43.008737],[-78.834682,43.008735],[-78.83465200000001,43.009507]]],"type":"Polygon"}
}