{
  "id": "361031700011",
  "type": "Feature",
  "properties": {
    "area_land":9239646,
    "area_water":3643125,
    "geoid":"361031700011",
    "name":"Block Group 1",
    "state":"ny"
},
  "bbox": [
    -72.598112,
    40.976804,
    -72.536662,
    41.020111
],
  "geometry": {"coordinates":[[[-72.598112,41.002946],[-72.580719,41.010371],[-72.565794,41.020111],[-72.562439,41.016792],[-72.560973,41.015443],[-72.55961499999999,41.015462],[-72.558127,41.013829],[-72.558097,41.013619],[-72.557867,41.012998],[-72.55702100000001,41.012803],[-72.55489300000001,41.014115],[-72.55371100000001,41.014485],[-72.55197800000001,41.013955],[-72.55087899999999,41.014165],[-72.548987,41.014466],[-72.54884199999999,41.014181],[-72.550094,41.01418],[-72.551025,41.01389],[-72.55051400000001,41.013699],[-72.54948400000001,41.013158],[-72.549003,41.011987],[-72.548811,41.011987],[-72.547774,41.011511],[-72.54778899999999,41.013188],[-72.54745200000001,41.011666],[-72.547758,41.01079],[-72.54763,41.009797],[-72.54839800000001,41.011331],[-72.548942,41.01162],[-72.549757,41.01122],[-72.549133,41.009652],[-72.54862199999999,41.009412],[-72.54825700000001,41.009174],[-72.548123,41.009023],[-72.54764299999999,41.008196],[-72.54698,41.007954],[-72.546812,41.007893],[-72.54684399999999,41.007317],[-72.547056,41.005972],[-72.546638,41.005044],[-72.546508,41.004964],[-72.54609499999999,41.003892],[-72.545717,41.003306],[-72.544479,41.001382],[-72.54418800000001,41.000341],[-72.54337200000001,40.999158],[-72.542715,40.997586],[-72.54205899999999,40.996995],[-72.540102,40.99534],[-72.53806,40.994107],[-72.537972,40.994585],[-72.537459,40.993878],[-72.537054,40.99359],[-72.53681899999999,40.993433],[-72.536744,40.993382],[-72.53666200000001,40.993322],[-72.538419,40.991801],[-72.539041,40.991192],[-72.540229,40.990481],[-72.54087,40.990214],[-72.541579,40.989993],[-72.542107,40.989849],[-72.54267400000001,40.989752],[-72.54302199999999,40.989683],[-72.54319599999999,40.989653],[-72.54463800000001,40.989407],[-72.546218,40.989138],[-72.551041,40.988221],[-72.551376,40.98817],[-72.553186,40.9879],[-72.55275399999999,40.987829],[-72.552254,40.987764],[-72.551721,40.987681],[-72.55088499999999,40.98753],[-72.55031700000001,40.987453],[-72.549916,40.987411],[-72.549817,40.987405],[-72.549432,40.987384],[-72.549105,40.98738],[-72.548748,40.987395],[-72.548483,40.987412],[-72.547594,40.987512],[-72.546564,40.987619],[-72.54616300000001,40.987688],[-72.54530800000001,40.987815],[-72.544202,40.987973],[-72.543644,40.988061],[-72.543525,40.988081],[-72.543054,40.988195],[-72.542416,40.988342],[-72.54133400000001,40.986932],[-72.54093399999999,40.986416],[-72.539558,40.98463],[-72.539193,40.984168],[-72.539299,40.984066],[-72.539586,40.983821],[-72.54004999999999,40.983445],[-72.54024699999999,40.983287],[-72.54044399999999,40.983123],[-72.540646,40.982958],[-72.540942,40.982714],[-72.54116399999999,40.982519],[-72.541478,40.982227],[-72.541661,40.982056],[-72.542001,40.981752],[-72.542171,40.98161],[-72.54328,40.982981],[-72.543515,40.983281],[-72.54362399999999,40.983419],[-72.549582,40.976804],[-72.55004700000001,40.977094],[-72.551535,40.978261],[-72.551681,40.978341],[-72.551711,40.978436],[-72.551788,40.978547],[-72.551872,40.978642],[-72.55200000000001,40.978757],[-72.552122,40.978852],[-72.55238300000001,40.979043],[-72.552528,40.979157],[-72.552589,40.979268],[-72.552589,40.979524],[-72.552688,40.979733],[-72.552763,40.979844],[-72.552909,40.979974],[-72.553085,40.980054],[-72.553214,40.9801],[-72.553358,40.980116],[-72.55352000000001,40.980149],[-72.55364899999999,40.98018],[-72.553735,40.980226],[-72.55377,40.980245],[-72.55388499999999,40.980405],[-72.55399800000001,40.980581],[-72.55401500000001,40.980805],[-72.55401500000001,40.981252],[-72.554045,40.981461],[-72.55412099999999,40.981843],[-72.554191,40.982003],[-72.55425200000001,40.982179],[-72.554413,40.98242],[-72.55452699999999,40.982565],[-72.554732,40.982755],[-72.555052,40.983075],[-72.55516799999999,40.983235],[-72.555244,40.98338],[-72.55538900000001,40.983571],[-72.55558000000001,40.983796],[-72.555694,40.984007],[-72.555885,40.984227],[-72.556219,40.984708],[-72.55638,40.984853],[-72.556799,40.985158],[-72.55697600000001,40.985314],[-72.557166,40.985494],[-72.557311,40.9857],[-72.557472,40.985875],[-72.557632,40.986005],[-72.55798299999999,40.986276],[-72.558143,40.986386],[-72.558273,40.986516],[-72.558364,40.986646],[-72.558452,40.986893],[-72.55929399999999,40.986651],[-72.55951399999999,40.986589],[-72.559834,40.986488],[-72.56021699999999,40.986329],[-72.5604,40.986263],[-72.56101700000001,40.98604],[-72.561206,40.985976],[-72.561702,40.985934],[-72.56205799999999,40.985916],[-72.56237900000001,40.985906],[-72.56292500000001,40.985897],[-72.56302100000001,40.985904],[-72.563289,40.985925],[-72.56400600000001,40.985991],[-72.564069,40.985997],[-72.564314,40.986009],[-72.56469300000001,40.985954],[-72.565088,40.985889],[-72.56564400000001,40.985791],[-72.565855,40.985755],[-72.566035,40.985721],[-72.566592,40.985618],[-72.566745,40.985595],[-72.566891,40.985573],[-72.567612,40.985597],[-72.56835599999999,40.985729],[-72.56896999999999,40.985874],[-72.569444,40.985971],[-72.570038,40.986112],[-72.57028800000001,40.986133],[-72.570747,40.986174],[-72.571487,40.986233],[-72.57416499999999,40.986428],[-72.574742,40.986464],[-72.57576899999999,40.986412],[-72.575948,40.986379],[-72.57766599999999,40.986083],[-72.578107,40.986001],[-72.57871,40.98588],[-72.579307,40.985746],[-72.58015399999999,40.985547],[-72.58049200000001,40.98546],[-72.581194,40.985264],[-72.58154500000001,40.98515],[-72.582138,40.984979],[-72.58242199999999,40.984897],[-72.58310899999999,40.985686],[-72.59139399999999,40.995206],[-72.59582399999999,41.000116],[-72.598112,41.002946]]],"type":"Polygon"}
}