{
  "id": "361031595051",
  "type": "Feature",
  "properties": {
    "area_land":696741,
    "area_water":0,
    "geoid":"361031595051",
    "name":"Block Group 1",
    "state":"ny"
},
  "bbox": [
    -72.876845,
    40.776569,
    -72.864223,
    40.785034
],
  "geometry": {"coordinates":[[[-72.876845,40.784038],[-72.87594300000001,40.78414],[-72.874494,40.784301],[-72.871343,40.784649],[-72.867895,40.785034],[-72.86801800000001,40.784321],[-72.868155,40.783564],[-72.868292,40.782923],[-72.86733099999999,40.78302],[-72.86641400000001,40.78313],[-72.86544600000001,40.783245],[-72.865284,40.783218],[-72.86508600000001,40.783176],[-72.864706,40.783077],[-72.86447,40.783248],[-72.864223,40.783276],[-72.865307,40.779851],[-72.865926,40.777923],[-72.866136,40.77726],[-72.86635699999999,40.77728],[-72.86658300000001,40.777301],[-72.86988700000001,40.776958],[-72.873419,40.776569],[-72.873313,40.777397],[-72.873244,40.777771],[-72.873434,40.778155],[-72.874129,40.777973],[-72.87467700000001,40.777866],[-72.87469299999999,40.777964],[-72.87488399999999,40.778311],[-72.875006,40.778559],[-72.875028,40.779144],[-72.87521099999999,40.779644],[-72.875624,40.780403],[-72.875777,40.780661],[-72.875928,40.780914],[-72.87615,40.781207],[-72.876532,40.781853],[-72.876508,40.782547],[-72.87657,40.7831],[-72.876768,40.783492],[-72.87679900000001,40.78392],[-72.876845,40.784038]]],"type":"Polygon"}
}