{
  "id": "360470580002",
  "type": "Feature",
  "properties": {
    "area_land":77827,
    "area_water":0,
    "geoid":"360470580002",
    "name":"Block Group 2",
    "state":"ny"
},
  "bbox": [
    -73.957757,
    40.596612,
    -73.955076,
    40.601191
],
  "geometry": {"coordinates":[[[-73.957757,40.600986],[-73.95683,40.601087],[-73.956282,40.601149],[-73.955905,40.601191],[-73.955476,40.598938],[-73.95507600000001,40.596816],[-73.955529,40.596765],[-73.956001,40.596714],[-73.956928,40.596612],[-73.95733199999999,40.598731],[-73.957757,40.600986]]],"type":"Polygon"}
}