{
  "id": "361031585093",
  "type": "Feature",
  "properties": {
    "area_land":773043,
    "area_water":0,
    "geoid":"361031585093",
    "name":"Block Group 3",
    "state":"ny"
},
  "bbox": [
    -73.047617,
    40.85104,
    -73.039567,
    40.865447
],
  "geometry": {"coordinates":[[[-73.047617,40.863857],[-73.047144,40.863967],[-73.045824,40.864291],[-73.044939,40.864521],[-73.044313,40.864666],[-73.04372600000001,40.86483],[-73.043131,40.864967],[-73.042475,40.865135],[-73.041246,40.865447],[-73.041213,40.865192],[-73.041162,40.864806],[-73.04104100000001,40.863971],[-73.040933,40.863017],[-73.040797,40.862056],[-73.04074300000001,40.861636],[-73.040665,40.861107],[-73.04052900000001,40.859938],[-73.040407,40.859051],[-73.040375,40.858772],[-73.04022399999999,40.857616],[-73.040072,40.856463],[-73.03992700000001,40.855376],[-73.03977399999999,40.854132],[-73.03956700000001,40.852626],[-73.040171,40.852439],[-73.040628,40.852328],[-73.041208,40.852173],[-73.041949,40.851997],[-73.042438,40.85187],[-73.043055,40.851729],[-73.044161,40.851458],[-73.044596,40.851322],[-73.045069,40.851204],[-73.04561099999999,40.85104],[-73.045894,40.852871],[-73.046071,40.854063],[-73.046255,40.855207],[-73.046466,40.856201],[-73.04649499999999,40.856498],[-73.04655700000001,40.85686],[-73.04658000000001,40.856994],[-73.04660199999999,40.857124],[-73.046617,40.857383],[-73.04666400000001,40.857684],[-73.046869,40.85895],[-73.047037,40.860058],[-73.04709099999999,40.860362],[-73.04731099999999,40.86179],[-73.04734999999999,40.862079],[-73.04741199999999,40.862465],[-73.047434,40.862659],[-73.047518,40.863148],[-73.047617,40.863857]]],"type":"Polygon"}
}