{
  "id": "360594141006",
  "type": "Feature",
  "properties": {
    "area_land":464856,
    "area_water":0,
    "geoid":"360594141006",
    "name":"Block Group 6",
    "state":"ny"
},
  "bbox": [
    -73.602787,
    40.663862,
    -73.592551,
    40.670209
],
  "geometry": {"coordinates":[[[-73.60278700000001,40.663862],[-73.60271299999999,40.664932],[-73.60262299999999,40.666253],[-73.602598,40.66661],[-73.60254500000001,40.667379],[-73.602518,40.667769],[-73.602396,40.668232],[-73.60215700000001,40.669141],[-73.60210600000001,40.670133],[-73.601992,40.670136],[-73.601383,40.670201],[-73.601412,40.670022],[-73.601432,40.669566],[-73.601483,40.668496],[-73.601448,40.668238],[-73.601158,40.668277],[-73.600511,40.668333],[-73.60036599999999,40.66836],[-73.600218,40.668416],[-73.59946100000001,40.668677],[-73.59927500000001,40.668741],[-73.59912,40.668782],[-73.59866,40.668835],[-73.59880699999999,40.669652],[-73.59730999999999,40.66981],[-73.59537400000001,40.670026],[-73.594157,40.670153],[-73.59361800000001,40.670209],[-73.59346600000001,40.669393],[-73.59331,40.668578],[-73.59315700000001,40.667761],[-73.593031,40.667028],[-73.59278999999999,40.665874],[-73.59269500000001,40.665364],[-73.592551,40.66471],[-73.59294300000001,40.664679],[-73.593593,40.664628],[-73.594888,40.664526],[-73.59618,40.664425],[-73.59747400000001,40.664325],[-73.598764,40.664224],[-73.599836,40.664143],[-73.599937,40.664124],[-73.600058,40.664123],[-73.601192,40.664037],[-73.60144699999999,40.664008],[-73.601654,40.663979],[-73.60178399999999,40.663974],[-73.60221199999999,40.663925],[-73.60275,40.663864],[-73.60278700000001,40.663862]]],"type":"Polygon"}
}