{
  "id": "360594118004",
  "type": "Feature",
  "properties": {
    "area_land":232424,
    "area_water":0,
    "geoid":"360594118004",
    "name":"Block Group 4",
    "state":"ny"
},
  "bbox": [
    -73.683844,
    40.661896,
    -73.67611,
    40.667221
],
  "geometry": {"coordinates":[[[-73.68384399999999,40.666352],[-73.683522,40.666544],[-73.683049,40.666812],[-73.683002,40.666828],[-73.682851,40.666922],[-73.682338,40.667221],[-73.68209299999999,40.666979],[-73.68204299999999,40.6669],[-73.681708,40.665838],[-73.68144100000001,40.66503],[-73.68057,40.665192],[-73.680269,40.665246],[-73.67969600000001,40.665352],[-73.67933499999999,40.665417],[-73.67882400000001,40.665511],[-73.67846299999999,40.665577],[-73.678264,40.665616],[-73.677936,40.665663],[-73.677577,40.665702],[-73.676959,40.665766],[-73.676588,40.665798],[-73.67630699999999,40.664735],[-73.676283,40.664663],[-73.676258,40.66452],[-73.67626199999999,40.664438],[-73.676266,40.664317],[-73.676182,40.663856],[-73.67618899999999,40.663762],[-73.67619000000001,40.66362],[-73.67610999999999,40.663169],[-73.676124,40.663066],[-73.67613799999999,40.662782],[-73.676197,40.662187],[-73.67617799999999,40.662062],[-73.67694400000001,40.662084],[-73.677279,40.662094],[-73.677435,40.66209],[-73.67787,40.662066],[-73.678274,40.662042],[-73.67901000000001,40.662003],[-73.67904799999999,40.661998],[-73.679067,40.661986],[-73.67912,40.661994],[-73.680043,40.661945],[-73.680943,40.661896],[-73.68109699999999,40.663524],[-73.681214,40.66352],[-73.681996,40.663473],[-73.682486,40.663447],[-73.682895,40.663425],[-73.683724,40.663384],[-73.68376600000001,40.663833],[-73.683812,40.664593],[-73.68371500000001,40.664615],[-73.68373800000001,40.664922],[-73.68384399999999,40.666352]]],"type":"Polygon"}
}