{
  "id": "360290067023",
  "type": "Feature",
  "properties": {
    "area_land":345708,
    "area_water":0,
    "geoid":"360290067023",
    "name":"Block Group 3",
    "state":"ny"
},
  "bbox": [
    -78.877137,
    42.904668,
    -78.870325,
    42.911298
],
  "geometry": {"coordinates":[[[-78.87713599999999,42.905891],[-78.877117,42.906515],[-78.87710300000001,42.908928],[-78.877107,42.90897],[-78.877094,42.9099],[-78.87708499999999,42.911298],[-78.87282999999999,42.911274],[-78.87215399999999,42.911274],[-78.87032499999999,42.911261],[-78.87052199999999,42.910618],[-78.870771,42.909845],[-78.871045,42.908985],[-78.871082,42.908872],[-78.87142799999999,42.907613],[-78.87168200000001,42.906784],[-78.871692,42.906739],[-78.872297,42.904668],[-78.875128,42.904703],[-78.877126,42.904732],[-78.877137,42.90553],[-78.87713599999999,42.905891]]],"type":"Polygon"}
}