{
  "id": "360070125002",
  "type": "Feature",
  "properties": {
    "area_land":81314124,
    "area_water":566267,
    "geoid":"360070125002",
    "name":"Block Group 2",
    "state":"ny"
},
  "bbox": [
    -75.769426,
    41.997864,
    -75.609671,
    42.08343
],
  "geometry": {"coordinates":[[[-75.768829,42.080791],[-75.766695,42.08177],[-75.766302,42.081923],[-75.765913,42.082034],[-75.765607,42.0821],[-75.764532,42.082277],[-75.763811,42.08238],[-75.762147,42.082652],[-75.759023,42.083207],[-75.757645,42.083406],[-75.757304,42.08343],[-75.757093,42.083422],[-75.75703,42.083362],[-75.756854,42.083231],[-75.756576,42.083045],[-75.755937,42.082588],[-75.75586800000001,42.082539],[-75.755242,42.082106],[-75.754981,42.081911],[-75.754689,42.081632],[-75.75424599999999,42.081175],[-75.75389,42.080861],[-75.75118999999999,42.07875],[-75.74963,42.077605],[-75.74919800000001,42.077249],[-75.748262,42.07642],[-75.74766,42.07594],[-75.744888,42.073916],[-75.744497,42.073634],[-75.744393,42.073561],[-75.74173,42.071698],[-75.741038,42.071188],[-75.740928,42.071091],[-75.740574,42.07078],[-75.740132,42.070309],[-75.739334,42.069326],[-75.738598,42.068362],[-75.737864,42.067414],[-75.73756,42.067099],[-75.737448,42.067009],[-75.736677,42.066444],[-75.736524,42.066303],[-75.73634300000001,42.06608],[-75.73625,42.065923],[-75.736181,42.065765],[-75.736048,42.065389],[-75.735872,42.064787],[-75.735769,42.064519],[-75.735721,42.064365],[-75.73562800000001,42.063919],[-75.735525,42.063626],[-75.735432,42.063433],[-75.735275,42.063224],[-75.73508699999999,42.063076],[-75.735004,42.063024],[-75.734919,42.062985],[-75.73483299999999,42.062958],[-75.734604,42.062927],[-75.734499,42.062927],[-75.734251,42.062947],[-75.73371299999999,42.063038],[-75.733378,42.063079],[-75.733025,42.063086],[-75.732704,42.063074],[-75.732525,42.063054],[-75.732336,42.063022],[-75.732118,42.062971],[-75.731965,42.062924],[-75.731504,42.062765],[-75.731176,42.062626],[-75.730603,42.062352],[-75.73043699999999,42.062248],[-75.730312,42.06217],[-75.729752,42.061754],[-75.729535,42.061587],[-75.729271,42.061416],[-75.729045,42.061303],[-75.728465,42.061096],[-75.728177,42.061008],[-75.727424,42.0608],[-75.72697599999999,42.060691],[-75.72569900000001,42.060451],[-75.72499999999999,42.060312],[-75.724011,42.060079],[-75.723517,42.059944],[-75.722679,42.059664],[-75.72252,42.059627],[-75.722302,42.059605],[-75.722132,42.059614],[-75.721912,42.059647],[-75.72172999999999,42.059697],[-75.721636,42.059728],[-75.72086899999999,42.059986],[-75.720153,42.060238],[-75.71945599999999,42.060518],[-75.718238,42.061043],[-75.71710400000001,42.061531],[-75.71652,42.061742],[-75.715603,42.062014],[-75.71509399999999,42.06211],[-75.714702,42.062161],[-75.71378799999999,42.062262],[-75.71334,42.062312],[-75.712855,42.062378],[-75.711968,42.062473],[-75.710284,42.06257],[-75.709526,42.062563],[-75.70891399999999,42.062543],[-75.70767600000001,42.062572],[-75.70704499999999,42.062577],[-75.706411,42.062593],[-75.70597600000001,42.06262],[-75.70545300000001,42.062674],[-75.704296,42.062738],[-75.70353900000001,42.062805],[-75.70278500000001,42.062893],[-75.70212600000001,42.062982],[-75.701004,42.063115],[-75.700472,42.06321],[-75.70028499999999,42.063256],[-75.700039,42.063339],[-75.699718,42.063433],[-75.699416,42.063522],[-75.69883900000001,42.063711],[-75.698447,42.063806],[-75.697975,42.063894],[-75.69757199999999,42.063941],[-75.696231,42.064133],[-75.694458,42.064414],[-75.69345300000001,42.064556],[-75.69333,42.064594],[-75.69307000000001,42.064712],[-75.692683,42.064948],[-75.692094,42.065331],[-75.69188,42.065418],[-75.691678,42.065458],[-75.69152200000001,42.06547],[-75.691315,42.06547],[-75.69041900000001,42.065456],[-75.69023,42.065445],[-75.689978,42.065414],[-75.68972599999999,42.065365],[-75.689566,42.065322],[-75.68912,42.065178],[-75.688658,42.064996],[-75.68812800000001,42.064812],[-75.687832,42.06474],[-75.687563,42.064697],[-75.687226,42.064672],[-75.685897,42.064601],[-75.684819,42.064522],[-75.683644,42.064496],[-75.682096,42.064477],[-75.68128400000001,42.06448],[-75.67894699999999,42.064518],[-75.678572,42.064559],[-75.678387,42.064599],[-75.678057,42.064685],[-75.678004,42.064699],[-75.677216,42.064955],[-75.676737,42.065157],[-75.676256,42.065376],[-75.675847,42.065529],[-75.675549,42.065611],[-75.674756,42.065789],[-75.674025,42.065968],[-75.673254,42.066169],[-75.67277799999999,42.066306],[-75.67254,42.06641],[-75.671808,42.066813],[-75.67110099999999,42.06722],[-75.670435,42.067626],[-75.66997000000001,42.067927],[-75.669577,42.068148],[-75.669285,42.068272],[-75.668831,42.06842],[-75.668314,42.068571],[-75.668071,42.068625],[-75.667919,42.068648],[-75.667754,42.068661],[-75.667558,42.068665],[-75.66502800000001,42.068523],[-75.664502,42.068459],[-75.662429,42.068136],[-75.661883,42.068018],[-75.66167299999999,42.067945],[-75.661278,42.067775],[-75.660445,42.067374],[-75.659683,42.066965],[-75.658559,42.066352],[-75.65732199999999,42.065629],[-75.656549,42.065274],[-75.65625199999999,42.065149],[-75.65525100000001,42.064785],[-75.654926,42.064687],[-75.654498,42.064594],[-75.654235,42.064565],[-75.653734,42.064564],[-75.65343900000001,42.06458],[-75.65289900000001,42.064614],[-75.652362,42.06466],[-75.65200400000001,42.06471],[-75.651307,42.064825],[-75.65021,42.065075],[-75.649621,42.065164],[-75.649407,42.065214],[-75.649175,42.065307],[-75.649036,42.065392],[-75.648832,42.065561],[-75.648122,42.066287],[-75.64798500000001,42.066466],[-75.647593,42.067207],[-75.647419,42.067473],[-75.64736000000001,42.067539],[-75.646601,42.068197],[-75.645951,42.06892],[-75.645405,42.069594],[-75.645383,42.069616],[-75.64525399999999,42.069741],[-75.64510300000001,42.069861],[-75.64455,42.070179],[-75.644476,42.070212],[-75.644305,42.070272],[-75.643918,42.070357],[-75.64299800000001,42.070504],[-75.64268199999999,42.070565],[-75.64183199999999,42.070712],[-75.641699,42.070746],[-75.641594,42.070803],[-75.641566,42.070627],[-75.641212,42.069534],[-75.640953,42.06877],[-75.640811,42.068281],[-75.64077399999999,42.068059],[-75.640761,42.067741],[-75.640788,42.067403],[-75.64080300000001,42.067223],[-75.64085799999999,42.066424],[-75.640912,42.065943],[-75.641057,42.064992],[-75.64113399999999,42.064619],[-75.641184,42.064375],[-75.641277,42.064051],[-75.641313,42.063953],[-75.64175400000001,42.062972],[-75.641766,42.062909],[-75.641766,42.062731],[-75.64172499999999,42.0625],[-75.641457,42.061693],[-75.64134300000001,42.06144],[-75.641296,42.061369],[-75.64096600000001,42.060977],[-75.63826899999999,42.058162],[-75.63819100000001,42.058093],[-75.637987,42.057952],[-75.63785300000001,42.057877],[-75.637682,42.057799],[-75.637343,42.057672],[-75.63701399999999,42.057576],[-75.63679999999999,42.057523],[-75.63651900000001,42.057478],[-75.635977,42.057424],[-75.63585500000001,42.057399],[-75.635617,42.057316],[-75.63496600000001,42.057015],[-75.63464399999999,42.056887],[-75.633881,42.056666],[-75.633396,42.05652],[-75.632865,42.056325],[-75.632492,42.056155],[-75.632214,42.055997],[-75.63204399999999,42.055879],[-75.63114299999999,42.055103],[-75.630737,42.054787],[-75.630453,42.054612],[-75.63029899999999,42.054546],[-75.629108,42.054111],[-75.62868899999999,42.05395],[-75.628609,42.053915],[-75.62830599999999,42.053781],[-75.628057,42.053671],[-75.62802000000001,42.053655],[-75.626755,42.053072],[-75.62552100000001,42.052521],[-75.625156,42.052345],[-75.62436,42.051902],[-75.623805,42.051576],[-75.623605,42.051433],[-75.623278,42.05112],[-75.621612,42.049289],[-75.62056200000001,42.047862],[-75.62023000000001,42.047371],[-75.620107,42.047124],[-75.61997599999999,42.046782],[-75.619895,42.046436],[-75.619772,42.045743],[-75.619742,42.045516],[-75.619721,42.04524],[-75.619669,42.044546],[-75.619624,42.044317],[-75.619563,42.044175],[-75.619427,42.04399],[-75.61928899999999,42.043878],[-75.619083,42.043757],[-75.61883899999999,42.043656],[-75.617857,42.043342],[-75.61747,42.043201],[-75.617259,42.043101],[-75.61715599999999,42.043033],[-75.61701600000001,42.042905],[-75.616946,42.0428],[-75.616889,42.042663],[-75.61684700000001,42.042479],[-75.616844,42.04241],[-75.61682999999999,42.042046],[-75.61684,42.041664],[-75.616874,42.041517],[-75.616973,42.041287],[-75.61705600000001,42.041094],[-75.617328,42.040594],[-75.617501,42.040314],[-75.61812500000001,42.039449],[-75.618869,42.038199],[-75.619435,42.037229],[-75.619547,42.036989],[-75.61969499999999,42.03653],[-75.619784,42.03628],[-75.620003,42.035782],[-75.620261,42.035294],[-75.620529,42.034818],[-75.621255,42.033681],[-75.621398,42.033377],[-75.621458,42.033183],[-75.62172700000001,42.031464],[-75.621792,42.030985],[-75.62190699999999,42.030265],[-75.621968,42.029885],[-75.62204800000001,42.029322],[-75.622089,42.029038],[-75.622209,42.028226],[-75.62223899999999,42.027613],[-75.62223299999999,42.027496],[-75.622196,42.027089],[-75.622162,42.026872],[-75.622117,42.026594],[-75.622077,42.026406],[-75.622021,42.026147],[-75.621987,42.025831],[-75.621999,42.025641],[-75.622032,42.025526],[-75.62212,42.025372],[-75.622618,42.024709],[-75.62270599999999,42.024576],[-75.62285900000001,42.024303],[-75.62309399999999,42.023685],[-75.623159,42.023572],[-75.623586,42.022921],[-75.624217,42.022027],[-75.624571,42.02157],[-75.624911,42.021221],[-75.625247,42.020821],[-75.625331,42.020689],[-75.625409,42.020532],[-75.625564,42.02015],[-75.62582999999999,42.019228],[-75.62608400000001,42.018215],[-75.62618500000001,42.017741],[-75.62623499999999,42.017256],[-75.626233,42.017095],[-75.626214,42.016915],[-75.626158,42.016675],[-75.626019,42.016323],[-75.625917,42.016146],[-75.625567,42.015663],[-75.62537399999999,42.01538],[-75.625074,42.014904],[-75.624934,42.014617],[-75.62490200000001,42.014463],[-75.62488500000001,42.014206],[-75.624883,42.014178],[-75.62488,42.013959],[-75.624859,42.0138],[-75.624827,42.013664],[-75.62482199999999,42.013642],[-75.62477199999999,42.013499],[-75.62453499999999,42.013033],[-75.623895,42.011914],[-75.623705,42.011617],[-75.623339,42.011149],[-75.622756,42.010456],[-75.62262200000001,42.010325],[-75.621833,42.009748],[-75.621067,42.009097],[-75.62073100000001,42.008804],[-75.62022,42.008329],[-75.620074,42.008176],[-75.61997100000001,42.008033],[-75.619913,42.007896],[-75.61989,42.007747],[-75.619884,42.007353],[-75.619862,42.007238],[-75.61977899999999,42.006991],[-75.619675,42.00679],[-75.619591,42.006667],[-75.61951000000001,42.006574],[-75.619332,42.006412],[-75.619145,42.006287],[-75.618965,42.006203],[-75.618763,42.006145],[-75.61863200000001,42.006127],[-75.618315,42.006122],[-75.617619,42.006134],[-75.617414,42.006116],[-75.61727,42.006079],[-75.61712,42.006009],[-75.61696000000001,42.005893],[-75.616623,42.005591],[-75.616416,42.005406],[-75.61533300000001,42.004459],[-75.615171,42.004306],[-75.614373,42.003312],[-75.61414499999999,42.003055],[-75.613849,42.002798],[-75.61311499999999,42.002273],[-75.612863,42.002069],[-75.612522,42.001701],[-75.612307,42.001484],[-75.61184900000001,42.001098],[-75.61134699999999,42.000696],[-75.611113,42.000498],[-75.61097700000001,42.000363],[-75.610798,42.000171],[-75.61017699999999,41.999464],[-75.609825,41.999065],[-75.60967100000001,41.998972],[-75.609718,41.998959],[-75.610316,41.998959],[-75.62462600000001,41.99881],[-75.627813,41.998779],[-75.65231900000001,41.998545],[-75.65289799999999,41.998537],[-75.65558799999999,41.998512],[-75.67207500000001,41.998386],[-75.673354,41.998376],[-75.67955600000001,41.998332],[-75.68909499999999,41.998257],[-75.69313699999999,41.99823],[-75.696038,41.998209],[-75.704342,41.998146],[-75.70768099999999,41.998121],[-75.70778799999999,41.99812],[-75.723767,41.998],[-75.724638,41.998001],[-75.728814,41.997964],[-75.729839,41.997955],[-75.731728,41.997943],[-75.73311,41.997928],[-75.738039,41.997894],[-75.74141400000001,41.997871],[-75.742217,41.997864],[-75.74238,42.000077],[-75.74235299999999,42.009232],[-75.742322,42.012648],[-75.742302,42.017797],[-75.744551,42.01779],[-75.749652,42.017775],[-75.750719,42.017773],[-75.750382,42.035613],[-75.755712,42.035673],[-75.755729,42.035876],[-75.755743,42.036708],[-75.755776,42.037479],[-75.755833,42.038149],[-75.755898,42.039581],[-75.755973,42.041492],[-75.756079,42.043506],[-75.75632,42.053947],[-75.762517,42.054117],[-75.763428,42.057378],[-75.76500799999999,42.063085],[-75.76503599999999,42.063177],[-75.76594,42.066129],[-75.766482,42.067889],[-75.766547,42.068112],[-75.769426,42.080561],[-75.768829,42.080791]]],"type":"Polygon"}
}