{
  "id": "360610089002",
  "type": "Feature",
  "properties": {
    "area_land":40804,
    "area_water":0,
    "geoid":"360610089002",
    "name":"Block Group 2",
    "state":"ny"
},
  "bbox": [
    -74.003542,
    40.742254,
    -73.999848,
    40.744622
],
  "geometry": {"coordinates":[[[-74.00311600000001,40.744035],[-74.002691,40.744622],[-74.00048099999999,40.743691],[-73.999848,40.743425],[-74.000032,40.743172],[-74.000275,40.742839],[-74.000703,40.742254],[-74.003542,40.743448],[-74.00311600000001,40.744035]]],"type":"Polygon"}
}