{
  "id": "360050340001",
  "type": "Feature",
  "properties": {
    "area_land":46941,
    "area_water":0,
    "geoid":"360050340001",
    "name":"Block Group 1",
    "state":"ny"
},
  "bbox": [
    -73.864326,
    40.869603,
    -73.861379,
    40.871389
],
  "geometry": {"coordinates":[[[-73.864266,40.871389],[-73.863332,40.871375],[-73.862392,40.871357],[-73.861379,40.871336],[-73.86143300000001,40.869603],[-73.862447,40.869622],[-73.863387,40.869641],[-73.86432600000001,40.869656],[-73.864266,40.871389]]],"type":"Polygon"}
}