{
  "id": "360470542001",
  "type": "Feature",
  "properties": {
    "area_land":68892,
    "area_water":0,
    "geoid":"360470542001",
    "name":"Block Group 1",
    "state":"ny"
},
  "bbox": [
    -73.960921,
    40.610202,
    -73.958593,
    40.61562
],
  "geometry": {"coordinates":[[[-73.960921,40.612757],[-73.960004,40.612854],[-73.960511,40.615518],[-73.95958299999999,40.61562],[-73.959079,40.612957],[-73.95859299999999,40.610403],[-73.95952,40.610302],[-73.960444,40.610202],[-73.960921,40.612757]]],"type":"Polygon"}
}