{
  "id": "360470802002",
  "type": "Feature",
  "properties": {
    "area_land":69522,
    "area_water":0,
    "geoid":"360470802002",
    "name":"Block Group 2",
    "state":"ny"
},
  "bbox": [
    -73.956478,
    40.655875,
    -73.95016,
    40.657838
],
  "geometry": {"coordinates":[[[-73.956478,40.656711],[-73.95313899999999,40.656915],[-73.95322,40.657661],[-73.950326,40.657838],[-73.950247,40.657095],[-73.95016,40.65626],[-73.953048,40.656081],[-73.956388,40.655875],[-73.956428,40.656247],[-73.956478,40.656711]]],"type":"Polygon"}
}