{
  "id": "360650201021",
  "type": "Feature",
  "properties": {
    "area_land":209942,
    "area_water":0,
    "geoid":"360650201021",
    "name":"Block Group 1",
    "state":"ny"
},
  "bbox": [
    -75.256997,
    43.10583,
    -75.24457,
    43.109906
],
  "geometry": {"coordinates":[[[-75.256997,43.108402],[-75.25598599999999,43.109684],[-75.255826,43.109906],[-75.254919,43.109641],[-75.25420200000001,43.109424],[-75.253057,43.109082],[-75.252516,43.10892],[-75.251114,43.10854],[-75.25088599999999,43.108479],[-75.250652,43.108943],[-75.250585,43.109062],[-75.250533,43.109156],[-75.250474,43.109215],[-75.250451,43.109238],[-75.250416,43.10927],[-75.249499,43.109006],[-75.249331,43.108958],[-75.24827500000001,43.108665],[-75.247989,43.108586],[-75.247249,43.108383],[-75.247145,43.108352],[-75.24457,43.107581],[-75.24459,43.107544],[-75.24462699999999,43.107474],[-75.24491999999999,43.106918],[-75.245018,43.106731],[-75.245165,43.106448],[-75.245305,43.106192],[-75.24550499999999,43.10583],[-75.245582,43.105854],[-75.245723,43.105897],[-75.245839,43.105933],[-75.246565,43.106151],[-75.247041,43.106292],[-75.247362,43.10642],[-75.247614,43.106444],[-75.24867,43.106565],[-75.25,43.10672],[-75.250062,43.106737],[-75.252376,43.106968],[-75.253108,43.10703],[-75.254037,43.107361],[-75.25494500000001,43.107687],[-75.25575600000001,43.107962],[-75.256148,43.108104],[-75.25664399999999,43.108276],[-75.256997,43.108402]]],"type":"Polygon"}
}