{
  "id": "360810613014",
  "type": "Feature",
  "properties": {
    "area_land":61502,
    "area_water":0,
    "geoid":"360810613014",
    "name":"Block Group 4",
    "state":"ny"
},
  "bbox": [
    -73.898003,
    40.707091,
    -73.892347,
    40.70935
],
  "geometry": {"coordinates":[[[-73.898003,40.708401],[-73.895869,40.708943],[-73.89424,40.70935],[-73.893157,40.70886],[-73.892347,40.70846],[-73.893056,40.708148],[-73.89528300000001,40.707588],[-73.897231,40.707091],[-73.89756300000001,40.707759],[-73.898003,40.708401]]],"type":"Polygon"}
}