{
  "id": "360930325033",
  "type": "Feature",
  "properties": {
    "area_land":1620383,
    "area_water":3306,
    "geoid":"360930325033",
    "name":"Block Group 3",
    "state":"ny"
},
  "bbox": [
    -73.949191,
    42.869076,
    -73.929953,
    42.883351
],
  "geometry": {"coordinates":[[[-73.949191,42.877986],[-73.947121,42.881379],[-73.946969,42.881587],[-73.946881,42.881546],[-73.94667200000001,42.881464],[-73.946563,42.881416],[-73.94647999999999,42.881422],[-73.946361,42.881414],[-73.946243,42.881366],[-73.946134,42.881297],[-73.94603499999999,42.881209],[-73.94587199999999,42.881126],[-73.94565299999999,42.881057],[-73.945435,42.880947],[-73.94531600000001,42.880919],[-73.945252,42.880932],[-73.945205,42.880999],[-73.94523100000001,42.881067],[-73.94524800000001,42.881188],[-73.945199,42.881363],[-73.94522499999999,42.881457],[-73.94521400000001,42.881531],[-73.94515699999999,42.881645],[-73.945046,42.881752],[-73.944889,42.881838],[-73.944723,42.881904],[-73.944622,42.881912],[-73.944475,42.881929],[-73.9444,42.881995],[-73.944408,42.882076],[-73.94435300000001,42.882116],[-73.94419600000001,42.882182],[-73.944058,42.882201],[-73.943939,42.882159],[-73.943819,42.882185],[-73.94379000000001,42.882286],[-73.943748,42.882369],[-73.94371099999999,42.882505],[-73.94372799999999,42.882581],[-73.94369399999999,42.882728],[-73.94365000000001,42.882868],[-73.94359799999999,42.882995],[-73.94348599999999,42.883065],[-73.943399,42.883173],[-73.94333,42.8833],[-73.94327800000001,42.883351],[-73.943168,42.883329],[-73.943094,42.883317],[-73.942994,42.883289],[-73.942922,42.883208],[-73.942886,42.883154],[-73.942823,42.883146],[-73.94273,42.883186],[-73.942688,42.883225],[-73.942629,42.883212],[-73.942584,42.883171],[-73.942539,42.883117],[-73.942448,42.883089],[-73.942403,42.883055],[-73.942395,42.882994],[-73.94240600000001,42.882921],[-73.94237,42.882852],[-73.94231499999999,42.882832],[-73.94224199999999,42.882844],[-73.942176,42.882925],[-73.94212,42.882985],[-73.942046,42.883038],[-73.941954,42.883064],[-73.94185299999999,42.883043],[-73.94180900000001,42.882989],[-73.941857,42.882861],[-73.941793,42.882807],[-73.941655,42.882826],[-73.941526,42.882899],[-73.941378,42.883012],[-73.941146,42.883144],[-73.941036,42.883184],[-73.940926,42.883196],[-73.940844,42.883148],[-73.940855,42.883047],[-73.940893,42.882974],[-73.940986,42.882894],[-73.941051,42.882847],[-73.941061,42.882787],[-73.941025,42.882739],[-73.94088000000001,42.88263],[-73.940764,42.882552],[-73.940614,42.882537],[-73.940405,42.882572],[-73.94017599999999,42.882549],[-73.94004,42.882494],[-73.939959,42.882439],[-73.939905,42.882331],[-73.93990700000001,42.88223],[-73.939982,42.882157],[-73.940065,42.88209],[-73.94020399999999,42.882017],[-73.940342,42.881971],[-73.940462,42.881925],[-73.940545,42.881866],[-73.94063800000001,42.881779],[-73.940732,42.881672],[-73.940743,42.881544],[-73.940727,42.881436],[-73.940619,42.881321],[-73.940473,42.881245],[-73.940392,42.881163],[-73.940358,42.881055],[-73.940378,42.880968],[-73.940434,42.880888],[-73.940577,42.880552],[-73.940625,42.880398],[-73.940656,42.88023],[-73.94057599999999,42.880067],[-73.940523,42.879979],[-73.940451,42.879891],[-73.940342,42.879836],[-73.94027800000001,42.879808],[-73.940169,42.879774],[-73.940001,42.879743],[-73.93984,42.879723],[-73.93973099999999,42.879655],[-73.93971500000001,42.879547],[-73.939689,42.879453],[-73.939739,42.879197],[-73.93977,42.878988],[-73.939818,42.878895],[-73.939875,42.878767],[-73.93994000000001,42.878687],[-73.94004200000001,42.878627],[-73.94019,42.878548],[-73.940403,42.878415],[-73.940523,42.878322],[-73.940673,42.878162],[-73.940738,42.878108],[-73.940757,42.878048],[-73.940758,42.877994],[-73.940732,42.877946],[-73.940659,42.877899],[-73.940592,42.877836],[-73.940547,42.877777],[-73.94043499999999,42.877713],[-73.94035100000001,42.8777],[-73.94025000000001,42.87772],[-73.940067,42.877705],[-73.939948,42.877724],[-73.93987300000001,42.87777],[-73.93975399999999,42.877816],[-73.93968,42.877856],[-73.93956900000001,42.877895],[-73.939449,42.877928],[-73.939303,42.87794],[-73.93920199999999,42.877919],[-73.939066,42.87787],[-73.93892,42.877808],[-73.938866,42.877767],[-73.938757,42.87774],[-73.93861,42.877732],[-73.938445,42.877764],[-73.938287,42.877863],[-73.938176,42.877943],[-73.93810999999999,42.87803],[-73.938073,42.87809],[-73.938081,42.878138],[-73.938052,42.878212],[-73.93805,42.87836],[-73.938039,42.878474],[-73.93801000000001,42.878555],[-73.937945,42.878621],[-73.937889,42.878654],[-73.93776,42.878694],[-73.937586,42.878692],[-73.93738399999999,42.878751],[-73.937219,42.878722],[-73.937065,42.878667],[-73.93689999999999,42.878659],[-73.936733,42.87866],[-73.936644,42.878636],[-73.936516,42.878608],[-73.936333,42.878593],[-73.936205,42.878612],[-73.93606699999999,42.878624],[-73.93593799999999,42.87865],[-73.935845,42.87873],[-73.935678,42.878843],[-73.935559,42.878869],[-73.93544900000001,42.878841],[-73.93518899999999,42.878628],[-73.935098,42.878528],[-73.93498700000001,42.878437],[-73.934855,42.878229],[-73.934703,42.878052],[-73.934704,42.878005],[-73.934797,42.877878],[-73.934808,42.877804],[-73.934763,42.87775],[-73.93450900000001,42.877599],[-73.93437299999999,42.877504],[-73.934209,42.877441],[-73.934073,42.877406],[-73.93396300000001,42.877385],[-73.933826,42.877377],[-73.93372599999999,42.877329],[-73.933616,42.877315],[-73.933525,42.877293],[-73.933443,42.877266],[-73.93322499999999,42.877183],[-73.93307799999999,42.877168],[-73.932896,42.877139],[-73.93274,42.877131],[-73.93256700000001,42.877089],[-73.93244,42.877034],[-73.93232999999999,42.877006],[-73.93223999999999,42.876938],[-73.932214,42.87685],[-73.932087,42.876768],[-73.932023,42.876741],[-73.931951,42.876686],[-73.93187,42.876598],[-73.93178,42.876523],[-73.931707,42.876475],[-73.93165999999999,42.876454],[-73.931498,42.876379],[-73.931445,42.876304],[-73.931336,42.876249],[-73.931281,42.876215],[-73.93119,42.876187],[-73.93110900000001,42.876133],[-73.930999,42.876111],[-73.930854,42.876029],[-73.930819,42.875928],[-73.930719,42.875873],[-73.930629,42.875805],[-73.930494,42.875689],[-73.930378,42.875513],[-73.930361,42.875445],[-73.930356,42.875386],[-73.930335,42.875337],[-73.93027600000001,42.875257],[-73.930207,42.875267],[-73.930092,42.875275],[-73.93003,42.875308],[-73.92997099999999,42.875007],[-73.929953,42.8749],[-73.929996,42.874376],[-73.930207,42.873589],[-73.930656,42.872574],[-73.931122,42.87183],[-73.93158699999999,42.871072],[-73.932666,42.869076],[-73.934104,42.869359],[-73.93605599999999,42.869651],[-73.93702399999999,42.86982],[-73.938356,42.870052],[-73.94070600000001,42.87037],[-73.941305,42.870255],[-73.942229,42.870153],[-73.94286099999999,42.870084],[-73.94354,42.870072],[-73.94373899999999,42.870028],[-73.94457800000001,42.869723],[-73.945145,42.869511],[-73.945198,42.869491],[-73.94551800000001,42.869477],[-73.947784,42.869816],[-73.948564,42.869933],[-73.949017,42.873404],[-73.94903600000001,42.873852],[-73.949016,42.873965],[-73.948989,42.874117],[-73.948898,42.874366],[-73.948896,42.874665],[-73.94891699999999,42.874947],[-73.94911399999999,42.875828],[-73.94918,42.87621],[-73.949173,42.877305],[-73.949191,42.877986]]],"type":"Polygon"}
}