{
  "id": "360810818002",
  "type": "Feature",
  "properties": {
    "area_land":128799,
    "area_water":0,
    "geoid":"360810818002",
    "name":"Block Group 2",
    "state":"ny"
},
  "bbox": [
    -73.813198,
    40.666896,
    -73.805252,
    40.670133
],
  "geometry": {"coordinates":[[[-73.813198,40.667253],[-73.81263300000001,40.669052],[-73.811718,40.668886],[-73.81080900000001,40.668723],[-73.80986300000001,40.668554],[-73.809371,40.670133],[-73.808497,40.669735],[-73.807699,40.669397],[-73.80678899999999,40.669244],[-73.807143,40.667669],[-73.806237,40.667643],[-73.805252,40.667623],[-73.805452,40.666896],[-73.80665399999999,40.666976],[-73.809439,40.667048],[-73.809668,40.667056],[-73.810322,40.66708],[-73.811319,40.667119],[-73.812179,40.667173],[-73.81230600000001,40.66718],[-73.812714,40.667213],[-73.813198,40.667253]]],"type":"Polygon"}
}