{
  "id": "361031906042",
  "type": "Feature",
  "properties": {
    "area_land":2253349,
    "area_water":0,
    "geoid":"361031906042",
    "name":"Block Group 2",
    "state":"ny"
},
  "bbox": [
    -72.508294,
    40.858595,
    -72.490698,
    40.884874
],
  "geometry": {"coordinates":[[[-72.50829400000001,40.879394],[-72.508047,40.880069],[-72.507846,40.880639],[-72.50764599999999,40.881181],[-72.507548,40.881304],[-72.507369,40.881661],[-72.507154,40.881984],[-72.506974,40.882271],[-72.50681400000001,40.882501],[-72.506471,40.882782],[-72.50595,40.883551],[-72.505809,40.88358],[-72.505718,40.883566],[-72.505663,40.883573],[-72.505442,40.883616],[-72.505095,40.883672],[-72.50490499999999,40.883716],[-72.50457900000001,40.883814],[-72.503939,40.884089],[-72.503401,40.884374],[-72.503022,40.884536],[-72.502841,40.884603],[-72.50278400000001,40.88462],[-72.502596,40.884675],[-72.502163,40.884769],[-72.501769,40.884824],[-72.501192,40.884874],[-72.501212,40.884629],[-72.50149500000001,40.884641],[-72.50265,40.884301],[-72.50251400000001,40.884154],[-72.50144899999999,40.884561],[-72.50138099999999,40.884516],[-72.50148299999999,40.884425],[-72.501982,40.883859],[-72.501993,40.883463],[-72.501721,40.883349],[-72.50136999999999,40.883972],[-72.501223,40.883893],[-72.501144,40.883678],[-72.501076,40.883474],[-72.501155,40.883281],[-72.501313,40.883078],[-72.501439,40.882933],[-72.50171400000001,40.882559],[-72.50186600000001,40.882326],[-72.50214200000001,40.879908],[-72.50145500000001,40.878739],[-72.50082399999999,40.87717],[-72.500598,40.87673],[-72.49956400000001,40.875378],[-72.498572,40.875172],[-72.497069,40.874287],[-72.495518,40.873635],[-72.492475,40.872628],[-72.491803,40.872838],[-72.491567,40.873125],[-72.49204899999999,40.873415],[-72.49200999999999,40.873589],[-72.492238,40.874341],[-72.491888,40.874502],[-72.490858,40.873876],[-72.49069799999999,40.871477],[-72.490988,40.87018],[-72.491705,40.868151],[-72.49200999999999,40.867524],[-72.494367,40.864534],[-72.495772,40.863558],[-72.497539,40.86149],[-72.49754900000001,40.861479],[-72.498892,40.85946],[-72.499487,40.859074],[-72.499914,40.858595],[-72.500263,40.859297],[-72.502242,40.859613],[-72.501862,40.860492],[-72.50158,40.861158],[-72.501355,40.861672],[-72.50131399999999,40.861775],[-72.50481600000001,40.86202],[-72.506083,40.86211],[-72.507097,40.862184],[-72.507349,40.862209],[-72.50736000000001,40.862324],[-72.507316,40.862918],[-72.507122,40.863522],[-72.506867,40.864371],[-72.50676199999999,40.864813],[-72.506738,40.864893],[-72.50667799999999,40.865154],[-72.506541,40.865633],[-72.50650899999999,40.865699],[-72.50646,40.865826],[-72.50633999999999,40.86623],[-72.506332,40.866562],[-72.506236,40.867514],[-72.506168,40.867959],[-72.50613,40.868582],[-72.506078,40.869073],[-72.50607100000001,40.869618],[-72.506023,40.870529],[-72.506,40.870596],[-72.506,40.870904],[-72.50597399999999,40.871278],[-72.505994,40.871483],[-72.506032,40.871686],[-72.506154,40.87217],[-72.506243,40.872481],[-72.506332,40.872746],[-72.50640799999999,40.873089],[-72.506569,40.87335],[-72.50688100000001,40.873876],[-72.507249,40.874466],[-72.50758399999999,40.875117],[-72.50775,40.875684],[-72.50780399999999,40.87577],[-72.50784299999999,40.875833],[-72.507942,40.876356],[-72.50792300000001,40.876438],[-72.508027,40.876961],[-72.508118,40.877474],[-72.50819,40.877831],[-72.508245,40.878143],[-72.508191,40.878231],[-72.508111,40.878333],[-72.508245,40.879079],[-72.50829400000001,40.879394]]],"type":"Polygon"}
}