{
  "id": "360910619032",
  "type": "Feature",
  "properties": {
    "area_land":10537516,
    "area_water":1395158,
    "geoid":"360910619032",
    "name":"Block Group 2",
    "state":"ny"
},
  "bbox": [
    -73.792979,
    42.920795,
    -73.752963,
    42.972661
],
  "geometry": {"coordinates":[[[-73.79297699999999,42.97106],[-73.79296100000001,42.971169],[-73.7929,42.971175],[-73.791223,42.971325],[-73.78966200000001,42.971488],[-73.789051,42.971533],[-73.788776,42.971557],[-73.788096,42.971616],[-73.78657200000001,42.971714],[-73.785371,42.971822],[-73.78361099999999,42.97195],[-73.782121,42.972089],[-73.779662,42.972276],[-73.778387,42.972385],[-73.777041,42.972494],[-73.776331,42.972543],[-73.775966,42.972579],[-73.775862,42.972597],[-73.77570799999999,42.972661],[-73.775459,42.97251],[-73.774719,42.972019],[-73.774343,42.971784],[-73.773262,42.97104],[-73.771984,42.970162],[-73.77165599999999,42.969919],[-73.770579,42.969185],[-73.770185,42.968883],[-73.769261,42.968221],[-73.768866,42.967919],[-73.767996,42.967307],[-73.76724900000001,42.966797],[-73.76668100000001,42.966369],[-73.7664,42.966104],[-73.765894,42.965501],[-73.76540300000001,42.964977],[-73.76490800000001,42.96447],[-73.764503,42.964134],[-73.763914,42.963695],[-73.763554,42.963405],[-73.76330799999999,42.963206],[-73.762449,42.962575],[-73.762,42.962292],[-73.761229,42.961842],[-73.76087800000001,42.961611],[-73.76065199999999,42.96148],[-73.759443,42.960753],[-73.75808600000001,42.959908],[-73.75759100000001,42.959642],[-73.757113,42.959399],[-73.75668400000001,42.959233],[-73.756203,42.959083],[-73.755725,42.959545],[-73.75527099999999,42.959913],[-73.754552,42.960637],[-73.753738,42.961342],[-73.753423,42.961589],[-73.75296299999999,42.961952],[-73.75310899999999,42.96136],[-73.75349199999999,42.95935],[-73.75374600000001,42.958419],[-73.75436999999999,42.956165],[-73.755214,42.953117],[-73.75541,42.951886],[-73.755804,42.950609],[-73.755966,42.950398],[-73.757673,42.944388],[-73.758262,42.942238],[-73.761036,42.932076],[-73.76231900000001,42.927793],[-73.764179,42.921355],[-73.764242,42.921378],[-73.76433900000001,42.921399],[-73.76447899999999,42.921407],[-73.76452500000001,42.921382],[-73.764563,42.921331],[-73.764622,42.921179],[-73.764635,42.921095],[-73.764736,42.920795],[-73.76507100000001,42.920856],[-73.765327,42.920961],[-73.765432,42.921018],[-73.765517,42.921188],[-73.765603,42.921388],[-73.765669,42.921511],[-73.76580199999999,42.921672],[-73.76649500000001,42.922261],[-73.76696099999999,42.922602],[-73.767426,42.92283],[-73.76790099999999,42.923115],[-73.768822,42.923722],[-73.769148,42.923992],[-73.76922399999999,42.924115],[-73.769338,42.92422],[-73.76948,42.924315],[-73.76967999999999,42.924419],[-73.769851,42.924495],[-73.77001199999999,42.92458],[-73.77022100000001,42.924865],[-73.770325,42.925197],[-73.770572,42.925539],[-73.770743,42.925643],[-73.77085700000001,42.925738],[-73.770943,42.925956],[-73.771019,42.92607],[-73.77113300000001,42.926165],[-73.771294,42.926241],[-73.771608,42.926486],[-73.7719,42.926788],[-73.772046,42.926986],[-73.77213,42.927059],[-73.77222399999999,42.927122],[-73.77243300000001,42.927372],[-73.772547,42.927476],[-73.772662,42.927539],[-73.773028,42.927602],[-73.77314200000001,42.927643],[-73.773247,42.927706],[-73.773382,42.927821],[-73.773487,42.927946],[-73.77356,42.927998],[-73.77361999999999,42.928028],[-73.77369400000001,42.928031],[-73.77403099999999,42.928],[-73.774157,42.927999],[-73.774621,42.928154],[-73.77479200000001,42.928216],[-73.775423,42.928711],[-73.775629,42.928837],[-73.77576999999999,42.929547],[-73.783164,42.928976],[-73.78733800000001,42.928315],[-73.78738,42.928357],[-73.787629,42.928721],[-73.78818800000001,42.929002],[-73.788258,42.92954],[-73.788014,42.930103],[-73.787594,42.930385],[-73.78731399999999,42.930666],[-73.787454,42.93082],[-73.78801300000001,42.930961],[-73.788398,42.931268],[-73.789446,42.931959],[-73.789796,42.932292],[-73.79014599999999,42.933009],[-73.79028599999999,42.933802],[-73.79035500000001,42.935696],[-73.79014599999999,42.936567],[-73.790071,42.937329],[-73.78999,42.937458],[-73.78972400000001,42.937813],[-73.789483,42.938007],[-73.78944300000001,42.938033],[-73.789376,42.938214],[-73.789343,42.938247],[-73.789202,42.938267],[-73.789002,42.938281],[-73.78890800000001,42.938341],[-73.788848,42.938428],[-73.78880100000001,42.938602],[-73.78865999999999,42.938782],[-73.78852000000001,42.938929],[-73.788466,42.938969],[-73.78843999999999,42.939003],[-73.78836,42.939042],[-73.788383,42.939117],[-73.78864299999999,42.939401],[-73.78885699999999,42.939591],[-73.788921,42.939674],[-73.7885,42.939937],[-73.788281,42.940054],[-73.787818,42.940338],[-73.787656,42.940437],[-73.787229,42.940727],[-73.78706200000001,42.940869],[-73.786902,42.941001],[-73.78639099999999,42.941535],[-73.78569400000001,42.942218],[-73.785111,42.942804],[-73.784931,42.942971],[-73.784834,42.943074],[-73.78473099999999,42.94325],[-73.784705,42.943363],[-73.7847,42.943543],[-73.784721,42.943666],[-73.784893,42.944287],[-73.784914,42.944485],[-73.784902,42.944595],[-73.78478800000001,42.944752],[-73.78467499999999,42.944843],[-73.784519,42.944832],[-73.78434799999999,42.944831],[-73.783964,42.944848],[-73.78390899999999,42.944856],[-73.783728,42.944882],[-73.783576,42.944942],[-73.783114,42.945198],[-73.782929,42.945278],[-73.78264900000001,42.945402],[-73.78223800000001,42.945496],[-73.78202400000001,42.945519],[-73.781661,42.945558],[-73.781631,42.94561],[-73.781937,42.945725],[-73.782259,42.945845],[-73.783508,42.946257],[-73.784212,42.946514],[-73.784903,42.946948],[-73.785061,42.947142],[-73.785338,42.947225],[-73.785859,42.947415],[-73.787082,42.948047],[-73.787423,42.948198],[-73.787847,42.948322],[-73.788246,42.948412],[-73.78845099999999,42.948447],[-73.788984,42.9485],[-73.78905399999999,42.948509],[-73.789993,42.948601],[-73.789739,42.949223],[-73.78971300000001,42.949615],[-73.78962,42.951003],[-73.78962,42.951147],[-73.789609,42.95136],[-73.789598,42.951588],[-73.78957699999999,42.951885],[-73.789559,42.952268],[-73.789553,42.952564],[-73.78954,42.953171],[-73.789534,42.953464],[-73.789551,42.95388],[-73.78959399999999,42.954192],[-73.78989,42.955716],[-73.789912,42.955831],[-73.790171,42.957062],[-73.79027600000001,42.957609],[-73.790346,42.957906],[-73.790601,42.958992],[-73.79091699999999,42.960506],[-73.791178,42.961812],[-73.791241,42.962142],[-73.791439,42.9632],[-73.791529,42.963704],[-73.79194,42.965647],[-73.791949,42.965694],[-73.792176,42.966803],[-73.792366,42.967735],[-73.792418,42.96799],[-73.79264000000001,42.969114],[-73.792677,42.969252],[-73.79283700000001,42.969961],[-73.792952,42.970502],[-73.792979,42.970858],[-73.79297699999999,42.97106]]],"type":"Polygon"}
}