{
  "id": "360290159002",
  "type": "Feature",
  "properties": {
    "area_land":4781806,
    "area_water":0,
    "geoid":"360290159002",
    "name":"Block Group 2",
    "state":"ny"
},
  "bbox": [
    -78.696997,
    42.492959,
    -78.641273,
    42.509389
],
  "geometry": {"coordinates":[[[-78.696887,42.496767],[-78.696831,42.498248],[-78.696793,42.499285],[-78.696787,42.499437],[-78.696741,42.50069],[-78.696699,42.501846],[-78.695809,42.501849],[-78.695083,42.501851],[-78.69458400000001,42.501852],[-78.692313,42.501862],[-78.69193799999999,42.505611],[-78.691805,42.506953],[-78.691615,42.508858],[-78.691565,42.509389],[-78.69147100000001,42.509387],[-78.691361,42.509386],[-78.69092000000001,42.509372],[-78.690849,42.50937],[-78.69080099999999,42.509369],[-78.690709,42.509366],[-78.68929199999999,42.509323],[-78.687209,42.50926],[-78.68558899999999,42.50921],[-78.68549400000001,42.509207],[-78.683708,42.509153],[-78.67816000000001,42.508984],[-78.676085,42.50892],[-78.675774,42.508911],[-78.675228,42.508894],[-78.674605,42.508875],[-78.674064,42.508859],[-78.673875,42.508853],[-78.671048,42.508766],[-78.668487,42.508688],[-78.667428,42.508656],[-78.666099,42.508632],[-78.665093,42.508614],[-78.664559,42.508605],[-78.663808,42.508591],[-78.663736,42.50859],[-78.66261,42.50857],[-78.661108,42.508543],[-78.65964099999999,42.508517],[-78.656201,42.508456],[-78.655174,42.508437],[-78.65133899999999,42.508444],[-78.65126100000001,42.508443],[-78.64671800000001,42.50836],[-78.646503,42.508354],[-78.646129,42.508349],[-78.645455,42.508337],[-78.644806,42.508327],[-78.643995,42.508314],[-78.64132499999999,42.508311],[-78.641273,42.50831],[-78.641369,42.506067],[-78.641395,42.504651],[-78.643568,42.504625],[-78.645673,42.504598],[-78.646615,42.504586],[-78.646597,42.502926],[-78.649384,42.502942],[-78.65142299999999,42.502992],[-78.65155,42.502995],[-78.652995,42.502997],[-78.652995,42.502774],[-78.653503,42.502792],[-78.65349500000001,42.502088],[-78.65517199999999,42.50214],[-78.655142,42.502883],[-78.655293,42.502885],[-78.655447,42.502887],[-78.655491,42.502136],[-78.656319,42.502145],[-78.656363,42.501069],[-78.663523,42.501216],[-78.669067,42.501075],[-78.669365,42.500916],[-78.669383,42.501067],[-78.67123599999999,42.50107],[-78.671747,42.501067],[-78.670834,42.5007],[-78.67085899999999,42.500511],[-78.67177100000001,42.500878],[-78.67189399999999,42.498849],[-78.669112,42.498777],[-78.668868,42.496382],[-78.668847,42.496242],[-78.668806,42.496117],[-78.66865,42.495914],[-78.668543,42.495832],[-78.66831000000001,42.495728],[-78.668019,42.495631],[-78.667722,42.495525],[-78.667481,42.495452],[-78.667275,42.495354],[-78.66682400000001,42.495124],[-78.666791,42.495102],[-78.66689599999999,42.492959],[-78.67225999999999,42.493046],[-78.672167,42.494835],[-78.67738900000001,42.494891],[-78.676529,42.495862],[-78.67636899999999,42.496043],[-78.68055099999999,42.496119],[-78.685458,42.496182],[-78.68559999999999,42.496161],[-78.68725999999999,42.495512],[-78.687258,42.495099],[-78.691856,42.495089],[-78.6922,42.494199],[-78.692251,42.494201],[-78.696997,42.4942],[-78.696887,42.496767]]],"type":"Polygon"}
}