{
  "id": "361190053001",
  "type": "Feature",
  "properties": {
    "area_land":340045,
    "area_water":0,
    "geoid":"361190053001",
    "name":"Block Group 1",
    "state":"ny"
},
  "bbox": [
    -73.810565,
    40.917511,
    -73.803136,
    40.926132
],
  "geometry": {"coordinates":[[[-73.81054,40.920158],[-73.810265,40.920665],[-73.810001,40.921089],[-73.809684,40.921585],[-73.809364,40.922096],[-73.80933899999999,40.92248],[-73.809353,40.922772],[-73.80931099999999,40.923715],[-73.809314,40.923878],[-73.80929,40.923978],[-73.80917599999999,40.924175],[-73.80884399999999,40.924591],[-73.80856300000001,40.924843],[-73.808373,40.924999],[-73.808196,40.925122],[-73.80811300000001,40.925191],[-73.808054,40.92526],[-73.807985,40.925402],[-73.807954,40.925444],[-73.80789799999999,40.925489],[-73.80759,40.925629],[-73.80744799999999,40.925695],[-73.807418,40.925707],[-73.80676,40.925611],[-73.806656,40.925596],[-73.80647999999999,40.9256],[-73.80646,40.925598],[-73.805583,40.925501],[-73.80545600000001,40.925636],[-73.80502300000001,40.926132],[-73.805013,40.925915],[-73.804923,40.925596],[-73.80488200000001,40.925508],[-73.804811,40.925324],[-73.804773,40.925295],[-73.80474,40.925269],[-73.804706,40.925172],[-73.80446600000001,40.924389],[-73.80440900000001,40.924147],[-73.804224,40.923259],[-73.804171,40.923003],[-73.804086,40.922587],[-73.80393100000001,40.921781],[-73.803892,40.921524],[-73.80392000000001,40.921346],[-73.803997,40.921117],[-73.80407,40.921015],[-73.80411100000001,40.920957],[-73.80356,40.919173],[-73.80327200000001,40.918074],[-73.80313599999999,40.917514],[-73.803214,40.917511],[-73.803422,40.917536],[-73.80359300000001,40.917596],[-73.80393100000001,40.917716],[-73.80422299999999,40.917842],[-73.805024,40.918168],[-73.80583300000001,40.918487],[-73.80572600000001,40.918645],[-73.80657600000001,40.918951],[-73.807339,40.919213],[-73.807638,40.919298],[-73.80847900000001,40.919537],[-73.809341,40.919776],[-73.810209,40.920004],[-73.810423,40.920062],[-73.810565,40.920101],[-73.81054,40.920158]]],"type":"Polygon"}
}