{
  "id": "360710001003",
  "type": "Feature",
  "properties": {
    "area_land":446134,
    "area_water":0,
    "geoid":"360710001003",
    "name":"Block Group 3",
    "state":"ny"
},
  "bbox": [
    -74.017578,
    41.507633,
    -74.010637,
    41.51742
],
  "geometry": {"coordinates":[[[-74.01754200000001,41.509568],[-74.017458,41.510602],[-74.017425,41.511049],[-74.01732,41.512421],[-74.017257,41.513124],[-74.017206,41.513841],[-74.017194,41.514399],[-74.017189,41.516113],[-74.017155,41.517116],[-74.01682099999999,41.51717],[-74.016446,41.517254],[-74.016172,41.51734],[-74.016001,41.51742],[-74.014415,41.517314],[-74.01457499999999,41.515709],[-74.01383300000001,41.51569],[-74.01383300000001,41.515051],[-74.013817,41.51499],[-74.013773,41.514926],[-74.013684,41.514878],[-74.01353400000001,41.514846],[-74.010991,41.514704],[-74.010969,41.514364],[-74.010959,41.514191],[-74.010835,41.511764],[-74.010757,41.510219],[-74.01074199999999,41.509931],[-74.010715,41.509301],[-74.010637,41.507633],[-74.01155,41.50778],[-74.012027,41.507849],[-74.01245900000001,41.507912],[-74.01296600000001,41.50798],[-74.013172,41.508022],[-74.013278,41.508073],[-74.013572,41.50825],[-74.013919,41.508472],[-74.01428799999999,41.508739],[-74.014627,41.508985],[-74.015018,41.509247],[-74.015168,41.509333],[-74.015322,41.509377],[-74.015439,41.509391],[-74.015578,41.509381],[-74.01605000000001,41.509308],[-74.01705,41.509147],[-74.017578,41.509071],[-74.01754200000001,41.509568]]],"type":"Polygon"}
}