{
  "id": "360810889016",
  "type": "Feature",
  "properties": {
    "area_land":90803,
    "area_water":0,
    "geoid":"360810889016",
    "name":"Block Group 6",
    "state":"ny"
},
  "bbox": [
    -73.831925,
    40.764712,
    -73.827532,
    40.76877
],
  "geometry": {"coordinates":[[[-73.831925,40.767754],[-73.830853,40.767999],[-73.829751,40.768253],[-73.82862799999999,40.768519],[-73.82753200000001,40.76877],[-73.828442,40.767874],[-73.82904499999999,40.76727],[-73.82909100000001,40.766447],[-73.82769,40.766104],[-73.82786299999999,40.765363],[-73.829059,40.765093],[-73.830686,40.764712],[-73.83144299999999,40.76657],[-73.831925,40.767754]]],"type":"Polygon"}
}