{
  "id": "360850291033",
  "type": "Feature",
  "properties": {
    "area_land":294600,
    "area_water":0,
    "geoid":"360850291033",
    "name":"Block Group 3",
    "state":"ny"
},
  "bbox": [
    -74.167197,
    40.601681,
    -74.160402,
    40.610495
],
  "geometry": {"coordinates":[[[-74.166949,40.602796],[-74.16669400000001,40.603493],[-74.16636,40.604189],[-74.16597400000001,40.604941],[-74.165926,40.605032],[-74.16585600000001,40.605195],[-74.165814,40.605339],[-74.165785,40.605493],[-74.165774,40.605655],[-74.16582200000001,40.606763],[-74.165701,40.606902],[-74.165504,40.607624],[-74.16543799999999,40.608345],[-74.164839,40.610495],[-74.163875,40.610339],[-74.161496,40.609964],[-74.160402,40.609807],[-74.160436,40.609682],[-74.160494,40.609543],[-74.16057000000001,40.609406],[-74.160669,40.609269],[-74.16077900000001,40.609145],[-74.160903,40.609032],[-74.16103200000001,40.608934],[-74.161186,40.608835],[-74.161939,40.608409],[-74.162057,40.60832],[-74.16216300000001,40.608219],[-74.162251,40.608115],[-74.162324,40.608003],[-74.162375,40.607901],[-74.162418,40.607779],[-74.16244399999999,40.607646],[-74.162451,40.607514],[-74.162435,40.607367],[-74.162396,40.607227],[-74.16238199999999,40.60719],[-74.162271,40.606699],[-74.162233,40.605932],[-74.16221400000001,40.605306],[-74.162378,40.604619],[-74.16248,40.604377],[-74.163287,40.601681],[-74.165334,40.601876],[-74.166265,40.601978],[-74.167197,40.602076],[-74.166949,40.602796]]],"type":"Polygon"}
}