{
  "id": "361031245003",
  "type": "Feature",
  "properties": {
    "area_land":434860,
    "area_water":0,
    "geoid":"361031245003",
    "name":"Block Group 3",
    "state":"ny"
},
  "bbox": [
    -73.340742,
    40.697094,
    -73.326694,
    40.702263
],
  "geometry": {"coordinates":[[[-73.34074200000001,40.701339],[-73.338965,40.701765],[-73.337329,40.702129],[-73.337113,40.702168],[-73.33642399999999,40.702263],[-73.335133,40.702248],[-73.33387999999999,40.702213],[-73.332628,40.702195],[-73.331345,40.702167],[-73.32986099999999,40.702122],[-73.328969,40.702102],[-73.32786400000001,40.702071],[-73.326694,40.702045],[-73.327392,40.701025],[-73.327175,40.700113],[-73.32796500000001,40.699601],[-73.335217,40.697596],[-73.33709,40.697094],[-73.337164,40.697167],[-73.3372,40.697205],[-73.337523,40.697561],[-73.33813499999999,40.698162],[-73.338587,40.698741],[-73.339406,40.699751],[-73.33969999999999,40.700103],[-73.34074200000001,40.701339]]],"type":"Polygon"}
}