{
  "id": "360811267003",
  "type": "Feature",
  "properties": {
    "area_land":105651,
    "area_water":0,
    "geoid":"360811267003",
    "name":"Block Group 3",
    "state":"ny"
},
  "bbox": [
    -73.802693,
    40.71655,
    -73.798096,
    40.720145
],
  "geometry": {"coordinates":[[[-73.802693,40.719514],[-73.80176299999999,40.719679],[-73.800843,40.719836],[-73.79992799999999,40.720004],[-73.799001,40.720145],[-73.798492,40.718707],[-73.798096,40.717543],[-73.79918600000001,40.717225],[-73.800082,40.716974],[-73.80099199999999,40.716787],[-73.801922,40.71655],[-73.80230299999999,40.718034],[-73.802693,40.719514]]],"type":"Polygon"}
}