{
  "id": "360470136001",
  "type": "Feature",
  "properties": {
    "area_land":92037,
    "area_water":0,
    "geoid":"360470136001",
    "name":"Block Group 1",
    "state":"ny"
},
  "bbox": [
    -74.023557,
    40.624285,
    -74.017842,
    40.628701
],
  "geometry": {"coordinates":[[[-74.023258,40.627972],[-74.022959,40.628701],[-74.0206,40.627277],[-74.018961,40.626296],[-74.01863899999999,40.627071],[-74.018315,40.626876],[-74.018175,40.626791],[-74.017842,40.626591],[-74.018879,40.624303],[-74.019218,40.624299],[-74.019403,40.624293],[-74.019459,40.624291],[-74.019605,40.624289],[-74.019752,40.624285],[-74.020064,40.624285],[-74.019632,40.624879],[-74.02119399999999,40.625816],[-74.023557,40.627242],[-74.023258,40.627972]]],"type":"Polygon"}
}