{
  "id": "360470396002",
  "type": "Feature",
  "properties": {
    "area_land":85533,
    "area_water":0,
    "geoid":"360470396002",
    "name":"Block Group 2",
    "state":"ny"
},
  "bbox": [
    -73.971911,
    40.59493,
    -73.969228,
    40.599632
],
  "geometry": {"coordinates":[[[-73.97191100000001,40.599423],[-73.970984,40.59953],[-73.970056,40.599632],[-73.96963,40.597379],[-73.969228,40.595256],[-73.96977099999999,40.59493],[-73.970111,40.594957],[-73.971082,40.595049],[-73.971765,40.595112],[-73.97153299999999,40.596369],[-73.971329,40.596353],[-73.971484,40.597172],[-73.97163,40.597944],[-73.971761,40.598652],[-73.97191100000001,40.599423]]],"type":"Polygon"}
}