{
  "id": "360470328004",
  "type": "Feature",
  "properties": {
    "area_land":45874,
    "area_water":0,
    "geoid":"360470328004",
    "name":"Block Group 4",
    "state":"ny"
},
  "bbox": [
    -74.003223,
    40.574637,
    -74.000675,
    40.577121
],
  "geometry": {"coordinates":[[[-74.00322300000001,40.576887],[-74.00216,40.577006],[-74.00152799999999,40.577074],[-74.001105,40.577121],[-74.000675,40.574868],[-74.001734,40.57475],[-74.002796,40.574637],[-74.00284000000001,40.574849],[-74.00296400000001,40.575516],[-74.00309300000001,40.576196],[-74.00322300000001,40.576887]]],"type":"Polygon"}
}