{
  "id": "360470106001",
  "type": "Feature",
  "properties": {
    "area_land":56621,
    "area_water":0,
    "geoid":"360470106001",
    "name":"Block Group 1",
    "state":"ny"
},
  "bbox": [
    -74.006622,
    40.636985,
    -74.002672,
    40.639995
],
  "geometry": {"coordinates":[[[-74.006041,40.638877],[-74.00545700000001,40.639435],[-74.00487699999999,40.639995],[-74.002672,40.638667],[-74.003253,40.638104],[-74.003838,40.637546],[-74.00442,40.636985],[-74.00662199999999,40.638315],[-74.006041,40.638877]]],"type":"Polygon"}
}