{
  "id": "360010007003",
  "type": "Feature",
  "properties": {
    "area_land":185327,
    "area_water":0,
    "geoid":"360010007003",
    "name":"Block Group 3",
    "state":"ny"
},
  "bbox": [
    -73.764976,
    42.662273,
    -73.757012,
    42.6674
],
  "geometry": {"coordinates":[[[-73.764268,42.665749],[-73.76423699999999,42.665778],[-73.763859,42.666124],[-73.763481,42.666486],[-73.762327,42.665835],[-73.761798,42.66631],[-73.761042,42.667048],[-73.760892,42.667177],[-73.76068100000001,42.6674],[-73.759905,42.666954],[-73.75916700000001,42.666522],[-73.758408,42.666077],[-73.757277,42.665404],[-73.757012,42.665246],[-73.75787099999999,42.664443],[-73.758196,42.664125],[-73.758664,42.663708],[-73.759079,42.66334],[-73.759101,42.663258],[-73.75942499999999,42.662979],[-73.76017899999999,42.662273],[-73.761081,42.662775],[-73.762798,42.663787],[-73.763063,42.663954],[-73.764976,42.665095],[-73.764268,42.665749]]],"type":"Polygon"}
}