{
  "id": "360470130001",
  "type": "Feature",
  "properties": {
    "area_land":38923,
    "area_water":0,
    "geoid":"360470130001",
    "name":"Block Group 1",
    "state":"ny"
},
  "bbox": [
    -74.023518,
    40.632334,
    -74.018245,
    40.635318
],
  "geometry": {"coordinates":[[[-74.023518,40.634616],[-74.023235,40.635318],[-74.02072200000001,40.634169],[-74.019263,40.633494],[-74.01824499999999,40.633034],[-74.01853,40.632334],[-74.01973599999999,40.632885],[-74.021012,40.633469],[-74.02121699999999,40.633562],[-74.02324,40.634489],[-74.023518,40.634616]]],"type":"Polygon"}
}