{
  "id": "360570722004",
  "type": "Feature",
  "properties": {
    "area_land":46777253,
    "area_water":823945,
    "geoid":"360570722004",
    "name":"Block Group 4",
    "state":"ny"
},
  "bbox": [
    -74.488844,
    42.897793,
    -74.380967,
    42.985118
],
  "geometry": {"coordinates":[[[-74.488844,42.985118],[-74.48377499999999,42.985082],[-74.47289600000001,42.985092],[-74.467339,42.985098],[-74.447002,42.984831],[-74.445061,42.984811],[-74.429417,42.984732],[-74.42929700000001,42.984731],[-74.426847,42.98479],[-74.417366,42.984774],[-74.41670000000001,42.984754],[-74.416507,42.98475],[-74.41588900000001,42.984735],[-74.41580500000001,42.984736],[-74.415389,42.984736],[-74.415149,42.984736],[-74.411474,42.984736],[-74.410928,42.984736],[-74.410836,42.984736],[-74.414946,42.982978],[-74.41783100000001,42.981637],[-74.418747,42.980602],[-74.418824,42.980555],[-74.419732,42.979084],[-74.419602,42.977105],[-74.418446,42.975241],[-74.417202,42.973914],[-74.41602,42.973044],[-74.41427899999999,42.972497],[-74.41207199999999,42.972132],[-74.410394,42.971447],[-74.408373,42.970191],[-74.40769899999999,42.969423],[-74.407489,42.968769],[-74.40580300000001,42.966902],[-74.404116,42.964894],[-74.403594,42.963569],[-74.402295,42.962497],[-74.39999299999999,42.961496],[-74.397757,42.961087],[-74.39593000000001,42.96061],[-74.39466400000001,42.959744],[-74.393584,42.958626],[-74.393518,42.958506],[-74.393524,42.958351],[-74.39291299999999,42.957454],[-74.39181499999999,42.956344],[-74.39063299999999,42.955643],[-74.386786,42.954684],[-74.38533099999999,42.954586],[-74.384609,42.954533],[-74.383077,42.954269],[-74.382389,42.954258],[-74.382125,42.954117],[-74.38174600000001,42.953889],[-74.381306,42.953683],[-74.38116100000001,42.953593],[-74.381078,42.953528],[-74.380967,42.953402],[-74.381137,42.95332],[-74.38149300000001,42.95316],[-74.381659,42.953091],[-74.38214600000001,42.952924],[-74.38321999999999,42.952613],[-74.383374,42.952588],[-74.384219,42.952378],[-74.38564700000001,42.952055],[-74.385705,42.952028],[-74.38669,42.951764],[-74.388852,42.95115],[-74.390236,42.950762],[-74.390587,42.950617],[-74.390828,42.950504],[-74.391926,42.949898],[-74.393528,42.948824],[-74.393934,42.948553],[-74.393778,42.948401],[-74.39348,42.948178],[-74.39337399999999,42.948083],[-74.393249,42.94797],[-74.393204,42.947915],[-74.39315999999999,42.947877],[-74.39298100000001,42.947702],[-74.392951,42.947665],[-74.39272800000001,42.947452],[-74.39219900000001,42.946669],[-74.39758,42.944155],[-74.40422700000001,42.940487],[-74.404636,42.94028],[-74.405044,42.940072],[-74.41094200000001,42.937077],[-74.41361000000001,42.935225],[-74.42192,42.930315],[-74.424543,42.928234],[-74.425016,42.927859],[-74.425597,42.927284],[-74.428971,42.925019],[-74.434449,42.92239],[-74.43824499999999,42.920579],[-74.44289000000001,42.919047],[-74.444608,42.91893],[-74.4452,42.918889],[-74.44590100000001,42.918587],[-74.44613200000001,42.918448],[-74.44626,42.91837],[-74.44713900000001,42.917842],[-74.448624,42.916521],[-74.449952,42.915392],[-74.45801299999999,42.91012],[-74.45904299999999,42.908605],[-74.46003399999999,42.907146],[-74.46015,42.905644],[-74.46029,42.904663],[-74.460859,42.903724],[-74.46194800000001,42.90244],[-74.464572,42.90049],[-74.466544,42.899018],[-74.4684,42.898612],[-74.471588,42.898017],[-74.472031,42.897897],[-74.473437,42.897793],[-74.473511,42.898187],[-74.473581,42.898562],[-74.47361100000001,42.898719],[-74.476268,42.912818],[-74.476435,42.913811],[-74.476438,42.913824],[-74.476456,42.91392],[-74.477181,42.917771],[-74.477244,42.918099],[-74.47820400000001,42.923103],[-74.478239,42.923281],[-74.478264,42.923414],[-74.48047699999999,42.934928],[-74.480501,42.935056],[-74.480744,42.936307],[-74.48076500000001,42.93642],[-74.481399,42.939712],[-74.48206,42.943395],[-74.482071,42.943467],[-74.48221599999999,42.944343],[-74.48339799999999,42.951481],[-74.484008,42.955184],[-74.484026,42.955315],[-74.48486,42.960851],[-74.484959,42.961544],[-74.485069,42.962311],[-74.485293,42.963279],[-74.485744,42.96631],[-74.48607199999999,42.967663],[-74.48640399999999,42.969844],[-74.48689899999999,42.973033],[-74.486982,42.973841],[-74.48740599999999,42.97638],[-74.48756400000001,42.977326],[-74.488478,42.982832],[-74.488844,42.985118]]],"type":"Polygon"}
}