{
  "id": "361031905032",
  "type": "Feature",
  "properties": {
    "area_land":2075480,
    "area_water":17177,
    "geoid":"361031905032",
    "name":"Block Group 2",
    "state":"ny"
},
  "bbox": [
    -72.716375,
    40.818322,
    -72.689932,
    40.831241
],
  "geometry": {"coordinates":[[[-72.716296,40.823638],[-72.71338,40.82607],[-72.71326500000001,40.826151],[-72.713204,40.826294],[-72.712885,40.826663],[-72.712875,40.826717],[-72.71276,40.826704],[-72.71266799999999,40.826817],[-72.712388,40.827236],[-72.71210600000001,40.827637],[-72.710792,40.828548],[-72.710067,40.829594],[-72.709962,40.829746],[-72.70899900000001,40.830307],[-72.70810299999999,40.831241],[-72.707723,40.831043],[-72.70748,40.830925],[-72.707064,40.830724],[-72.706824,40.830608],[-72.706579,40.830496],[-72.70576800000001,40.830296],[-72.704385,40.82994],[-72.704106,40.829875],[-72.703469,40.82971],[-72.702944,40.829582],[-72.701774,40.829283],[-72.701251,40.829118],[-72.70016,40.828776],[-72.69928,40.828519],[-72.698926,40.828446],[-72.69861899999999,40.828391],[-72.69804600000001,40.828287],[-72.69752099999999,40.828177],[-72.69679499999999,40.828037],[-72.69623799999999,40.827957],[-72.69552400000001,40.827863],[-72.693309,40.827551],[-72.692627,40.827451],[-72.692238,40.827394],[-72.69186999999999,40.82734],[-72.691174,40.827242],[-72.690347,40.827122],[-72.689932,40.827064],[-72.690279,40.826222],[-72.69065399999999,40.825336],[-72.690763,40.825185],[-72.691076,40.82475],[-72.691119,40.824599],[-72.69129599999999,40.823981],[-72.69140400000001,40.823605],[-72.691372,40.823364],[-72.691349,40.823193],[-72.691282,40.822679],[-72.69126199999999,40.822527],[-72.691192,40.821987],[-72.69117199999999,40.821836],[-72.691125,40.821474],[-72.691042,40.821241],[-72.69094699999999,40.82101],[-72.691042,40.820456],[-72.690978,40.818452],[-72.690971,40.818322],[-72.691586,40.818339],[-72.69318,40.818501],[-72.69367800000001,40.81856],[-72.69413400000001,40.818615],[-72.69445399999999,40.818681],[-72.69484199999999,40.818749],[-72.695571,40.818833],[-72.695904,40.818862],[-72.69813600000001,40.819001],[-72.698998,40.81906],[-72.70036899999999,40.819149],[-72.70250299999999,40.819292],[-72.702668,40.819303],[-72.70425400000001,40.819395],[-72.70465799999999,40.819419],[-72.70511399999999,40.819446],[-72.705297,40.819468],[-72.705433,40.819483],[-72.70765299999999,40.819611],[-72.70828400000001,40.819648],[-72.709155,40.819701],[-72.709412,40.819717],[-72.710994,40.819819],[-72.71225699999999,40.819914],[-72.712552,40.819979],[-72.712749,40.820058],[-72.712897,40.820143],[-72.71316400000001,40.820339],[-72.713329,40.820538],[-72.713483,40.820694],[-72.713819,40.821],[-72.71391800000001,40.821094],[-72.714163,40.821325],[-72.714439,40.821553],[-72.714714,40.821774],[-72.714945,40.821969],[-72.715277,40.822193],[-72.71557300000001,40.822375],[-72.71581399999999,40.822776],[-72.715908,40.82288],[-72.716133,40.823217],[-72.716207,40.823321],[-72.716375,40.823582],[-72.716296,40.823638]]],"type":"Polygon"}
}