{
  "id": "360830524032",
  "type": "Feature",
  "properties": {
    "area_land":279937,
    "area_water":60038,
    "geoid":"360830524032",
    "name":"Block Group 2",
    "state":"ny"
},
  "bbox": [
    -73.733908,
    42.614057,
    -73.717283,
    42.619329
],
  "geometry": {"coordinates":[[[-73.733908,42.618991],[-73.73253,42.618796],[-73.73236199999999,42.618791],[-73.732313,42.618788],[-73.73135000000001,42.618871],[-73.731009,42.618916],[-73.730441,42.619007],[-73.72967800000001,42.619084],[-73.729527,42.619096],[-73.728545,42.619193],[-73.72753899999999,42.619329],[-73.72737600000001,42.619322],[-73.726353,42.619278],[-73.72633,42.619197],[-73.72623400000001,42.619059],[-73.726129,42.618891],[-73.72606500000001,42.618763],[-73.72599200000001,42.618524],[-73.72579899999999,42.617571],[-73.725781,42.617503],[-73.72575399999999,42.61745],[-73.72567100000001,42.617345],[-73.72559800000001,42.617298],[-73.72548399999999,42.617274],[-73.725323,42.617261],[-73.72517000000001,42.617288],[-73.724656,42.617331],[-73.72432000000001,42.617344],[-73.720508,42.617601],[-73.71870199999999,42.617697],[-73.717523,42.617816],[-73.71728299999999,42.617224],[-73.71729000000001,42.617183],[-73.71730599999999,42.617138],[-73.71736799999999,42.617115],[-73.717467,42.617105],[-73.718766,42.61702],[-73.72018300000001,42.616941],[-73.72052100000001,42.616915],[-73.720547,42.616215],[-73.720586,42.615574],[-73.7206,42.615542],[-73.72062699999999,42.615515],[-73.720658,42.615487],[-73.72072,42.61547],[-73.72145399999999,42.615419],[-73.72247299999999,42.615333],[-73.72295200000001,42.615299],[-73.72461300000001,42.615174],[-73.72526999999999,42.615163],[-73.72530399999999,42.614831],[-73.725334,42.614618],[-73.725374,42.614463],[-73.72543400000001,42.614337],[-73.725515,42.614219],[-73.725595,42.614146],[-73.725635,42.614124],[-73.725695,42.614101],[-73.72575500000001,42.614079],[-73.725846,42.614057],[-73.725966,42.614065],[-73.726096,42.614094],[-73.726196,42.614153],[-73.726277,42.614249],[-73.726327,42.614374],[-73.72636300000001,42.614819],[-73.7264,42.614925],[-73.726437,42.614972],[-73.726568,42.615088],[-73.72796099999999,42.614912],[-73.728435,42.614841],[-73.728892,42.615427],[-73.72942399999999,42.616074],[-73.72988100000001,42.615857],[-73.730189,42.61571],[-73.730385,42.61562],[-73.73084299999999,42.616138],[-73.73135600000001,42.616721],[-73.73195200000001,42.617285],[-73.73266700000001,42.617867],[-73.732972,42.618145],[-73.733142,42.618288],[-73.733333,42.61845],[-73.733908,42.618991]]],"type":"Polygon"}
}