{
  "id": "360050125002",
  "type": "Feature",
  "properties": {
    "area_land":68846,
    "area_water":0,
    "geoid":"360050125002",
    "name":"Block Group 2",
    "state":"ny"
},
  "bbox": [
    -73.896696,
    40.828143,
    -73.892886,
    40.830619
],
  "geometry": {"coordinates":[[[-73.89669600000001,40.830414],[-73.895606,40.830524],[-73.89469200000001,40.830619],[-73.89336,40.830152],[-73.892886,40.830148],[-73.892903,40.828467],[-73.893843,40.828392],[-73.894914,40.828306],[-73.89505800000001,40.828388],[-73.89522599999999,40.828213],[-73.895292,40.828143],[-73.89548499999999,40.828249],[-73.89560299999999,40.828316],[-73.896395,40.828763],[-73.89669600000001,40.830414]]],"type":"Polygon"}
}