{
  "id": "361031234025",
  "type": "Feature",
  "properties": {
    "area_land":726526,
    "area_water":0,
    "geoid":"361031234025",
    "name":"Block Group 5",
    "state":"ny"
},
  "bbox": [
    -73.383852,
    40.705977,
    -73.367179,
    40.714569
],
  "geometry": {"coordinates":[[[-73.38357000000001,40.710841],[-73.383447,40.711058],[-73.383126,40.711652],[-73.382631,40.712518],[-73.382322,40.713142],[-73.38211699999999,40.713503],[-73.38186,40.713973],[-73.38159899999999,40.714409],[-73.381507,40.714569],[-73.380859,40.714471],[-73.380393,40.714401],[-73.37932499999999,40.714225],[-73.37885,40.714122],[-73.37763099999999,40.713807],[-73.377054,40.713686],[-73.37603,40.713507],[-73.374487,40.713191],[-73.373662,40.712954],[-73.37318399999999,40.712788],[-73.37237500000001,40.712512],[-73.371951,40.712344],[-73.371286,40.71214],[-73.370648,40.711923],[-73.36962,40.711577],[-73.36927300000001,40.711462],[-73.36781000000001,40.710951],[-73.367515,40.710852],[-73.367334,40.710792],[-73.36717899999999,40.71074],[-73.36729099999999,40.710624],[-73.3682,40.70972],[-73.368664,40.709493],[-73.369107,40.709055],[-73.369283,40.708884],[-73.36984,40.708362],[-73.369941,40.708263],[-73.370431,40.70779],[-73.371,40.707234],[-73.371582,40.706691],[-73.37186,40.706428],[-73.372162,40.70616],[-73.372326,40.705977],[-73.373672,40.706435],[-73.374743,40.706864],[-73.375978,40.707422],[-73.377565,40.70795],[-73.378621,40.70833],[-73.37950499999999,40.708672],[-73.380421,40.708998],[-73.383852,40.71029],[-73.38357000000001,40.710841]]],"type":"Polygon"}
}