{
  "id": "360470199001",
  "type": "Feature",
  "properties": {
    "area_land":41586,
    "area_water":0,
    "geoid":"360470199001",
    "name":"Block Group 1",
    "state":"ny"
},
  "bbox": [
    -73.967493,
    40.684319,
    -73.965082,
    40.686744
],
  "geometry": {"coordinates":[[[-73.967493,40.686518],[-73.96653000000001,40.686627],[-73.965525,40.686744],[-73.965082,40.684546],[-73.966094,40.684431],[-73.967056,40.684319],[-73.967493,40.686518]]],"type":"Polygon"}
}