{
  "id": "360470894004",
  "type": "Feature",
  "properties": {
    "area_land":35472,
    "area_water":0,
    "geoid":"360470894004",
    "name":"Block Group 4",
    "state":"ny"
},
  "bbox": [
    -73.917074,
    40.658393,
    -73.913736,
    40.660181
],
  "geometry": {"coordinates":[[[-73.91604,40.6599],[-73.915086,40.660041],[-73.914131,40.660181],[-73.913736,40.658645],[-73.914692,40.658503],[-73.915567,40.658393],[-73.915728,40.65855],[-73.917074,40.659745],[-73.91604,40.6599]]],"type":"Polygon"}
}