{
  "id": "360594046001",
  "type": "Feature",
  "properties": {
    "area_land":184853,
    "area_water":0,
    "geoid":"360594046001",
    "name":"Block Group 1",
    "state":"ny"
},
  "bbox": [
    -73.695254,
    40.712894,
    -73.690465,
    40.719981
],
  "geometry": {"coordinates":[[[-73.69515800000001,40.713641],[-73.69512899999999,40.713791],[-73.695035,40.714022],[-73.694969,40.714267],[-73.69486499999999,40.714662],[-73.694675,40.71536],[-73.694496,40.716062],[-73.694306,40.716763],[-73.694293,40.716847],[-73.69423999999999,40.717038],[-73.69412800000001,40.717463],[-73.694018,40.717855],[-73.693938,40.718163],[-73.693834,40.71856],[-73.693758,40.718854],[-73.693651,40.719258],[-73.693558,40.719616],[-73.69346400000001,40.719981],[-73.693332,40.719923],[-73.69232100000001,40.719478],[-73.691405,40.71907],[-73.69134,40.719041],[-73.690465,40.718656],[-73.69097499999999,40.717002],[-73.6922,40.71386],[-73.692376,40.713195],[-73.692548,40.712897],[-73.692989,40.712894],[-73.69525400000001,40.713257],[-73.69515800000001,40.713641]]],"type":"Polygon"}
}