{
  "id": "360670058003",
  "type": "Feature",
  "properties": {
    "area_land":234903,
    "area_water":0,
    "geoid":"360670058003",
    "name":"Block Group 3",
    "state":"ny"
},
  "bbox": [
    -76.154197,
    43.012604,
    -76.147884,
    43.017368
],
  "geometry": {"coordinates":[[[-76.154197,43.016768],[-76.15351200000001,43.016839],[-76.153261,43.016865],[-76.15260600000001,43.016932],[-76.15210399999999,43.016981],[-76.1515,43.017037],[-76.15075,43.01712],[-76.14987600000001,43.017201],[-76.148286,43.017368],[-76.14823,43.016835],[-76.148203,43.016501],[-76.148128,43.015609],[-76.148054,43.014777],[-76.14797900000001,43.013961],[-76.14790000000001,43.01307],[-76.147884,43.012909],[-76.14845200000001,43.012892],[-76.150819,43.012799],[-76.15298,43.01272],[-76.15333800000001,43.012681],[-76.15353899999999,43.012604],[-76.154099,43.012972],[-76.154096,43.013184],[-76.154105,43.013743],[-76.154107,43.013901],[-76.154151,43.014846],[-76.15415900000001,43.015659],[-76.154197,43.016768]]],"type":"Polygon"}
}