{
  "id": "360610269003",
  "type": "Feature",
  "properties": {
    "area_land":33572,
    "area_water":0,
    "geoid":"360610269003",
    "name":"Block Group 3",
    "state":"ny"
},
  "bbox": [
    -73.932849,
    40.847428,
    -73.930013,
    40.849921
],
  "geometry": {"coordinates":[[[-73.932337,40.848735],[-73.931917,40.849309],[-73.931472,40.849921],[-73.930013,40.849314],[-73.930466,40.848697],[-73.930621,40.848481],[-73.93088400000001,40.848119],[-73.931161,40.84774],[-73.931393,40.847428],[-73.932849,40.848038],[-73.932337,40.848735]]],"type":"Polygon"}
}