{
  "id": "361190107011",
  "type": "Feature",
  "properties": {
    "area_land":5113222,
    "area_water":0,
    "geoid":"361190107011",
    "name":"Block Group 1",
    "state":"ny"
},
  "bbox": [
    -73.865449,
    40.980332,
    -73.829397,
    41.01329
],
  "geometry": {"coordinates":[[[-73.865447,40.982084],[-73.86543,40.982387],[-73.865342,40.982743],[-73.865222,40.98301],[-73.865033,40.983671],[-73.86480299999999,40.984387],[-73.864726,40.984591],[-73.86462,40.984843],[-73.864301,40.985511],[-73.86411099999999,40.985963],[-73.86396499999999,40.98631],[-73.86329000000001,40.987724],[-73.862818,40.988708],[-73.86261500000001,40.989199],[-73.862438,40.989667],[-73.86214699999999,40.990529],[-73.861957,40.991036],[-73.861677,40.991506],[-73.86144299999999,40.991799],[-73.86095299999999,40.992469],[-73.860539,40.993007],[-73.860271,40.993316],[-73.860178,40.993423],[-73.859399,40.994387],[-73.859205,40.994651],[-73.85912999999999,40.994756],[-73.85874699999999,40.995295],[-73.85823000000001,40.996355],[-73.858104,40.996553],[-73.857814,40.997008],[-73.85740199999999,40.997538],[-73.85845500000001,40.997888],[-73.85865200000001,40.997989],[-73.858425,40.998344],[-73.85833100000001,40.998477],[-73.85780099999999,40.999495],[-73.85753200000001,40.999997],[-73.85681700000001,41.00149],[-73.85619199999999,41.002469],[-73.855227,41.003977],[-73.854018,41.005584],[-73.853932,41.005698],[-73.85298899999999,41.005695],[-73.852904,41.005232],[-73.85285399999999,41.004992],[-73.852822,41.004664],[-73.852851,41.004467],[-73.852906,41.00427],[-73.85299000000001,41.004043],[-73.85312399999999,41.003729],[-73.852529,41.003678],[-73.85230199999999,41.003672],[-73.851106,41.003641],[-73.850398,41.003664],[-73.849476,41.003667],[-73.84946600000001,41.004186],[-73.849436,41.004296],[-73.84942599999999,41.004763],[-73.84935400000001,41.005226],[-73.848477,41.004995],[-73.847926,41.004925],[-73.84786800000001,41.004918],[-73.84758100000001,41.004881],[-73.84693,41.006803],[-73.846296,41.006811],[-73.845854,41.006811],[-73.845032,41.006617],[-73.84425,41.006443],[-73.84272300000001,41.006251],[-73.841206,41.005761],[-73.84069599999999,41.005508],[-73.840986,41.004922],[-73.840987,41.004549],[-73.839606,41.004199],[-73.840335,41.002699],[-73.83928,41.002299],[-73.839381,41.001699],[-73.83907000000001,41.001496],[-73.838733,41.001076],[-73.83850099999999,41.000791],[-73.838381,41.000953],[-73.8379,41.001482],[-73.837508,41.001814],[-73.837059,41.002152],[-73.837661,41.002268],[-73.83759999999999,41.002337],[-73.837422,41.002523],[-73.836915,41.002951],[-73.836094,41.00353],[-73.836027,41.00362],[-73.836012,41.00375],[-73.83596799999999,41.003885],[-73.835886,41.003969],[-73.83557999999999,41.004222],[-73.835196,41.00449],[-73.83446499999999,41.004053],[-73.834444,41.00407],[-73.834097,41.004573],[-73.834391,41.004785],[-73.833718,41.005212],[-73.83369,41.005262],[-73.833404,41.005548],[-73.833512,41.005576],[-73.834609,41.005999],[-73.83473600000001,41.005901],[-73.835092,41.006052],[-73.83508399999999,41.006088],[-73.834997,41.006348],[-73.83480299999999,41.00632],[-73.834233,41.006122],[-73.83336300000001,41.005828],[-73.833247,41.005785],[-73.83322800000001,41.006001],[-73.83304,41.006228],[-73.832716,41.006595],[-73.83260300000001,41.006737],[-73.833247,41.00783],[-73.833369,41.008062],[-73.832339,41.00922],[-73.83216,41.010206],[-73.832027,41.010582],[-73.831934,41.010753],[-73.83184799999999,41.010841],[-73.831568,41.011029],[-73.830782,41.011358],[-73.83056000000001,41.011497],[-73.830549,41.011505],[-73.83040099999999,41.011628],[-73.830331,41.011722],[-73.830144,41.012075],[-73.82989499999999,41.012973],[-73.82942,41.01329],[-73.82956,41.012943],[-73.829762,41.01235],[-73.829832,41.012092],[-73.829871,41.011687],[-73.829863,41.011287],[-73.829809,41.010759],[-73.8297,41.009842],[-73.829685,41.00973],[-73.82956299999999,41.008783],[-73.82951,41.008362],[-73.829419,41.007585],[-73.829397,41.00707],[-73.829459,41.005816],[-73.829492,41.005507],[-73.829584,41.00475],[-73.829605,41.004637],[-73.82969,41.004191],[-73.829804,41.003718],[-73.829944,41.003248],[-73.830248,41.002309],[-73.83035099999999,41.002028],[-73.830665,41.001341],[-73.830817,41.001045],[-73.83109899999999,41.000558],[-73.83143,41.000034],[-73.83144900000001,41.000005],[-73.831678,40.999717],[-73.831878,40.999476],[-73.83251799999999,40.998828],[-73.832711,40.998668],[-73.834081,40.997433],[-73.834631,40.996922],[-73.835594,40.995965],[-73.836052,40.995473],[-73.836456,40.995011],[-73.837226,40.994043],[-73.83788699999999,40.993102],[-73.838494,40.992165],[-73.83891300000001,40.991444],[-73.83940800000001,40.990641],[-73.839834,40.989704],[-73.839905,40.989579],[-73.840091,40.989264],[-73.840397,40.988794],[-73.840513,40.988639],[-73.840806,40.988258],[-73.840884,40.988162],[-73.84103500000001,40.987975],[-73.841245,40.987766],[-73.841982,40.987045],[-73.842106,40.986926],[-73.84266,40.986399],[-73.8442,40.984875],[-73.844526,40.984564],[-73.84480600000001,40.98429],[-73.84526,40.983767],[-73.845461,40.983509],[-73.845966,40.983398],[-73.853516,40.982113],[-73.85414299999999,40.9821],[-73.854364,40.982095],[-73.854812,40.982035],[-73.85493700000001,40.982012],[-73.855422,40.981937],[-73.85860599999999,40.981427],[-73.863625,40.980495],[-73.865279,40.980332],[-73.865267,40.980632],[-73.865286,40.980794],[-73.865295,40.980876],[-73.865403,40.981359],[-73.865449,40.981779],[-73.865447,40.982084]]],"type":"Polygon"}
}