{
  "id": "361019623001",
  "type": "Feature",
  "properties": {
    "area_land":65587734,
    "area_water":1186145,
    "geoid":"361019623001",
    "name":"Block Group 1",
    "state":"ny"
},
  "bbox": [
    -77.201665,
    42.090656,
    -77.083624,
    42.181275
],
  "geometry": {"coordinates":[[[-77.20166500000001,42.181275],[-77.20158000000001,42.181211],[-77.20152899999999,42.181149],[-77.20149600000001,42.18108],[-77.20147799999999,42.181003],[-77.201464,42.180788],[-77.201449,42.179604],[-77.201431,42.179488],[-77.201391,42.179353],[-77.201351,42.179269],[-77.20126999999999,42.179156],[-77.201139,42.179014],[-77.20051599999999,42.178438],[-77.200424,42.17834],[-77.200318,42.178194],[-77.20020599999999,42.177961],[-77.199713,42.176737],[-77.199568,42.176402],[-77.19947999999999,42.176227],[-77.199331,42.175997],[-77.19925000000001,42.17591],[-77.19911500000001,42.175797],[-77.198707,42.175527],[-77.198419,42.175294],[-77.19831000000001,42.175185],[-77.19817500000001,42.175028],[-77.19768999999999,42.174329],[-77.19726,42.173731],[-77.197103,42.173553],[-77.19703800000001,42.173498],[-77.196994,42.173462],[-77.196906,42.173403],[-77.195976,42.172929],[-77.195178,42.172572],[-77.194864,42.172452],[-77.19332199999999,42.171931],[-77.19308100000001,42.171829],[-77.19298999999999,42.171771],[-77.192938,42.171716],[-77.19288,42.171629],[-77.1925,42.170824],[-77.191141,42.168095],[-77.191025,42.16784],[-77.190966,42.16769],[-77.190963,42.167617],[-77.190201,42.167635],[-77.189789,42.167653],[-77.189545,42.167682],[-77.18938799999999,42.167737],[-77.18917999999999,42.16785],[-77.188969,42.168017],[-77.18871,42.168291],[-77.18741799999999,42.169699],[-77.186998,42.170192],[-77.186768,42.170421],[-77.186498,42.170632],[-77.18566300000001,42.171208],[-77.185579,42.171245],[-77.18548800000001,42.171266],[-77.185317,42.171281],[-77.184336,42.171296],[-77.184286,42.171301],[-77.184021,42.171326],[-77.18392,42.171343],[-77.18376000000001,42.171394],[-77.18312899999999,42.171656],[-77.182934,42.171397],[-77.182821,42.171299],[-77.182744,42.171255],[-77.181224,42.170541],[-77.180268,42.170078],[-77.179845,42.169831],[-77.17935,42.169499],[-77.178303,42.168749],[-77.177909,42.168504],[-77.17673000000001,42.167835],[-77.176615,42.167772],[-77.176312,42.167648],[-77.176137,42.167597],[-77.175977,42.167561],[-77.17518200000001,42.167459],[-77.174817,42.167386],[-77.17448899999999,42.16728],[-77.174048,42.167084],[-77.173534,42.166796],[-77.17293600000001,42.166402],[-77.172455,42.166038],[-77.172006,42.165623],[-77.171835,42.165411],[-77.171689,42.165156],[-77.171288,42.164132],[-77.171109,42.163779],[-77.170755,42.163233],[-77.169935,42.16211],[-77.16966499999999,42.161699],[-77.169461,42.161349],[-77.169122,42.160806],[-77.16866400000001,42.160163],[-77.16845499999999,42.159903],[-77.168316,42.159753],[-77.16799899999999,42.159505],[-77.167682,42.159298],[-77.166737,42.158708],[-77.166427,42.158478],[-77.16593899999999,42.158136],[-77.165651,42.157975],[-77.165468,42.15791],[-77.16501700000001,42.157772],[-77.164502,42.157626],[-77.16404300000001,42.157527],[-77.163831,42.157494],[-77.16349599999999,42.157469],[-77.16293400000001,42.15748],[-77.162588,42.157498],[-77.162222,42.157502],[-77.16207199999999,42.157429],[-77.16201100000001,42.157369],[-77.16194400000001,42.157305],[-77.161879,42.157209],[-77.161659,42.15673],[-77.161252,42.156107],[-77.16106000000001,42.155738],[-77.16100900000001,42.155595],[-77.160872,42.155022],[-77.160866,42.154797],[-77.161025,42.154246],[-77.161036,42.154122],[-77.16102100000001,42.153948],[-77.160972,42.153844],[-77.160718,42.153441],[-77.160589,42.153207],[-77.160453,42.152807],[-77.16038399999999,42.152373],[-77.16034999999999,42.152252],[-77.160228,42.152037],[-77.160023,42.151828],[-77.159701,42.15154],[-77.159434,42.151326],[-77.159245,42.151211],[-77.158968,42.151086],[-77.158517,42.150921],[-77.158073,42.150742],[-77.157839,42.150639],[-77.157611,42.150509],[-77.157258,42.150242],[-77.157127,42.150115],[-77.15707,42.150034],[-77.157004,42.149911],[-77.156752,42.149228],[-77.15656,42.148744],[-77.156431,42.148323],[-77.15640399999999,42.148119],[-77.156392,42.147861],[-77.15642099999999,42.147002],[-77.156417,42.146732],[-77.156379,42.146575],[-77.156323,42.146473],[-77.156263,42.146397],[-77.156115,42.146263],[-77.156029,42.14621],[-77.155922,42.146172],[-77.155822,42.146157],[-77.155619,42.146152],[-77.155376,42.146182],[-77.154965,42.146284],[-77.154737,42.146355],[-77.154309,42.146476],[-77.153768,42.146595],[-77.153364,42.146654],[-77.153037,42.146683],[-77.15249900000001,42.146664],[-77.15186300000001,42.146582],[-77.151276,42.146535],[-77.150806,42.146513],[-77.149169,42.146471],[-77.149057,42.146459],[-77.148934,42.146417],[-77.14861500000001,42.146232],[-77.148037,42.145698],[-77.14771399999999,42.145311],[-77.147649,42.145245],[-77.147502,42.145126],[-77.147419,42.145082],[-77.146202,42.144639],[-77.145837,42.144471],[-77.145493,42.144271],[-77.144527,42.143684],[-77.143925,42.143296],[-77.143635,42.143065],[-77.143522,42.143017],[-77.141965,42.142157],[-77.14161900000001,42.141968],[-77.140744,42.141507],[-77.1405,42.141389],[-77.140079,42.141221],[-77.138671,42.140728],[-77.137805,42.14041],[-77.13764,42.140359],[-77.137109,42.140242],[-77.137038,42.140237],[-77.136674,42.14022],[-77.136276,42.140239],[-77.13594399999999,42.140295],[-77.135369,42.140478],[-77.134725,42.140747],[-77.13388500000001,42.14114],[-77.133326,42.141391],[-77.133112,42.14146],[-77.132982,42.141495],[-77.132547,42.141569],[-77.132063,42.141592],[-77.129508,42.141631],[-77.128964,42.14164],[-77.128759,42.141645],[-77.12563,42.1417],[-77.12536900000001,42.141703],[-77.124978,42.141707],[-77.124224,42.141713],[-77.123848,42.141716],[-77.12262200000001,42.141746],[-77.11837,42.141803],[-77.116896,42.141823],[-77.116524,42.141799],[-77.11638499999999,42.141811],[-77.11644200000001,42.141731],[-77.116602,42.14132],[-77.116699,42.141094],[-77.11678000000001,42.14086],[-77.116877,42.140606],[-77.116957,42.140479],[-77.117065,42.140348],[-77.11724700000001,42.140152],[-77.117351,42.140058],[-77.117588,42.139849],[-77.117947,42.1396],[-77.118303,42.139396],[-77.119128,42.138951],[-77.11948599999999,42.138736],[-77.119681,42.138603],[-77.119838,42.138481],[-77.12005499999999,42.138288],[-77.120221,42.138119],[-77.12037599999999,42.137929],[-77.12050600000001,42.137744],[-77.120634,42.137521],[-77.120749,42.137266],[-77.12082599999999,42.137019],[-77.12089,42.136687],[-77.120907,42.136342],[-77.12090999999999,42.136289],[-77.12091100000001,42.136233],[-77.120914,42.136178],[-77.12091599999999,42.136115],[-77.120741,42.136189],[-77.119437,42.137254],[-77.11827099999999,42.138217],[-77.117468,42.138888],[-77.117344,42.138976],[-77.117225,42.139074],[-77.11691999999999,42.13932],[-77.116011,42.139847],[-77.115803,42.139968],[-77.11559200000001,42.140092],[-77.115385,42.140217],[-77.115103,42.140424],[-77.113457,42.141772],[-77.113114,42.142087],[-77.113024,42.142187],[-77.11291199999999,42.142317],[-77.112709,42.142558],[-77.112004,42.143353],[-77.111801,42.143588],[-77.111464,42.14387],[-77.111036,42.144135],[-77.11090799999999,42.144189],[-77.11078000000001,42.144235],[-77.11062200000001,42.14427],[-77.110445,42.144293],[-77.11024,42.144304],[-77.10999,42.144295],[-77.109849,42.144279],[-77.1097,42.144248],[-77.109539,42.144198],[-77.10938,42.144137],[-77.109236,42.144064],[-77.109145,42.144007],[-77.109025,42.143914],[-77.108895,42.143796],[-77.108789,42.143666],[-77.108718,42.143554],[-77.108583,42.143312],[-77.108467,42.143391],[-77.108289,42.14358],[-77.107831,42.144006],[-77.107591,42.144199],[-77.107467,42.144287],[-77.106819,42.144629],[-77.10657500000001,42.144826],[-77.10647299999999,42.14488],[-77.10590999999999,42.145093],[-77.105436,42.145322],[-77.10468299999999,42.145668],[-77.10451500000001,42.145774],[-77.10373199999999,42.146404],[-77.10368800000001,42.146448],[-77.10368,42.14649],[-77.103711,42.146517],[-77.103773,42.146521],[-77.103803,42.146515],[-77.10415399999999,42.146268],[-77.10420000000001,42.146257],[-77.10421599999999,42.146275],[-77.104167,42.146371],[-77.104083,42.146479],[-77.103928,42.146609],[-77.103176,42.147131],[-77.102908,42.147331],[-77.102812,42.147399],[-77.102709,42.147474],[-77.10248199999999,42.147626],[-77.102143,42.147783],[-77.101962,42.147886],[-77.101423,42.148213],[-77.10113800000001,42.148373],[-77.100735,42.148577],[-77.099543,42.149203],[-77.098484,42.149709],[-77.097551,42.150084],[-77.097177,42.15023],[-77.096816,42.150329],[-77.096045,42.15058],[-77.09533399999999,42.15078],[-77.09451,42.151039],[-77.09426999999999,42.151101],[-77.094117,42.151166],[-77.094024,42.15121],[-77.09394899999999,42.151233],[-77.09335900000001,42.151398],[-77.092973,42.151686],[-77.092804,42.151904],[-77.092755,42.152009],[-77.092551,42.152178],[-77.092108,42.152417],[-77.091911,42.152529],[-77.09164699999999,42.152585],[-77.091103,42.152872],[-77.090979,42.152994],[-77.090186,42.15266],[-77.089338,42.152377],[-77.088021,42.151839],[-77.08708,42.151685],[-77.085866,42.151852],[-77.08493900000001,42.151703],[-77.08494899999999,42.151039],[-77.08486600000001,42.150597],[-77.084818,42.148727],[-77.084836,42.147932],[-77.084772,42.145752],[-77.084643,42.141239],[-77.08456099999999,42.138703],[-77.08488199999999,42.132162],[-77.08486600000001,42.132061],[-77.084621,42.131923],[-77.084468,42.131797],[-77.08441999999999,42.131722],[-77.08438700000001,42.131606],[-77.084315,42.131077],[-77.084277,42.130579],[-77.084272,42.128795],[-77.084233,42.128409],[-77.084219,42.128122],[-77.084209,42.127779],[-77.084249,42.126306],[-77.084231,42.126173],[-77.08419000000001,42.12603],[-77.084075,42.125819],[-77.084003,42.125718],[-77.084166,42.12503],[-77.08419000000001,42.121223],[-77.083814,42.115789],[-77.08399799999999,42.115306],[-77.084013,42.115189],[-77.084006,42.114724],[-77.083986,42.114374],[-77.083956,42.114148],[-77.083799,42.109821],[-77.083624,42.106569],[-77.08367,42.106523],[-77.083793,42.10635],[-77.08385800000001,42.106186],[-77.083872,42.106113],[-77.083894,42.105773],[-77.08387500000001,42.105298],[-77.083866,42.105137],[-77.08387,42.104262],[-77.08387399999999,42.103734],[-77.08387,42.103096],[-77.083872,42.102949],[-77.083901,42.101408],[-77.083893,42.101168],[-77.083859,42.100056],[-77.083828,42.0991],[-77.083797,42.096182],[-77.083769,42.09473],[-77.083763,42.092456],[-77.083765,42.092185],[-77.08376,42.091114],[-77.099079,42.090867],[-77.099166,42.090874],[-77.101743,42.090851],[-77.104,42.090863],[-77.10449699999999,42.090855],[-77.10547699999999,42.090856],[-77.106143,42.090872],[-77.124782,42.090757],[-77.146175,42.090709],[-77.14797,42.090682],[-77.148053,42.090682],[-77.14956599999999,42.090679],[-77.150221,42.090675],[-77.15122599999999,42.090683],[-77.158501,42.09069],[-77.15920699999999,42.090689],[-77.17914399999999,42.090656],[-77.190512,42.090719],[-77.200542,42.090779],[-77.20055600000001,42.091246],[-77.20057,42.091804],[-77.20058299999999,42.092363],[-77.200785,42.100224],[-77.200791,42.100457],[-77.200732,42.107786],[-77.200733,42.10801],[-77.200829,42.115719],[-77.20083700000001,42.116059],[-77.200886,42.119158],[-77.20088699999999,42.119351],[-77.200908,42.124828],[-77.200947,42.125585],[-77.20101200000001,42.126333],[-77.20102199999999,42.126756],[-77.201019,42.127504],[-77.201054,42.133295],[-77.2011,42.140797],[-77.20114100000001,42.143029],[-77.201078,42.143329],[-77.201176,42.144997],[-77.201269,42.145742],[-77.201301,42.146974],[-77.20134,42.149608],[-77.201425,42.162392],[-77.201491,42.167314],[-77.20158000000001,42.173223],[-77.201616,42.175783],[-77.20166500000001,42.181275]]],"type":"Polygon"}
}