{
  "id": "360870115011",
  "type": "Feature",
  "properties": {
    "area_land":2671563,
    "area_water":0,
    "geoid":"360870115011",
    "name":"Block Group 1",
    "state":"ny"
},
  "bbox": [
    -74.074958,
    41.165854,
    -74.049478,
    41.187685
],
  "geometry": {"coordinates":[[[-74.07495299999999,41.169859],[-74.07490799999999,41.170373],[-74.07476800000001,41.172005],[-74.074397,41.171966],[-74.07258899999999,41.171786],[-74.07247099999999,41.172381],[-74.07240400000001,41.172377],[-74.070609,41.172285],[-74.070556,41.172262],[-74.070413,41.172242],[-74.068562,41.17208],[-74.06796799999999,41.17201],[-74.067829,41.172787],[-74.067694,41.173643],[-74.06762500000001,41.173985],[-74.06724800000001,41.176249],[-74.06701,41.17759],[-74.06676899999999,41.178911],[-74.06654899999999,41.180285],[-74.066479,41.180853],[-74.066485,41.180988],[-74.06649899999999,41.181077],[-74.066551,41.181227],[-74.06662900000001,41.181359],[-74.066973,41.181793],[-74.067154,41.181988],[-74.067549,41.182447],[-74.067792,41.182768],[-74.06836300000001,41.183396],[-74.068336,41.183541],[-74.06827800000001,41.183724],[-74.06807999999999,41.184157],[-74.068027,41.184308],[-74.067987,41.184512],[-74.06795099999999,41.185031],[-74.067913,41.185381],[-74.067871,41.185539],[-74.067841,41.185607],[-74.067753,41.18571],[-74.067652,41.185799],[-74.06755800000001,41.185852],[-74.067159,41.185982],[-74.066486,41.186161],[-74.06626,41.186198],[-74.065613,41.186243],[-74.065433,41.186245],[-74.065324,41.1863],[-74.065112,41.186426],[-74.063546,41.187265],[-74.062843,41.187685],[-74.056268,41.187158],[-74.054543,41.18702],[-74.05302399999999,41.186898],[-74.05309,41.186826],[-74.053208,41.18673],[-74.05343000000001,41.186594],[-74.05364299999999,41.186508],[-74.05383500000001,41.186455],[-74.05416200000001,41.186398],[-74.054104,41.186266],[-74.054062,41.186044],[-74.054029,41.185724],[-74.054008,41.185352],[-74.054029,41.185052],[-74.054517,41.182928],[-74.054627,41.182449],[-74.05471900000001,41.182134],[-74.05480799999999,41.181747],[-74.054885,41.181466],[-74.054939,41.181322],[-74.05506,41.181105],[-74.05527600000001,41.180742],[-74.055376,41.180595],[-74.055443,41.180515],[-74.055774,41.180181],[-74.055864,41.180061],[-74.055978,41.179876],[-74.056022,41.179775],[-74.056072,41.179571],[-74.056072,41.179355],[-74.055975,41.178717],[-74.05587199999999,41.178137],[-74.055745,41.177415],[-74.055702,41.177151],[-74.05556900000001,41.176323],[-74.055553,41.176219],[-74.055531,41.175827],[-74.055553,41.1751],[-74.055553,41.174908],[-74.055553,41.174626],[-74.05548400000001,41.174616],[-74.055328,41.174575],[-74.055257,41.174556],[-74.05464000000001,41.174422],[-74.05455600000001,41.174394],[-74.054435,41.174325],[-74.05436899999999,41.174269],[-74.054292,41.174182],[-74.05426,41.174132],[-74.054242,41.174104],[-74.05417300000001,41.173936],[-74.05415499999999,41.17384],[-74.05413299999999,41.17356],[-74.05412699999999,41.172924],[-74.05411100000001,41.172772],[-74.054061,41.172519],[-74.05389599999999,41.171911],[-74.05354699999999,41.171045],[-74.05335100000001,41.170605],[-74.053335,41.170568],[-74.053239,41.170434],[-74.053186,41.17039],[-74.053117,41.170351],[-74.053031,41.170321],[-74.052885,41.170285],[-74.05268700000001,41.170255],[-74.051557,41.170115],[-74.051109,41.170071],[-74.050186,41.169975],[-74.05011399999999,41.169961],[-74.049942,41.169916],[-74.049841,41.169867],[-74.04974300000001,41.169803],[-74.04971,41.169755],[-74.049609,41.169547],[-74.049516,41.169288],[-74.049483,41.169126],[-74.04947799999999,41.169018],[-74.04948899999999,41.168866],[-74.049522,41.168718],[-74.049599,41.168518],[-74.049665,41.168367],[-74.04974799999999,41.168042],[-74.049813,41.167369],[-74.050736,41.16741],[-74.05097499999999,41.167421],[-74.05284,41.167478],[-74.053938,41.167521],[-74.05403099999999,41.167519],[-74.054435,41.16746],[-74.054862,41.167373],[-74.054957,41.167352],[-74.05523100000001,41.167316],[-74.05558000000001,41.167316],[-74.055892,41.167334],[-74.05799500000001,41.167458],[-74.058403,41.167482],[-74.05987,41.167577],[-74.060242,41.167603],[-74.06073000000001,41.167625],[-74.061362,41.167656],[-74.061908,41.167691],[-74.062341,41.1677],[-74.063143,41.167695],[-74.063526,41.167719],[-74.063636,41.167738],[-74.06486700000001,41.167947],[-74.064937,41.167826],[-74.065304,41.167313],[-74.06565500000001,41.166909],[-74.06605399999999,41.166335],[-74.06627,41.166062],[-74.06647,41.165854],[-74.06865500000001,41.166062],[-74.068864,41.16609],[-74.06871700000001,41.166714],[-74.06868799999999,41.16681],[-74.068635,41.166981],[-74.068237,41.167903],[-74.068124,41.168221],[-74.068091,41.168347],[-74.067956,41.16906],[-74.067919,41.169363],[-74.06832,41.169397],[-74.068377,41.169053],[-74.068586,41.169072],[-74.073364,41.169527],[-74.074393,41.169663],[-74.07440800000001,41.169694],[-74.07441900000001,41.169667],[-74.074958,41.169708],[-74.07495299999999,41.169859]]],"type":"Polygon"}
}