{
  "id": "360710121004",
  "type": "Feature",
  "properties": {
    "area_land":3912096,
    "area_water":27237,
    "geoid":"360710121004",
    "name":"Block Group 4",
    "state":"ny"
},
  "bbox": [
    -74.354977,
    41.37817,
    -74.314986,
    41.402371
],
  "geometry": {"coordinates":[[[-74.35497700000001,41.391138],[-74.352878,41.392902],[-74.352199,41.393367],[-74.348996,41.395073],[-74.348456,41.395372],[-74.346491,41.39644],[-74.346501,41.396562],[-74.346349,41.396592],[-74.346603,41.396837],[-74.346835,41.397063],[-74.346858,41.397085],[-74.347064,41.397285],[-74.34607,41.398097],[-74.34533,41.398562],[-74.345545,41.398555],[-74.352366,41.398303],[-74.35342799999999,41.39826],[-74.35348999999999,41.398257],[-74.35415500000001,41.398232],[-74.353883,41.398549],[-74.35281999999999,41.399796],[-74.35239,41.400302],[-74.352237,41.400535],[-74.35136900000001,41.400049],[-74.35019200000001,41.399466],[-74.34944,41.400114],[-74.347156,41.398873],[-74.343907,41.400813],[-74.34282399999999,41.400261],[-74.340858,41.401306],[-74.340748,41.401364],[-74.34060599999999,41.401255],[-74.340383,41.401083],[-74.340276,41.401],[-74.33966599999999,41.400521],[-74.33956000000001,41.400448],[-74.3386,41.400009],[-74.337819,41.399833],[-74.337065,41.399786],[-74.33595200000001,41.399882],[-74.335718,41.399897],[-74.335003,41.399953],[-74.333935,41.400193],[-74.33359,41.40032],[-74.333468,41.400366],[-74.33329000000001,41.400395],[-74.332767,41.400526],[-74.33237699999999,41.400624],[-74.330707,41.401046],[-74.33068400000001,41.401152],[-74.330634,41.40122],[-74.329048,41.401831],[-74.328833,41.401933],[-74.32872,41.401997],[-74.32865700000001,41.402056],[-74.32855600000001,41.402213],[-74.32849899999999,41.402371],[-74.327984,41.402264],[-74.32725499999999,41.402142],[-74.327049,41.402103],[-74.326492,41.401996],[-74.326252,41.40196],[-74.325789,41.401887],[-74.325484,41.401904],[-74.32525699999999,41.401824],[-74.32471700000001,41.401648],[-74.324516,41.401538],[-74.323932,41.401188],[-74.32368200000001,41.401006],[-74.323459,41.400809],[-74.323345,41.40069],[-74.32316899999999,41.400463],[-74.322923,41.400055],[-74.322726,41.399623],[-74.32258,41.399316],[-74.322587,41.398933],[-74.322603,41.398702],[-74.32261699999999,41.398555],[-74.32271900000001,41.398011],[-74.322727,41.397968],[-74.323015,41.396281],[-74.323064,41.395909],[-74.323082,41.395545],[-74.323066,41.395297],[-74.323032,41.395068],[-74.322946,41.394657],[-74.32278599999999,41.394118],[-74.32270800000001,41.393922],[-74.322654,41.393796],[-74.322531,41.393581],[-74.322307,41.393245],[-74.322119,41.392992],[-74.32204299999999,41.392897],[-74.321848,41.392707],[-74.32161000000001,41.392511],[-74.32109,41.392111],[-74.320639,41.391793],[-74.319585,41.391171],[-74.31974,41.390927],[-74.320046,41.390499],[-74.319487,41.390262],[-74.31916200000001,41.390113],[-74.31858200000001,41.389828],[-74.318403,41.389731],[-74.316678,41.388749],[-74.31562599999999,41.388132],[-74.314986,41.387758],[-74.3151,41.387586],[-74.315299,41.387288],[-74.31832300000001,41.382646],[-74.320716,41.378979],[-74.321245,41.37817],[-74.32154199999999,41.378339],[-74.322075,41.378644],[-74.323685,41.379569],[-74.32639500000001,41.381122],[-74.326398,41.381183],[-74.32655200000001,41.383817],[-74.326583,41.384035],[-74.326634,41.384196],[-74.326731,41.384358],[-74.326818,41.384466],[-74.326964,41.384607],[-74.327044,41.384665],[-74.32717599999999,41.384759],[-74.327384,41.384922],[-74.327472,41.385008],[-74.327744,41.385211],[-74.32790300000001,41.385292],[-74.328087,41.385313],[-74.32801000000001,41.385328],[-74.327949,41.385351],[-74.327744,41.3855],[-74.327602,41.385633],[-74.327557,41.385743],[-74.32741300000001,41.385965],[-74.327913,41.3863],[-74.328271,41.385984],[-74.328897,41.385435],[-74.33087,41.386568],[-74.331152,41.386713],[-74.33245599999999,41.385442],[-74.33325000000001,41.386042],[-74.33336199999999,41.385932],[-74.33713899999999,41.38853],[-74.337273,41.388403],[-74.337971,41.387826],[-74.338601,41.388203],[-74.33887300000001,41.387939],[-74.33982899999999,41.388548],[-74.34681500000001,41.392954],[-74.34993,41.391375],[-74.350765,41.391925],[-74.351089,41.391767],[-74.35204299999999,41.392372],[-74.35430700000001,41.390721],[-74.35497700000001,41.391138]]],"type":"Polygon"}
}