{
  "id": "360050193003",
  "type": "Feature",
  "properties": {
    "area_land":134924,
    "area_water":0,
    "geoid":"360050193003",
    "name":"Block Group 3",
    "state":"ny"
},
  "bbox": [
    -73.933144,
    40.834505,
    -73.927619,
    40.840279
],
  "geometry": {"coordinates":[[[-73.93300600000001,40.835679],[-73.930654,40.839599],[-73.930606,40.839679],[-73.930406,40.840279],[-73.930114,40.840149],[-73.929338,40.839936],[-73.929119,40.839888],[-73.928659,40.839802],[-73.928139,40.838771],[-73.92761900000001,40.837721],[-73.928082,40.837261],[-73.92823,40.837347],[-73.928298,40.837411],[-73.928348,40.837528],[-73.928354,40.837669],[-73.928342,40.83787],[-73.92832799999999,40.83809],[-73.928321,40.83819],[-73.928344,40.838248],[-73.928406,40.838323],[-73.92847999999999,40.838387],[-73.928584,40.838436],[-73.92867099999999,40.838461],[-73.928793,40.838468],[-73.92889,40.838454],[-73.929011,40.838412],[-73.92914399999999,40.83836],[-73.92927,40.838295],[-73.92937999999999,40.838216],[-73.92946499999999,40.83812],[-73.929524,40.838027],[-73.929573,40.837892],[-73.929624,40.837699],[-73.929676,40.837398],[-73.92974,40.837083],[-73.92979,40.836879],[-73.92989300000001,40.836682],[-73.930026,40.836439],[-73.93010099999999,40.836274],[-73.930137,40.836066],[-73.930131,40.835965],[-73.930081,40.835845],[-73.92996100000001,40.835733],[-73.929721,40.835623],[-73.93035500000001,40.834505],[-73.930965,40.834572],[-73.93114300000001,40.834591],[-73.93134999999999,40.834615],[-73.93187,40.834673],[-73.932658,40.834761],[-73.933144,40.834815],[-73.93300600000001,40.835679]]],"type":"Polygon"}
}