{
  "id": "360470230003",
  "type": "Feature",
  "properties": {
    "area_land":56583,
    "area_water":0,
    "geoid":"360470230003",
    "name":"Block Group 3",
    "state":"ny"
},
  "bbox": [
    -73.989077,
    40.638175,
    -73.984088,
    40.641956
],
  "geometry": {"coordinates":[[[-73.988494,40.641956],[-73.98629200000001,40.640625],[-73.984088,40.639297],[-73.984672,40.638735],[-73.985252,40.638175],[-73.987455,40.639505],[-73.986876,40.640069],[-73.98907699999999,40.641396],[-73.988494,40.641956]]],"type":"Polygon"}
}