{
  "id": "360550032001",
  "type": "Feature",
  "properties": {
    "area_land":285304,
    "area_water":0,
    "geoid":"360550032001",
    "name":"Block Group 1",
    "state":"ny"
},
  "bbox": [
    -77.607464,
    43.142003,
    -77.599855,
    43.151218
],
  "geometry": {"coordinates":[[[-77.60746399999999,43.151218],[-77.607398,43.151214],[-77.607348,43.151212],[-77.607218,43.151206],[-77.60720000000001,43.151169],[-77.607152,43.151107],[-77.607063,43.151007],[-77.606844,43.150869],[-77.60665,43.15078],[-77.6065,43.150691],[-77.606258,43.150578],[-77.60599000000001,43.15042],[-77.605732,43.150276],[-77.60532499999999,43.150009],[-77.604737,43.14961],[-77.604271,43.149267],[-77.604308,43.149459],[-77.604321,43.149543],[-77.604117,43.149417],[-77.60370399999999,43.149231],[-77.603414,43.149112],[-77.60324300000001,43.149034],[-77.602722,43.148718],[-77.60237499999999,43.148401],[-77.60216699999999,43.148126],[-77.60181300000001,43.147726],[-77.601367,43.147166],[-77.60127900000001,43.147055],[-77.60079,43.146441],[-77.59985500000001,43.14524],[-77.600042,43.145166],[-77.60007,43.145155],[-77.601117,43.144754],[-77.600202,43.143556],[-77.60127799999999,43.143091],[-77.60172799999999,43.142896],[-77.60235299999999,43.142633],[-77.603307,43.142229],[-77.603605,43.142125],[-77.603887,43.14206],[-77.60412599999999,43.142016],[-77.60436,43.142003],[-77.604642,43.142992],[-77.60490900000001,43.143972],[-77.605192,43.144998],[-77.60548199999999,43.146058],[-77.605797,43.147227],[-77.605924,43.147603],[-77.60594399999999,43.147677],[-77.60621399999999,43.14866],[-77.606258,43.148693],[-77.60625400000001,43.148711],[-77.60644000000001,43.149248],[-77.606505,43.14928],[-77.606646,43.149391],[-77.606848,43.149601],[-77.607007,43.149817],[-77.607097,43.149995],[-77.607169,43.150164],[-77.607242,43.150335],[-77.607322,43.150575],[-77.60733,43.150665],[-77.60735099999999,43.150726],[-77.60738499999999,43.150899],[-77.607421,43.151038],[-77.607434,43.151114],[-77.607455,43.151173],[-77.60746399999999,43.151218]]],"type":"Polygon"}
}