{
  "id": "360870108034",
  "type": "Feature",
  "properties": {
    "area_land":819626,
    "area_water":0,
    "geoid":"360870108034",
    "name":"Block Group 4",
    "state":"ny"
},
  "bbox": [
    -74.00227,
    41.147642,
    -73.988638,
    41.156699
],
  "geometry": {"coordinates":[[[-74.002137,41.155468],[-74.002019,41.15548],[-74.00117899999999,41.155494],[-74.00023400000001,41.155498],[-73.99903399999999,41.155498],[-73.998169,41.155521],[-73.997851,41.155529],[-73.996702,41.155531],[-73.996684,41.155004],[-73.996634,41.155042],[-73.99654700000001,41.155054],[-73.996002,41.154997],[-73.995565,41.154967],[-73.995216,41.154962],[-73.994342,41.154889],[-73.993944,41.154868],[-73.99373900000001,41.154879],[-73.993605,41.154914],[-73.993528,41.154988],[-73.99332099999999,41.155631],[-73.993292,41.155693],[-73.993233,41.15578],[-73.99304600000001,41.155999],[-73.99298400000001,41.156092],[-73.99295499999999,41.156188],[-73.992937,41.156699],[-73.99164399999999,41.15664],[-73.991012,41.156612],[-73.990382,41.156574],[-73.990251,41.156556],[-73.990193,41.156518],[-73.989861,41.156232],[-73.989761,41.156146],[-73.989705,41.156119],[-73.989634,41.1561],[-73.989465,41.156095],[-73.988992,41.156082],[-73.98863799999999,41.156069],[-73.988657,41.155799],[-73.988804,41.154227],[-73.98884200000001,41.153873],[-73.988894,41.153371],[-73.988947,41.152894],[-73.98900399999999,41.152039],[-73.989088,41.150949],[-73.98912900000001,41.150522],[-73.98916699999999,41.149944],[-73.989209,41.149371],[-73.989328,41.148116],[-73.99032800000001,41.148159],[-73.99082,41.148174],[-73.99120600000001,41.14819],[-73.991837,41.148238],[-73.992063,41.148247],[-73.99254999999999,41.148267],[-73.99265200000001,41.14826],[-73.99276,41.14824],[-73.99284,41.148216],[-73.993002,41.148118],[-73.993387,41.147775],[-73.993572,41.147658],[-73.993731,41.147642],[-73.99410399999999,41.147651],[-73.994974,41.147675],[-73.99575900000001,41.147731],[-73.99687400000001,41.14782],[-73.998419,41.147934],[-73.998476,41.148017],[-73.99851099999999,41.148126],[-73.998559,41.148368],[-73.998654,41.148601],[-73.998857,41.149044],[-73.999106,41.149493],[-73.999223,41.14965],[-73.999303,41.149801],[-73.999447,41.15007],[-73.999728,41.150636],[-73.999943,41.15103],[-74.000078,41.151289],[-74.000361,41.151781],[-74.00063400000001,41.152274],[-74.001358,41.153657],[-74.001643,41.1542],[-74.00180899999999,41.154534],[-74.00227,41.155441],[-74.002137,41.155468]]],"type":"Polygon"}
}