{
  "id": "361190118003",
  "type": "Feature",
  "properties": {
    "area_land":5940727,
    "area_water":15680,
    "geoid":"361190118003",
    "name":"Block Group 3",
    "state":"ny"
},
  "bbox": [
    -73.815694,
    41.109787,
    -73.778528,
    41.160577
],
  "geometry": {"coordinates":[[[-73.81569399999999,41.13555],[-73.815445,41.135534],[-73.815225,41.13552],[-73.815009,41.133318],[-73.814556,41.132317],[-73.812828,41.13311],[-73.81259,41.133822],[-73.812292,41.134505],[-73.81183299999999,41.13489],[-73.8113,41.13538],[-73.810667,41.135719],[-73.810911,41.135856],[-73.811001,41.135937],[-73.810823,41.136173],[-73.81069100000001,41.136482],[-73.810464,41.136802],[-73.810247,41.13668],[-73.80985200000001,41.136575],[-73.809478,41.136531],[-73.808885,41.136514],[-73.808654,41.136534],[-73.808412,41.136611],[-73.808178,41.136738],[-73.807804,41.137014],[-73.80751100000001,41.137218],[-73.807211,41.137345],[-73.80691,41.137428],[-73.80642,41.137522],[-73.80622200000001,41.137533],[-73.805892,41.137522],[-73.805761,41.137489],[-73.80557,41.137389],[-73.80534299999999,41.137183],[-73.805193,41.136984],[-73.80507900000001,41.136779],[-73.805041,41.136685],[-73.805027,41.13659],[-73.80451100000001,41.136111],[-73.804323,41.135595],[-73.804284,41.135652],[-73.804231,41.135754],[-73.804047,41.136013],[-73.804019,41.136036],[-73.803855,41.136176],[-73.803802,41.13622],[-73.803668,41.136336],[-73.803515,41.136466],[-73.803353,41.136576],[-73.803226,41.136664],[-73.80265799999999,41.137058],[-73.802401,41.137297],[-73.802279,41.137429],[-73.80187100000001,41.137871],[-73.80180300000001,41.137961],[-73.801664,41.138182],[-73.80162900000001,41.138228],[-73.80158299999999,41.138407],[-73.80143099999999,41.139153],[-73.801332,41.139784],[-73.801129,41.140445],[-73.80064,41.141169],[-73.800167,41.141632],[-73.800107,41.141628],[-73.800028,41.141637],[-73.799944,41.141672],[-73.79939,41.14196],[-73.799294,41.142046],[-73.79915,41.142302],[-73.799057,41.142529],[-73.79897200000001,41.142669],[-73.798588,41.143302],[-73.798205,41.143641],[-73.797766,41.143894],[-73.796993,41.144206],[-73.79642800000001,41.14446],[-73.79602800000001,41.144697],[-73.79576400000001,41.14496],[-73.795385,41.145315],[-73.795039,41.145576],[-73.79495799999999,41.145631],[-73.79477799999999,41.145753],[-73.79355200000001,41.146278],[-73.79334,41.146421],[-73.793074,41.146662],[-73.793037,41.146729],[-73.79294400000001,41.146984],[-73.792934,41.147049],[-73.792829,41.147813],[-73.792708,41.148623],[-73.792523,41.149967],[-73.792411,41.150463],[-73.79226800000001,41.150996],[-73.79224000000001,41.151102],[-73.79216099999999,41.151747],[-73.792165,41.151898],[-73.792174,41.152243],[-73.792029,41.153154],[-73.79195799999999,41.153591],[-73.791954,41.153642],[-73.791944,41.153697],[-73.791904,41.153931],[-73.791723,41.154559],[-73.79149099999999,41.155081],[-73.791177,41.155632],[-73.79070400000001,41.156502],[-73.790667,41.156657],[-73.790662,41.156815],[-73.790693,41.157331],[-73.790688,41.158068],[-73.79067999999999,41.15835],[-73.79068700000001,41.158529],[-73.790678,41.158596],[-73.790629,41.158999],[-73.790604,41.15918],[-73.790476,41.159747],[-73.79044500000001,41.160059],[-73.79044500000001,41.160386],[-73.79044500000001,41.160577],[-73.784971,41.157965],[-73.783728,41.157371],[-73.78188299999999,41.15649],[-73.781184,41.156156],[-73.780838,41.155991],[-73.779949,41.155567],[-73.77921600000001,41.155217],[-73.77852799999999,41.155013],[-73.778848,41.154833],[-73.778994,41.154747],[-73.77971100000001,41.154385],[-73.78018,41.154119],[-73.780968,41.153602],[-73.781023,41.15301],[-73.78123100000001,41.152754],[-73.78136000000001,41.152521],[-73.78152900000001,41.152191],[-73.78180999999999,41.151635],[-73.782028,41.151281],[-73.78243000000001,41.150731],[-73.78577,41.147489],[-73.785887,41.147608],[-73.786367,41.148098],[-73.786574,41.147913],[-73.786755,41.147752],[-73.78699,41.147543],[-73.786642,41.147139],[-73.786511,41.146987],[-73.78786100000001,41.146349],[-73.78733,41.145818],[-73.787772,41.145468],[-73.788428,41.144975],[-73.78928399999999,41.144239],[-73.789404,41.144126],[-73.78991000000001,41.144398],[-73.790532,41.143655],[-73.790931,41.143221],[-73.79185099999999,41.142302],[-73.792243,41.141827],[-73.793041,41.140727],[-73.79266200000001,41.140563],[-73.79242499999999,41.140543],[-73.79227,41.140473],[-73.792187,41.140447],[-73.79192999999999,41.140366],[-73.792306,41.140149],[-73.792423,41.140082],[-73.792473,41.140047],[-73.79377700000001,41.139187],[-73.793993,41.139104],[-73.794128,41.139016],[-73.79421000000001,41.138934],[-73.79428,41.138858],[-73.79433299999999,41.138811],[-73.794459,41.138872],[-73.794248,41.139158],[-73.79502100000001,41.139508],[-73.795506,41.138863],[-73.79624099999999,41.139216],[-73.79623100000001,41.139175],[-73.79621899999999,41.139124],[-73.79623100000001,41.139049],[-73.79627000000001,41.138914],[-73.79626500000001,41.138844],[-73.79624699999999,41.138794],[-73.79624,41.138734],[-73.796249,41.13861],[-73.79619700000001,41.138381],[-73.796166,41.138281],[-73.796165,41.137992],[-73.795832,41.137754],[-73.79593199999999,41.137646],[-73.79665199999999,41.136859],[-73.79849,41.134654],[-73.799516,41.133432],[-73.799738,41.132837],[-73.799904,41.132173],[-73.800907,41.131835],[-73.800934,41.131603],[-73.800957,41.13139],[-73.80094699999999,41.131154],[-73.800938,41.130947],[-73.800938,41.130587],[-73.80094699999999,41.130474],[-73.801051,41.130306],[-73.80113799999999,41.130223],[-73.80120100000001,41.130161],[-73.801394,41.13006],[-73.80168399999999,41.12987],[-73.80175800000001,41.129808],[-73.801892,41.129698],[-73.802008,41.129538],[-73.802065,41.129405],[-73.80150500000001,41.129298],[-73.801726,41.128992],[-73.801928,41.12894],[-73.80193300000001,41.128775],[-73.801732,41.128831],[-73.801699,41.128533],[-73.801545,41.128612],[-73.80065399999999,41.129072],[-73.80037900000001,41.129399],[-73.80009,41.129741],[-73.800015,41.129848],[-73.799179,41.130746],[-73.79824000000001,41.130695],[-73.79756999999999,41.130586],[-73.79681600000001,41.130509],[-73.79693,41.130441],[-73.79715400000001,41.130314],[-73.797274,41.130245],[-73.797303,41.130229],[-73.797088,41.129499],[-73.79693,41.128786],[-73.796808,41.128779],[-73.79673699999999,41.128791],[-73.796667,41.128815],[-73.796206,41.129064],[-73.796159,41.129862],[-73.795773,41.12975],[-73.79492500000001,41.12965],[-73.794813,41.129155],[-73.79476,41.129015],[-73.794648,41.128718],[-73.794487,41.128349],[-73.794331,41.127933],[-73.79387800000001,41.127751],[-73.793646,41.127658],[-73.793071,41.127404],[-73.792866,41.127316],[-73.792822,41.127252],[-73.79263899999999,41.127033],[-73.792613,41.126987],[-73.792404,41.126734],[-73.79220100000001,41.126527],[-73.79194,41.126281],[-73.791715,41.126108],[-73.791405,41.125869],[-73.79118699999999,41.125718],[-73.791015,41.125598],[-73.79059100000001,41.125362],[-73.790334,41.125241],[-73.790115,41.125138],[-73.789992,41.125084],[-73.789646,41.124955],[-73.789467,41.124911],[-73.789315,41.124874],[-73.789137,41.124842],[-73.788825,41.124814],[-73.78834999999999,41.124803],[-73.787083,41.124862],[-73.786894,41.12486],[-73.78630200000001,41.124835],[-73.78605,41.124814],[-73.785731,41.124757],[-73.78518800000001,41.124592],[-73.78500699999999,41.124529],[-73.78480399999999,41.12444],[-73.784538,41.124298],[-73.784414,41.124219],[-73.784121,41.123992],[-73.78401700000001,41.123908],[-73.78370200000001,41.123584],[-73.783534,41.123349],[-73.78343099999999,41.123156],[-73.78335300000001,41.122968],[-73.783325,41.122865],[-73.783292,41.122741],[-73.783232,41.122323],[-73.78322900000001,41.122096],[-73.78324600000001,41.121828],[-73.78330699999999,41.121491],[-73.78336299999999,41.121296],[-73.783537,41.120864],[-73.78364000000001,41.120693],[-73.78413,41.119988],[-73.784375,41.119683],[-73.784666,41.119358],[-73.785017,41.119032],[-73.78563800000001,41.118525],[-73.78619500000001,41.118119],[-73.78720300000001,41.117475],[-73.78911600000001,41.11636],[-73.790312,41.115702],[-73.791195,41.115184],[-73.791831,41.114832],[-73.792636,41.114346],[-73.79321899999999,41.114017],[-73.793786,41.113674],[-73.794634,41.113193],[-73.79499300000001,41.112973],[-73.79648299999999,41.112135],[-73.79671,41.112009],[-73.797246,41.111706],[-73.79765399999999,41.111491],[-73.798222,41.111217],[-73.79911300000001,41.110828],[-73.79993,41.110493],[-73.800586,41.110233],[-73.80092500000001,41.110104],[-73.80151499999999,41.10988],[-73.801568,41.109859],[-73.801708,41.109804],[-73.801754,41.109787],[-73.802038,41.110066],[-73.80320500000001,41.11123],[-73.803613,41.111668],[-73.804063,41.112193],[-73.804411,41.112652],[-73.80490500000001,41.113355],[-73.80502199999999,41.113523],[-73.80535500000001,41.114083],[-73.805643,41.114645],[-73.80573800000001,41.114858],[-73.80594000000001,41.115411],[-73.806004,41.115587],[-73.806466,41.116922],[-73.806775,41.117865],[-73.806895,41.118199],[-73.807097,41.11867],[-73.80719000000001,41.11884],[-73.8073,41.119073],[-73.807463,41.119371],[-73.807914,41.120106],[-73.808013,41.120274],[-73.808159,41.120525],[-73.808341,41.120814],[-73.808408,41.12092],[-73.808691,41.121399],[-73.809113,41.122131],[-73.80933,41.122668],[-73.80939600000001,41.122895],[-73.809408,41.122946],[-73.80956999999999,41.12365],[-73.809607,41.123827],[-73.809614,41.123858],[-73.809663,41.124031],[-73.809787,41.124365],[-73.809915,41.124615],[-73.810174,41.125005],[-73.810661,41.12557],[-73.810816,41.12575],[-73.811018,41.125959],[-73.81219,41.127176],[-73.812623,41.127649],[-73.81290199999999,41.127948],[-73.814583,41.129748],[-73.81476499999999,41.129996],[-73.81481100000001,41.130058],[-73.81508599999999,41.130506],[-73.815175,41.130681],[-73.815355,41.131143],[-73.81547999999999,41.131538],[-73.815539,41.131808],[-73.815577,41.132093],[-73.815594,41.132366],[-73.815596,41.132638],[-73.815602,41.133921],[-73.815611,41.134867],[-73.81563199999999,41.135164],[-73.815686,41.135513],[-73.81569399999999,41.13555]]],"type":"Polygon"}
}