{
  "id": "361119516001",
  "type": "Feature",
  "properties": {
    "area_land":2082937,
    "area_water":39706,
    "geoid":"361119516001",
    "name":"Block Group 1",
    "state":"ny"
},
  "bbox": [
    -74.057533,
    41.899471,
    -74.036214,
    41.939366
],
  "geometry": {"coordinates":[[[-74.056523,41.937046],[-74.056068,41.936954],[-74.055628,41.936799],[-74.055274,41.936637],[-74.05476400000001,41.936344],[-74.054232,41.936006],[-74.053815,41.935789],[-74.053493,41.935659],[-74.053117,41.935563],[-74.052751,41.935523],[-74.05248400000001,41.935538],[-74.05225,41.935599],[-74.05201599999999,41.935715],[-74.05161,41.935994],[-74.05096,41.936622],[-74.049971,41.937502],[-74.04971399999999,41.937717],[-74.049464,41.937909],[-74.04919700000001,41.938092],[-74.048849,41.938286],[-74.048478,41.93845],[-74.048289,41.938518],[-74.048187,41.938555],[-74.047017,41.938808],[-74.04642800000001,41.938973],[-74.045439,41.939214],[-74.04470499999999,41.939353],[-74.044629,41.939366],[-74.044101,41.938762],[-74.042078,41.936449],[-74.04141799999999,41.935685],[-74.040216,41.934306],[-74.04007799999999,41.934123],[-74.03978600000001,41.933758],[-74.03915499999999,41.932941],[-74.038686,41.932344],[-74.037111,41.930436],[-74.036676,41.929922],[-74.036214,41.929391],[-74.036233,41.929384],[-74.036592,41.92925],[-74.036714,41.929204],[-74.03706699999999,41.929075],[-74.03747300000001,41.928956],[-74.038048,41.928771],[-74.038416,41.928605],[-74.03863200000001,41.928468],[-74.038905,41.928257],[-74.039536,41.92772],[-74.039924,41.927344],[-74.04010599999999,41.927121],[-74.04041100000001,41.926668],[-74.04090100000001,41.925842],[-74.04110900000001,41.925479],[-74.041344,41.925038],[-74.04190800000001,41.924087],[-74.04203699999999,41.92384],[-74.04221,41.923553],[-74.04237000000001,41.923321],[-74.042574,41.923047],[-74.04282000000001,41.922793],[-74.042986,41.922648],[-74.04325,41.922451],[-74.043369,41.922369],[-74.043649,41.922209],[-74.043679,41.922194],[-74.044073,41.921997],[-74.044359,41.921856],[-74.04429399999999,41.921015],[-74.044032,41.917631],[-74.043953,41.916927],[-74.04373200000001,41.915485],[-74.04239,41.907395],[-74.041911,41.90451],[-74.041854,41.904076],[-74.041814,41.903381],[-74.041837,41.902636],[-74.04188499999999,41.902161],[-74.041957,41.901679],[-74.042143,41.90088],[-74.042348,41.900267],[-74.04266800000001,41.899502],[-74.04268399999999,41.899471],[-74.042805,41.899921],[-74.04341700000001,41.90189],[-74.043564,41.902224],[-74.04356199999999,41.902249],[-74.043566,41.902348],[-74.04357299999999,41.902503],[-74.04364099999999,41.902811],[-74.04365900000001,41.902894],[-74.04375899999999,41.90326],[-74.043938,41.903853],[-74.044023,41.904095],[-74.044157,41.904399],[-74.044359,41.90476],[-74.044449,41.904989],[-74.044473,41.905091],[-74.044499,41.905567],[-74.04450799999999,41.905725],[-74.04451400000001,41.905778],[-74.044545,41.906042],[-74.044636,41.906534],[-74.044826,41.907315],[-74.04489700000001,41.907683],[-74.04503099999999,41.908253],[-74.045113,41.908601],[-74.04535300000001,41.909148],[-74.045574,41.909733],[-74.04562199999999,41.909971],[-74.04562900000001,41.910113],[-74.045616,41.910468],[-74.045632,41.910539],[-74.045688,41.910601],[-74.045784,41.910654],[-74.045835,41.910662],[-74.045878,41.910665],[-74.045896,41.910819],[-74.04598300000001,41.911536],[-74.047241,41.916838],[-74.047622,41.918515],[-74.047731,41.918996],[-74.04791,41.919765],[-74.048163,41.920864],[-74.048371,41.921732],[-74.048631,41.922838],[-74.048923,41.924036],[-74.04940000000001,41.926011],[-74.049589,41.926847],[-74.049756,41.927798],[-74.04998000000001,41.928599],[-74.050225,41.929529],[-74.05036200000001,41.929974],[-74.05072199999999,41.931466],[-74.050927,41.932345],[-74.051051,41.932808],[-74.051092,41.932974],[-74.051109,41.933018],[-74.05148199999999,41.933256],[-74.051562,41.933315],[-74.051937,41.933553],[-74.05231499999999,41.933792],[-74.052395,41.933843],[-74.05393100000001,41.93481],[-74.054092,41.934909],[-74.05753300000001,41.937207],[-74.056523,41.937046]]],"type":"Polygon"}
}