{
  "id": "360810889014",
  "type": "Feature",
  "properties": {
    "area_land":70897,
    "area_water":0,
    "geoid":"360810889014",
    "name":"Block Group 4",
    "state":"ny"
},
  "bbox": [
    -73.833428,
    40.767754,
    -73.830546,
    40.772474
],
  "geometry": {"coordinates":[[[-73.833428,40.771434],[-73.833133,40.77161],[-73.83278900000001,40.771807],[-73.832522,40.771964],[-73.832438,40.772014],[-73.832178,40.772175],[-73.831833,40.772388],[-73.83171299999999,40.772474],[-73.831615,40.772278],[-73.831491,40.772029],[-73.83151700000001,40.771658],[-73.830585,40.771639],[-73.830546,40.770224],[-73.83076699999999,40.770057],[-73.831001,40.769899],[-73.831244,40.76975],[-73.831497,40.769611],[-73.830853,40.767999],[-73.831925,40.767754],[-73.832578,40.769353],[-73.833243,40.770999],[-73.833347,40.771245],[-73.833428,40.771434]]],"type":"Polygon"}
}