{
  "id": "360470610044",
  "type": "Feature",
  "properties": {
    "area_land":22517,
    "area_water":0,
    "geoid":"360470610044",
    "name":"Block Group 4",
    "state":"ny"
},
  "bbox": [
    -73.956053,
    40.577366,
    -73.954041,
    40.579196
],
  "geometry": {"coordinates":[[[-73.956053,40.577766],[-73.95504099999999,40.579182],[-73.954345,40.579196],[-73.954206,40.578426],[-73.954041,40.577457],[-73.954735,40.577366],[-73.95483299999999,40.577393],[-73.955213,40.577505],[-73.955787,40.577684],[-73.956053,40.577766]]],"type":"Polygon"}
}