{
  "id": "360670103221",
  "type": "Feature",
  "properties": {
    "area_land":3290152,
    "area_water":0,
    "geoid":"360670103221",
    "name":"Block Group 1",
    "state":"ny"
},
  "bbox": [
    -76.122154,
    43.175598,
    -76.09306,
    43.197491
],
  "geometry": {"coordinates":[[[-76.12215399999999,43.191817],[-76.119674,43.185884],[-76.118447,43.183018],[-76.120053,43.187338],[-76.12122100000001,43.190435],[-76.121582,43.191428],[-76.121758,43.191858],[-76.12186699999999,43.192134],[-76.121937,43.192315],[-76.121604,43.192281],[-76.121368,43.192323],[-76.118199,43.192465],[-76.116434,43.19257],[-76.113388,43.192708],[-76.11236,43.192781],[-76.111778,43.192857],[-76.110342,43.193093],[-76.109178,43.193332],[-76.108982,43.193379],[-76.10821300000001,43.193574],[-76.106067,43.194137],[-76.103724,43.194757],[-76.102211,43.195147],[-76.10172799999999,43.195273],[-76.101091,43.195439],[-76.100155,43.195702],[-76.09943,43.195933],[-76.09886899999999,43.196123],[-76.09875099999999,43.196164],[-76.09756,43.196581],[-76.096193,43.19706],[-76.095388,43.197345],[-76.095184,43.197435],[-76.095091,43.197491],[-76.09487300000001,43.197347],[-76.09465,43.197238],[-76.094431,43.197156],[-76.09421500000001,43.19709],[-76.093836,43.197015],[-76.093648,43.19699],[-76.093531,43.195161],[-76.09342599999999,43.193835],[-76.09342100000001,43.193755],[-76.09305999999999,43.191278],[-76.093408,43.191137],[-76.093591,43.191094],[-76.09371400000001,43.191024],[-76.09377000000001,43.190949],[-76.09393,43.190517],[-76.09403399999999,43.190276],[-76.09414200000001,43.190103],[-76.094156,43.190018],[-76.09414700000001,43.189962],[-76.0941,43.189901],[-76.09402,43.18984],[-76.093963,43.189779],[-76.093917,43.18969],[-76.09388800000001,43.189507],[-76.09386000000001,43.189436],[-76.093855,43.189366],[-76.093874,43.189333],[-76.093935,43.189305],[-76.094067,43.189314],[-76.09425899999999,43.189361],[-76.09437200000001,43.189375],[-76.09448999999999,43.189375],[-76.09456900000001,43.189366],[-76.094674,43.189321],[-76.09475399999999,43.189265],[-76.094824,43.189232],[-76.094956,43.189199],[-76.094973,43.189343],[-76.09493999999999,43.189503],[-76.095112,43.189511],[-76.09731600000001,43.189429],[-76.0986,43.189379],[-76.099841,43.189328],[-76.099756,43.188455],[-76.09992,43.188423],[-76.100221,43.188323],[-76.100375,43.188245],[-76.10075999999999,43.188036],[-76.10063700000001,43.187928],[-76.10009700000001,43.187572],[-76.099594,43.187269],[-76.099345,43.187097],[-76.099231,43.186996],[-76.099135,43.186884],[-76.099028,43.186697],[-76.09898699999999,43.18645],[-76.098939,43.185861],[-76.09887500000001,43.184988],[-76.098806,43.184662],[-76.098738,43.184452],[-76.098607,43.184161],[-76.09830599999999,43.183559],[-76.09823,43.18343],[-76.098035,43.183181],[-76.09751300000001,43.182604],[-76.10012500000001,43.181308],[-76.103819,43.179469],[-76.10627599999999,43.178277],[-76.11004699999999,43.176452],[-76.11135,43.175809],[-76.112297,43.175776],[-76.11526499999999,43.175638],[-76.11580499999999,43.175611],[-76.116091,43.175598],[-76.11689,43.177738],[-76.11708299999999,43.178252],[-76.117418,43.179093],[-76.11814,43.181092],[-76.118816,43.182897],[-76.121104,43.189026],[-76.12146,43.189992],[-76.122027,43.191458],[-76.12215399999999,43.191817]]],"type":"Polygon"}
}