{
  "id": "361190008015",
  "type": "Feature",
  "properties": {
    "area_land":245629,
    "area_water":0,
    "geoid":"361190008015",
    "name":"Block Group 5",
    "state":"ny"
},
  "bbox": [
    -73.886267,
    40.959826,
    -73.877189,
    40.965398
],
  "geometry": {"coordinates":[[[-73.88620400000001,40.961047],[-73.88590499999999,40.961501],[-73.885643,40.961936],[-73.885526,40.962189],[-73.885443,40.962453],[-73.885403,40.962732],[-73.88539,40.963342],[-73.88539900000001,40.963684],[-73.88539,40.965228],[-73.885401,40.965385],[-73.885194,40.965398],[-73.884916,40.965393],[-73.8848,40.965382],[-73.884703,40.965373],[-73.884491,40.965328],[-73.884199,40.965238],[-73.88406999999999,40.965193],[-73.88415500000001,40.965074],[-73.88417,40.965013],[-73.884165,40.964895],[-73.88414899999999,40.964833],[-73.884062,40.964623],[-73.88399,40.964533],[-73.883893,40.964451],[-73.883792,40.964391],[-73.88350199999999,40.964262],[-73.883245,40.964169],[-73.88221900000001,40.963792],[-73.88175699999999,40.963633],[-73.88162800000001,40.963613],[-73.881551,40.963613],[-73.881449,40.963639],[-73.88134100000001,40.963685],[-73.881293,40.963719],[-73.88113300000001,40.9636],[-73.88100900000001,40.963539],[-73.88061,40.963398],[-73.879715,40.963103],[-73.87924700000001,40.962962],[-73.878648,40.962784],[-73.878353,40.962707],[-73.877574,40.962493],[-73.877405,40.962416],[-73.877251,40.962288],[-73.877205,40.96218],[-73.877189,40.962093],[-73.877194,40.961959],[-73.877225,40.961825],[-73.87732699999999,40.961447],[-73.877568,40.960588],[-73.877638,40.960336],[-73.87778299999999,40.959826],[-73.879008,40.960205],[-73.879059,40.9602],[-73.879172,40.959966],[-73.879234,40.95993],[-73.879336,40.95993],[-73.879475,40.959966],[-73.880501,40.960293],[-73.882311,40.9608],[-73.88318599999999,40.961035],[-73.883239,40.960927],[-73.884863,40.961312],[-73.88512900000001,40.960648],[-73.886077,40.960898],[-73.886112,40.960907],[-73.886267,40.960951],[-73.88620400000001,40.961047]]],"type":"Polygon"}
}