{
  "id": "360610048001",
  "type": "Feature",
  "properties": {
    "area_land":16070,
    "area_water":0,
    "geoid":"360610048001",
    "name":"Block Group 1",
    "state":"ny"
},
  "bbox": [
    -73.985361,
    40.734846,
    -73.982695,
    40.736376
],
  "geometry": {"coordinates":[[[-73.984934,40.736376],[-73.98436700000001,40.736136],[-73.98269500000001,40.735431],[-73.98312199999999,40.734846],[-73.984784,40.735547],[-73.985361,40.73579],[-73.984934,40.736376]]],"type":"Polygon"}
}