{
  "id": "360290066021",
  "type": "Feature",
  "properties": {
    "area_land":155932,
    "area_water":0,
    "geoid":"360290066021",
    "name":"Block Group 1",
    "state":"ny"
},
  "bbox": [
    -78.877061,
    42.913136,
    -78.869173,
    42.915465
],
  "geometry": {"coordinates":[[[-78.877061,42.914115],[-78.877047,42.915465],[-78.87634199999999,42.915455],[-78.875681,42.915449],[-78.87371,42.915431],[-78.873515,42.915429],[-78.87312799999999,42.915426],[-78.870689,42.915404],[-78.869173,42.915394],[-78.869372,42.914691],[-78.86956600000001,42.91408],[-78.86982500000001,42.913136],[-78.87165400000001,42.913147],[-78.872815,42.913152],[-78.875899,42.91316],[-78.877061,42.913173],[-78.877061,42.914115]]],"type":"Polygon"}
}