{
  "id": "361170210004",
  "type": "Feature",
  "properties": {
    "area_land":56341307,
    "area_water":155738,
    "geoid":"361170210004",
    "name":"Block Group 4",
    "state":"ny"
},
  "bbox": [
    -77.136727,
    43.012463,
    -77.074744,
    43.161666
],
  "geometry": {"coordinates":[[[-77.136719,43.160833],[-77.136695,43.161224],[-77.13668800000001,43.161354],[-77.135583,43.161364],[-77.132268,43.161396],[-77.131164,43.161407],[-77.128911,43.161436],[-77.1247,43.161492],[-77.12462600000001,43.161426],[-77.12218,43.16144],[-77.119928,43.161454],[-77.11948099999999,43.161447],[-77.118143,43.161428],[-77.11769700000001,43.161422],[-77.11634100000001,43.161435],[-77.11227700000001,43.161475],[-77.110922,43.161489],[-77.10923099999999,43.161495],[-77.10817400000001,43.161515],[-77.103024,43.161564],[-77.102687,43.161565],[-77.102576,43.161567],[-77.102306,43.161571],[-77.101823,43.161576],[-77.1015,43.161578],[-77.101269,43.16158],[-77.100641,43.161579],[-77.100335,43.161576],[-77.100116,43.161579],[-77.099316,43.161578],[-77.09626900000001,43.161612],[-77.095254,43.161604],[-77.094674,43.161601],[-77.092935,43.161592],[-77.092356,43.161589],[-77.09154599999999,43.1616],[-77.089116,43.161634],[-77.088307,43.161646],[-77.08765099999999,43.161649],[-77.085686,43.161662],[-77.085031,43.161666],[-77.084727,43.160199],[-77.084594,43.159554],[-77.08445399999999,43.15879],[-77.08414,43.15688],[-77.08396999999999,43.155772],[-77.08374499999999,43.154292],[-77.083636,43.15368],[-77.08331099999999,43.151844],[-77.083203,43.151233],[-77.08271499999999,43.148633],[-77.082448,43.147302],[-77.08205100000001,43.145324],[-77.081459,43.142682],[-77.080956,43.140193],[-77.080558,43.138432],[-77.080063,43.1365],[-77.08000199999999,43.136091],[-77.079977,43.135563],[-77.079792,43.131566],[-77.079739,43.13053],[-77.079735,43.130438],[-77.079551,43.127427],[-77.079488,43.126393],[-77.07944999999999,43.125754],[-77.079412,43.124973],[-77.079387,43.124454],[-77.079362,43.122702],[-77.079263,43.120712],[-77.079194,43.119293],[-77.079157,43.118588],[-77.07911900000001,43.117854],[-77.07906,43.116473],[-77.07903,43.115769],[-77.07901200000001,43.115472],[-77.07896,43.114583],[-77.078943,43.114287],[-77.07883200000001,43.112393],[-77.078723,43.110385],[-77.078706,43.110125],[-77.078653,43.109316],[-77.078633,43.109179],[-77.078549,43.108803],[-77.07847,43.108556],[-77.07829599999999,43.108135],[-77.07787,43.107205],[-77.077473,43.106379],[-77.07733500000001,43.106042],[-77.077206,43.105641],[-77.07696,43.10455],[-77.07683400000001,43.103965],[-77.076021,43.100299],[-77.07554399999999,43.098091],[-77.07492999999999,43.095242],[-77.074772,43.094426],[-77.074747,43.094208],[-77.074744,43.094006],[-77.07476200000001,43.093649],[-77.074797,43.093391],[-77.07483499999999,43.093217],[-77.07485699999999,43.093117],[-77.07493599999999,43.092845],[-77.07504,43.092572],[-77.07518899999999,43.092266],[-77.075829,43.091055],[-77.076201,43.090352],[-77.077241,43.088364],[-77.07737,43.088096],[-77.077482,43.08781],[-77.077533,43.087681],[-77.077662,43.087197],[-77.077726,43.086811],[-77.077781,43.086311],[-77.07788499999999,43.085004],[-77.077994,43.083931],[-77.078203,43.082195],[-77.078307,43.081671],[-77.078485,43.081042],[-77.078648,43.080562],[-77.078991,43.079638],[-77.079066,43.079463],[-77.07925400000001,43.079029],[-77.07937200000001,43.078802],[-77.07949600000001,43.078599],[-77.079694,43.078331],[-77.07988899999999,43.0781],[-77.080206,43.077789],[-77.080803,43.077254],[-77.08091400000001,43.077157],[-77.08125,43.076866],[-77.081362,43.07677],[-77.081405,43.076732],[-77.081537,43.076618],[-77.081581,43.076581],[-77.082301,43.075976],[-77.082999,43.075392],[-77.08431299999999,43.074246],[-77.08443699999999,43.074135],[-77.084896,43.073727],[-77.085121,43.073491],[-77.08526500000001,43.073326],[-77.085426,43.073144],[-77.08567600000001,43.072816],[-77.08581,43.072643],[-77.086516,43.071691],[-77.08674499999999,43.071384],[-77.087329,43.070676],[-77.087503,43.070503],[-77.087931,43.070119],[-77.088218,43.069901],[-77.08853499999999,43.069698],[-77.088685,43.069623],[-77.089161,43.069396],[-77.090232,43.068889],[-77.092538,43.067884],[-77.09272199999999,43.0678],[-77.093022,43.067666],[-77.093271,43.06754],[-77.093452,43.06745],[-77.09383099999999,43.067212],[-77.09387099999999,43.067181],[-77.09416299999999,43.066959],[-77.09436100000001,43.066786],[-77.094584,43.066568],[-77.094909,43.066169],[-77.09493000000001,43.066138],[-77.095033,43.065989],[-77.09518199999999,43.06571],[-77.09522200000001,43.065634],[-77.095229,43.065623],[-77.09531699999999,43.065396],[-77.095349,43.065317],[-77.095387,43.065197],[-77.0954,43.065135],[-77.095471,43.0648],[-77.09548599999999,43.064575],[-77.095491,43.064511],[-77.095483,43.064387],[-77.095473,43.06427],[-77.09546400000001,43.064206],[-77.09538999999999,43.063666],[-77.095366,43.063487],[-77.095353,43.063362],[-77.095315,43.062988],[-77.095303,43.062864],[-77.095302,43.062795],[-77.095302,43.062591],[-77.095302,43.062523],[-77.095305,43.062383],[-77.095311,43.062329],[-77.09537400000001,43.061831],[-77.095387,43.061752],[-77.09542,43.061561],[-77.095431,43.061494],[-77.09545900000001,43.061293],[-77.09546899999999,43.061226],[-77.096084,43.06137],[-77.097932,43.061805],[-77.09854799999999,43.06195],[-77.099177,43.062093],[-77.10089600000001,43.062486],[-77.10106500000001,43.062527],[-77.101692,43.062682],[-77.102164,43.062789],[-77.10283200000001,43.062942],[-77.103403,43.063087],[-77.10351799999999,43.063121],[-77.103576,43.063135],[-77.10404699999999,43.063249],[-77.105209,43.063514],[-77.106212,43.063743],[-77.107772,43.064112],[-77.10869,43.06434],[-77.109848,43.064629],[-77.110269,43.064735],[-77.11103300000001,43.064929],[-77.111532,43.065068],[-77.11178200000001,43.065139],[-77.111948,43.065197],[-77.111986,43.06521],[-77.11210199999999,43.06525],[-77.11214099999999,43.065264],[-77.113001,43.065597],[-77.113242,43.065674],[-77.11348,43.06575],[-77.113798,43.065822],[-77.114385,43.065892],[-77.114631,43.065907],[-77.115099,43.065902],[-77.116426,43.065839],[-77.116744,43.065835],[-77.11698699999999,43.065833],[-77.11735,43.065849],[-77.117667,43.065878],[-77.11791599999999,43.065912],[-77.118364,43.065453],[-77.118427,43.065389],[-77.118838,43.064943],[-77.11964999999999,43.06402],[-77.120074,43.063539],[-77.12028599999999,43.0633],[-77.120751,43.062777],[-77.12091599999999,43.062578],[-77.121121,43.062333],[-77.12114699999999,43.062302],[-77.121244,43.062196],[-77.12158599999999,43.061891],[-77.121679,43.061809],[-77.121972,43.061577],[-77.12312300000001,43.060727],[-77.12364100000001,43.060346],[-77.12372999999999,43.060279],[-77.12388,43.060168],[-77.123998,43.06008],[-77.124088,43.060014],[-77.124246,43.059881],[-77.12452500000001,43.05965],[-77.124719,43.05948],[-77.124875,43.059344],[-77.125647,43.058671],[-77.125766,43.058568],[-77.12616199999999,43.058209],[-77.126306,43.058055],[-77.126496,43.057771],[-77.126811,43.057177],[-77.12727599999999,43.056198],[-77.127303,43.056131],[-77.127394,43.055912],[-77.127431,43.055763],[-77.127469,43.055404],[-77.127476,43.055132],[-77.127465,43.054975],[-77.127465,43.054853],[-77.127465,43.054016],[-77.127466,43.053737],[-77.127471,43.053485],[-77.12748000000001,43.053104],[-77.127481,43.05299],[-77.12748499999999,43.052729],[-77.127489,43.052477],[-77.127493,43.052331],[-77.127506,43.051894],[-77.127511,43.051749],[-77.12751400000001,43.051692],[-77.12751299999999,43.051663],[-77.12750699999999,43.051407],[-77.127506,43.05136],[-77.12750200000001,43.051322],[-77.128429,43.050804],[-77.128742,43.0504],[-77.128927,43.049519],[-77.128908,43.049302],[-77.128854,43.048653],[-77.12883600000001,43.048437],[-77.12873,43.04761],[-77.12866200000001,43.047312],[-77.12861599999999,43.04718],[-77.128596,43.047132],[-77.12842999999999,43.046734],[-77.12796400000001,43.045756],[-77.127319,43.044288],[-77.126982,43.043481],[-77.126701,43.042805],[-77.12648900000001,43.042246],[-77.126363,43.041841],[-77.12625,43.04115],[-77.12608299999999,43.039723],[-77.125878,43.037542],[-77.125838,43.037333],[-77.125777,43.037169],[-77.12566,43.036991],[-77.125467,43.036784],[-77.12500300000001,43.036362],[-77.124646,43.03606],[-77.12451900000001,43.0361],[-77.12380400000001,43.036197],[-77.123391,43.036232],[-77.123127,43.036256],[-77.12248099999999,43.036284],[-77.121258,43.036286],[-77.119681,43.036245],[-77.119589,43.036241],[-77.119029,43.036219],[-77.118323,43.036171],[-77.117801,43.036129],[-77.11756,43.036095],[-77.11705600000001,43.036013],[-77.116694,43.035932],[-77.11583400000001,43.035742],[-77.115073,43.035562],[-77.11277800000001,43.03498],[-77.112213,43.034841],[-77.11188900000001,43.034762],[-77.110502,43.034424],[-77.110285,43.034386],[-77.109979,43.034336],[-77.10972,43.034304],[-77.109646,43.034295],[-77.109054,43.034248],[-77.108479,43.034251],[-77.108209,43.034268],[-77.108014,43.034287],[-77.107709,43.034318],[-77.107449,43.034355],[-77.107225,43.034399],[-77.106821,43.03448],[-77.10655800000001,43.034542],[-77.106337,43.034596],[-77.106326,43.03445],[-77.10629299999999,43.034013],[-77.106283,43.033868],[-77.10650699999999,43.033842],[-77.10662000000001,43.03383],[-77.106847,43.03383],[-77.106982,43.03384],[-77.10718199999999,43.033825],[-77.10740800000001,43.033809],[-77.107422,43.033808],[-77.107585,43.03379],[-77.107686,43.033778],[-77.107772,43.033746],[-77.108131,43.033545],[-77.108377,43.033408],[-77.108451,43.033344],[-77.10850600000001,43.033264],[-77.10856800000001,43.033202],[-77.108617,43.03318],[-77.108784,43.033156],[-77.108839,43.033138],[-77.10924799999999,43.03294],[-77.10936,43.032925],[-77.109532,43.032887],[-77.10959099999999,43.032856],[-77.10968099999999,43.032781],[-77.109869,43.032524],[-77.109949,43.032406],[-77.11001400000001,43.032308],[-77.11018799999999,43.032052],[-77.11043100000001,43.031645],[-77.110474,43.031549],[-77.110474,43.031463],[-77.11044200000001,43.031404],[-77.110437,43.031395],[-77.110343,43.031294],[-77.11030599999999,43.031229],[-77.11028899999999,43.031097],[-77.11031,43.030834],[-77.11033999999999,43.030728],[-77.11036300000001,43.030691],[-77.110399,43.030636],[-77.11044,43.030604],[-77.11056600000001,43.030543],[-77.11066,43.030498],[-77.110871,43.030416],[-77.110899,43.0304],[-77.11096000000001,43.030329],[-77.11098200000001,43.030272],[-77.11103,43.030031],[-77.111057,43.029972],[-77.11111200000001,43.029928],[-77.11123600000001,43.029893],[-77.111282,43.029862],[-77.111317,43.02982],[-77.111335,43.029773],[-77.111349,43.029651],[-77.11134699999999,43.029639],[-77.11133,43.029449],[-77.111323,43.029429],[-77.11130199999999,43.029313],[-77.111397,43.029279],[-77.11166900000001,43.029182],[-77.111717,43.029165],[-77.111761,43.029149],[-77.111744,43.029091],[-77.11169599999999,43.028919],[-77.11168000000001,43.028862],[-77.112495,43.028006],[-77.11279,43.027698],[-77.112846,43.027624],[-77.112905,43.027479],[-77.11306500000001,43.027265],[-77.113105,43.027166],[-77.11314400000001,43.027097],[-77.11320600000001,43.027063],[-77.113292,43.027048],[-77.1134,43.026969],[-77.11344,43.026896],[-77.11345900000001,43.026738],[-77.113506,43.026721],[-77.113777,43.026706],[-77.113822,43.026691],[-77.11401600000001,43.026568],[-77.114127,43.026372],[-77.11418399999999,43.02618],[-77.114223,43.026125],[-77.114412,43.026038],[-77.114485,43.025995],[-77.114526,43.02596],[-77.114811,43.025618],[-77.114853,43.025569],[-77.115151,43.025174],[-77.115617,43.024761],[-77.114625,43.022886],[-77.11367,43.021193],[-77.113423,43.020745],[-77.11327300000001,43.020402],[-77.11318,43.020106],[-77.113067,43.019616],[-77.11285599999999,43.018208],[-77.11268200000001,43.016949],[-77.112465,43.015366],[-77.11243,43.015205],[-77.112391,43.015085],[-77.11233,43.015005],[-77.112222,43.014942],[-77.112157,43.014924],[-77.111925,43.014901],[-77.11157300000001,43.014897],[-77.11026699999999,43.014916],[-77.108177,43.014976],[-77.10663599999999,43.015011],[-77.10528499999999,43.015037],[-77.1039,43.015063],[-77.103273,43.015075],[-77.099745,43.015161],[-77.098361,43.015195],[-77.09781599999999,43.015208],[-77.096577,43.015239],[-77.096181,43.015239],[-77.095636,43.015241],[-77.0956,43.015241],[-77.095495,43.015241],[-77.09546,43.015242],[-77.095418,43.015243],[-77.095294,43.015246],[-77.095253,43.015248],[-77.09459099999999,43.015261],[-77.093722,43.015277],[-77.09370199999999,43.014922],[-77.09363500000001,43.014157],[-77.0936,43.014054],[-77.093439,43.012677],[-77.093433,43.012581],[-77.093847,43.01258],[-77.09509199999999,43.012579],[-77.095508,43.012579],[-77.097657,43.012575],[-77.104108,43.012567],[-77.10625899999999,43.012565],[-77.107373,43.012561],[-77.110715,43.012551],[-77.111831,43.012549],[-77.113895,43.012543],[-77.120087,43.012525],[-77.122152,43.01252],[-77.122176,43.01252],[-77.122248,43.01252],[-77.12227300000001,43.01252],[-77.122429,43.012518],[-77.12290299999999,43.012516],[-77.12306100000001,43.012516],[-77.123542,43.012513],[-77.124084,43.012491],[-77.124359,43.012481],[-77.124697,43.012467],[-77.127156,43.012484],[-77.128182,43.012493],[-77.12839099999999,43.01249],[-77.12902,43.012486],[-77.129231,43.012486],[-77.12981600000001,43.012481],[-77.131581,43.01247],[-77.13217,43.012468],[-77.13241499999999,43.012466],[-77.13315,43.012463],[-77.133397,43.012463],[-77.133426,43.012965],[-77.13351400000001,43.014472],[-77.133544,43.014975],[-77.13357000000001,43.015213],[-77.13357499999999,43.015286],[-77.133596,43.015539],[-77.133606,43.016225],[-77.133611,43.016539],[-77.133612,43.016916],[-77.133618,43.018048],[-77.13361999999999,43.018426],[-77.13362499999999,43.018583],[-77.13363699999999,43.018887],[-77.133636,43.019057],[-77.133636,43.019216],[-77.133634,43.019497],[-77.133655,43.020727],[-77.133724,43.024753],[-77.13372699999999,43.025263],[-77.133729,43.025581],[-77.13377699999999,43.026775],[-77.13378400000001,43.026949],[-77.133785,43.027],[-77.133803,43.027678],[-77.133809,43.027905],[-77.13381200000001,43.027975],[-77.133824,43.028185],[-77.13382900000001,43.028256],[-77.133854,43.028643],[-77.133881,43.02922],[-77.133966,43.030964],[-77.134005,43.031934],[-77.13401,43.032114],[-77.13403700000001,43.03308],[-77.13404199999999,43.033207],[-77.13406000000001,43.03359],[-77.134066,43.033718],[-77.134066,43.033733],[-77.134069,43.033779],[-77.13406999999999,43.033795],[-77.134125,43.035013],[-77.13424500000001,43.037627],[-77.13428399999999,43.038668],[-77.134305,43.039204],[-77.13431300000001,43.039686],[-77.13430700000001,43.039887],[-77.13433499999999,43.039926],[-77.13460600000001,43.039917],[-77.13542099999999,43.03989],[-77.13569699999999,43.039882],[-77.135704,43.039986],[-77.135896,43.04572],[-77.13590000000001,43.045772],[-77.135913,43.045931],[-77.135918,43.045984],[-77.135937,43.046586],[-77.135994,43.048392],[-77.136014,43.048994],[-77.136015,43.049013],[-77.13602,43.049072],[-77.136022,43.049092],[-77.13604100000001,43.049615],[-77.136098,43.051186],[-77.136118,43.05171],[-77.136117,43.051763],[-77.136191,43.053736],[-77.13632699999999,43.057481],[-77.136377,43.058933],[-77.136377,43.059128],[-77.13637799999999,43.060363],[-77.136383,43.062806],[-77.136387,43.064655],[-77.136369,43.06656],[-77.136376,43.066755],[-77.136444,43.068713],[-77.136459,43.071645],[-77.136506,43.080441],[-77.136522,43.083373],[-77.13653600000001,43.083482],[-77.136578,43.083809],[-77.136593,43.083918],[-77.13656400000001,43.083962],[-77.136529,43.08407],[-77.136539,43.084602],[-77.136579,43.086696],[-77.13658700000001,43.087105],[-77.136571,43.087188],[-77.136465,43.087364],[-77.136476,43.087415],[-77.136511,43.087568],[-77.136523,43.087619],[-77.136533,43.087686],[-77.136565,43.087887],[-77.136567,43.087896],[-77.136577,43.087954],[-77.136436,43.090123],[-77.136037,43.096319],[-77.136034,43.096634],[-77.13601800000001,43.098809],[-77.136021,43.102145],[-77.136033,43.112153],[-77.136037,43.11549],[-77.13607,43.115697],[-77.136132,43.116077],[-77.136169,43.116321],[-77.136201,43.116529],[-77.13625999999999,43.11691],[-77.136324,43.117406],[-77.136335,43.117518],[-77.13637,43.117875],[-77.13638899999999,43.118229],[-77.13641200000001,43.118917],[-77.13639000000001,43.120512],[-77.136377,43.121511],[-77.136376,43.121536],[-77.136375,43.12161],[-77.136375,43.121636],[-77.13636700000001,43.122461],[-77.136365,43.122784],[-77.136393,43.124937],[-77.136394,43.125004],[-77.136411,43.125763],[-77.136414,43.125954],[-77.13642400000001,43.126527],[-77.136428,43.126719],[-77.136436,43.127612],[-77.13644499999999,43.128538],[-77.13643500000001,43.129209],[-77.136403,43.130291],[-77.136377,43.131184],[-77.136375,43.131297],[-77.136371,43.131637],[-77.136371,43.131751],[-77.136369,43.131923],[-77.136365,43.132441],[-77.136365,43.132614],[-77.136371,43.133319],[-77.13638899999999,43.135434],[-77.13639499999999,43.13614],[-77.136427,43.13905],[-77.136526,43.14778],[-77.13655900000001,43.150691],[-77.13659199999999,43.152693],[-77.13669299999999,43.158701],[-77.13672699999999,43.160704],[-77.136719,43.160833]]],"type":"Polygon"}
}