{
  "id": "360610281001",
  "type": "Feature",
  "properties": {
    "area_land":17992,
    "area_water":0,
    "geoid":"360610281001",
    "name":"Block Group 1",
    "state":"ny"
},
  "bbox": [
    -73.936879,
    40.854915,
    -73.934848,
    40.857109
],
  "geometry": {"coordinates":[[[-73.93670299999999,40.855623],[-73.935602,40.857109],[-73.934912,40.856892],[-73.934848,40.856845],[-73.934848,40.85681],[-73.935348,40.856119],[-73.93553300000001,40.855853],[-73.93566800000001,40.85566],[-73.93582499999999,40.855369],[-73.936038,40.854915],[-73.936879,40.855136],[-73.93670299999999,40.855623]]],"type":"Polygon"}
}