{
  "id": "361190134002",
  "type": "Feature",
  "properties": {
    "area_land":377613,
    "area_water":0,
    "geoid":"361190134002",
    "name":"Block Group 2",
    "state":"ny"
},
  "bbox": [
    -73.857074,
    41.159668,
    -73.8445,
    41.1674
],
  "geometry": {"coordinates":[[[-73.857074,41.161516],[-73.856532,41.161527],[-73.855659,41.16153],[-73.855599,41.162563],[-73.854477,41.162464],[-73.85427300000001,41.162437],[-73.853202,41.162297],[-73.852774,41.162242],[-73.85269700000001,41.162255],[-73.852665,41.162284],[-73.852631,41.162355],[-73.85254399999999,41.162644],[-73.851887,41.164322],[-73.851748,41.16468],[-73.85165499999999,41.164976],[-73.851632,41.165124],[-73.851632,41.165506],[-73.85160500000001,41.167173],[-73.850993,41.167078],[-73.850836,41.167053],[-73.850026,41.166978],[-73.849904,41.166965],[-73.849766,41.166967],[-73.84944299999999,41.166983],[-73.849082,41.16702],[-73.84885,41.167017],[-73.848538,41.166965],[-73.848302,41.166911],[-73.848181,41.166897],[-73.84803599999999,41.166897],[-73.847835,41.166914],[-73.847588,41.166952],[-73.846976,41.167062],[-73.84648,41.167127],[-73.845522,41.167256],[-73.844544,41.1674],[-73.8445,41.165793],[-73.844598,41.165721],[-73.844886,41.165283],[-73.844937,41.165188],[-73.845243,41.164498],[-73.84553099999999,41.163798],[-73.845823,41.163957],[-73.846138,41.164154],[-73.84679199999999,41.164588],[-73.846941,41.164661],[-73.847037,41.164695],[-73.84836300000001,41.16306],[-73.849182,41.161824],[-73.849622,41.161954],[-73.849841,41.161512],[-73.850014,41.161185],[-73.850842,41.161387],[-73.851297,41.160634],[-73.851502,41.160268],[-73.85156600000001,41.160178],[-73.851631,41.16012],[-73.85172,41.160063],[-73.85189099999999,41.160006],[-73.852126,41.159932],[-73.85236999999999,41.159899],[-73.852783,41.159887],[-73.85289,41.159887],[-73.852993,41.15987],[-73.853121,41.159835],[-73.85324300000001,41.159771],[-73.853409,41.159668],[-73.85404200000001,41.160016],[-73.854343,41.160163],[-73.854895,41.160464],[-73.85495299999999,41.160497],[-73.855114,41.160606],[-73.85521,41.160657],[-73.855358,41.160683],[-73.85702000000001,41.160618],[-73.857074,41.161516]]],"type":"Polygon"}
}