{
  "id": "360050399011",
  "type": "Feature",
  "properties": {
    "area_land":43216,
    "area_water":0,
    "geoid":"360050399011",
    "name":"Block Group 1",
    "state":"ny"
},
  "bbox": [
    -73.897068,
    40.861926,
    -73.893559,
    40.86429
],
  "geometry": {"coordinates":[[[-73.897068,40.862534],[-73.895777,40.864227],[-73.895599,40.864188],[-73.89459100000001,40.863964],[-73.894323,40.86429],[-73.894176,40.863184],[-73.894154,40.862968],[-73.894057,40.86235],[-73.893559,40.861926],[-73.89372400000001,40.861944],[-73.894825,40.862065],[-73.895884,40.862258],[-73.89690400000001,40.862495],[-73.897068,40.862534]]],"type":"Polygon"}
}