{
  "id": "360290081023",
  "type": "Feature",
  "properties": {
    "area_land":362080,
    "area_water":0,
    "geoid":"360290081023",
    "name":"Block Group 3",
    "state":"ny"
},
  "bbox": [
    -78.867623,
    42.967965,
    -78.852569,
    42.973512
],
  "geometry": {"coordinates":[[[-78.867474,42.968851],[-78.867349,42.969212],[-78.867306,42.96934],[-78.867221,42.969595],[-78.867141,42.969751],[-78.86705000000001,42.969951],[-78.867013,42.970032],[-78.866619,42.970869],[-78.866468,42.97119],[-78.865286,42.971184],[-78.86527,42.971287],[-78.86523800000001,42.971357],[-78.86519,42.971422],[-78.865126,42.971482],[-78.86504499999999,42.971534],[-78.864971,42.971567],[-78.864893,42.971593],[-78.864814,42.971609],[-78.86466,42.971625],[-78.864504,42.971627],[-78.860438,42.971604],[-78.86033,42.971595],[-78.86019899999999,42.971569],[-78.86007499999999,42.971528],[-78.859962,42.971472],[-78.859911,42.971432],[-78.859854,42.971367],[-78.859793,42.97126],[-78.85977699999999,42.971162],[-78.859775,42.970728],[-78.859773,42.970271],[-78.859787,42.970182],[-78.859825,42.970097],[-78.859874,42.970031],[-78.85994599999999,42.96997],[-78.86003100000001,42.969919],[-78.86012700000001,42.969879],[-78.86023,42.969852],[-78.860339,42.969838],[-78.862514,42.969838],[-78.862527,42.968897],[-78.85841600000001,42.968884],[-78.858412,42.969121],[-78.858407,42.969569],[-78.858411,42.969811],[-78.858395,42.971276],[-78.858395,42.972496],[-78.85839900000001,42.973512],[-78.85702000000001,42.973506],[-78.856526,42.973504],[-78.85648,42.973499],[-78.856424,42.973483],[-78.856354,42.973452],[-78.85576500000001,42.97308],[-78.85441899999999,42.972239],[-78.854422,42.972088],[-78.854473,42.96998],[-78.85450400000001,42.968874],[-78.85321999999999,42.968872],[-78.852569,42.968866],[-78.852599,42.967966],[-78.853042,42.967965],[-78.853032,42.968496],[-78.85841600000001,42.968438],[-78.86762299999999,42.968429],[-78.867474,42.968851]]],"type":"Polygon"}
}