{
  "id": "360550096022",
  "type": "Feature",
  "properties": {
    "area_land":314819,
    "area_water":0,
    "geoid":"360550096022",
    "name":"Block Group 2",
    "state":"ny"
},
  "bbox": [
    -77.64964,
    43.152087,
    -77.638862,
    43.157236
],
  "geometry": {"coordinates":[[[-77.649317,43.15222],[-77.649164,43.1523],[-77.649022,43.15239],[-77.648892,43.15249],[-77.648776,43.152598],[-77.648707,43.152675],[-77.648459,43.153177],[-77.648385,43.153328],[-77.648353,43.153439],[-77.64833900000001,43.153552],[-77.64834399999999,43.153666],[-77.648368,43.153778],[-77.648409,43.153888],[-77.648492,43.154027],[-77.648914,43.154559],[-77.64896,43.154617],[-77.649073,43.154804],[-77.649168,43.154997],[-77.649264,43.155256],[-77.64917800000001,43.155256],[-77.649242,43.155465],[-77.649272,43.155633],[-77.64928399999999,43.155802],[-77.649271,43.156322],[-77.649252,43.157079],[-77.649249,43.157219],[-77.648366,43.15721],[-77.64708299999999,43.157236],[-77.644886,43.157202],[-77.64398199999999,43.157191],[-77.64397700000001,43.157056],[-77.64397200000001,43.156756],[-77.643101,43.156651],[-77.642242,43.156568],[-77.64113999999999,43.156419],[-77.641143,43.155236],[-77.63911299999999,43.155229],[-77.638862,43.155233],[-77.638874,43.154027],[-77.64131999999999,43.153607],[-77.642037,43.153484],[-77.64394299999999,43.153134],[-77.64444899999999,43.153041],[-77.644966,43.152945],[-77.64964000000001,43.152087],[-77.649317,43.15222]]],"type":"Polygon"}
}