{
  "id": "360670046004",
  "type": "Feature",
  "properties": {
    "area_land":495862,
    "area_water":0,
    "geoid":"360670046004",
    "name":"Block Group 4",
    "state":"ny"
},
  "bbox": [
    -76.114536,
    43.03694,
    -76.100801,
    43.04524
],
  "geometry": {"coordinates":[[[-76.114521,43.04524],[-76.113399,43.045068],[-76.112458,43.044906],[-76.112348,43.044875],[-76.112002,43.044745],[-76.108661,43.043569],[-76.108543,43.043534],[-76.107445,43.043205],[-76.107302,43.043156],[-76.10690099999999,43.043014],[-76.105704,43.042589],[-76.105351,43.042482],[-76.105187,43.042435],[-76.10455399999999,43.042299],[-76.10415500000001,43.042264],[-76.103658,43.042242],[-76.103392,43.042242],[-76.103183,43.042252],[-76.102728,43.042298],[-76.102456,43.042336],[-76.101878,43.042435],[-76.10091199999999,43.042566],[-76.100859,43.04208],[-76.100801,43.041776],[-76.102144,43.04158],[-76.102817,43.04149],[-76.103391,43.041392],[-76.104151,43.041257],[-76.104642,43.04115],[-76.104874,43.041089],[-76.105115,43.041029],[-76.10533700000001,43.040963],[-76.105808,43.040785],[-76.106295,43.040576],[-76.10641800000001,43.040519],[-76.10656,43.040448],[-76.10715500000001,43.040112],[-76.10751500000001,43.03988],[-76.107731,43.039723],[-76.10788599999999,43.039556],[-76.108121,43.039252],[-76.108819,43.038347],[-76.10932099999999,43.037685],[-76.109391,43.037603],[-76.109864,43.036976],[-76.11000199999999,43.036955],[-76.110271,43.03694],[-76.110468,43.036948],[-76.111009,43.036999],[-76.111108,43.037012],[-76.111221,43.037044],[-76.111475,43.037106],[-76.111796,43.037142],[-76.111954,43.037146],[-76.11229299999999,43.03713],[-76.112774,43.037108],[-76.113946,43.037051],[-76.11403,43.038432],[-76.114244,43.041173],[-76.114277,43.041407],[-76.114302,43.04176],[-76.114536,43.045123],[-76.114521,43.04524]]],"type":"Polygon"}
}