{
  "id": "360810317001",
  "type": "Feature",
  "properties": {
    "area_land":336577,
    "area_water":0,
    "geoid":"360810317001",
    "name":"Block Group 1",
    "state":"ny"
},
  "bbox": [
    -73.896565,
    40.770321,
    -73.88904,
    40.778154
],
  "geometry": {"coordinates":[[[-73.896565,40.776247],[-73.894232,40.778154],[-73.89312099999999,40.777347],[-73.89286199999999,40.777159],[-73.892523,40.777405],[-73.892503,40.777365],[-73.89225399999999,40.777205],[-73.892132,40.777091],[-73.89204100000001,40.776963],[-73.89190000000001,40.776755],[-73.891845,40.776686],[-73.891772,40.776594],[-73.89165199999999,40.776562],[-73.891531,40.776477],[-73.891434,40.776381],[-73.89141600000001,40.776339],[-73.891368,40.776343],[-73.891446,40.776523],[-73.89126400000001,40.776856],[-73.891104,40.777023],[-73.89112,40.777125],[-73.89106700000001,40.777213],[-73.89094900000001,40.777284],[-73.890731,40.777332],[-73.890563,40.777404],[-73.89045900000001,40.77755],[-73.89046500000001,40.777703],[-73.89035199999999,40.7778],[-73.890174,40.777851],[-73.89008699999999,40.777784],[-73.890011,40.777213],[-73.889516,40.775937],[-73.889472,40.775738],[-73.889471,40.775536],[-73.889555,40.775279],[-73.889561,40.775092],[-73.889582,40.775035],[-73.889593,40.774941],[-73.88961399999999,40.774846],[-73.88978899999999,40.774237],[-73.889842,40.7741],[-73.889887,40.774017],[-73.890068,40.773962],[-73.890192,40.773647],[-73.890089,40.773626],[-73.889977,40.773724],[-73.889852,40.773753],[-73.88975000000001,40.773717],[-73.889577,40.773594],[-73.88952399999999,40.773575],[-73.889455,40.773533],[-73.889077,40.773574],[-73.88942400000001,40.773046],[-73.88903999999999,40.770916],[-73.890035,40.77081],[-73.89096600000001,40.770712],[-73.89189500000001,40.770613],[-73.892826,40.770517],[-73.893154,40.770483],[-73.893754,40.770418],[-73.894683,40.770321],[-73.894935,40.771704],[-73.89521999999999,40.771904],[-73.895008,40.772078],[-73.894183,40.772745],[-73.89336900000001,40.773415],[-73.89288999999999,40.773808],[-73.893069,40.773869],[-73.893242,40.773943],[-73.893407,40.774028],[-73.89356100000001,40.774122],[-73.893703,40.774226],[-73.894423,40.774735],[-73.89513100000001,40.775233],[-73.895841,40.775735],[-73.896565,40.776247]]],"type":"Polygon"}
}