{
  "id": "360050380002",
  "type": "Feature",
  "properties": {
    "area_land":34721,
    "area_water":0,
    "geoid":"360050380002",
    "name":"Block Group 2",
    "state":"ny"
},
  "bbox": [
    -73.86163,
    40.877728,
    -73.8586,
    40.879818
],
  "geometry": {"coordinates":[[[-73.861604,40.878956],[-73.86157799999999,40.879207],[-73.86148,40.879818],[-73.8586,40.878954],[-73.858924,40.878366],[-73.859278,40.877728],[-73.86163000000001,40.878482],[-73.861604,40.878956]]],"type":"Polygon"}
}