{
  "id": "360550034002",
  "type": "Feature",
  "properties": {
    "area_land":439589,
    "area_water":3804,
    "geoid":"360550034002",
    "name":"Block Group 2",
    "state":"ny"
},
  "bbox": [
    -77.614526,
    43.133062,
    -77.603742,
    43.140819
],
  "geometry": {"coordinates":[[[-77.614526,43.138402],[-77.614518,43.138502],[-77.61449500000001,43.138595],[-77.614462,43.138686],[-77.614073,43.139501],[-77.610342,43.139623],[-77.61039599999999,43.140665],[-77.60918100000001,43.140699],[-77.608587,43.14072],[-77.607427,43.140764],[-77.606876,43.14078],[-77.605401,43.140819],[-77.60527500000001,43.140808],[-77.605171,43.140788],[-77.60493700000001,43.140707],[-77.605001,43.140585],[-77.603742,43.140203],[-77.604703,43.138456],[-77.605947,43.138852],[-77.606527,43.137811],[-77.60656400000001,43.137746],[-77.606786,43.137357],[-77.60702999999999,43.136903],[-77.607557,43.13593],[-77.607737,43.135169],[-77.608121,43.133188],[-77.608152,43.133062],[-77.608476,43.13311],[-77.608671,43.133145],[-77.608886,43.133195],[-77.60903999999999,43.133237],[-77.60924,43.133301],[-77.609419,43.133372],[-77.609582,43.133444],[-77.609753,43.133533],[-77.61004699999999,43.133707],[-77.610265,43.133811],[-77.610501,43.133909],[-77.61075700000001,43.133989],[-77.61097700000001,43.134035],[-77.61125699999999,43.134076],[-77.611484,43.134103],[-77.611593,43.134121],[-77.61186600000001,43.134184],[-77.612003,43.134228],[-77.61212999999999,43.134275],[-77.61223,43.134322],[-77.61234399999999,43.134383],[-77.61252399999999,43.134496],[-77.612604,43.13454],[-77.612684,43.134568],[-77.612771,43.134588],[-77.61287900000001,43.134598],[-77.61363900000001,43.134566],[-77.61383600000001,43.135299],[-77.613955,43.135667],[-77.61421799999999,43.136483],[-77.61443,43.137171],[-77.61452300000001,43.138292],[-77.614526,43.138402]]],"type":"Polygon"}
}