{
  "id": "360810138002",
  "type": "Feature",
  "properties": {
    "area_land":125629,
    "area_water":0,
    "geoid":"360810138002",
    "name":"Block Group 2",
    "state":"ny"
},
  "bbox": [
    -73.828139,
    40.703656,
    -73.819377,
    40.708145
],
  "geometry": {"coordinates":[[[-73.82813899999999,40.707963],[-73.827124,40.70808],[-73.826532,40.708145],[-73.826104,40.707727],[-73.825101,40.707449],[-73.82404699999999,40.706931],[-73.822979,40.706192],[-73.822845,40.706064],[-73.822256,40.705456],[-73.82201999999999,40.705212],[-73.82177799999999,40.704958],[-73.82125000000001,40.704566],[-73.820739,40.704187],[-73.82023,40.704048],[-73.819694,40.703937],[-73.819377,40.703871],[-73.82028200000001,40.703811],[-73.82154,40.703729],[-73.82245899999999,40.703656],[-73.823438,40.703802],[-73.82444099999999,40.704062],[-73.82450799999999,40.704334],[-73.825655,40.705426],[-73.82574700000001,40.705816],[-73.82691199999999,40.706861],[-73.82746,40.707348],[-73.82813899999999,40.707963]]],"type":"Polygon"}
}