{
  "id": "361019606003",
  "type": "Feature",
  "properties": {
    "area_land":35834116,
    "area_water":556640,
    "geoid":"361019606003",
    "name":"Block Group 3",
    "state":"ny"
},
  "bbox": [
    -77.736813,
    42.281034,
    -77.659964,
    42.378369
],
  "geometry": {"coordinates":[[[-77.736485,42.288231],[-77.735733,42.302931],[-77.735499,42.307488],[-77.73509199999999,42.315422],[-77.735089,42.315535],[-77.735027,42.316868],[-77.73487799999999,42.319706],[-77.734872,42.319844],[-77.734844,42.320369],[-77.73467100000001,42.323799],[-77.734595,42.325359],[-77.73450699999999,42.327215],[-77.734257,42.332251],[-77.734206,42.333262],[-77.73375,42.333816],[-77.733356,42.334274],[-77.732955,42.334715],[-77.732603,42.335103],[-77.731742,42.336128],[-77.731315,42.336611],[-77.73092699999999,42.337013],[-77.730316,42.33775],[-77.72998,42.338172],[-77.729679,42.338599],[-77.72940199999999,42.339028],[-77.729095,42.339414],[-77.728611,42.339989],[-77.72825400000001,42.340456],[-77.727374,42.341655],[-77.72678399999999,42.342479],[-77.726614,42.342716],[-77.725971,42.343608],[-77.72555699999999,42.344179],[-77.72537800000001,42.344412],[-77.72521999999999,42.344632],[-77.724085,42.346079],[-77.72378999999999,42.346474],[-77.723089,42.347315],[-77.72298600000001,42.347433],[-77.722672,42.347796],[-77.721773,42.348764],[-77.720917,42.349653],[-77.719082,42.351253],[-77.71802,42.352122],[-77.71740200000001,42.352567],[-77.71670399999999,42.353093],[-77.715414,42.353977],[-77.714297,42.354701],[-77.713223,42.355366],[-77.708938,42.35813],[-77.70724199999999,42.359198],[-77.705186,42.360535],[-77.70434899999999,42.361069],[-77.703014,42.36197],[-77.701741,42.362787],[-77.701291,42.363067],[-77.70094,42.363289],[-77.700104,42.363798],[-77.699967,42.363876],[-77.69969500000001,42.364033],[-77.699455,42.36416],[-77.69937,42.364203],[-77.69846,42.364664],[-77.697919,42.364913],[-77.69721,42.365215],[-77.695798,42.365739],[-77.69493,42.366014],[-77.694408,42.366166],[-77.693108,42.366491],[-77.69238900000001,42.366646],[-77.691191,42.366844],[-77.690333,42.366961],[-77.68923700000001,42.367072],[-77.687984,42.367165],[-77.687352,42.367216],[-77.687296,42.36722],[-77.686447,42.36729],[-77.685355,42.367374],[-77.684287,42.367505],[-77.684071,42.367538],[-77.683651,42.367617],[-77.68304500000001,42.36774],[-77.68277399999999,42.367799],[-77.682579,42.367851],[-77.68203200000001,42.368],[-77.68181,42.368063],[-77.681348,42.368197],[-77.68105,42.368295],[-77.680755,42.368399],[-77.680387,42.36854],[-77.67974700000001,42.368821],[-77.679205,42.369081],[-77.67886799999999,42.369254],[-77.678183,42.369643],[-77.678077,42.369709],[-77.67777100000001,42.369915],[-77.677724,42.369948],[-77.677536,42.370082],[-77.67729199999999,42.370265],[-77.677204,42.370331],[-77.677119,42.370396],[-77.676828,42.370617],[-77.676638,42.370762],[-77.676222,42.371107],[-77.675819,42.371467],[-77.672842,42.374184],[-77.671587,42.375342],[-77.671189,42.375714],[-77.669905,42.37688],[-77.669506,42.377227],[-77.669004,42.377601],[-77.6687,42.377811],[-77.668037,42.378224],[-77.66778100000001,42.378369],[-77.667804,42.377756],[-77.667923,42.375279],[-77.66816900000001,42.3701],[-77.668323,42.366567],[-77.668362,42.36605],[-77.66836000000001,42.365975],[-77.668076,42.365967],[-77.668048,42.365914],[-77.668021,42.365791],[-77.66794400000001,42.365427],[-77.667728,42.364521],[-77.66751600000001,42.363676],[-77.66749,42.363531],[-77.6675,42.36342],[-77.667545,42.36336],[-77.667511,42.363336],[-77.66683500000001,42.362854],[-77.666113,42.362342],[-77.664643,42.361287],[-77.66460499999999,42.361259],[-77.664328,42.361031],[-77.664072,42.36077],[-77.66389700000001,42.360562],[-77.663704,42.360301],[-77.662919,42.358799],[-77.662172,42.357402],[-77.66182000000001,42.356711],[-77.66177,42.356617],[-77.661072,42.355285],[-77.66028,42.353769],[-77.66025500000001,42.353722],[-77.66013,42.353402],[-77.66001300000001,42.35296],[-77.659982,42.352694],[-77.659964,42.352365],[-77.660054,42.350794],[-77.660237,42.347944],[-77.660282,42.3472],[-77.660329,42.346319],[-77.660386,42.34523],[-77.660428,42.344475],[-77.660459,42.343951],[-77.66048499999999,42.343424],[-77.660529,42.342656],[-77.66062700000001,42.340844],[-77.66072200000001,42.339028],[-77.660757,42.338334],[-77.66176299999999,42.338336],[-77.66203299999999,42.338344],[-77.66220800000001,42.338358],[-77.66242,42.338398],[-77.66249999999999,42.338422],[-77.66264200000001,42.338464],[-77.663375,42.338721],[-77.663978,42.338512],[-77.66435199999999,42.338508],[-77.664748,42.338818],[-77.66478499999999,42.338837],[-77.664846,42.338867],[-77.66497099999999,42.339004],[-77.66501700000001,42.339047],[-77.66540000000001,42.339405],[-77.665713,42.339799],[-77.672139,42.347891],[-77.672183,42.347878],[-77.67218200000001,42.347812],[-77.671165,42.343185],[-77.669798,42.339791],[-77.66976200000001,42.339454],[-77.66948499999999,42.339185],[-77.669207,42.338996],[-77.668184,42.338783],[-77.667793,42.338731],[-77.66775699999999,42.338734],[-77.66743099999999,42.338679],[-77.66719999999999,42.338595],[-77.667063,42.338484],[-77.667091,42.338418],[-77.66710999999999,42.338388],[-77.66722799999999,42.338362],[-77.668498,42.33803],[-77.66921499999999,42.337922],[-77.66965399999999,42.337862],[-77.670404,42.337759],[-77.67122500000001,42.336525],[-77.67253599999999,42.33729],[-77.672611,42.337287],[-77.672757,42.337373],[-77.67280599999999,42.337374],[-77.673044,42.337339],[-77.673648,42.337302],[-77.673785,42.337244],[-77.675009,42.337468],[-77.675315,42.337494],[-77.675541,42.337399],[-77.67660100000001,42.336892],[-77.67744999999999,42.336764],[-77.67745499999999,42.335941],[-77.677429,42.335421],[-77.677453,42.335227],[-77.677182,42.335119],[-77.67701099999999,42.335037],[-77.676543,42.334777],[-77.676457,42.33473],[-77.675377,42.334144],[-77.675156,42.334035],[-77.674874,42.333937],[-77.6747,42.333866],[-77.673868,42.33338],[-77.67349,42.333132],[-77.674829,42.33348],[-77.678871,42.334274],[-77.68212,42.334452],[-77.681507,42.333472],[-77.680842,42.332161],[-77.680808,42.332153],[-77.68057,42.332107],[-77.679078,42.33189],[-77.677361,42.331673],[-77.67673600000001,42.33159],[-77.676413,42.331791],[-77.67609899999999,42.331753],[-77.675642,42.331734],[-77.675551,42.331749],[-77.67528799999999,42.33184],[-77.674683,42.331978],[-77.67412,42.332091],[-77.673813,42.332117],[-77.673682,42.332106],[-77.673518,42.332066],[-77.67325700000001,42.331982],[-77.673181,42.331938],[-77.672681,42.331505],[-77.672377,42.331195],[-77.67230000000001,42.331144],[-77.672155,42.331068],[-77.672045,42.330998],[-77.671925,42.330904],[-77.67152900000001,42.330474],[-77.671442,42.330394],[-77.67133200000001,42.33031],[-77.671176,42.330219],[-77.670457,42.329924],[-77.670423,42.32991],[-77.67046499999999,42.3297],[-77.670475,42.329394],[-77.670575,42.323662],[-77.67057699999999,42.323651],[-77.67107,42.320759],[-77.67067,42.319307],[-77.67067,42.319078],[-77.6709,42.316885],[-77.671344,42.316665],[-77.673511,42.315532],[-77.674072,42.315232],[-77.674218,42.315138],[-77.67437700000001,42.315021],[-77.674521,42.314885],[-77.67552000000001,42.313869],[-77.675701,42.313668],[-77.675816,42.313529],[-77.675923,42.313361],[-77.67602599999999,42.313165],[-77.676256,42.312503],[-77.67646499999999,42.311934],[-77.67660100000001,42.311644],[-77.67674,42.311407],[-77.676982,42.311116],[-77.677224,42.310877],[-77.677408,42.310721],[-77.677682,42.31051],[-77.677802,42.310418],[-77.678102,42.31024],[-77.678489,42.310062],[-77.678839,42.309943],[-77.67898599999999,42.309907],[-77.679241,42.309877],[-77.680179,42.309845],[-77.681603,42.309831],[-77.68268999999999,42.309932],[-77.683711,42.310066],[-77.683924,42.310088],[-77.684225,42.310084],[-77.68513,42.310026],[-77.686397,42.309961],[-77.686814,42.309947],[-77.68701299999999,42.309949],[-77.68750300000001,42.309955],[-77.688208,42.309991],[-77.689374,42.310034],[-77.690068,42.310022],[-77.69038399999999,42.310001],[-77.69085200000001,42.309948],[-77.691517,42.309821],[-77.691722,42.309793],[-77.692238,42.309732],[-77.69256,42.309678],[-77.69405500000001,42.309346],[-77.694457,42.30927],[-77.69469599999999,42.309241],[-77.69503,42.309171],[-77.695359,42.309074],[-77.695931,42.308847],[-77.69637400000001,42.308655],[-77.69662099999999,42.30853],[-77.69687999999999,42.308401],[-77.697197,42.308259],[-77.6983,42.307865],[-77.699138,42.307601],[-77.69986900000001,42.307381],[-77.70019499999999,42.307291],[-77.70052,42.307213],[-77.700835,42.307166],[-77.701244,42.307138],[-77.701825,42.307146],[-77.70214,42.307138],[-77.70243000000001,42.307113],[-77.702566,42.307087],[-77.703901,42.306752],[-77.704509,42.30656],[-77.704898,42.30639],[-77.705493,42.3061],[-77.706748,42.305511],[-77.707104,42.305337],[-77.707577,42.305052],[-77.707848,42.304852],[-77.708192,42.304577],[-77.708527,42.304274],[-77.709377,42.303532],[-77.710117,42.302875],[-77.71051900000001,42.302501],[-77.711118,42.301914],[-77.71138999999999,42.301623],[-77.71154300000001,42.301419],[-77.711733,42.301113],[-77.71203800000001,42.300437],[-77.712093,42.300322],[-77.71225800000001,42.299972],[-77.712322,42.299867],[-77.712603,42.299449],[-77.712778,42.299199],[-77.71321399999999,42.298535],[-77.713413,42.298191],[-77.713515,42.29802],[-77.713695,42.297801],[-77.714159,42.297369],[-77.71434600000001,42.297156],[-77.714403,42.297062],[-77.71446299999999,42.296908],[-77.714652,42.296099],[-77.71474600000001,42.29581],[-77.714901,42.295477],[-77.715042,42.295263],[-77.715219,42.295042],[-77.71541000000001,42.294867],[-77.71557,42.294745],[-77.71570199999999,42.29465],[-77.71587599999999,42.294488],[-77.716007,42.294326],[-77.71608999999999,42.294175],[-77.71611900000001,42.294066],[-77.716143,42.293877],[-77.716129,42.293094],[-77.716138,42.292689],[-77.716156,42.292465],[-77.716313,42.291695],[-77.716319,42.291646],[-77.716431,42.290653],[-77.716567,42.289444],[-77.716595,42.289222],[-77.71670899999999,42.288617],[-77.71701,42.287545],[-77.717225,42.287052],[-77.71735,42.286849],[-77.71744700000001,42.286703],[-77.717716,42.286359],[-77.718034,42.285933],[-77.718214,42.285558],[-77.718479,42.284853],[-77.718993,42.2837],[-77.719402,42.282804],[-77.7197,42.282234],[-77.72018,42.281421],[-77.72030700000001,42.281252],[-77.720501,42.281034],[-77.721311,42.28106],[-77.722683,42.28112],[-77.733285,42.281446],[-77.736813,42.28153],[-77.736485,42.288231]]],"type":"Polygon"}
}