{
  "id": "360594067023",
  "type": "Feature",
  "properties": {
    "area_land":293759,
    "area_water":0,
    "geoid":"360594067023",
    "name":"Block Group 3",
    "state":"ny"
},
  "bbox": [
    -73.63927,
    40.704903,
    -73.631762,
    40.713572
],
  "geometry": {"coordinates":[[[-73.639206,40.707245],[-73.639134,40.707314],[-73.638817,40.707681],[-73.63874199999999,40.70778],[-73.638805,40.707846],[-73.639011,40.708135],[-73.63903000000001,40.708193],[-73.63903000000001,40.70822],[-73.639017,40.708256],[-73.638952,40.708352],[-73.639048,40.708472],[-73.639191,40.708665],[-73.63845000000001,40.709035],[-73.638161,40.709144],[-73.63709900000001,40.709502],[-73.63696,40.709281],[-73.63580899999999,40.711021],[-73.63503300000001,40.712169],[-73.634411,40.713089],[-73.634311,40.713572],[-73.634219,40.713374],[-73.634198,40.71333],[-73.63374,40.712505],[-73.633015,40.711166],[-73.632397,40.710026],[-73.632266,40.70978],[-73.63176199999999,40.708853],[-73.63182399999999,40.708847],[-73.632087,40.708776],[-73.634134,40.708183],[-73.63337900000001,40.70693],[-73.633183,40.706613],[-73.633015,40.706316],[-73.63439200000001,40.705877],[-73.634576,40.70581],[-73.634736,40.705746],[-73.63529800000001,40.705527],[-73.635667,40.705379],[-73.636127,40.705221],[-73.636427,40.705113],[-73.636892,40.704993],[-73.636989,40.704972],[-73.63731300000001,40.704903],[-73.638593,40.706178],[-73.638718,40.706565],[-73.63927,40.707162],[-73.639206,40.707245]]],"type":"Polygon"}
}