{
  "id": "360610134001",
  "type": "Feature",
  "properties": {
    "area_land":17419,
    "area_water":0,
    "geoid":"360610134001",
    "name":"Block Group 1",
    "state":"ny"
},
  "bbox": [
    -73.958255,
    40.77202,
    -73.955553,
    40.7736
],
  "geometry": {"coordinates":[[[-73.95779400000001,40.7736],[-73.95555299999999,40.772654],[-73.95601499999999,40.77202],[-73.95825499999999,40.772965],[-73.95779400000001,40.7736]]],"type":"Polygon"}
}