{
  "id": "360850096023",
  "type": "Feature",
  "properties": {
    "area_land":234894,
    "area_water":0,
    "geoid":"360850096023",
    "name":"Block Group 3",
    "state":"ny"
},
  "bbox": [
    -74.100976,
    40.589227,
    -74.093766,
    40.595365
],
  "geometry": {"coordinates":[[[-74.10083,40.592632],[-74.10081700000001,40.592668],[-74.10074,40.592847],[-74.100641,40.593028],[-74.10053000000001,40.593196],[-74.100415,40.593343],[-74.100067,40.593641],[-74.099796,40.593871],[-74.099492,40.594048],[-74.09902700000001,40.59432],[-74.098738,40.594488],[-74.098069,40.594881],[-74.097987,40.594931],[-74.097221,40.595365],[-74.095568,40.594495],[-74.094686,40.594033],[-74.093766,40.59355],[-74.094285,40.592996],[-74.094795,40.592425],[-74.095302,40.591861],[-74.09581300000001,40.591284],[-74.094195,40.590446],[-74.09517,40.589719],[-74.095826,40.589227],[-74.097933,40.590314],[-74.099722,40.591234],[-74.100976,40.591832],[-74.10083,40.592632]]],"type":"Polygon"}
}