{
  "id": "360239703003",
  "type": "Feature",
  "properties": {
    "area_land":783183,
    "area_water":0,
    "geoid":"360239703003",
    "name":"Block Group 3",
    "state":"ny"
},
  "bbox": [
    -76.195254,
    42.633879,
    -76.182515,
    42.647625
],
  "geometry": {"coordinates":[[[-76.19525400000001,42.639424],[-76.193015,42.639548],[-76.193026,42.640025],[-76.19304200000001,42.640719],[-76.192673,42.640706],[-76.192763,42.642606],[-76.193085,42.642622],[-76.193161,42.642627],[-76.19319400000001,42.643557],[-76.19372199999999,42.643403],[-76.193803,42.643903],[-76.19359,42.643924],[-76.193395,42.643959],[-76.19331099999999,42.644001],[-76.19322,42.644071],[-76.193331,42.64441],[-76.19350300000001,42.644828],[-76.193577,42.644939],[-76.193437,42.64503],[-76.191835,42.646712],[-76.19332,42.647526],[-76.193314,42.647606],[-76.193316,42.647625],[-76.19296199999999,42.647427],[-76.19107700000001,42.646432],[-76.190285,42.646016],[-76.18926500000001,42.645484],[-76.187999,42.644814],[-76.187747,42.644669],[-76.18705,42.644225],[-76.18525,42.643024],[-76.184629,42.642629],[-76.18306200000001,42.641686],[-76.18279,42.641522],[-76.182592,42.641403],[-76.182515,42.641356],[-76.182592,42.64097],[-76.18270200000001,42.640492],[-76.18275300000001,42.640151],[-76.182829,42.639642],[-76.182858,42.639122],[-76.18294899999999,42.638195],[-76.18310200000001,42.63687],[-76.183155,42.636868],[-76.183544,42.63685],[-76.18415899999999,42.636822],[-76.18652,42.636698],[-76.1875,42.636655],[-76.18807200000001,42.636617],[-76.189273,42.636566],[-76.19006400000001,42.636527],[-76.19038399999999,42.636564],[-76.190611,42.635779],[-76.19095799999999,42.634497],[-76.191091,42.633952],[-76.19222499999999,42.633879],[-76.19170200000001,42.637831],[-76.19446499999999,42.637745],[-76.19505700000001,42.637747],[-76.19524199999999,42.639321],[-76.19525400000001,42.639424]]],"type":"Polygon"}
}