{
  "id": "360593001002",
  "type": "Feature",
  "properties": {
    "area_land":1997930,
    "area_water":2106896,
    "geoid":"360593001002",
    "name":"Block Group 2",
    "state":"ny"
},
  "bbox": [
    -73.742026,
    40.799501,
    -73.709416,
    40.833248
],
  "geometry": {"coordinates":[[[-73.741997,40.820479],[-73.741517,40.821372],[-73.739983,40.822677],[-73.739954,40.823203],[-73.74022600000001,40.823729],[-73.74037800000001,40.824599],[-73.740379,40.825216],[-73.74011,40.826338],[-73.740351,40.826658],[-73.74023099999999,40.827001],[-73.73969,40.827528],[-73.739118,40.827757],[-73.738877,40.82794],[-73.73746,40.828344],[-73.73358500000001,40.833248],[-73.720275,40.8285],[-73.718334,40.825957],[-73.71705300000001,40.824279],[-73.711575,40.8171],[-73.711973,40.80973],[-73.711975,40.8097],[-73.71215100000001,40.808036],[-73.712247,40.80642],[-73.712253,40.806284],[-73.712327,40.804692],[-73.712356,40.804359],[-73.712399,40.803873],[-73.71145799999999,40.803873],[-73.711517,40.802736],[-73.711567,40.801907],[-73.711197,40.800093],[-73.709416,40.799779],[-73.711575,40.799501],[-73.712175,40.801101],[-73.712575,40.8019],[-73.714144,40.801262],[-73.715025,40.801332],[-73.71780200000001,40.800652],[-73.718119,40.800685],[-73.718305,40.800634],[-73.718503,40.800781],[-73.718695,40.800839],[-73.719224,40.800974],[-73.71921500000001,40.801015],[-73.71914700000001,40.801336],[-73.719138,40.801377],[-73.719138,40.801443],[-73.719182,40.801737],[-73.719356,40.802822],[-73.719472,40.803436],[-73.719503,40.803533],[-73.720697,40.803406],[-73.72158899999999,40.803576],[-73.721683,40.804066],[-73.72084700000001,40.804727],[-73.72166199999999,40.8052],[-73.721718,40.805319],[-73.721863,40.806077],[-73.721926,40.806496],[-73.72283400000001,40.806316],[-73.72304200000001,40.807405],[-73.72331,40.807387],[-73.72411700000001,40.807306],[-73.725009,40.807218],[-73.725185,40.807203],[-73.725902,40.807131],[-73.726433,40.807085],[-73.726968,40.807026],[-73.726996,40.807253],[-73.727025,40.807789],[-73.727091,40.80874],[-73.727142,40.809588],[-73.72686299999999,40.809603],[-73.726083,40.809601],[-73.72588,40.809619],[-73.725711,40.80965],[-73.724594,40.809822],[-73.72430799999999,40.809857],[-73.723105,40.809975],[-73.722526,40.810045],[-73.721543,40.810144],[-73.721355,40.810185],[-73.721225,40.810226],[-73.72079100000001,40.810409],[-73.720625,40.810456],[-73.721791,40.811459],[-73.72214700000001,40.811817],[-73.722269,40.811996],[-73.72235499999999,40.812166],[-73.722416,40.812337],[-73.722483,40.8126],[-73.722562,40.813054],[-73.722792,40.814308],[-73.72308,40.815818],[-73.723204,40.816508],[-73.72334600000001,40.817197],[-73.72336300000001,40.817343],[-73.723341,40.817515],[-73.723276,40.817707],[-73.72341900000001,40.817678],[-73.723466,40.817678],[-73.72355,40.817659],[-73.723986,40.817599],[-73.72454,40.817518],[-73.72491599999999,40.817448],[-73.725292,40.817402],[-73.725853,40.817315],[-73.725943,40.817297],[-73.726304,40.817254],[-73.72699799999999,40.817145],[-73.72753299999999,40.817075],[-73.727649,40.817084],[-73.72779300000001,40.817112],[-73.728039,40.817178],[-73.728111,40.817189],[-73.72850099999999,40.817179],[-73.72876100000001,40.817141],[-73.728819,40.817139],[-73.72905299999999,40.817156],[-73.728809,40.817251],[-73.72868800000001,40.81735],[-73.728565,40.817511],[-73.728459,40.817731],[-73.728408,40.817917],[-73.728414,40.818142],[-73.728435,40.818285],[-73.72859200000001,40.819028],[-73.728735,40.819181],[-73.72877800000001,40.819329],[-73.72877699999999,40.819516],[-73.728762,40.819581],[-73.728711,40.819745],[-73.728634,40.819917],[-73.728742,40.82018],[-73.728864,40.820422],[-73.72901400000001,40.820674],[-73.72919,40.820916],[-73.729359,40.82112],[-73.729518,40.821285],[-73.729911,40.821641],[-73.730464,40.821322],[-73.730515,40.821293],[-73.73071299999999,40.821198],[-73.730761,40.821175],[-73.731022,40.82108],[-73.73142,40.820993],[-73.731544,40.820974],[-73.732027,40.820865],[-73.732111,40.820842],[-73.732432,40.820754],[-73.732823,40.820626],[-73.733975,40.820272],[-73.734385,40.820141],[-73.73450099999999,40.820092],[-73.73469,40.819974],[-73.734932,40.819762],[-73.73511999999999,40.819961],[-73.73545900000001,40.820647],[-73.736588,40.823201],[-73.73674699999999,40.823612],[-73.737116,40.824511],[-73.737302,40.824566],[-73.737475,40.824602],[-73.738833,40.824798],[-73.738855,40.824661],[-73.738855,40.824529],[-73.738831,40.824419],[-73.73860500000001,40.823891],[-73.738519,40.823661],[-73.738347,40.823276],[-73.738326,40.823187],[-73.73843599999999,40.823023],[-73.738559,40.822804],[-73.73871200000001,40.822486],[-73.73882500000001,40.822278],[-73.73889699999999,40.822171],[-73.739115,40.821979],[-73.739428,40.821731],[-73.74059,40.820767],[-73.74063700000001,40.820718],[-73.74067700000001,40.820641],[-73.740667,40.820537],[-73.740638,40.820471],[-73.739964,40.819198],[-73.740115,40.819146],[-73.74043,40.819061],[-73.74047299999999,40.819053],[-73.741392,40.818901],[-73.741332,40.819313],[-73.742026,40.819998],[-73.741997,40.820479]]],"type":"Polygon"}
}