{
  "id": "360595178013",
  "type": "Feature",
  "properties": {
    "area_land":10637777,
    "area_water":84282,
    "geoid":"360595178013",
    "name":"Block Group 3",
    "state":"ny"
},
  "bbox": [
    -73.604889,
    40.844793,
    -73.541245,
    40.887998
],
  "geometry": {"coordinates":[[[-73.604889,40.870629],[-73.59868299999999,40.874234],[-73.597742,40.874802],[-73.596647,40.874392],[-73.596236,40.874291],[-73.595952,40.874293],[-73.595974,40.875072],[-73.596121,40.875573],[-73.595085,40.876139],[-73.591358,40.877369],[-73.586359,40.878186],[-73.584779,40.878405],[-73.581564,40.878777],[-73.58135900000001,40.878715],[-73.580979,40.878636],[-73.580412,40.87857],[-73.579866,40.878511],[-73.579798,40.878504],[-73.579014,40.878321],[-73.578633,40.87823],[-73.57849400000001,40.878182],[-73.57835,40.878118],[-73.577979,40.877975],[-73.577765,40.877855],[-73.57759,40.87767],[-73.577516,40.877607],[-73.577331,40.87738],[-73.577184,40.877139],[-73.576981,40.876856],[-73.576678,40.876297],[-73.576521,40.876106],[-73.57606,40.87554],[-73.57579200000001,40.875224],[-73.575515,40.874895],[-73.57510000000001,40.874435],[-73.57438500000001,40.874806],[-73.57355800000001,40.875258],[-73.573267,40.875381],[-73.573108,40.87541],[-73.572891,40.875409],[-73.572703,40.875387],[-73.572429,40.875325],[-73.57214,40.875247],[-73.571996,40.87522],[-73.571692,40.87518],[-73.571331,40.875173],[-73.57040499999999,40.875175],[-73.57010099999999,40.875147],[-73.569784,40.875091],[-73.569495,40.875051],[-73.569205,40.875044],[-73.569104,40.87505],[-73.568771,40.875098],[-73.568597,40.875144],[-73.56850300000001,40.875185],[-73.568383,40.875272],[-73.568288,40.875379],[-73.56815,40.875573],[-73.568088,40.875684],[-73.568018,40.875792],[-73.56795200000001,40.875938],[-73.567911,40.876088],[-73.567871,40.876747],[-73.567898,40.877054],[-73.567954,40.877307],[-73.567953,40.877417],[-73.567747,40.877921],[-73.567718,40.878031],[-73.567724,40.878184],[-73.567745,40.878272],[-73.567791,40.878382],[-73.56787,40.878528],[-73.568003,40.878679],[-73.56573899999999,40.878462],[-73.5656,40.878447],[-73.565611,40.878606],[-73.565555,40.878788],[-73.56540099999999,40.878914],[-73.56514900000001,40.87918],[-73.565079,40.879264],[-73.565093,40.879376],[-73.565219,40.879545],[-73.56526100000001,40.879601],[-73.565275,40.879699],[-73.565275,40.879797],[-73.56528900000001,40.879839],[-73.56542899999999,40.879895],[-73.565611,40.879923],[-73.56575100000001,40.879923],[-73.565843,40.879913],[-73.566017,40.879895],[-73.566129,40.879895],[-73.566199,40.879965],[-73.566199,40.880007],[-73.566185,40.880119],[-73.56593700000001,40.880717],[-73.56564899999999,40.881417],[-73.565594,40.881548],[-73.56550300000001,40.881768],[-73.56489000000001,40.881625],[-73.564769,40.88167],[-73.56455800000001,40.882013],[-73.564255,40.883134],[-73.563924,40.883203],[-73.563562,40.88302],[-73.56329100000001,40.883134],[-73.56314,40.883408],[-73.56304900000001,40.884117],[-73.562747,40.884437],[-73.56262599999999,40.884689],[-73.562506,40.884712],[-73.56238399999999,40.885398],[-73.562746,40.885673],[-73.563017,40.886062],[-73.56316700000001,40.886428],[-73.56367899999999,40.887252],[-73.56407,40.88755],[-73.56405700000001,40.887645],[-73.56350399999999,40.887558],[-73.56269399999999,40.887486],[-73.562607,40.887483],[-73.562507,40.887487],[-73.562343,40.887408],[-73.56208100000001,40.887265],[-73.561937,40.887212],[-73.561835,40.887195],[-73.561705,40.887189],[-73.561532,40.887199],[-73.560902,40.887293],[-73.560322,40.887387],[-73.559862,40.887498],[-73.55972800000001,40.887544],[-73.559173,40.887841],[-73.559046,40.887895],[-73.55869800000001,40.887976],[-73.55851,40.887998],[-73.55839400000001,40.887997],[-73.558221,40.887977],[-73.558048,40.887922],[-73.55744199999999,40.887543],[-73.557284,40.887466],[-73.557233,40.887448],[-73.557125,40.88741],[-73.556634,40.887288],[-73.55611399999999,40.887179],[-73.555013,40.88702],[-73.554495,40.886936],[-73.554293,40.886889],[-73.554134,40.886839],[-73.55397600000001,40.886767],[-73.553572,40.88654],[-73.553298,40.886364],[-73.55318,40.886262],[-73.553076,40.886132],[-73.552847,40.885736],[-73.55265,40.885439],[-73.552488,40.885274],[-73.55223700000001,40.885064],[-73.551776,40.884656],[-73.551608,40.88448],[-73.551547,40.884381],[-73.551483,40.884205],[-73.551311,40.883501],[-73.551304,40.883414],[-73.551323,40.883238],[-73.551394,40.882898],[-73.55140299999999,40.882711],[-73.551321,40.882414],[-73.551226,40.882179],[-73.551179,40.882096],[-73.551061,40.881919],[-73.55089599999999,40.88171],[-73.55074500000001,40.881556],[-73.550529,40.88139],[-73.550209,40.881172],[-73.549668,40.88086],[-73.549553,40.880802],[-73.54949499999999,40.880783],[-73.549409,40.880766],[-73.549336,40.880763],[-73.54919200000001,40.880781],[-73.549065,40.880822],[-73.548934,40.880887],[-73.54871300000001,40.881032],[-73.548582,40.881103],[-73.548241,40.881252],[-73.547828,40.881396],[-73.547422,40.88151],[-73.54726599999999,40.881572],[-73.54715299999999,40.88163],[-73.546892,40.881796],[-73.546601,40.881998],[-73.54624099999999,40.882282],[-73.54593300000001,40.882473],[-73.54559999999999,40.882715],[-73.545025,40.882728],[-73.54486199999999,40.882895],[-73.543978,40.881493],[-73.543389,40.880388],[-73.541894,40.877683],[-73.541566,40.876897],[-73.542546,40.876423],[-73.542492,40.876341],[-73.54244199999999,40.876226],[-73.54239699999999,40.87605],[-73.542404,40.875854],[-73.542405,40.87582],[-73.542399,40.875732],[-73.54234700000001,40.875571],[-73.542332,40.875523],[-73.542231,40.875355],[-73.541995,40.875074],[-73.541736,40.874807],[-73.541417,40.874513],[-73.541454,40.874378],[-73.541438,40.874247],[-73.541419,40.874097],[-73.54128799999999,40.873801],[-73.541274,40.873735],[-73.541274,40.873614],[-73.54133400000001,40.87334],[-73.541343,40.873065],[-73.54132300000001,40.872876],[-73.541273,40.872725],[-73.541245,40.872587],[-73.541246,40.872477],[-73.54126100000001,40.87239],[-73.541354,40.872083],[-73.54148600000001,40.871754],[-73.54184100000001,40.870801],[-73.54186900000001,40.870723],[-73.541968,40.870493],[-73.54221699999999,40.869797],[-73.542241,40.869759],[-73.54224499999999,40.869715],[-73.542322,40.869484],[-73.542439,40.86916],[-73.542607,40.868696],[-73.54286399999999,40.867961],[-73.543027,40.867559],[-73.543149,40.867613],[-73.54323599999999,40.867627],[-73.543688,40.867772],[-73.54402899999999,40.867877],[-73.544213,40.867921],[-73.54439000000001,40.867969],[-73.54472199999999,40.868028],[-73.54489599999999,40.868045],[-73.54553199999999,40.868075],[-73.54589300000001,40.868104],[-73.546645,40.868206],[-73.547454,40.868291],[-73.547721,40.868329],[-73.54785099999999,40.868356],[-73.54789100000001,40.868381],[-73.547956,40.868433],[-73.548096,40.868519],[-73.548233,40.868651],[-73.548322,40.868772],[-73.548451,40.869015],[-73.548637,40.869275],[-73.548676,40.869339],[-73.548766,40.869422],[-73.549496,40.869963],[-73.549795,40.870202],[-73.54984899999999,40.870239],[-73.550089,40.870613],[-73.550442,40.871262],[-73.550546,40.871438],[-73.55071100000001,40.87168],[-73.55090800000001,40.871901],[-73.551323,40.872259],[-73.551506,40.872153],[-73.551637,40.872107],[-73.551956,40.871946],[-73.552724,40.871522],[-73.55370499999999,40.870995],[-73.55401000000001,40.870845],[-73.55422799999999,40.870758],[-73.554474,40.870685],[-73.554575,40.870669],[-73.555285,40.870589],[-73.55548400000001,40.870572],[-73.55617100000001,40.870496],[-73.55643499999999,40.870451],[-73.556783,40.870364],[-73.55705399999999,40.870277],[-73.55714500000001,40.870248],[-73.55784,40.869986],[-73.55802199999999,40.869912],[-73.55855200000001,40.869701],[-73.558858,40.869608],[-73.558943,40.869582],[-73.55920399999999,40.869528],[-73.560253,40.869408],[-73.562425,40.864881],[-73.56491,40.858996],[-73.568225,40.858424],[-73.56829500000001,40.858183],[-73.568405,40.857942],[-73.568806,40.857236],[-73.56884700000001,40.857186],[-73.568859,40.857131],[-73.568895,40.857065],[-73.569356,40.856277],[-73.569451,40.856079],[-73.56953,40.855883],[-73.569862,40.855115],[-73.56998299999999,40.854896],[-73.570048,40.854808],[-73.570183,40.854666],[-73.570627,40.854261],[-73.570697,40.85419],[-73.570758,40.85413],[-73.57082699999999,40.854053],[-73.570896,40.853955],[-73.570999,40.853736],[-73.571117,40.853396],[-73.571231,40.853111],[-73.57137,40.85287],[-73.571483,40.852727],[-73.571624,40.852596],[-73.571817,40.852457],[-73.572118,40.852282],[-73.572952,40.851915],[-73.573604,40.851615],[-73.57386700000001,40.851461],[-73.573938,40.851413],[-73.57404,40.851364],[-73.57458800000001,40.851007],[-73.57519600000001,40.850637],[-73.575504,40.850479],[-73.575813,40.850321],[-73.57751500000001,40.849609],[-73.57765499999999,40.849541],[-73.57792000000001,40.849424],[-73.578513,40.84909],[-73.578627,40.849021],[-73.578776,40.848969],[-73.579475,40.848651],[-73.57970400000001,40.848514],[-73.580027,40.848271],[-73.58025600000001,40.848118],[-73.580462,40.84802],[-73.580806,40.847885],[-73.580879,40.847857],[-73.581028,40.847783],[-73.581118,40.847729],[-73.581457,40.847479],[-73.581715,40.847166],[-73.58200600000001,40.846903],[-73.582184,40.846728],[-73.58267499999999,40.84617],[-73.582939,40.845989],[-73.583187,40.845856],[-73.58437499999999,40.845394],[-73.585846,40.844793],[-73.585936,40.844886],[-73.586219,40.845304],[-73.586455,40.84569],[-73.58662,40.846009],[-73.58691899999999,40.846646],[-73.587062,40.846899],[-73.58713,40.846987],[-73.587249,40.847109],[-73.587551,40.847373],[-73.587727,40.84755],[-73.588053,40.847957],[-73.58815,40.8481],[-73.588202,40.848211],[-73.588239,40.848259],[-73.588264,40.848314],[-73.588328,40.84849],[-73.588384,40.848798],[-73.58840499999999,40.849018],[-73.588475,40.850423],[-73.58851,40.850709],[-73.588588,40.850984],[-73.58891,40.851809],[-73.58904,40.852116],[-73.589564,40.853205],[-73.589617,40.853301],[-73.58966100000001,40.853381],[-73.589808,40.853612],[-73.58988600000001,40.853777],[-73.590053,40.854293],[-73.590136,40.854588],[-73.590248,40.855035],[-73.590693,40.856978],[-73.590712,40.857062],[-73.590751,40.857209],[-73.59079699999999,40.857378],[-73.590853,40.857645],[-73.590924,40.857887],[-73.59099500000001,40.858063],[-73.591109,40.85825],[-73.59123099999999,40.858404],[-73.59159699999999,40.858825],[-73.591723,40.859004],[-73.591855,40.859276],[-73.59191199999999,40.85943],[-73.591936,40.859706],[-73.59207499999999,40.859903],[-73.592225,40.860323],[-73.592513,40.860988],[-73.59256999999999,40.861181],[-73.59258699999999,40.8614],[-73.592547,40.86196],[-73.59254199999999,40.862172],[-73.59253,40.86235],[-73.592522,40.863041],[-73.592556,40.86339],[-73.592663,40.863624],[-73.593086,40.8643],[-73.593148,40.864383],[-73.59323999999999,40.864559],[-73.59366799999999,40.865274],[-73.59375799999999,40.865607],[-73.593779,40.86573],[-73.59381,40.865966],[-73.597078,40.867211],[-73.598859,40.867991],[-73.604889,40.870629]]],"type":"Polygon"}
}