{
  "id": "360670112423",
  "type": "Feature",
  "properties": {
    "area_land":889995,
    "area_water":0,
    "geoid":"360670112423",
    "name":"Block Group 3",
    "state":"ny"
},
  "bbox": [
    -76.150799,
    43.156565,
    -76.139213,
    43.167915
],
  "geometry": {"coordinates":[[[-76.15079900000001,43.167915],[-76.150102,43.167908],[-76.14970099999999,43.16786],[-76.14937399999999,43.167799],[-76.14898100000001,43.167699],[-76.148759,43.167626],[-76.148383,43.167469],[-76.147981,43.167278],[-76.14761900000001,43.167157],[-76.147364,43.167098],[-76.147037,43.167049],[-76.146457,43.166973],[-76.14627400000001,43.166917],[-76.146117,43.166842],[-76.14591799999999,43.16672],[-76.14580599999999,43.166622],[-76.145526,43.166274],[-76.14538400000001,43.166081],[-76.14524299999999,43.165951],[-76.145034,43.165824],[-76.144825,43.16574],[-76.144553,43.165676],[-76.144429,43.165659],[-76.14409499999999,43.165609],[-76.143738,43.165582],[-76.14337500000001,43.165568],[-76.143169,43.165574],[-76.142619,43.165601],[-76.14203999999999,43.165649],[-76.14179,43.165669],[-76.141306,43.165696],[-76.141142,43.165692],[-76.140947,43.165658],[-76.140715,43.165579],[-76.140529,43.165483],[-76.140299,43.165262],[-76.140072,43.165],[-76.139877,43.164732],[-76.139703,43.164469],[-76.139521,43.164152],[-76.139313,43.163683],[-76.139222,43.163382],[-76.139216,43.163318],[-76.139213,43.163108],[-76.13923800000001,43.162956],[-76.139518,43.162305],[-76.139599,43.161972],[-76.139608,43.161906],[-76.139606,43.161731],[-76.139588,43.161586],[-76.139546,43.16148],[-76.13941,43.161293],[-76.140141,43.160919],[-76.14028500000001,43.16083],[-76.140336,43.160766],[-76.140351,43.16071],[-76.140342,43.16059],[-76.140202,43.160221],[-76.14017699999999,43.160089],[-76.140052,43.158197],[-76.140075,43.158143],[-76.140123,43.158099],[-76.140213,43.158061],[-76.140377,43.158045],[-76.140665,43.158031],[-76.140812,43.157992],[-76.14098300000001,43.157898],[-76.141066,43.157841],[-76.14114600000001,43.157738],[-76.141188,43.157616],[-76.14120200000001,43.157454],[-76.14114600000001,43.156753],[-76.14173700000001,43.156723],[-76.142314,43.156694],[-76.14393200000001,43.156602],[-76.144625,43.156568],[-76.144873,43.156565],[-76.14521999999999,43.156577],[-76.145561,43.156616],[-76.145972,43.156703],[-76.146233,43.156791],[-76.14721,43.157188],[-76.148605,43.157782],[-76.15039299999999,43.158525],[-76.150295,43.158825],[-76.150263,43.159102],[-76.150294,43.159685],[-76.15033099999999,43.160207],[-76.150369,43.160738],[-76.150384,43.16095],[-76.150417,43.161514],[-76.150463,43.162199],[-76.150547,43.163515],[-76.150648,43.165337],[-76.15079900000001,43.167915]]],"type":"Polygon"}
}