{
  "id": "360470523003",
  "type": "Feature",
  "properties": {
    "area_land":38476,
    "area_water":0,
    "geoid":"360470523003",
    "name":"Block Group 3",
    "state":"ny"
},
  "bbox": [
    -73.962035,
    40.710004,
    -73.959064,
    40.712713
],
  "geometry": {"coordinates":[[[-73.961962,40.710488],[-73.961905,40.71058],[-73.96181,40.710737],[-73.961421,40.711349],[-73.961029,40.711969],[-73.960561,40.712713],[-73.959064,40.712166],[-73.95953299999999,40.711424],[-73.959943,40.710787],[-73.960177,40.71038],[-73.960195,40.710355],[-73.960217,40.710333],[-73.960244,40.710315],[-73.960274,40.710299],[-73.960308,40.710288],[-73.960425,40.71027],[-73.960644,40.710274],[-73.960324,40.710132],[-73.960381,40.710004],[-73.96059700000001,40.71011],[-73.960702,40.710135],[-73.96081599999999,40.71016],[-73.961123,40.710227],[-73.961303,40.710285],[-73.96124399999999,40.710111],[-73.961462,40.710179],[-73.962035,40.710362],[-73.961962,40.710488]]],"type":"Polygon"}
}