{
  "id": "360470550002",
  "type": "Feature",
  "properties": {
    "area_land":68161,
    "area_water":0,
    "geoid":"360470550002",
    "name":"Block Group 2",
    "state":"ny"
},
  "bbox": [
    -73.953192,
    40.606349,
    -73.949837,
    40.609125
],
  "geometry": {"coordinates":[[[-73.953192,40.608807],[-73.952158,40.608921],[-73.951229,40.609023],[-73.950299,40.609125],[-73.949837,40.606667],[-73.95076400000001,40.606565],[-73.951691,40.606462],[-73.952724,40.606349],[-73.953192,40.608807]]],"type":"Polygon"}
}