{
  "id": "361090014001",
  "type": "Feature",
  "properties": {
    "area_land":8462007,
    "area_water":227226,
    "geoid":"361090014001",
    "name":"Block Group 1",
    "state":"ny"
},
  "bbox": [
    -76.442464,
    42.4528,
    -76.37098,
    42.496252
],
  "geometry": {"coordinates":[[[-76.442464,42.462608],[-76.44223,42.463832],[-76.441823,42.464437],[-76.441204,42.465062],[-76.440686,42.465083],[-76.43929199999999,42.464817],[-76.437713,42.464428],[-76.436826,42.464216],[-76.436571,42.464368],[-76.436048,42.465391],[-76.435619,42.46586],[-76.434878,42.466144],[-76.434657,42.466224],[-76.4342,42.466388],[-76.433755,42.466239],[-76.433216,42.465685],[-76.43302199999999,42.465408],[-76.43274700000001,42.46526],[-76.432366,42.465269],[-76.43195299999999,42.465555],[-76.431082,42.465973],[-76.43035500000001,42.466203],[-76.430183,42.466636],[-76.430336,42.467252],[-76.430458,42.467425],[-76.430115,42.467678],[-76.42952099999999,42.4679],[-76.429074,42.467959],[-76.428783,42.467894],[-76.42856500000001,42.467845],[-76.428147,42.467604],[-76.42796199999999,42.46702],[-76.427712,42.46649],[-76.42750100000001,42.465991],[-76.426928,42.464962],[-76.42690399999999,42.464919],[-76.426624,42.464611],[-76.425952,42.464473],[-76.425647,42.464411],[-76.42440499999999,42.464639],[-76.423706,42.465126],[-76.423745,42.465575],[-76.424029,42.465949],[-76.424294,42.466296],[-76.42462500000001,42.467088],[-76.424463,42.467526],[-76.424244,42.467723],[-76.424459,42.468213],[-76.42531200000001,42.468778],[-76.426089,42.469204],[-76.426597,42.46995],[-76.426607,42.470442],[-76.426171,42.470589],[-76.425957,42.470662],[-76.42491099999999,42.470528],[-76.423956,42.470184],[-76.423024,42.469854],[-76.42230499999999,42.46982],[-76.42138300000001,42.470003],[-76.420682,42.470326],[-76.419845,42.471586],[-76.41968199999999,42.471707],[-76.41919300000001,42.47206],[-76.41872499999999,42.472092],[-76.41847799999999,42.472113],[-76.417232,42.472188],[-76.416088,42.471535],[-76.41533800000001,42.471381],[-76.414573,42.471362],[-76.414384,42.471862],[-76.414242,42.472194],[-76.41425099999999,42.472251],[-76.41429599999999,42.472466],[-76.414343,42.472772],[-76.414483,42.473685],[-76.414613,42.47474],[-76.414365,42.475395],[-76.41403800000001,42.475791],[-76.413662,42.476016],[-76.413134,42.476189],[-76.412475,42.476199],[-76.412195,42.4761],[-76.41099199999999,42.475879],[-76.408894,42.475673],[-76.40780700000001,42.475653],[-76.407242,42.475831],[-76.407133,42.475865],[-76.40678200000001,42.47606],[-76.406295,42.476369],[-76.40606,42.476481],[-76.40603,42.476498],[-76.40607300000001,42.476601],[-76.40625,42.47703],[-76.406299,42.477588],[-76.40634799999999,42.477979],[-76.40642699999999,42.478375],[-76.40655,42.478868],[-76.406615,42.479102],[-76.406688,42.479335],[-76.406751,42.479514],[-76.406949,42.480142],[-76.407476,42.481739],[-76.407883,42.482945],[-76.407956,42.483174],[-76.408,42.483295],[-76.40805899999999,42.483533],[-76.408103,42.483771],[-76.40813,42.484009],[-76.40816599999999,42.484193],[-76.40822900000001,42.484364],[-76.408354,42.484641],[-76.40844800000001,42.48482],[-76.40866800000001,42.485272],[-76.408714,42.485375],[-76.40878600000001,42.485568],[-76.408816,42.485639],[-76.408868,42.485765],[-76.40888699999999,42.485814],[-76.40896600000001,42.485994],[-76.409145,42.486347],[-76.40916900000001,42.486405],[-76.409626,42.487215],[-76.40935500000001,42.487223],[-76.40860000000001,42.487236],[-76.408449,42.487242],[-76.40804799999999,42.487257],[-76.406391,42.487304],[-76.40435600000001,42.48737],[-76.404026,42.487382],[-76.401264,42.487479],[-76.400598,42.487506],[-76.39810900000001,42.487585],[-76.397232,42.487619],[-76.3946,42.487708],[-76.392629,42.487774],[-76.392127,42.487793],[-76.390428,42.487841],[-76.389413,42.487876],[-76.387871,42.487935],[-76.385488,42.488015],[-76.38498,42.488033],[-76.384919,42.488038],[-76.384856,42.488048],[-76.384415,42.488207],[-76.38435200000001,42.488232],[-76.383371,42.488615],[-76.38271899999999,42.48888],[-76.382257,42.489057],[-76.38199400000001,42.489145],[-76.381553,42.489263],[-76.38082900000001,42.489449],[-76.38067100000001,42.48949],[-76.380359,42.489575],[-76.379594,42.489809],[-76.378468,42.490169],[-76.37797999999999,42.490333],[-76.37743399999999,42.490524],[-76.376451,42.490937],[-76.37611699999999,42.491085],[-76.375968,42.491159],[-76.375829,42.491241],[-76.375704,42.491337],[-76.37555399999999,42.491474],[-76.375388,42.491688],[-76.374486,42.492991],[-76.374126,42.4935],[-76.373682,42.49414],[-76.37347800000001,42.49443],[-76.37333,42.49463],[-76.373278,42.494698],[-76.373172,42.494821],[-76.373136,42.494858],[-76.373092,42.494908],[-76.37299299999999,42.495008],[-76.372843,42.495136],[-76.372591,42.495324],[-76.372241,42.495544],[-76.37191,42.495741],[-76.371628,42.495919],[-76.371537,42.495976],[-76.37141099999999,42.496045],[-76.37098,42.496252],[-76.371098,42.495994],[-76.37120899999999,42.495732],[-76.371318,42.495491],[-76.371376,42.495361],[-76.371399,42.495311],[-76.371413,42.495279],[-76.37156299999999,42.49494],[-76.371673,42.494718],[-76.371799,42.494487],[-76.371978,42.49421],[-76.372074,42.494074],[-76.37217699999999,42.49391],[-76.372394,42.493601],[-76.374263,42.491138],[-76.374295,42.491057],[-76.37426499999999,42.491017],[-76.37422599999999,42.49051],[-76.374207,42.490268],[-76.37417600000001,42.489955],[-76.37412500000001,42.489289],[-76.374082,42.488628],[-76.374033,42.487904],[-76.373929,42.485344],[-76.373921,42.485145],[-76.373853,42.483709],[-76.37382599999999,42.483138],[-76.37381600000001,42.482922],[-76.37379,42.482598],[-76.373695,42.48137],[-76.373678,42.481023],[-76.373668,42.480907],[-76.37366400000001,42.480731],[-76.374844,42.480469],[-76.375614,42.480293],[-76.375908,42.480213],[-76.376273,42.4801],[-76.376508,42.480026],[-76.379471,42.478962],[-76.380639,42.478554],[-76.382074,42.478061],[-76.384445,42.47724],[-76.386651,42.476462],[-76.38688500000001,42.476382],[-76.387078,42.476312],[-76.387193,42.476273],[-76.38744199999999,42.476199],[-76.387714,42.476119],[-76.388465,42.475865],[-76.38853899999999,42.475846],[-76.38952399999999,42.475532],[-76.390406,42.47523],[-76.390917,42.475074],[-76.391572,42.47485],[-76.393173,42.474308],[-76.393247,42.474276],[-76.394462,42.473847],[-76.395929,42.473311],[-76.39704999999999,42.472901],[-76.39712299999999,42.472869],[-76.39755,42.472715],[-76.398594,42.472315],[-76.39879999999999,42.472238],[-76.399643,42.471924],[-76.39971799999999,42.471892],[-76.400657,42.471542],[-76.400732,42.47151],[-76.40108600000001,42.471377],[-76.40136200000001,42.471273],[-76.40143500000001,42.47124],[-76.40175600000001,42.471115],[-76.402142,42.47097],[-76.402788,42.470728],[-76.402992,42.470648],[-76.403429,42.470477],[-76.404245,42.470166],[-76.404391,42.47011],[-76.405535,42.469641],[-76.40622500000001,42.469401],[-76.406783,42.469207],[-76.407488,42.468996],[-76.40804900000001,42.46887],[-76.40842499999999,42.468786],[-76.408688,42.468748],[-76.408828,42.468627],[-76.408931,42.468539],[-76.40901700000001,42.468436],[-76.40910700000001,42.468339],[-76.409235,42.468229],[-76.40946,42.46806],[-76.409958,42.467811],[-76.411112,42.467303],[-76.410804,42.467046],[-76.410473,42.466752],[-76.41040599999999,42.466699],[-76.409305,42.465678],[-76.40841399999999,42.464851],[-76.40800400000001,42.464459],[-76.407481,42.463944],[-76.407016,42.463446],[-76.406342,42.462724],[-76.404304,42.46047],[-76.40405699999999,42.460149],[-76.40213799999999,42.457097],[-76.40198100000001,42.45682],[-76.401005,42.455022],[-76.400806,42.454655],[-76.40071,42.454508],[-76.401566,42.454464],[-76.401847,42.454449],[-76.403099,42.454411],[-76.404461,42.454379],[-76.404663,42.454374],[-76.40686100000001,42.454293],[-76.412148,42.454079],[-76.414691,42.45398],[-76.41522399999999,42.453966],[-76.41540000000001,42.453962],[-76.4158,42.45394],[-76.41650300000001,42.453915],[-76.417601,42.453877],[-76.418646,42.453819],[-76.42009299999999,42.453702],[-76.420796,42.453603],[-76.421099,42.453554],[-76.421476,42.453486],[-76.422585,42.453294],[-76.423996,42.45305],[-76.425325,42.452858],[-76.425635,42.452818],[-76.42598700000001,42.4528],[-76.426339,42.452814],[-76.426689,42.45285],[-76.42691000000001,42.452888],[-76.427593,42.452992],[-76.429292,42.453178],[-76.428923,42.453466],[-76.428815,42.453557],[-76.42872699999999,42.453653],[-76.42865399999999,42.453753],[-76.428595,42.453857],[-76.428551,42.453966],[-76.427914,42.456324],[-76.42773099999999,42.457015],[-76.42765199999999,42.457476],[-76.427438,42.459955],[-76.427415,42.460167],[-76.427404,42.460347],[-76.42756900000001,42.460273],[-76.428055,42.460082],[-76.428129,42.460059],[-76.43200299999999,42.458696],[-76.432687,42.458449],[-76.433086,42.458263],[-76.43345600000001,42.458047],[-76.43379299999999,42.457804],[-76.435667,42.456326],[-76.436273,42.455895],[-76.43703600000001,42.456233],[-76.437352,42.456368],[-76.437704,42.456535],[-76.438151,42.456759],[-76.43836400000001,42.456862],[-76.438458,42.456908],[-76.4384,42.457189],[-76.43787399999999,42.45795],[-76.43781,42.45832],[-76.437175,42.459071],[-76.436938,42.459293],[-76.43750799999999,42.459679],[-76.438478,42.460009],[-76.440056,42.460197],[-76.441013,42.460463],[-76.44182499999999,42.461244],[-76.44238900000001,42.461842],[-76.442464,42.462608]]],"type":"Polygon"}
}