{
  "id": "360191004006",
  "type": "Feature",
  "properties": {
    "area_land":1435671,
    "area_water":0,
    "geoid":"360191004006",
    "name":"Block Group 6",
    "state":"ny"
},
  "bbox": [
    -73.730307,
    44.719257,
    -73.708547,
    44.729887
],
  "geometry": {"coordinates":[[[-73.72995899999999,44.724266],[-73.72924500000001,44.724933],[-73.727085,44.726952],[-73.72636900000001,44.727619],[-73.71078199999999,44.729887],[-73.71028699999999,44.728051],[-73.710301,44.727777],[-73.710204,44.727808],[-73.710138,44.727561],[-73.709154,44.723643],[-73.709048,44.723635],[-73.708969,44.723626],[-73.70890300000001,44.723618],[-73.708561,44.723546],[-73.708682,44.722989],[-73.708859,44.722842],[-73.708547,44.721619],[-73.709806,44.721497],[-73.710308,44.721422],[-73.711517,44.72127],[-73.71285899999999,44.721105],[-73.713982,44.720974],[-73.71495899999999,44.720851],[-73.715912,44.720723],[-73.717609,44.720509],[-73.71822899999999,44.720434],[-73.719657,44.720244],[-73.720168,44.720172],[-73.72123499999999,44.720019],[-73.72294599999999,44.719782],[-73.723679,44.7197],[-73.72443,44.719633],[-73.725706,44.719506],[-73.72634100000001,44.719444],[-73.727147,44.719359],[-73.727407,44.719344],[-73.729212,44.719257],[-73.72959400000001,44.720997],[-73.730307,44.723926],[-73.72995899999999,44.724266]]],"type":"Polygon"}
}