{
  "id": "361031904015",
  "type": "Feature",
  "properties": {
    "area_land":2262858,
    "area_water":167353,
    "geoid":"361031904015",
    "name":"Block Group 5",
    "state":"ny"
},
  "bbox": [
    -72.662744,
    40.897952,
    -72.638848,
    40.91832
],
  "geometry": {"coordinates":[[[-72.662744,40.915088],[-72.66271999999999,40.91534],[-72.66271500000001,40.915411],[-72.66272600000001,40.91543],[-72.662656,40.915736],[-72.661734,40.915556],[-72.660939,40.915727],[-72.66042899999999,40.916089],[-72.65985499999999,40.916151],[-72.65901700000001,40.916118],[-72.658349,40.916243],[-72.657359,40.91664],[-72.655632,40.917002],[-72.654623,40.917572],[-72.654675,40.91832],[-72.65323100000001,40.918097],[-72.651605,40.917523],[-72.64994900000001,40.916939],[-72.64975200000001,40.91687],[-72.648724,40.916901],[-72.647638,40.916935],[-72.647357,40.916944],[-72.644013,40.917903],[-72.64216,40.918211],[-72.64141100000001,40.91795],[-72.639886,40.917741],[-72.638915,40.91779],[-72.638848,40.917794],[-72.638919,40.917687],[-72.638998,40.917566],[-72.63963800000001,40.916693],[-72.640114,40.916051],[-72.640309,40.915739],[-72.64054299999999,40.91531],[-72.640626,40.915122],[-72.640704,40.914933],[-72.640849,40.914491],[-72.640944,40.914074],[-72.640995,40.913718],[-72.64110100000001,40.912171],[-72.641124,40.911808],[-72.64120200000001,40.910542],[-72.64133699999999,40.908403],[-72.641414,40.907263],[-72.641454,40.906919],[-72.641503,40.906699],[-72.64160200000001,40.906387],[-72.641794,40.905957],[-72.641971,40.90566],[-72.642115,40.905463],[-72.64240700000001,40.90512],[-72.642655,40.904882],[-72.64286300000001,40.904709],[-72.643884,40.903906],[-72.64488900000001,40.903164],[-72.645465,40.90271],[-72.647514,40.901189],[-72.647955,40.900807],[-72.648134,40.900644],[-72.648331,40.900435],[-72.648437,40.900302],[-72.64864,40.900015],[-72.64879999999999,40.899725],[-72.64892399999999,40.899433],[-72.64901,40.8991],[-72.649047,40.898891],[-72.649067,40.898493],[-72.64904199999999,40.897952],[-72.649305,40.898555],[-72.649534,40.898935],[-72.649766,40.899259],[-72.64994900000001,40.899502],[-72.65013500000001,40.899699],[-72.650792,40.900397],[-72.65105,40.900712],[-72.65138899999999,40.901152],[-72.651596,40.901464],[-72.65168199999999,40.90161],[-72.652193,40.902469],[-72.65288200000001,40.903492],[-72.65317400000001,40.903758],[-72.65340500000001,40.904023],[-72.653537,40.904171],[-72.65369699999999,40.904349],[-72.654048,40.904675],[-72.654893,40.905491],[-72.65491,40.905532],[-72.655021,40.905639],[-72.656707,40.907244],[-72.65760299999999,40.908142],[-72.657954,40.908494],[-72.65837000000001,40.909057],[-72.658856,40.909687],[-72.659178,40.910104],[-72.659944,40.910955],[-72.66033400000001,40.911367],[-72.660634,40.911766],[-72.660901,40.912227],[-72.661247,40.912965],[-72.661672,40.913606],[-72.662076,40.914093],[-72.662194,40.914237],[-72.66231500000001,40.914399],[-72.662449,40.914558],[-72.66253,40.914651],[-72.66260200000001,40.914734],[-72.662623,40.914746],[-72.66263499999999,40.914811],[-72.662679,40.914887],[-72.66272499999999,40.914981],[-72.662744,40.915088]]],"type":"Polygon"}
}