{
  "id": "360210018001",
  "type": "Feature",
  "properties": {
    "area_land":65177015,
    "area_water":1246962,
    "geoid":"360210018001",
    "name":"Block Group 1",
    "state":"ny"
},
  "bbox": [
    -73.736244,
    41.995016,
    -73.642191,
    42.096086
],
  "geometry": {"coordinates":[[[-73.735927,42.015987],[-73.735416,42.016418],[-73.73506,42.016731],[-73.734855,42.016921],[-73.734628,42.017169],[-73.734407,42.01743],[-73.7342,42.017708],[-73.73403399999999,42.017932],[-73.733813,42.018277],[-73.733732,42.018422],[-73.733552,42.018799],[-73.733329,42.019375],[-73.733194,42.019903],[-73.73311,42.020434],[-73.733085,42.020947],[-73.73321799999999,42.022908],[-73.733237,42.023495],[-73.733208,42.024162],[-73.73319499999999,42.024277],[-73.733104,42.025096],[-73.732984,42.02575],[-73.73245199999999,42.027919],[-73.732303,42.028702],[-73.73224399999999,42.029215],[-73.732218,42.029656],[-73.73223,42.030448],[-73.73226099999999,42.030854],[-73.732349,42.031489],[-73.73244200000001,42.031917],[-73.732596,42.032485],[-73.732934,42.033421],[-73.733424,42.034659],[-73.733583,42.035112],[-73.733699,42.035587],[-73.733755,42.035952],[-73.73377600000001,42.036126],[-73.733789,42.036796],[-73.73377000000001,42.037089],[-73.73359499999999,42.038579],[-73.73357900000001,42.039044],[-73.73363500000001,42.03976],[-73.7337,42.040177],[-73.73381999999999,42.041139],[-73.733839,42.041456],[-73.733841,42.041682],[-73.733825,42.042077],[-73.733755,42.042538],[-73.733694,42.042843],[-73.733441,42.043821],[-73.733379,42.044045],[-73.733276,42.044411],[-73.73314999999999,42.04509],[-73.733115,42.045367],[-73.73311099999999,42.045994],[-73.733232,42.046993],[-73.733304,42.04754],[-73.733327,42.047961],[-73.73330799999999,42.048398],[-73.73326900000001,42.048677],[-73.73318999999999,42.049052],[-73.73313400000001,42.049252],[-73.733026,42.049571],[-73.732784,42.050098],[-73.732373,42.050799],[-73.731814,42.051695],[-73.730519,42.053846],[-73.730221,42.054447],[-73.729994,42.054959],[-73.729769,42.055522],[-73.729607,42.055995],[-73.729185,42.057381],[-73.72758399999999,42.062511],[-73.72757900000001,42.062528],[-73.727216,42.063634],[-73.726806,42.064694],[-73.72654900000001,42.0653],[-73.726062,42.066351],[-73.725612,42.06716],[-73.725373,42.067506],[-73.72520299999999,42.067732],[-73.72484799999999,42.06815],[-73.72453299999999,42.068463],[-73.724108,42.068837],[-73.723671,42.069168],[-73.723214,42.06947],[-73.72299099999999,42.069601],[-73.722782,42.069725],[-73.72096000000001,42.07065],[-73.719454,42.071491],[-73.71879199999999,42.071889],[-73.71827500000001,42.072268],[-73.71794,42.072561],[-73.71762699999999,42.072892],[-73.717377,42.073194],[-73.717079,42.073608],[-73.716857,42.073945],[-73.716719,42.074163],[-73.716545,42.074543],[-73.716397,42.074947],[-73.71631499999999,42.075272],[-73.71628800000001,42.075442],[-73.71623200000001,42.07588],[-73.71622000000001,42.076151],[-73.71623200000001,42.076555],[-73.71627599999999,42.076979],[-73.716347,42.077342],[-73.716425,42.077615],[-73.71652400000001,42.077883],[-73.716849,42.078597],[-73.717322,42.07952],[-73.717754,42.080478],[-73.717907,42.080827],[-73.718081,42.08133],[-73.718749,42.083713],[-73.71893900000001,42.084242],[-73.719116,42.084621],[-73.71948999999999,42.08522],[-73.71966,42.085438],[-73.720885,42.086855],[-73.721006,42.087003],[-73.721204,42.087283],[-73.721429,42.08766],[-73.721656,42.08811],[-73.721851,42.088646],[-73.721965,42.089101],[-73.72202799999999,42.089582],[-73.72203,42.090148],[-73.722009,42.090384],[-73.721949,42.090806],[-73.721799,42.091336],[-73.721655,42.091737],[-73.72152199999999,42.092025],[-73.721007,42.092964],[-73.720191,42.094529],[-73.719999,42.094865],[-73.719341,42.096086],[-73.71743499999999,42.09587],[-73.715328,42.095618],[-73.71400199999999,42.095433],[-73.71321,42.09537],[-73.711764,42.095325],[-73.710094,42.094807],[-73.709059,42.094703],[-73.707599,42.094516],[-73.705916,42.094302],[-73.704832,42.09417],[-73.70361800000001,42.09406],[-73.70296399999999,42.094009],[-73.70009400000001,42.093657],[-73.693303,42.092862],[-73.69019900000001,42.092515],[-73.68963100000001,42.092431],[-73.68951300000001,42.092413],[-73.678916,42.09116],[-73.67618400000001,42.090803],[-73.675721,42.090738],[-73.67556399999999,42.09073],[-73.655357,42.088361],[-73.654658,42.088282],[-73.65325,42.08811],[-73.652513,42.086276],[-73.65167099999999,42.08401],[-73.650969,42.082134],[-73.65042800000001,42.08061],[-73.650184,42.079912],[-73.649672,42.077972],[-73.648771,42.0747],[-73.648415,42.072998],[-73.64825,42.069771],[-73.64818699999999,42.066827],[-73.648167,42.065964],[-73.648034,42.063352],[-73.648241,42.061322],[-73.648493,42.058567],[-73.648734,42.05533],[-73.648771,42.054985],[-73.648843,42.054175],[-73.648932,42.053417],[-73.648977,42.051845],[-73.648906,42.04818],[-73.648938,42.045477],[-73.64885599999999,42.04226],[-73.64826100000001,42.039517],[-73.64776999999999,42.037457],[-73.64756199999999,42.036619],[-73.647251,42.035066],[-73.647166,42.034744],[-73.647052,42.034292],[-73.646745,42.033056],[-73.64624999999999,42.03082],[-73.64570500000001,42.028254],[-73.645261,42.026349],[-73.645033,42.025292],[-73.64370700000001,42.019251],[-73.64378600000001,42.017208],[-73.643816,42.016439],[-73.643838,42.01593],[-73.64388700000001,42.01476],[-73.64416799999999,42.007339],[-73.64417400000001,42.007101],[-73.644204,42.006616],[-73.644278,42.005561],[-73.644284,42.005176],[-73.644329,42.004114],[-73.64436499999999,42.003849],[-73.644352,42.003231],[-73.642218,41.99559],[-73.642274,41.995425],[-73.642262,41.995193],[-73.642213,41.995039],[-73.642191,41.995016],[-73.65733299999999,41.997577],[-73.65830800000001,41.99774],[-73.659569,41.997952],[-73.667928,41.999354],[-73.67232300000001,42.000091],[-73.672432,42.000101],[-73.672648,42.000122],[-73.676078,42.000435],[-73.676326,42.00047],[-73.680012,42.00099],[-73.686286,42.001913],[-73.69212899999999,42.00281],[-73.69775199999999,42.00359],[-73.701876,42.004199],[-73.701894,42.004202],[-73.702078,42.004229],[-73.70310600000001,42.004381],[-73.704618,42.004585],[-73.705277,42.004674],[-73.70549099999999,42.004703],[-73.70657300000001,42.004849],[-73.707132,42.004951],[-73.70846,42.005166],[-73.709446,42.005318],[-73.71093,42.005488],[-73.711781,42.005828],[-73.71355800000001,42.006483],[-73.714393,42.006852],[-73.71563399999999,42.007399],[-73.71621500000001,42.007628],[-73.71646699999999,42.007728],[-73.716688,42.007816],[-73.717315,42.008064],[-73.71818399999999,42.008419],[-73.71848199999999,42.008542],[-73.719487,42.008954],[-73.722301,42.010075],[-73.722652,42.010215],[-73.722684,42.010228],[-73.723094,42.010392],[-73.723675,42.010625],[-73.725752,42.01146],[-73.729191,42.012861],[-73.72942500000001,42.012957],[-73.732401,42.014176],[-73.733797,42.014725],[-73.733908,42.014769],[-73.734402,42.014963],[-73.73487799999999,42.015152],[-73.735124,42.015249],[-73.73514400000001,42.015257],[-73.735178,42.01527],[-73.73559899999999,42.015436],[-73.736244,42.015702],[-73.735927,42.015987]]],"type":"Polygon"}
}