{
  "id": "360810869001",
  "type": "Feature",
  "properties": {
    "area_land":224386,
    "area_water":0,
    "geoid":"360810869001",
    "name":"Block Group 1",
    "state":"ny"
},
  "bbox": [
    -73.836024,
    40.760255,
    -73.827516,
    40.765363
],
  "geometry": {"coordinates":[[[-73.83602399999999,40.76359],[-73.83506300000001,40.763747],[-73.83437600000001,40.763818],[-73.83335,40.764084],[-73.831773,40.764454],[-73.830686,40.764712],[-73.829059,40.765093],[-73.82786299999999,40.765363],[-73.828114,40.764056],[-73.828197,40.763796],[-73.827516,40.762421],[-73.829663,40.761882],[-73.831119,40.761548],[-73.83274400000001,40.760949],[-73.832993,40.760855],[-73.83492200000001,40.760255],[-73.835173,40.761048],[-73.835286,40.761386],[-73.835426,40.762104],[-73.83553499999999,40.762605],[-73.83555699999999,40.762708],[-73.835576,40.762796],[-73.835593,40.762853],[-73.835635,40.762969],[-73.83602399999999,40.76359]]],"type":"Polygon"}
}