{
  "id": "361031907042",
  "type": "Feature",
  "properties": {
    "area_land":11025458,
    "area_water":4563723,
    "geoid":"361031907042",
    "name":"Block Group 2",
    "state":"ny"
},
  "bbox": [
    -72.335033,
    40.88452,
    -72.285319,
    40.947676
],
  "geometry": {"coordinates":[[[-72.33499,40.896114],[-72.33488199999999,40.89627],[-72.334789,40.896364],[-72.334632,40.896488],[-72.324257,40.901839],[-72.322107,40.902886],[-72.321742,40.903158],[-72.32177799999999,40.903636],[-72.321247,40.903734],[-72.32119400000001,40.903828],[-72.321136,40.903911],[-72.320886,40.904321],[-72.32008999999999,40.905609],[-72.318601,40.907902],[-72.317899,40.908938],[-72.316553,40.910978],[-72.31706800000001,40.91103],[-72.31777599999999,40.911088],[-72.318085,40.911117],[-72.32052400000001,40.912227],[-72.32078300000001,40.912334],[-72.320655,40.91265],[-72.32005700000001,40.914088],[-72.31994899999999,40.914361],[-72.319841,40.914673],[-72.31998,40.914879],[-72.320233,40.915057],[-72.32043400000001,40.915185],[-72.32064200000001,40.91533],[-72.321504,40.915871],[-72.321866,40.916107],[-72.321619,40.917021],[-72.321388,40.917848],[-72.32119400000001,40.918483],[-72.32068,40.919108],[-72.320502,40.919342],[-72.319957,40.920016],[-72.319571,40.920422],[-72.319254,40.920767],[-72.319841,40.920851],[-72.32050700000001,40.92094],[-72.32096799999999,40.921015],[-72.321138,40.921101],[-72.321361,40.921214],[-72.321708,40.921379],[-72.322186,40.921614],[-72.322346,40.921694],[-72.32292099999999,40.922023],[-72.323308,40.922296],[-72.323449,40.92239],[-72.324033,40.922836],[-72.324381,40.923114],[-72.324665,40.923458],[-72.32478,40.923596],[-72.324988,40.923836],[-72.325281,40.924232],[-72.325867,40.924987],[-72.326882,40.926275],[-72.327359,40.926886],[-72.32765499999999,40.927267],[-72.328056,40.927763],[-72.328187,40.927919],[-72.327033,40.928594],[-72.326329,40.928948],[-72.32579800000001,40.929123],[-72.322407,40.930212],[-72.32091800000001,40.930695],[-72.320204,40.930942],[-72.319936,40.931039],[-72.319901,40.931073],[-72.317967,40.931765],[-72.315819,40.932507],[-72.315664,40.932558],[-72.3152,40.932697],[-72.314477,40.932898],[-72.313295,40.933222],[-72.312782,40.933368],[-72.31240699999999,40.933482],[-72.311528,40.933727],[-72.30977,40.934397],[-72.309597,40.934469],[-72.30936,40.934552],[-72.308907,40.934708],[-72.308384,40.934851],[-72.308138,40.934922],[-72.307348,40.935154],[-72.305976,40.935538],[-72.30565300000001,40.935637],[-72.305234,40.93583],[-72.304925,40.93597],[-72.304034,40.936355],[-72.303719,40.936477],[-72.30362700000001,40.936512],[-72.302983,40.936759],[-72.301721,40.937222],[-72.30164000000001,40.937228],[-72.301545,40.937265],[-72.301123,40.937497],[-72.300804,40.937662],[-72.300684,40.938093],[-72.30062100000001,40.938357],[-72.300499,40.941231],[-72.300541,40.941899],[-72.300533,40.942764],[-72.300336,40.943866],[-72.300083,40.945038],[-72.298041,40.945668],[-72.297819,40.945742],[-72.29543200000001,40.946544],[-72.291974,40.947618],[-72.291546,40.947676],[-72.291511,40.947251],[-72.291524,40.947105],[-72.291533,40.947016],[-72.290666,40.946612],[-72.29054600000001,40.946588],[-72.289191,40.945859],[-72.289395,40.945514],[-72.28994400000001,40.945023],[-72.290187,40.944941],[-72.288921,40.940706],[-72.288442,40.940834],[-72.28823300000001,40.940873],[-72.285737,40.941344],[-72.28538,40.941412],[-72.28552999999999,40.940703],[-72.285674,40.940687],[-72.286012,40.94065],[-72.28618899999999,40.939938],[-72.286276,40.939592],[-72.28663400000001,40.938013],[-72.286867,40.936413],[-72.287015,40.934675],[-72.287081,40.933903],[-72.287088,40.933824],[-72.28711,40.933571],[-72.287446,40.931491],[-72.28759100000001,40.930466],[-72.28751699999999,40.930306],[-72.287459,40.93018],[-72.285574,40.925284],[-72.285622,40.925124],[-72.28563800000001,40.924916],[-72.28563800000001,40.924772],[-72.28565399999999,40.924612],[-72.28565399999999,40.924532],[-72.28563800000001,40.924324],[-72.28609400000001,40.923796],[-72.286468,40.923364],[-72.288422,40.921365],[-72.29002199999999,40.919647],[-72.29028099999999,40.91927],[-72.290537,40.919062],[-72.290729,40.918934],[-72.29088900000001,40.918806],[-72.29098500000001,40.91871],[-72.291077,40.918529],[-72.291302,40.918352],[-72.291622,40.918062],[-72.291943,40.917756],[-72.292264,40.917418],[-72.29252200000001,40.91716],[-72.292714,40.916919],[-72.292907,40.916629],[-72.293132,40.916356],[-72.29342,40.916002],[-72.29372499999999,40.915664],[-72.294062,40.915294],[-72.294319,40.91502],[-72.294511,40.914795],[-72.294673,40.914473],[-72.294866,40.914135],[-72.294994,40.913894],[-72.29505899999999,40.913588],[-72.294506,40.912759],[-72.29421499999999,40.912322],[-72.292828,40.910241],[-72.292197,40.909262],[-72.291848,40.908786],[-72.29027499999999,40.906644],[-72.29013500000001,40.906477],[-72.290184,40.906358],[-72.290038,40.906165],[-72.287891,40.903328],[-72.285928,40.90026],[-72.285319,40.899119],[-72.30253500000001,40.892164],[-72.311825,40.888729],[-72.32131800000001,40.885219],[-72.32320799999999,40.88452],[-72.325309,40.887654],[-72.32692,40.88994],[-72.328103,40.891717],[-72.32858400000001,40.892068],[-72.328219,40.892484],[-72.328456,40.892567],[-72.32967499999999,40.892995],[-72.33021599999999,40.893782],[-72.331108,40.893731],[-72.331751,40.894022],[-72.332842,40.894421],[-72.333168,40.894528],[-72.33355899999999,40.89476],[-72.33391899999999,40.895008],[-72.33440899999999,40.895302],[-72.334802,40.895582],[-72.334965,40.895706],[-72.335033,40.895879],[-72.33499,40.896114]]],"type":"Polygon"}
}