{
  "id": "360290148011",
  "type": "Feature",
  "properties": {
    "area_land":3543236,
    "area_water":0,
    "geoid":"360290148011",
    "name":"Block Group 1",
    "state":"ny"
},
  "bbox": [
    -78.513779,
    43.018163,
    -78.475567,
    43.037419
],
  "geometry": {"coordinates":[[[-78.513747,43.019819],[-78.51366400000001,43.02172],[-78.513541,43.024567],[-78.51346100000001,43.026346],[-78.51342699999999,43.028187],[-78.507662,43.028064],[-78.50734300000001,43.028025],[-78.507108,43.028024],[-78.504836,43.027976],[-78.50359899999999,43.027949],[-78.500919,43.027891],[-78.50089800000001,43.02837],[-78.500895,43.028463],[-78.496274,43.028469],[-78.49474600000001,43.028456],[-78.494846,43.026682],[-78.494839,43.026606],[-78.494795,43.026631],[-78.48828,43.030287],[-78.475567,43.037419],[-78.475742,43.032868],[-78.475747,43.032773],[-78.476026,43.026602],[-78.476079,43.025435],[-78.476276,43.020825],[-78.47638999999999,43.018163],[-78.483008,43.018482],[-78.48864500000001,43.018759],[-78.488513,43.021227],[-78.488725,43.021212],[-78.491641,43.021007],[-78.49312500000001,43.021056],[-78.493393,43.021066],[-78.49487999999999,43.021105],[-78.4953,43.021117],[-78.495604,43.021125],[-78.496185,43.02114],[-78.497406,43.02118],[-78.49829800000001,43.021199],[-78.498431,43.021202],[-78.499517,43.021223],[-78.499556,43.021225],[-78.500647,43.021252],[-78.501183,43.021267],[-78.50179199999999,43.021281],[-78.502972,43.021306],[-78.503024,43.020304],[-78.503006,43.020266],[-78.502925,43.020197],[-78.503434,43.019468],[-78.50347499999999,43.019428],[-78.50353200000001,43.019354],[-78.504001,43.018842],[-78.504513,43.018855],[-78.50730799999999,43.018925],[-78.50838899999999,43.018949],[-78.50855,43.018952],[-78.50894,43.01896],[-78.510808,43.019001],[-78.513779,43.019079],[-78.513747,43.019819]]],"type":"Polygon"}
}