{
  "id": "360470197001",
  "type": "Feature",
  "properties": {
    "area_land":27762,
    "area_water":0,
    "geoid":"360470197001",
    "name":"Block Group 1",
    "state":"ny"
},
  "bbox": [
    -73.967115,
    40.688088,
    -73.96481,
    40.689782
],
  "geometry": {"coordinates":[[[-73.96711500000001,40.689561],[-73.96613499999999,40.689673],[-73.965188,40.689782],[-73.96481,40.688326],[-73.965822,40.688209],[-73.966821,40.688088],[-73.96711500000001,40.689561]]],"type":"Polygon"}
}