{
  "id": "360290025021",
  "type": "Feature",
  "properties": {
    "area_land":352978,
    "area_water":0,
    "geoid":"360290025021",
    "name":"Block Group 1",
    "state":"ny"
},
  "bbox": [
    -78.87189,
    42.892458,
    -78.859079,
    42.896946
],
  "geometry": {"coordinates":[[[-78.87150699999999,42.89446],[-78.871334,42.895001],[-78.871292,42.895133],[-78.87125399999999,42.895248],[-78.870918,42.89627],[-78.870752,42.896774],[-78.870555,42.896823],[-78.869657,42.896814],[-78.868385,42.896794],[-78.867215,42.896434],[-78.86694900000001,42.896529],[-78.865533,42.896946],[-78.864407,42.896747],[-78.864183,42.896744],[-78.86314900000001,42.896732],[-78.86212999999999,42.896721],[-78.86112,42.896707],[-78.860097,42.896698],[-78.85907899999999,42.896684],[-78.859101,42.896641],[-78.85943399999999,42.89561],[-78.859522,42.895334],[-78.86069500000001,42.894855],[-78.861858,42.894434],[-78.862555,42.894152],[-78.862824,42.894071],[-78.86301899999999,42.894042],[-78.86318900000001,42.894016],[-78.86355,42.893998],[-78.863838,42.894001],[-78.863652,42.893943],[-78.86311000000001,42.893774],[-78.863057,42.893655],[-78.862988,42.893495],[-78.86341,42.893323],[-78.864406,42.892923],[-78.865572,42.892458],[-78.86578799999999,42.892503],[-78.865433,42.89303],[-78.865679,42.892998],[-78.866921,42.8929],[-78.86695899999999,42.892897],[-78.867367,42.892849],[-78.868275,42.892868],[-78.869671,42.892934],[-78.87086499999999,42.893135],[-78.87188999999999,42.893315],[-78.87150699999999,42.89446]]],"type":"Polygon"}
}