{
  "id": "360670132001",
  "type": "Feature",
  "properties": {
    "area_land":1637383,
    "area_water":0,
    "geoid":"360670132001",
    "name":"Block Group 1",
    "state":"ny"
},
  "bbox": [
    -76.212562,
    43.031384,
    -76.187937,
    43.048344
],
  "geometry": {"coordinates":[[[-76.21256200000001,43.031384],[-76.212362,43.031638],[-76.211634,43.032531],[-76.211546,43.032643],[-76.211158,43.03312],[-76.210944,43.033364],[-76.21076499999999,43.033533],[-76.209558,43.034475],[-76.208423,43.03533],[-76.208327,43.035403],[-76.20807000000001,43.035582],[-76.207551,43.035936],[-76.20684900000001,43.036465],[-76.206487,43.036726],[-76.20592600000001,43.037056],[-76.205592,43.037225],[-76.205118,43.037497],[-76.204741,43.037755],[-76.20401200000001,43.038312],[-76.203659,43.038562],[-76.20328499999999,43.038774],[-76.203135,43.038843],[-76.202197,43.039305],[-76.201714,43.039553],[-76.201634,43.039594],[-76.2012,43.039879],[-76.200295,43.040555],[-76.20014500000001,43.040679],[-76.199867,43.040941],[-76.19936199999999,43.041466],[-76.19931200000001,43.041519],[-76.199144,43.041742],[-76.199119,43.041804],[-76.198871,43.041814],[-76.1965,43.041933],[-76.196367,43.041945],[-76.196031,43.042006],[-76.19553000000001,43.042149],[-76.19525400000001,43.042225],[-76.195035,43.042268],[-76.194782,43.042294],[-76.19503899999999,43.042688],[-76.195274,43.043694],[-76.19542199999999,43.044577],[-76.196228,43.045568],[-76.19572700000001,43.046363],[-76.195705,43.046679],[-76.195992,43.048294],[-76.195415,43.048344],[-76.19435,43.046781],[-76.194248,43.046566],[-76.19484799999999,43.046266],[-76.194022,43.045111],[-76.192235,43.042416],[-76.189921,43.04254],[-76.18969,43.042596],[-76.18967600000001,43.042465],[-76.189055,43.040311],[-76.188354,43.038315],[-76.188158,43.037779],[-76.188033,43.037428],[-76.18902799999999,43.037427],[-76.189223,43.036386],[-76.18953399999999,43.035913],[-76.18941599999999,43.035685],[-76.18825,43.033457],[-76.18793700000001,43.032561],[-76.192688,43.032676],[-76.192898,43.032606],[-76.193641,43.032326],[-76.194176,43.032117],[-76.195251,43.032085],[-76.196776,43.032095],[-76.197143,43.032082],[-76.19813600000001,43.032044],[-76.199572,43.032002],[-76.199664,43.031981],[-76.201339,43.032115],[-76.201759,43.031996],[-76.202172,43.031915],[-76.202574,43.031855],[-76.20280200000001,43.031833],[-76.203794,43.031789],[-76.20484,43.031749],[-76.205709,43.031719],[-76.210278,43.031576],[-76.21213899999999,43.031513],[-76.212183,43.031506],[-76.21228499999999,43.031488],[-76.21238700000001,43.031461],[-76.21256200000001,43.031384]]],"type":"Polygon"}
}