{
  "id": "360470410001",
  "type": "Feature",
  "properties": {
    "area_land":80258,
    "area_water":0,
    "geoid":"360470410001",
    "name":"Block Group 1",
    "state":"ny"
},
  "bbox": [
    -73.976462,
    40.598979,
    -73.972565,
    40.601794
],
  "geometry": {"coordinates":[[[-73.976462,40.601364],[-73.975543,40.601465],[-73.97436399999999,40.601596],[-73.97340800000001,40.601702],[-73.972565,40.601794],[-73.972911,40.599315],[-73.973755,40.599221],[-73.97471,40.599117],[-73.975098,40.59907],[-73.97601,40.598979],[-73.976339,40.60071],[-73.976462,40.601364]]],"type":"Polygon"}
}