{
  "id": "360290105003",
  "type": "Feature",
  "properties": {
    "area_land":156292,
    "area_water":0,
    "geoid":"360290105003",
    "name":"Block Group 3",
    "state":"ny"
},
  "bbox": [
    -78.793812,
    42.918045,
    -78.786711,
    42.921446
],
  "geometry": {"coordinates":[[[-78.79373099999999,42.918913],[-78.79364700000001,42.919842],[-78.792711,42.920073],[-78.791645,42.920336],[-78.79061,42.920591],[-78.78953300000001,42.920856],[-78.788411,42.921134],[-78.787161,42.921446],[-78.78673000000001,42.920527],[-78.786711,42.920101],[-78.786721,42.919577],[-78.78674700000001,42.919565],[-78.786835,42.919525],[-78.786934,42.919486],[-78.787057,42.919423],[-78.787167,42.919349],[-78.787263,42.919264],[-78.787341,42.91917],[-78.787402,42.919069],[-78.787443,42.918963],[-78.787443,42.918886],[-78.78743900000001,42.918073],[-78.792199,42.918056],[-78.793812,42.918045],[-78.79373099999999,42.918913]]],"type":"Polygon"}
}