{
  "id": "360810809007",
  "type": "Feature",
  "properties": {
    "area_land":470468,
    "area_water":0,
    "geoid":"360810809007",
    "name":"Block Group 7",
    "state":"ny"
},
  "bbox": [
    -73.825496,
    40.733783,
    -73.814694,
    40.739827
],
  "geometry": {"coordinates":[[[-73.825496,40.734046],[-73.824988,40.739377],[-73.82481199999999,40.739631],[-73.824682,40.739827],[-73.82462099999999,40.739814],[-73.824504,40.739788],[-73.823559,40.739579],[-73.82266799999999,40.739385],[-73.82177799999999,40.739194],[-73.820897,40.739002],[-73.820064,40.738828],[-73.81838,40.738594],[-73.817081,40.738415],[-73.81693300000001,40.73839],[-73.81677999999999,40.73838],[-73.816625,40.738386],[-73.816474,40.738409],[-73.81633100000001,40.738446],[-73.81607700000001,40.738858],[-73.815186,40.738571],[-73.81496799999999,40.73855],[-73.814843,40.737929],[-73.814769,40.737548],[-73.814694,40.737154],[-73.814742,40.73562],[-73.814769,40.734764],[-73.814773,40.734638],[-73.814775,40.734582],[-73.81480000000001,40.733783],[-73.817404,40.73396],[-73.819749,40.734195],[-73.820538,40.734284],[-73.821218,40.734361],[-73.821859,40.734433],[-73.82236899999999,40.734482],[-73.822704,40.734499],[-73.823041,40.7345],[-73.82338,40.734484],[-73.8236,40.734464],[-73.823718,40.734453],[-73.82405300000001,40.734405],[-73.824147,40.734387],[-73.824383,40.734342],[-73.82470600000001,40.734263],[-73.82502100000001,40.734169],[-73.825256,40.734097],[-73.825394,40.734055],[-73.825496,40.734046]]],"type":"Polygon"}
}