{
  "id": "360130307003",
  "type": "Feature",
  "properties": {
    "area_land":355855,
    "area_water":0,
    "geoid":"360130307003",
    "name":"Block Group 3",
    "state":"ny"
},
  "bbox": [
    -79.239599,
    42.081871,
    -79.226905,
    42.086262
],
  "geometry": {"coordinates":[[[-79.239591,42.083044],[-79.239581,42.083768],[-79.238444,42.083782],[-79.23844099999999,42.084216],[-79.23783400000001,42.084226],[-79.237363,42.084224],[-79.237115,42.08419],[-79.23710699999999,42.086167],[-79.235936,42.086162],[-79.234782,42.086155],[-79.23468099999999,42.086182],[-79.234628,42.086209],[-79.23455199999999,42.086231],[-79.233772,42.086231],[-79.233088,42.086241],[-79.23227300000001,42.086257],[-79.231593,42.086261],[-79.231533,42.086261],[-79.231487,42.086262],[-79.23119199999999,42.085594],[-79.23096,42.085031],[-79.230919,42.08479],[-79.230889,42.084164],[-79.23084,42.084164],[-79.229859,42.084177],[-79.22868099999999,42.084179],[-79.228583,42.084179],[-79.228236,42.08421],[-79.22780899999999,42.083694],[-79.227621,42.083451],[-79.22741600000001,42.083187],[-79.227181,42.082946],[-79.22711200000001,42.082896],[-79.227012,42.082842],[-79.226905,42.082802],[-79.22766900000001,42.082536],[-79.22865899999999,42.082217],[-79.229518,42.081915],[-79.229659,42.081905],[-79.229698,42.081902],[-79.22974000000001,42.081898],[-79.229803,42.081895],[-79.230193,42.081879],[-79.23102,42.081871],[-79.231938,42.081874],[-79.232829,42.081877],[-79.23378,42.081878],[-79.23469900000001,42.08188],[-79.235952,42.081882],[-79.237127,42.081884],[-79.238462,42.081877],[-79.239599,42.081878],[-79.239591,42.083044]]],"type":"Polygon"}
}