{
  "id": "360290146033",
  "type": "Feature",
  "properties": {
    "area_land":2185746,
    "area_water":0,
    "geoid":"360290146033",
    "name":"Block Group 3",
    "state":"ny"
},
  "bbox": [
    -78.662148,
    42.969835,
    -78.647141,
    42.989101
],
  "geometry": {"coordinates":[[[-78.66214100000001,42.976565],[-78.662119,42.977918],[-78.66212,42.977944],[-78.66210700000001,42.980662],[-78.662099,42.981304],[-78.66206699999999,42.984316],[-78.66206,42.985146],[-78.662053,42.986155],[-78.662037,42.986724],[-78.662026,42.988212],[-78.662026,42.989101],[-78.65825599999999,42.988988],[-78.65783500000001,42.988976],[-78.657212,42.988958],[-78.65706900000001,42.988954],[-78.65691200000001,42.988948],[-78.653628,42.988828],[-78.65300999999999,42.988807],[-78.651526,42.988762],[-78.649917,42.988701],[-78.648968,42.988673],[-78.648015,42.988645],[-78.647141,42.988614],[-78.647158,42.986623],[-78.647177,42.984909],[-78.647188,42.983957],[-78.647194,42.983359],[-78.647206,42.982242],[-78.64720699999999,42.982206],[-78.64720699999999,42.982171],[-78.64721299999999,42.981645],[-78.64722500000001,42.980635],[-78.64723600000001,42.979906],[-78.647244,42.979123],[-78.647245,42.978936],[-78.647246,42.977927],[-78.64724699999999,42.977613],[-78.647248,42.976452],[-78.64725,42.975211],[-78.647232,42.969835],[-78.648065,42.97015],[-78.64858099999999,42.970346],[-78.657144,42.973586],[-78.661631,42.97528],[-78.66209000000001,42.975453],[-78.66213399999999,42.975469],[-78.662148,42.975792],[-78.66214100000001,42.976565]]],"type":"Polygon"}
}