{
  "id": "360610155005",
  "type": "Feature",
  "properties": {
    "area_land":8597,
    "area_water":0,
    "geoid":"360610155005",
    "name":"Block Group 5",
    "state":"ny"
},
  "bbox": [
    -73.98843,
    40.776017,
    -73.986815,
    40.777116
],
  "geometry": {"coordinates":[[[-73.98811000000001,40.777116],[-73.98681500000001,40.776599],[-73.986929,40.776443],[-73.987241,40.776017],[-73.98842999999999,40.776531],[-73.98811000000001,40.777116]]],"type":"Polygon"}
}