{
  "id": "361190042003",
  "type": "Feature",
  "properties": {
    "area_land":221324,
    "area_water":0,
    "geoid":"361190042003",
    "name":"Block Group 3",
    "state":"ny"
},
  "bbox": [
    -73.831156,
    40.918113,
    -73.823352,
    40.924101
],
  "geometry": {"coordinates":[[[-73.83115599999999,40.924101],[-73.830958,40.924094],[-73.830704,40.924065],[-73.83042399999999,40.923997],[-73.83030599999999,40.923956],[-73.830213,40.923921],[-73.83000800000001,40.923843],[-73.82942,40.923667],[-73.82862299999999,40.923401],[-73.828982,40.922761],[-73.829379,40.922076],[-73.82843800000001,40.921775],[-73.827681,40.921534],[-73.827505,40.921478],[-73.826588,40.921175],[-73.825682,40.92087],[-73.82486400000001,40.920596],[-73.824851,40.920222],[-73.824674,40.920198],[-73.823352,40.920017],[-73.823432,40.919638],[-73.82355,40.919084],[-73.823615,40.918332],[-73.824974,40.91843],[-73.82526,40.918459],[-73.82546000000001,40.918465],[-73.825731,40.918461],[-73.826093,40.918449],[-73.826472,40.918426],[-73.82673,40.918403],[-73.827371,40.918349],[-73.827755,40.918316],[-73.828751,40.918232],[-73.83006399999999,40.918113],[-73.830153,40.918599],[-73.83028,40.919532],[-73.83049699999999,40.920477],[-73.83077400000001,40.921463],[-73.83079499999999,40.92159],[-73.83085199999999,40.921975],[-73.830888,40.922337],[-73.830969,40.922877],[-73.831052,40.923274],[-73.83115599999999,40.924101]]],"type":"Polygon"}
}