{
  "id": "360470234001",
  "type": "Feature",
  "properties": {
    "area_land":56590,
    "area_water":0,
    "geoid":"360470234001",
    "name":"Block Group 1",
    "state":"ny"
},
  "bbox": [
    -73.990956,
    40.632157,
    -73.983763,
    40.636705
],
  "geometry": {"coordinates":[[[-73.99037300000001,40.636705],[-73.988167,40.635374],[-73.985964,40.634047],[-73.983763,40.632717],[-73.98434399999999,40.632157],[-73.98457000000001,40.632293],[-73.98486699999999,40.632473],[-73.986548,40.633487],[-73.98875099999999,40.634816],[-73.990956,40.636145],[-73.99037300000001,40.636705]]],"type":"Polygon"}
}