{
  "id": "360810004003",
  "type": "Feature",
  "properties": {
    "area_land":72079,
    "area_water":0,
    "geoid":"360810004003",
    "name":"Block Group 3",
    "state":"ny"
},
  "bbox": [
    -73.86603,
    40.687434,
    -73.861349,
    40.690047
],
  "geometry": {"coordinates":[[[-73.86602999999999,40.689353],[-73.86514099999999,40.68947],[-73.86425300000001,40.689587],[-73.86334600000001,40.689706],[-73.863375,40.689834],[-73.86165699999999,40.690047],[-73.861504,40.689373],[-73.861349,40.688695],[-73.86306399999999,40.688472],[-73.86291,40.687796],[-73.863816,40.687679],[-73.864706,40.687562],[-73.86559200000001,40.687434],[-73.86587299999999,40.688661],[-73.86602999999999,40.689353]]],"type":"Polygon"}
}