{
  "id": "360290043002",
  "type": "Feature",
  "properties": {
    "area_land":140459,
    "area_water":0,
    "geoid":"360290043002",
    "name":"Block Group 2",
    "state":"ny"
},
  "bbox": [
    -78.813672,
    42.941903,
    -78.80689,
    42.944201
],
  "geometry": {"coordinates":[[[-78.813672,42.944197],[-78.810846,42.944201],[-78.80900800000001,42.9442],[-78.807832,42.944194],[-78.80689,42.944194],[-78.806892,42.943439],[-78.80689,42.942677],[-78.80689,42.941918],[-78.80813499999999,42.941916],[-78.80853399999999,42.941903],[-78.80903000000001,42.941903],[-78.809984,42.941908],[-78.810841,42.941908],[-78.812871,42.941911],[-78.813659,42.941909],[-78.813659,42.94248],[-78.813659,42.942677],[-78.81365599999999,42.943377],[-78.81365599999999,42.943435],[-78.813655,42.943598],[-78.813672,42.944197]]],"type":"Polygon"}
}