{
  "id": "360610009000",
  "type": "Feature",
  "properties": {
    "area_land":0,
    "area_water":463532,
    "geoid":"360610009000",
    "name":"Block Group 0",
    "state":"ny"
},
  "bbox": [
    -74.013653,
    40.694959,
    -73.998763,
    40.702618
],
  "geometry": {"coordinates":[[[-74.013583,40.700371],[-74.012345,40.700159],[-74.010957,40.700194],[-74.011174,40.701155],[-74.01071399999999,40.701494],[-74.009535,40.701778],[-74.00861399999999,40.700464],[-74.00824900000001,40.700708],[-74.008398,40.700911],[-74.00745000000001,40.701331],[-74.007775,40.701616],[-74.00877699999999,40.701182],[-74.00917,40.701859],[-74.00801800000001,40.702618],[-74.006066,40.701359],[-74.000454,40.698739],[-74.00103900000001,40.697899],[-73.998847,40.697141],[-73.998763,40.69711],[-73.998857,40.69692],[-73.99894,40.696941],[-73.998991,40.696812],[-73.999182,40.696885],[-73.999295,40.696795],[-73.99947400000001,40.696704],[-73.99953499999999,40.696578],[-73.999478,40.696466],[-73.99942799999999,40.69641],[-73.99942,40.696361],[-74.000105,40.696657],[-74.002031,40.69737],[-74.002191,40.697076],[-74.00035200000001,40.696284],[-73.99960400000001,40.696069],[-73.999882,40.695605],[-74.000277,40.694959],[-74.000534,40.695046],[-74.001267,40.695301],[-74.002408,40.695703],[-74.00266499999999,40.69531],[-74.01155900000001,40.698666],[-74.01337100000001,40.699142],[-74.01365300000001,40.700221],[-74.013583,40.700371]]],"type":"Polygon"}
}