{
  "id": "360610036012",
  "type": "Feature",
  "properties": {
    "area_land":22750,
    "area_water":0,
    "geoid":"360610036012",
    "name":"Block Group 2",
    "state":"ny"
},
  "bbox": [
    -73.991506,
    40.720766,
    -73.989392,
    40.723426
],
  "geometry": {"coordinates":[[[-73.990914,40.722181],[-73.990274,40.723426],[-73.989392,40.723174],[-73.99004100000001,40.721921],[-73.990629,40.720766],[-73.991506,40.721028],[-73.990914,40.722181]]],"type":"Polygon"}
}