{
  "id": "360570725002",
  "type": "Feature",
  "properties": {
    "area_land":6027458,
    "area_water":46133,
    "geoid":"360570725002",
    "name":"Block Group 2",
    "state":"ny"
},
  "bbox": [
    -74.65995,
    42.902183,
    -74.613881,
    42.93354
],
  "geometry": {"coordinates":[[[-74.65978699999999,42.928438],[-74.659069,42.928871],[-74.658947,42.928997],[-74.65840300000001,42.92886],[-74.656201,42.928345],[-74.65434399999999,42.927911],[-74.653786,42.927758],[-74.65243700000001,42.927448],[-74.651814,42.927327],[-74.65140100000001,42.927259],[-74.65102,42.927214],[-74.650558,42.927196],[-74.650083,42.927217],[-74.64972,42.927256],[-74.64944199999999,42.927299],[-74.649098,42.927365],[-74.648279,42.927564],[-74.647875,42.927613],[-74.647392,42.927657],[-74.646872,42.927666],[-74.646782,42.92768],[-74.646647,42.927693],[-74.646536,42.9277],[-74.64636400000001,42.927717],[-74.64618,42.92773],[-74.646039,42.927743],[-74.644654,42.927854],[-74.643852,42.927944],[-74.643106,42.928073],[-74.642833,42.928125],[-74.64120800000001,42.928552],[-74.641002,42.928595],[-74.640315,42.928781],[-74.63997999999999,42.92884],[-74.63981,42.928861],[-74.639746,42.928868],[-74.639708,42.928873],[-74.63921999999999,42.928894],[-74.636106,42.928984],[-74.634376,42.929041],[-74.63377300000001,42.929086],[-74.63341800000001,42.929154],[-74.633071,42.92925],[-74.632924,42.929298],[-74.632712,42.929368],[-74.632564,42.929413],[-74.632188,42.929533],[-74.63179700000001,42.929638],[-74.631541,42.929687],[-74.631134,42.929762],[-74.63067100000001,42.92985],[-74.629604,42.930021],[-74.629294,42.930057],[-74.628676,42.930094],[-74.627982,42.930077],[-74.627315,42.930041],[-74.62721000000001,42.930184],[-74.626735,42.93033],[-74.62584200000001,42.930642],[-74.624258,42.931151],[-74.623301,42.931471],[-74.623456,42.931701],[-74.62307300000001,42.931832],[-74.622857,42.931905],[-74.622135,42.932132],[-74.620283,42.932712],[-74.61998199999999,42.932795],[-74.619725,42.932888],[-74.619168,42.933049],[-74.619079,42.933076],[-74.618945,42.933119],[-74.618658,42.933212],[-74.618236,42.93335],[-74.61814699999999,42.933378],[-74.617659,42.93354],[-74.617217,42.932825],[-74.616338,42.931737],[-74.61592400000001,42.931224],[-74.614982,42.929953],[-74.61388100000001,42.928358],[-74.614255,42.928024],[-74.615315,42.927113],[-74.615362,42.927073],[-74.61546199999999,42.926987],[-74.61554,42.92692],[-74.616011,42.926516],[-74.61685,42.925741],[-74.617278,42.925355],[-74.61770799999999,42.924978],[-74.61850800000001,42.924319],[-74.61890200000001,42.923975],[-74.61925599999999,42.923666],[-74.619609,42.923356],[-74.62458100000001,42.919008],[-74.627178,42.916804],[-74.628857,42.915445],[-74.629065,42.915278],[-74.631108,42.913409],[-74.634028,42.910897],[-74.64413500000001,42.902183],[-74.644164,42.902207],[-74.645494,42.903382],[-74.646081,42.903943],[-74.646799,42.905015],[-74.64829400000001,42.90763],[-74.650713,42.911821],[-74.651124,42.912569],[-74.651781,42.912383],[-74.65189700000001,42.912682],[-74.65189599999999,42.913924],[-74.651803,42.914266],[-74.651833,42.915176],[-74.65205,42.915663],[-74.653389,42.916801],[-74.654042,42.917515],[-74.65444599999999,42.91811],[-74.654445,42.918218],[-74.654943,42.918842],[-74.65516,42.919094],[-74.655282,42.919248],[-74.65541,42.91941],[-74.65553300000001,42.919753],[-74.65569000000001,42.919978],[-74.65705800000001,42.921198],[-74.657088,42.922477],[-74.657369,42.922892],[-74.65758700000001,42.923091],[-74.657742,42.923136],[-74.657866,42.923344],[-74.65811600000001,42.923624],[-74.65842600000001,42.924075],[-74.658457,42.925084],[-74.65882999999999,42.925679],[-74.658829,42.925859],[-74.65889199999999,42.925949],[-74.658986,42.926391],[-74.658953,42.927003],[-74.658767,42.92721],[-74.658175,42.92755],[-74.65808800000001,42.927626],[-74.65825,42.927696],[-74.658359,42.927745],[-74.658451,42.927786],[-74.65855000000001,42.927833],[-74.658694,42.927903],[-74.658805,42.927957],[-74.65892100000001,42.928014],[-74.659037,42.92807],[-74.65913,42.928116],[-74.659234,42.928155],[-74.65931500000001,42.928185],[-74.659392,42.928214],[-74.659599,42.928262],[-74.65994999999999,42.92834],[-74.65978699999999,42.928438]]],"type":"Polygon"}
}