{
  "id": "360470920001",
  "type": "Feature",
  "properties": {
    "area_land":28684,
    "area_water":0,
    "geoid":"360470920001",
    "name":"Block Group 1",
    "state":"ny"
},
  "bbox": [
    -73.907191,
    40.656412,
    -73.90545,
    40.659754
],
  "geometry": {"coordinates":[[[-73.907191,40.659619],[-73.90627000000001,40.659754],[-73.905879,40.658218],[-73.90545,40.656547],[-73.906369,40.656412],[-73.906795,40.658084],[-73.907191,40.659619]]],"type":"Polygon"}
}