{
  "id": "360550103001",
  "type": "Feature",
  "properties": {
    "area_land":1127517,
    "area_water":0,
    "geoid":"360550103001",
    "name":"Block Group 1",
    "state":"ny"
},
  "bbox": [
    -77.620925,
    43.208376,
    -77.598538,
    43.225445
],
  "geometry": {"coordinates":[[[-77.620925,43.208662],[-77.61656499999999,43.211997],[-77.614908,43.216135],[-77.612824,43.221662],[-77.613125,43.225162],[-77.612465,43.225199],[-77.610444,43.225218],[-77.604738,43.225279],[-77.60423900000001,43.225284],[-77.601738,43.225309],[-77.60103700000001,43.225396],[-77.60072599999999,43.225426],[-77.60024199999999,43.225445],[-77.599768,43.225438],[-77.599394,43.225419],[-77.59897599999999,43.225382],[-77.59887000000001,43.225201],[-77.598803,43.225065],[-77.598769,43.224963],[-77.59874600000001,43.224839],[-77.598738,43.224703],[-77.59875700000001,43.224455],[-77.59879599999999,43.22424],[-77.598888,43.223903],[-77.598865,43.222756],[-77.59884700000001,43.222303],[-77.598815,43.221536],[-77.598782,43.220787],[-77.59877,43.220496],[-77.59874600000001,43.219957],[-77.598742,43.219871],[-77.598693,43.21901],[-77.598653,43.218181],[-77.598606,43.217387],[-77.598538,43.216221],[-77.601574,43.216154],[-77.602637,43.21614],[-77.60265200000001,43.216305],[-77.602662,43.216362],[-77.602684,43.216416],[-77.60270800000001,43.216456],[-77.60276500000001,43.216509],[-77.602818,43.216545],[-77.602874,43.216571],[-77.60297199999999,43.216599],[-77.603041,43.21661],[-77.60311799999999,43.216613],[-77.603745,43.216589],[-77.604395,43.216571],[-77.604533,43.216582],[-77.604651,43.21661],[-77.604761,43.216656],[-77.60499900000001,43.216792],[-77.60606900000001,43.217382],[-77.605232,43.218244],[-77.60458,43.218891],[-77.604294,43.219175],[-77.603498,43.219969],[-77.60341699999999,43.220045],[-77.603922,43.220196],[-77.604005,43.220214],[-77.60409,43.220216],[-77.60417700000001,43.220203],[-77.60427,43.220167],[-77.60432299999999,43.220134],[-77.60449300000001,43.219983],[-77.604587,43.219909],[-77.604662,43.219876],[-77.604738,43.219856],[-77.604831,43.219853],[-77.604968,43.219875],[-77.60587200000001,43.220137],[-77.60701400000001,43.220202],[-77.607393,43.219697],[-77.607795,43.219],[-77.608041,43.218565],[-77.60859000000001,43.217632],[-77.61180899999999,43.21754],[-77.611761,43.216708],[-77.612881,43.216686],[-77.612861,43.216154],[-77.612848,43.215772],[-77.613899,43.215182],[-77.613978,43.215123],[-77.614045,43.215048],[-77.61410100000001,43.214963],[-77.614177,43.214825],[-77.614254,43.214656],[-77.614352,43.214495],[-77.614464,43.214365],[-77.614695,43.214172],[-77.615027,43.213906],[-77.614999,43.213043],[-77.615331,43.212475],[-77.615764,43.211382],[-77.618579,43.209735],[-77.61881700000001,43.209596],[-77.61939599999999,43.209275],[-77.619469,43.209235],[-77.61962200000001,43.209126],[-77.619692,43.20906],[-77.62029099999999,43.208376],[-77.620925,43.208662]]],"type":"Polygon"}
}