{
  "id": "360050076001",
  "type": "Feature",
  "properties": {
    "area_land":16636,
    "area_water":0,
    "geoid":"360050076001",
    "name":"Block Group 1",
    "state":"ny"
},
  "bbox": [
    -73.871102,
    40.834645,
    -73.868991,
    40.835755
],
  "geometry": {"coordinates":[[[-73.87110199999999,40.835755],[-73.86999400000001,40.83565],[-73.869033,40.835486],[-73.86899099999999,40.834797],[-73.869939,40.83477],[-73.87090000000001,40.834645],[-73.87110199999999,40.835755]]],"type":"Polygon"}
}