{
  "id": "360610220001",
  "type": "Feature",
  "properties": {
    "area_land":43661,
    "area_water":0,
    "geoid":"360610220001",
    "name":"Block Group 1",
    "state":"ny"
},
  "bbox": [
    -73.950654,
    40.804587,
    -73.9469,
    40.80704
],
  "geometry": {"coordinates":[[[-73.950197,40.806413],[-73.94974000000001,40.80704],[-73.9469,40.805839],[-73.947352,40.805213],[-73.947813,40.804587],[-73.950654,40.805785],[-73.950197,40.806413]]],"type":"Polygon"}
}