{
  "id": "360470900006",
  "type": "Feature",
  "properties": {
    "area_land":31461,
    "area_water":0,
    "geoid":"360470900006",
    "name":"Block Group 6",
    "state":"ny"
},
  "bbox": [
    -73.922753,
    40.663843,
    -73.920972,
    40.667481
],
  "geometry": {"coordinates":[[[-73.922753,40.667098],[-73.92221499999999,40.667334],[-73.92187199999999,40.667481],[-73.92136600000001,40.66549],[-73.92097200000001,40.663953],[-73.921655,40.663843],[-73.922099,40.664251],[-73.92232,40.665348],[-73.922753,40.667098]]],"type":"Polygon"}
}