{
  "id": "360430107012",
  "type": "Feature",
  "properties": {
    "area_land":1773044,
    "area_water":0,
    "geoid":"360430107012",
    "name":"Block Group 2",
    "state":"ny"
},
  "bbox": [
    -74.879452,
    43.030658,
    -74.859,
    43.053176
],
  "geometry": {"coordinates":[[[-74.879452,43.051982],[-74.87862800000001,43.052066],[-74.87868,43.052303],[-74.877698,43.052559],[-74.877075,43.053176],[-74.87705099999999,43.053159],[-74.876547,43.052801],[-74.874987,43.051701],[-74.874764,43.051512],[-74.874585,43.051289],[-74.874459,43.051097],[-74.874364,43.050957],[-74.874112,43.050609],[-74.87402299999999,43.050517],[-74.873829,43.050351],[-74.87375400000001,43.050296],[-74.873295,43.05002],[-74.873086,43.049904],[-74.87215999999999,43.049474],[-74.871504,43.049165],[-74.87131100000001,43.049072],[-74.871576,43.049094],[-74.871726,43.049107],[-74.87183899999999,43.049018],[-74.87169299999999,43.049082],[-74.871661,43.049075],[-74.871635,43.049036],[-74.871112,43.048609],[-74.870384,43.048009],[-74.86968400000001,43.047457],[-74.868965,43.046955],[-74.867938,43.046323],[-74.86742700000001,43.046027],[-74.866224,43.045354],[-74.864985,43.044598],[-74.864859,43.044534],[-74.864839,43.044526],[-74.86315500000001,43.044168],[-74.862279,43.043985],[-74.861768,43.043871],[-74.86059,43.043627],[-74.85977099999999,43.043463],[-74.859701,43.04347],[-74.85961500000001,43.043236],[-74.859329,43.042579],[-74.85913499999999,43.042122],[-74.859043,43.041893],[-74.859031,43.04186],[-74.85899999999999,43.041784],[-74.85916,43.041754],[-74.859796,43.041648],[-74.860632,43.041508],[-74.860587,43.041367],[-74.860668,43.041345],[-74.861322,43.041171],[-74.861965,43.041],[-74.86243899999999,43.040834],[-74.862968,43.040581],[-74.86339099999999,43.040357],[-74.863637,43.040198],[-74.863947,43.039998],[-74.86480400000001,43.039358],[-74.865476,43.038826],[-74.865802,43.038542],[-74.866107,43.038274],[-74.866822,43.037552],[-74.86775799999999,43.036581],[-74.868208,43.036155],[-74.869709,43.034668],[-74.87037599999999,43.034021],[-74.871213,43.033275],[-74.87146199999999,43.03307],[-74.87208200000001,43.032589],[-74.87314000000001,43.031839],[-74.87443500000001,43.030983],[-74.874897,43.030658],[-74.875095,43.031135],[-74.87590400000001,43.036519],[-74.87751,43.043491],[-74.87841400000001,43.048258],[-74.879333,43.051574],[-74.879452,43.051982]]],"type":"Polygon"}
}