{
  "id": "360595185022",
  "type": "Feature",
  "properties": {
    "area_land":339523,
    "area_water":0,
    "geoid":"360595185022",
    "name":"Block Group 2",
    "state":"ny"
},
  "bbox": [
    -73.531587,
    40.777686,
    -73.521564,
    40.784421
],
  "geometry": {"coordinates":[[[-73.531587,40.780779],[-73.531308,40.780466],[-73.53122500000001,40.780455],[-73.530537,40.780641],[-73.529687,40.780872],[-73.530232,40.782037],[-73.530846,40.783349],[-73.53002499999999,40.783682],[-73.529234,40.784005],[-73.528385,40.784238],[-73.528164,40.784302],[-73.527674,40.784421],[-73.525245,40.782462],[-73.525148,40.782351],[-73.525099,40.782186],[-73.524995,40.782052],[-73.52420499999999,40.782493],[-73.52406000000001,40.782553],[-73.523901,40.782593],[-73.523843,40.782582],[-73.523735,40.782516],[-73.52361999999999,40.782436],[-73.523527,40.782342],[-73.523217,40.781905],[-73.52301199999999,40.781594],[-73.52237599999999,40.782154],[-73.52227999999999,40.782013],[-73.52185799999999,40.781395],[-73.521564,40.780965],[-73.52168899999999,40.780888],[-73.52184800000001,40.780814],[-73.521884,40.780809],[-73.521942,40.780785],[-73.52252,40.780463],[-73.523467,40.779959],[-73.524207,40.779561],[-73.52479700000001,40.779244],[-73.526635,40.77825],[-73.52688499999999,40.778112],[-73.52702600000001,40.778034],[-73.52741399999999,40.777835],[-73.527558,40.77776],[-73.527703,40.777686],[-73.528991,40.778283],[-73.52937300000001,40.77846],[-73.529793,40.778669],[-73.530028,40.778797],[-73.529999,40.778808],[-73.530227,40.778925],[-73.5303,40.778956],[-73.53053300000001,40.779096],[-73.530615,40.77919],[-73.530801,40.779269],[-73.53090400000001,40.779313],[-73.53111699999999,40.779772],[-73.53133099999999,40.780217],[-73.531587,40.780779]]],"type":"Polygon"}
}