{
  "id": "360550149032",
  "type": "Feature",
  "properties": {
    "area_land":17296211,
    "area_water":213432,
    "geoid":"360550149032",
    "name":"Block Group 2",
    "state":"ny"
},
  "bbox": [
    -77.89036,
    43.163419,
    -77.804508,
    43.202766
],
  "geometry": {"coordinates":[[[-77.889658,43.16753],[-77.88825799999999,43.171408],[-77.883734,43.179847],[-77.880922,43.186049],[-77.88026499999999,43.187584],[-77.87943300000001,43.188871],[-77.87509,43.197795],[-77.874571,43.198844],[-77.872725,43.202576],[-77.872631,43.202766],[-77.87074699999999,43.202043],[-77.868452,43.201076],[-77.86648,43.200094],[-77.864392,43.199402],[-77.862709,43.198667],[-77.859796,43.197419],[-77.85698499999999,43.19629],[-77.85401,43.195745],[-77.853807,43.195734],[-77.852537,43.195662],[-77.852248,43.195686],[-77.850684,43.195822],[-77.84924100000001,43.196356],[-77.848415,43.196586],[-77.84826099999999,43.19663],[-77.847348,43.197313],[-77.843729,43.199837],[-77.842922,43.200139],[-77.841182,43.200268],[-77.84077000000001,43.200296],[-77.83865900000001,43.199999],[-77.838461,43.199883],[-77.836718,43.199505],[-77.836223,43.199277],[-77.832881,43.198005],[-77.831355,43.1973],[-77.82974,43.196662],[-77.827478,43.196306],[-77.82570800000001,43.196331],[-77.824721,43.19618],[-77.823634,43.196188],[-77.82347799999999,43.196033],[-77.82347900000001,43.195988],[-77.823476,43.195758],[-77.823466,43.195573],[-77.823307,43.194906],[-77.823194,43.194361],[-77.823176,43.194272],[-77.823076,43.193823],[-77.823098,43.193501],[-77.82325899999999,43.191145],[-77.823465,43.188399],[-77.823566,43.187035],[-77.825969,43.187143],[-77.828333,43.187244],[-77.8293,43.187285],[-77.832684,43.187445],[-77.83957100000001,43.187724],[-77.841517,43.187804],[-77.844418,43.187902],[-77.851748,43.188165],[-77.85418199999999,43.188253],[-77.854265,43.186549],[-77.854266,43.186523],[-77.854399,43.183786],[-77.85462699999999,43.179098],[-77.851325,43.178998],[-77.847655,43.178888],[-77.838483,43.178514],[-77.82938,43.178077],[-77.824226,43.177808],[-77.819671,43.177618],[-77.81548100000001,43.177443],[-77.810373,43.177234],[-77.804508,43.177049],[-77.804709,43.172481],[-77.805036,43.166286],[-77.805149,43.163419],[-77.81129,43.163601],[-77.820376,43.163927],[-77.825462,43.164138],[-77.83173600000001,43.164427],[-77.832444,43.164461],[-77.84367399999999,43.164971],[-77.845547,43.165035],[-77.846074,43.165053],[-77.84912799999999,43.16514],[-77.85542700000001,43.16531],[-77.861182,43.16547],[-77.866112,43.165606],[-77.86914899999999,43.16568],[-77.870909,43.165723],[-77.87519399999999,43.165815],[-77.87893800000001,43.165889],[-77.879695,43.165901],[-77.87996800000001,43.165905],[-77.884372,43.165977],[-77.88747100000001,43.166021],[-77.89036,43.166061],[-77.889658,43.16753]]],"type":"Polygon"}
}