{
  "id": "360050365013",
  "type": "Feature",
  "properties": {
    "area_land":33542,
    "area_water":0,
    "geoid":"360050365013",
    "name":"Block Group 3",
    "state":"ny"
},
  "bbox": [
    -73.889017,
    40.84271,
    -73.885454,
    40.845179
],
  "geometry": {"coordinates":[[[-73.888319,40.845179],[-73.88769499999999,40.844867],[-73.88723299999999,40.844636],[-73.886149,40.844108],[-73.885454,40.843767],[-73.88566,40.84271],[-73.886843,40.843298],[-73.88792100000001,40.84383],[-73.889017,40.84437],[-73.888319,40.845179]]],"type":"Polygon"}
}