{
  "id": "360470440002",
  "type": "Feature",
  "properties": {
    "area_land":62626,
    "area_water":0,
    "geoid":"360470440002",
    "name":"Block Group 2",
    "state":"ny"
},
  "bbox": [
    -73.972673,
    40.611491,
    -73.969525,
    40.614469
],
  "geometry": {"coordinates":[[[-73.972673,40.612936],[-73.971695,40.613278],[-73.971881,40.614266],[-73.970955,40.614369],[-73.97002999999999,40.614469],[-73.969921,40.6139],[-73.969525,40.611808],[-73.97045199999999,40.611704],[-73.971379,40.611602],[-73.972398,40.611491],[-73.972673,40.612936]]],"type":"Polygon"}
}