{
  "id": "360593041002",
  "type": "Feature",
  "properties": {
    "area_land":875235,
    "area_water":0,
    "geoid":"360593041002",
    "name":"Block Group 2",
    "state":"ny"
},
  "bbox": [
    -73.587936,
    40.747566,
    -73.579641,
    40.765164
],
  "geometry": {"coordinates":[[[-73.587936,40.760036],[-73.587903,40.760198],[-73.587627,40.760939],[-73.587371,40.76155],[-73.587321,40.761694],[-73.587208,40.761953],[-73.587046,40.762345],[-73.58702700000001,40.762411],[-73.586851,40.762909],[-73.58682899999999,40.763042],[-73.586806,40.763089],[-73.58677400000001,40.763287],[-73.586758,40.763421],[-73.58583900000001,40.7637],[-73.584872,40.764026],[-73.584371,40.764207],[-73.58199999999999,40.765164],[-73.581879,40.764664],[-73.581799,40.764259],[-73.581664,40.763576],[-73.581523,40.762887],[-73.58173499999999,40.76286],[-73.583904,40.762391],[-73.584373,40.762227],[-73.58406100000001,40.761639],[-73.583828,40.761198],[-73.583708,40.760992],[-73.58362099999999,40.760825],[-73.58346,40.760501],[-73.583451,40.76046],[-73.58327300000001,40.760135],[-73.583157,40.759843],[-73.58292899999999,40.759273],[-73.5829,40.75918],[-73.58287,40.759091],[-73.58276600000001,40.758789],[-73.582691,40.758616],[-73.582661,40.758513],[-73.58245599999999,40.757951],[-73.58241700000001,40.757846],[-73.58220799999999,40.757288],[-73.58217399999999,40.757181],[-73.581929,40.756516],[-73.581667,40.755777],[-73.58159000000001,40.755553],[-73.581267,40.754638],[-73.58123000000001,40.754524],[-73.581074,40.754044],[-73.580934,40.75362],[-73.580724,40.752956],[-73.58051399999999,40.752293],[-73.580307,40.751623],[-73.579641,40.749524],[-73.579809,40.749495],[-73.579993,40.749443],[-73.58017700000001,40.749408],[-73.58097600000001,40.749255],[-73.58178599999999,40.749074],[-73.585747,40.748089],[-73.586572,40.747869],[-73.58704400000001,40.747736],[-73.587642,40.747566],[-73.587675,40.747888],[-73.58774,40.748543],[-73.587701,40.749139],[-73.587711,40.749251],[-73.587726,40.749935],[-73.587737,40.750624],[-73.58775199999999,40.751313],[-73.58774699999999,40.7515],[-73.587762,40.751999],[-73.587784,40.75244],[-73.587796,40.752744],[-73.587805,40.752979],[-73.587811,40.753125],[-73.587813,40.753321],[-73.587818,40.753959],[-73.587833,40.754042],[-73.587841,40.75458],[-73.587844,40.75486],[-73.58786600000001,40.755797],[-73.587879,40.756472],[-73.587878,40.756769],[-73.58789299999999,40.757152],[-73.587902,40.757836],[-73.587903,40.75789],[-73.587912,40.758293],[-73.58792,40.758532],[-73.58792699999999,40.758804],[-73.58792200000001,40.759093],[-73.587929,40.759498],[-73.587936,40.760036]]],"type":"Polygon"}
}