{
  "id": "360290091142",
  "type": "Feature",
  "properties": {
    "area_land":542168,
    "area_water":0,
    "geoid":"360290091142",
    "name":"Block Group 2",
    "state":"ny"
},
  "bbox": [
    -78.760869,
    42.991009,
    -78.751061,
    42.998496
],
  "geometry": {"coordinates":[[[-78.760869,42.99838],[-78.759631,42.998381],[-78.759514,42.998371],[-78.759361,42.998346],[-78.75921099999999,42.998306],[-78.75908699999999,42.998288],[-78.75904300000001,42.998285],[-78.759023,42.998284],[-78.75899699999999,42.998284],[-78.75839499999999,42.998285],[-78.758273,42.998285],[-78.758067,42.998286],[-78.757977,42.998272],[-78.75789399999999,42.998242],[-78.757842,42.998213],[-78.757634,42.998053],[-78.757542,42.998005],[-78.757452,42.997977],[-78.75742099999999,42.997971],[-78.757222,42.997968],[-78.756615,42.997958],[-78.756564,42.997958],[-78.75635200000001,42.997957],[-78.756308,42.997957],[-78.756202,42.997956],[-78.756058,42.997942],[-78.755917,42.997912],[-78.75572099999999,42.997907],[-78.75568699999999,42.997906],[-78.75509700000001,42.997914],[-78.7551,42.998084],[-78.755168,42.998257],[-78.755168,42.99834],[-78.755183,42.99849],[-78.754203,42.998496],[-78.75344699999999,42.998496],[-78.753173,42.998493],[-78.753058,42.99848],[-78.75294700000001,42.998456],[-78.751955,42.998119],[-78.751065,42.997811],[-78.751065,42.997793],[-78.75106100000001,42.997051],[-78.751071,42.99573],[-78.751068,42.994755],[-78.75107,42.993561],[-78.751087,42.993506],[-78.751135,42.993401],[-78.75120099999999,42.993302],[-78.75124599999999,42.993257],[-78.751346,42.993177],[-78.75146100000001,42.993107],[-78.751555,42.993063],[-78.751689,42.993015],[-78.75183199999999,42.992982],[-78.75197799999999,42.992963],[-78.75226000000001,42.992953],[-78.75246799999999,42.992957],[-78.752675,42.992971],[-78.75288,42.992995],[-78.752876,42.99104],[-78.753516,42.991035],[-78.75430799999999,42.991031],[-78.755658,42.991024],[-78.75657099999999,42.991021],[-78.75980800000001,42.991009],[-78.759784,42.991132],[-78.75970599999999,42.991528],[-78.759614,42.992002],[-78.759418,42.992948],[-78.759609,42.994708],[-78.75976199999999,42.995159],[-78.76009000000001,42.996108],[-78.760386,42.996972],[-78.760869,42.99838]]],"type":"Polygon"}
}