{
  "id": "360810042001",
  "type": "Feature",
  "properties": {
    "area_land":106546,
    "area_water":0,
    "geoid":"360810042001",
    "name":"Block Group 1",
    "state":"ny"
},
  "bbox": [
    -73.858727,
    40.68088,
    -73.851979,
    40.684253
],
  "geometry": {"coordinates":[[[-73.858727,40.682553],[-73.857867,40.682805],[-73.857804,40.682827],[-73.857026,40.683035],[-73.856725,40.683123],[-73.856174,40.683289],[-73.855599,40.683453],[-73.85533599999999,40.683528],[-73.85449199999999,40.68377],[-73.85365,40.684012],[-73.852801,40.684253],[-73.851979,40.682564],[-73.852819,40.682331],[-73.85366399999999,40.682088],[-73.854496,40.681851],[-73.85535299999999,40.681607],[-73.85619800000001,40.681367],[-73.857043,40.681127],[-73.857907,40.68088],[-73.858727,40.682553]]],"type":"Polygon"}
}