{
  "id": "360894907004",
  "type": "Feature",
  "properties": {
    "area_land":131431226,
    "area_water":934716,
    "geoid":"360894907004",
    "name":"Block Group 4",
    "state":"ny"
},
  "bbox": [
    -74.937694,
    44.649756,
    -74.714059,
    44.797655
],
  "geometry": {"coordinates":[[[-74.9375,44.701674],[-74.93573499999999,44.702937],[-74.93453599999999,44.703791],[-74.933665,44.704412],[-74.933333,44.704658],[-74.930027,44.707041],[-74.929354,44.707513],[-74.92730899999999,44.708996],[-74.92644300000001,44.709635],[-74.924353,44.711169],[-74.923428,44.711848],[-74.919448,44.71475],[-74.917497,44.716204],[-74.916212,44.717185],[-74.913303,44.719406],[-74.912891,44.719758],[-74.91257299999999,44.720051],[-74.91216,44.720468],[-74.908691,44.724272],[-74.908394,44.724583],[-74.906481,44.726586],[-74.905457,44.727686],[-74.904476,44.728708],[-74.904269,44.728929],[-74.902643,44.730598],[-74.902503,44.730742],[-74.90229100000001,44.730902],[-74.902198,44.730973],[-74.902072,44.731049],[-74.90176099999999,44.731218],[-74.90134999999999,44.731392],[-74.899614,44.731998],[-74.89812999999999,44.732498],[-74.897443,44.732725],[-74.89671300000001,44.732947],[-74.893936,44.733842],[-74.8931,44.734116],[-74.892695,44.73425],[-74.89047100000001,44.73502],[-74.88968800000001,44.735314],[-74.888875,44.735602],[-74.88501100000001,44.737023],[-74.883425,44.7376],[-74.87880800000001,44.739255],[-74.876473,44.740119],[-74.874594,44.740757],[-74.873462,44.741161],[-74.872748,44.741431],[-74.87151299999999,44.741882],[-74.871049,44.742064],[-74.870616,44.742238],[-74.868876,44.743032],[-74.868439,44.743239],[-74.865613,44.744564],[-74.862695,44.745943],[-74.861947,44.746278],[-74.857034,44.748551],[-74.856022,44.749005],[-74.854519,44.749704],[-74.85385100000001,44.749997],[-74.852343,44.750701],[-74.850919,44.751398],[-74.85002900000001,44.751836],[-74.847582,44.752992],[-74.84591399999999,44.75373],[-74.84513099999999,44.754081],[-74.84432200000001,44.75447],[-74.84350999999999,44.754841],[-74.841942,44.75559],[-74.84032500000001,44.756344],[-74.839529,44.756725],[-74.839212,44.756874],[-74.837816,44.757521],[-74.837113,44.757799],[-74.836375,44.758056],[-74.834243,44.758748],[-74.83331699999999,44.759049],[-74.832072,44.759471],[-74.829003,44.760502],[-74.828608,44.760615],[-74.828526,44.76098],[-74.828442,44.761176],[-74.828311,44.761373],[-74.828217,44.761482],[-74.827973,44.761726],[-74.827067,44.762563],[-74.82649600000001,44.763091],[-74.82639500000001,44.763184],[-74.82623100000001,44.76334],[-74.82564499999999,44.763892],[-74.825346,44.764173],[-74.822001,44.767148],[-74.82193599999999,44.767212],[-74.820598,44.768536],[-74.82011,44.769025],[-74.819597,44.769507],[-74.819115,44.769988],[-74.81819400000001,44.770955],[-74.816839,44.77241],[-74.816565,44.772715],[-74.81595799999999,44.773398],[-74.815437,44.774003],[-74.81520399999999,44.774267],[-74.814605,44.774862],[-74.81411900000001,44.775332],[-74.81348800000001,44.775911],[-74.812757,44.776591],[-74.81223799999999,44.777079],[-74.811809,44.777438],[-74.811301,44.777779],[-74.810574,44.778227],[-74.809878,44.778703],[-74.807506,44.780376],[-74.80573800000001,44.781555],[-74.80417300000001,44.782528],[-74.80314,44.78318],[-74.79945600000001,44.785511],[-74.79912299999999,44.785732],[-74.795744,44.787831],[-74.793423,44.789247],[-74.79082200000001,44.790874],[-74.790408,44.791148],[-74.790053,44.791422],[-74.789648,44.791828],[-74.788774,44.792762],[-74.785612,44.790966],[-74.785465,44.791154],[-74.785392,44.791292],[-74.78534000000001,44.791481],[-74.784875,44.792018],[-74.78525399999999,44.79309],[-74.785231,44.793945],[-74.785218,44.794293],[-74.784965,44.794948],[-74.78418000000001,44.795533],[-74.780798,44.797655],[-74.780547,44.797406],[-74.776951,44.793779],[-74.775199,44.79203],[-74.77455399999999,44.791378],[-74.766161,44.782742],[-74.758844,44.77535],[-74.75846799999999,44.774962],[-74.755945,44.772403],[-74.75287899999999,44.769217],[-74.749611,44.765888],[-74.74630399999999,44.762616],[-74.740233,44.756452],[-74.73362400000001,44.749872],[-74.73063500000001,44.746598],[-74.71405900000001,44.729875],[-74.718521,44.727764],[-74.721687,44.726258],[-74.726336,44.72407],[-74.72757300000001,44.723486],[-74.740099,44.71758],[-74.746262,44.71463],[-74.746881,44.714335],[-74.749577,44.7131],[-74.76818,44.704464],[-74.76873500000001,44.704187],[-74.77012499999999,44.703657],[-74.774495,44.701667],[-74.77816900000001,44.699975],[-74.783827,44.697382],[-74.785049,44.696827],[-74.79072600000001,44.694209],[-74.792171,44.693547],[-74.797281,44.6912],[-74.80287800000001,44.688631],[-74.805526,44.687422],[-74.808558,44.68603],[-74.817429,44.682052],[-74.817941,44.681823],[-74.825357,44.678407],[-74.82803800000001,44.677043],[-74.83080699999999,44.675751],[-74.834761,44.674031],[-74.83958699999999,44.671885],[-74.84731499999999,44.668423],[-74.84863300000001,44.667822],[-74.8545,44.665145],[-74.861839,44.661846],[-74.86277200000001,44.661421],[-74.870048,44.658092],[-74.87447,44.656104],[-74.88887200000001,44.649756],[-74.88933400000001,44.650233],[-74.89609799999999,44.657377],[-74.89663299999999,44.657943],[-74.899694,44.661176],[-74.90161500000001,44.663208],[-74.906814,44.668702],[-74.908325,44.670261],[-74.90938800000001,44.67135],[-74.91601799999999,44.678516],[-74.917599,44.680236],[-74.920463,44.683215],[-74.922912,44.685773],[-74.925072,44.687887],[-74.927998,44.691116],[-74.928725,44.691923],[-74.929484,44.692762],[-74.93276299999999,44.696365],[-74.935655,44.69939],[-74.936328,44.700108],[-74.93769399999999,44.701533],[-74.9375,44.701674]]],"type":"Polygon"}
}