{
  "id": "360050395001",
  "type": "Feature",
  "properties": {
    "area_land":72469,
    "area_water":0,
    "geoid":"360050395001",
    "name":"Block Group 1",
    "state":"ny"
},
  "bbox": [
    -73.897087,
    40.851082,
    -73.893071,
    40.854629
],
  "geometry": {"coordinates":[[[-73.897087,40.851969],[-73.896624,40.852787],[-73.89560899999999,40.854571],[-73.89541699999999,40.85458],[-73.895149,40.854629],[-73.893984,40.854247],[-73.894205,40.853855],[-73.89371300000001,40.853595],[-73.89307100000001,40.85325],[-73.894318,40.851891],[-73.89478800000001,40.851082],[-73.895563,40.851469],[-73.896722,40.851851],[-73.896936,40.85192],[-73.897087,40.851969]]],"type":"Polygon"}
}