{
  "id": "360670147001",
  "type": "Feature",
  "properties": {
    "area_land":2933656,
    "area_water":0,
    "geoid":"360670147001",
    "name":"Block Group 1",
    "state":"ny"
},
  "bbox": [
    -76.093345,
    43.010863,
    -76.059706,
    43.037677
],
  "geometry": {"coordinates":[[[-76.093345,43.037247],[-76.088229,43.037354],[-76.08360500000001,43.037562],[-76.083617,43.037064],[-76.082151,43.036066],[-76.079199,43.036371],[-76.07817300000001,43.036573],[-76.07743000000001,43.037677],[-76.077021,43.037467],[-76.07633300000001,43.037131],[-76.07581999999999,43.03693],[-76.075202,43.036741],[-76.07498699999999,43.036684],[-76.07427300000001,43.036535],[-76.074084,43.036497],[-76.073391,43.036358],[-76.072114,43.036101],[-76.070914,43.035861],[-76.07074,43.035826],[-76.070162,43.03571],[-76.067843,43.035249],[-76.066953,43.035065],[-76.06626199999999,43.034938],[-76.06558699999999,43.034796],[-76.065443,43.034766],[-76.064858,43.034643],[-76.064154,43.034494],[-76.063293,43.034306],[-76.06323399999999,43.034292],[-76.062856,43.034205],[-76.06201799999999,43.034017],[-76.060686,43.033719],[-76.060227,43.033614],[-76.05970600000001,43.033496],[-76.060346,43.032751],[-76.06090500000001,43.032104],[-76.061421,43.031474],[-76.061708,43.031069],[-76.06195200000001,43.030664],[-76.062051,43.030446],[-76.062246,43.030043],[-76.062363,43.029714],[-76.062453,43.029419],[-76.06251399999999,43.029168],[-76.06253599999999,43.028928],[-76.062487,43.027589],[-76.062364,43.025891],[-76.06227,43.024375],[-76.062275,43.024148],[-76.062321,43.023475],[-76.062415,43.022811],[-76.062547,43.022288],[-76.06271599999999,43.021727],[-76.062943,43.02117],[-76.063081,43.020867],[-76.063238,43.020552],[-76.06357199999999,43.019956],[-76.063783,43.019636],[-76.06407,43.019233],[-76.064359,43.018867],[-76.064695,43.018474],[-76.064921,43.018229],[-76.065421,43.017751],[-76.06568900000001,43.017514],[-76.066216,43.017082],[-76.06627899999999,43.017032],[-76.06643200000001,43.01692],[-76.066926,43.016559],[-76.067307,43.016317],[-76.067705,43.016078],[-76.068123,43.015836],[-76.069304,43.014201],[-76.069388,43.014096],[-76.069671,43.013835],[-76.06993900000001,43.01363],[-76.070627,43.013067],[-76.071209,43.012611],[-76.072501,43.011588],[-76.072799,43.011383],[-76.07293300000001,43.011307],[-76.073249,43.011157],[-76.073526,43.011049],[-76.07392400000001,43.010955],[-76.074119,43.010925],[-76.07459799999999,43.010863],[-76.07478399999999,43.011559],[-76.074935,43.012096],[-76.07525,43.011982],[-76.075271,43.012321],[-76.07524600000001,43.012501],[-76.07520700000001,43.012563],[-76.07516800000001,43.012599],[-76.075081,43.012639],[-76.075141,43.012916],[-76.075155,43.013264],[-76.075131,43.013582],[-76.07490900000001,43.015272],[-76.074836,43.015588],[-76.074759,43.015763],[-76.074636,43.015958],[-76.07451,43.016108],[-76.07401,43.016593],[-76.073753,43.016902],[-76.073564,43.017179],[-76.07352299999999,43.017255],[-76.073362,43.017583],[-76.07316299999999,43.018076],[-76.072891,43.018795],[-76.072822,43.019072],[-76.072807,43.019325],[-76.072846,43.019881],[-76.072866,43.020082],[-76.073032,43.022242],[-76.073109,43.023099],[-76.07313000000001,43.023436],[-76.07311300000001,43.023669],[-76.073053,43.023905],[-76.072956,43.024128],[-76.072891,43.024248],[-76.072565,43.02482],[-76.072152,43.025553],[-76.071585,43.026552],[-76.071466,43.026771],[-76.071388,43.026983],[-76.071347,43.027209],[-76.07118800000001,43.028682],[-76.071096,43.029309],[-76.070948,43.03026],[-76.070913,43.030382],[-76.071208,43.030508],[-76.07134499999999,43.030555],[-76.072379,43.030918],[-76.07265599999999,43.031016],[-76.07418,43.031586],[-76.07457100000001,43.03171],[-76.074877,43.031769],[-76.075244,43.031801],[-76.07562,43.031786],[-76.07589,43.031762],[-76.076626,43.031667],[-76.07694499999999,43.031637],[-76.07778500000001,43.031595],[-76.07908,43.031553],[-76.079644,43.031535],[-76.08045799999999,43.031487],[-76.082435,43.031376],[-76.083262,43.031338],[-76.085694,43.031245],[-76.087082,43.0312],[-76.089133,43.031116],[-76.09048799999999,43.031066],[-76.091291,43.031019],[-76.09178199999999,43.03098],[-76.09218300000001,43.030899],[-76.092496,43.0308],[-76.09265600000001,43.03107],[-76.092758,43.031315],[-76.092805,43.031564],[-76.09288599999999,43.032336],[-76.09294800000001,43.032948],[-76.093112,43.034473],[-76.093345,43.037247]]],"type":"Polygon"}
}