{
  "id": "360930205004",
  "type": "Feature",
  "properties": {
    "area_land":266001,
    "area_water":0,
    "geoid":"360930205004",
    "name":"Block Group 4",
    "state":"ny"
},
  "bbox": [
    -73.918822,
    42.808081,
    -73.908185,
    42.813825
],
  "geometry": {"coordinates":[[[-73.91882200000001,42.810025],[-73.916168,42.81183],[-73.91327800000001,42.813825],[-73.91198,42.813299],[-73.910715,42.812836],[-73.90945000000001,42.812371],[-73.908941,42.812184],[-73.908185,42.811908],[-73.912053,42.809273],[-73.91232100000001,42.809091],[-73.91304700000001,42.808081],[-73.914672,42.808733],[-73.916048,42.809184],[-73.91748699999999,42.809589],[-73.917801,42.809668],[-73.91882200000001,42.810025]]],"type":"Polygon"}
}