{
  "id": "360610072006",
  "type": "Feature",
  "properties": {
    "area_land":13118,
    "area_water":0,
    "geoid":"360610072006",
    "name":"Block Group 6",
    "state":"ny"
},
  "bbox": [
    -73.980209,
    40.745058,
    -73.978121,
    40.746402
],
  "geometry": {"coordinates":[[[-73.979724,40.746402],[-73.978121,40.745726],[-73.978607,40.745058],[-73.980209,40.745734],[-73.979724,40.746402]]],"type":"Polygon"}
}