{
  "id": "360999504001",
  "type": "Feature",
  "properties": {
    "area_land":14064147,
    "area_water":371165,
    "geoid":"360999504001",
    "name":"Block Group 1",
    "state":"ny"
},
  "bbox": [
    -76.854254,
    42.900576,
    -76.800737,
    42.947492
],
  "geometry": {"coordinates":[[[-76.854254,42.946112],[-76.846305,42.94641],[-76.84407299999999,42.946485],[-76.833753,42.946888],[-76.828783,42.947082],[-76.82658499999999,42.947168],[-76.81801900000001,42.947492],[-76.818006,42.947413],[-76.81796,42.947179],[-76.81794600000001,42.947109],[-76.817937,42.947065],[-76.817331,42.943795],[-76.817052,42.942353],[-76.81676899999999,42.941022],[-76.816399,42.939195],[-76.816275,42.938388],[-76.816143,42.937466],[-76.81591299999999,42.936109],[-76.815798,42.935507],[-76.815793,42.935484],[-76.81562099999999,42.934665],[-76.815181,42.932752],[-76.814699,42.930766],[-76.813766,42.926913],[-76.81348,42.925833],[-76.813259,42.924939],[-76.812867,42.92346],[-76.812676,42.922763],[-76.81261000000001,42.922527],[-76.812178,42.921185],[-76.811823,42.92001],[-76.81169300000001,42.919629],[-76.811487,42.918916],[-76.8113,42.918116],[-76.811181,42.917518],[-76.811099,42.917095],[-76.811055,42.916872],[-76.81094,42.916225],[-76.81086000000001,42.915749],[-76.81083599999999,42.915598],[-76.810802,42.915488],[-76.81077399999999,42.915458],[-76.81069599999999,42.915402],[-76.81062799999999,42.915383],[-76.810518,42.915377],[-76.809117,42.91544],[-76.808271,42.915481],[-76.80718,42.915547],[-76.807025,42.915548],[-76.806748,42.915551],[-76.805381,42.915629],[-76.803034,42.915706],[-76.80241599999999,42.915726],[-76.802364,42.915713],[-76.802313,42.915673],[-76.80229,42.91562],[-76.802245,42.915004],[-76.802205,42.914123],[-76.802153,42.913306],[-76.802091,42.912343],[-76.802087,42.912293],[-76.80208500000001,42.91226],[-76.802083,42.912235],[-76.80207799999999,42.912133],[-76.802042,42.911419],[-76.801924,42.911419],[-76.801924,42.910558],[-76.801503,42.91056],[-76.801472,42.910267],[-76.801424,42.910024],[-76.800862,42.910089],[-76.800838,42.909899],[-76.800822,42.909777],[-76.800803,42.909633],[-76.800737,42.90918],[-76.800794,42.909165],[-76.800994,42.909118],[-76.801417,42.909071],[-76.801928,42.909042],[-76.80238,42.909056],[-76.803189,42.909063],[-76.80345199999999,42.909042],[-76.80371,42.909001],[-76.804348,42.908918],[-76.804698,42.908852],[-76.80526399999999,42.908721],[-76.80582800000001,42.908627],[-76.806408,42.908531],[-76.806707,42.908451],[-76.806915,42.908422],[-76.807385,42.908429],[-76.80801599999999,42.90848],[-76.80826399999999,42.908519],[-76.808545,42.908581],[-76.808829,42.908681],[-76.808933,42.9087],[-76.808947,42.908683],[-76.80893399999999,42.908649],[-76.808893,42.908637],[-76.80883300000001,42.908604],[-76.80883300000001,42.908564],[-76.808853,42.908541],[-76.808882,42.908526],[-76.808971,42.908524],[-76.809083,42.908537],[-76.80949099999999,42.908652],[-76.809972,42.908834],[-76.810202,42.908899],[-76.810979,42.909052],[-76.811288,42.909096],[-76.811533,42.909111],[-76.811762,42.90914],[-76.812029,42.909147],[-76.812501,42.909085],[-76.812961,42.909001],[-76.81330699999999,42.908987],[-76.813526,42.909023],[-76.81363,42.909078],[-76.813757,42.909092],[-76.81394,42.909089],[-76.81407400000001,42.909063],[-76.81412899999999,42.909041],[-76.814198,42.908994],[-76.81441700000001,42.908779],[-76.81452299999999,42.908728],[-76.814807,42.908637],[-76.815077,42.908597],[-76.815321,42.90855],[-76.815394,42.90855],[-76.81545300000001,42.908561],[-76.8155,42.908593],[-76.815628,42.908713],[-76.815697,42.908703],[-76.815766,42.90867],[-76.81598700000001,42.908622],[-76.816486,42.908569],[-76.816616,42.908558],[-76.81671900000001,42.908549],[-76.81707900000001,42.908528],[-76.817864,42.908506],[-76.81814900000001,42.908506],[-76.81920700000001,42.908404],[-76.81983099999999,42.90836],[-76.820189,42.908302],[-76.82048399999999,42.908225],[-76.821253,42.907952],[-76.821454,42.907905],[-76.821682,42.907821],[-76.821952,42.907697],[-76.82241999999999,42.907387],[-76.822971,42.906972],[-76.823379,42.906684],[-76.823609,42.906484],[-76.82400800000001,42.90601],[-76.824241,42.905799],[-76.824427,42.905646],[-76.824617,42.905522],[-76.824828,42.905402],[-76.824952,42.905355],[-76.825022,42.90534],[-76.82522,42.90522],[-76.825406,42.905071],[-76.825468,42.905034],[-76.825541,42.905016],[-76.825683,42.905005],[-76.82575300000001,42.904921],[-76.82575900000001,42.904897],[-76.825789,42.904819],[-76.825822,42.904779],[-76.826123,42.904546],[-76.826436,42.904327],[-76.82671000000001,42.904112],[-76.82704699999999,42.903887],[-76.82716000000001,42.903788],[-76.827444,42.90357],[-76.827765,42.903373],[-76.828006,42.903242],[-76.82871,42.9029],[-76.828901,42.902808],[-76.82924,42.902662],[-76.829719,42.902477],[-76.829883,42.902382],[-76.830215,42.902244],[-76.83029500000001,42.9022],[-76.830394,42.902171],[-76.830591,42.902167],[-76.83067800000001,42.902142],[-76.830934,42.901999],[-76.83103699999999,42.901989],[-76.83114,42.902014],[-76.831209,42.90201],[-76.831289,42.901985],[-76.83135799999999,42.901945],[-76.831402,42.901897],[-76.831468,42.901861],[-76.83161699999999,42.901814],[-76.831694,42.901814],[-76.83179199999999,42.901846],[-76.83187599999999,42.901857],[-76.832128,42.901806],[-76.832277,42.901795],[-76.83259200000001,42.901795],[-76.832695,42.901788],[-76.832932,42.901755],[-76.833026,42.901715],[-76.833096,42.901701],[-76.833566,42.901679],[-76.83369399999999,42.901628],[-76.833821,42.90161],[-76.83404400000001,42.901621],[-76.834262,42.90153],[-76.834332,42.901515],[-76.834408,42.901511],[-76.834592,42.90153],[-76.834844,42.9015],[-76.835081,42.901497],[-76.83513600000001,42.901479],[-76.83529,42.901391],[-76.83545100000001,42.90138],[-76.83549499999999,42.901406],[-76.835517,42.901438],[-76.835553,42.901449],[-76.835611,42.901449],[-76.83576499999999,42.901415],[-76.835925,42.90138],[-76.836038,42.901402],[-76.836085,42.901428],[-76.836144,42.901424],[-76.83623799999999,42.901391],[-76.83641299999999,42.901377],[-76.83667800000001,42.901333],[-76.83694800000001,42.901315],[-76.837028,42.901289],[-76.83717,42.901267],[-76.837411,42.901245],[-76.83757799999999,42.90126],[-76.83795000000001,42.901275],[-76.83799399999999,42.901256],[-76.83802,42.901169],[-76.83804499999999,42.901157],[-76.838114,42.901147],[-76.838318,42.901158],[-76.838936,42.901125],[-76.83923,42.901089],[-76.83979100000001,42.901049],[-76.840225,42.901049],[-76.840462,42.90103],[-76.840586,42.900998],[-76.840869,42.900969],[-76.841613,42.900958],[-76.841707,42.90095],[-76.842012,42.90087],[-76.84243499999999,42.900808],[-76.843284,42.900735],[-76.843383,42.900721],[-76.84357799999999,42.900666],[-76.84413600000001,42.900576],[-76.844143,42.9009],[-76.842206,42.901098],[-76.842231,42.901218],[-76.842321,42.902217],[-76.842356,42.902572],[-76.842398,42.903221],[-76.842483,42.904606],[-76.842516,42.905073],[-76.842535,42.905359],[-76.842562,42.905565],[-76.842676,42.909858],[-76.842704,42.910119],[-76.843312,42.918096],[-76.843395,42.918092],[-76.844009,42.918064],[-76.8443,42.918056],[-76.844549,42.91805],[-76.845438,42.917991],[-76.846183,42.917955],[-76.84805,42.917923],[-76.851508,42.917838],[-76.852315,42.917821],[-76.85301200000001,42.926934],[-76.853154,42.929131],[-76.85337199999999,42.932268],[-76.853677,42.936648],[-76.853797,42.938672],[-76.85423299999999,42.945778],[-76.854254,42.946112]]],"type":"Polygon"}
}