{
  "id": "360610237002",
  "type": "Feature",
  "properties": {
    "area_land":27224,
    "area_water":0,
    "geoid":"360610237002",
    "name":"Block Group 2",
    "state":"ny"
},
  "bbox": [
    -73.949688,
    40.829599,
    -73.947226,
    40.831695
],
  "geometry": {"coordinates":[[[-73.949462,40.830962],[-73.94925600000001,40.831695],[-73.947226,40.830846],[-73.947684,40.830223],[-73.948139,40.829599],[-73.94968799999999,40.830244],[-73.949462,40.830962]]],"type":"Polygon"}
}