{
  "id": "360530303002",
  "type": "Feature",
  "properties": {
    "area_land":4839278,
    "area_water":0,
    "geoid":"360530303002",
    "name":"Block Group 2",
    "state":"ny"
},
  "bbox": [
    -75.787628,
    43.07438,
    -75.754332,
    43.097742
],
  "geometry": {"coordinates":[[[-75.787611,43.081929],[-75.787572,43.082149],[-75.787492,43.082423],[-75.787431,43.082582],[-75.78727600000001,43.08287],[-75.787104,43.083154],[-75.787055,43.083261],[-75.786956,43.083498],[-75.78693199999999,43.08373],[-75.78695,43.083946],[-75.787012,43.084432],[-75.78700499999999,43.084716],[-75.786967,43.08496],[-75.78687600000001,43.08529],[-75.786824,43.085473],[-75.786784,43.085527],[-75.786748,43.085549],[-75.786676,43.085581],[-75.78610500000001,43.085686],[-75.78558,43.085796],[-75.78466,43.085972],[-75.784519,43.086008],[-75.78429800000001,43.086098],[-75.78408,43.086204],[-75.783507,43.086536],[-75.782495,43.087149],[-75.781986,43.087441],[-75.781317,43.087859],[-75.78113999999999,43.087933],[-75.780996,43.087965],[-75.780827,43.087962],[-75.780703,43.087947],[-75.780182,43.087816],[-75.77863499999999,43.087384],[-75.777845,43.087175],[-75.777418,43.087051],[-75.777051,43.086973],[-75.77683,43.086942],[-75.776366,43.086909],[-75.775859,43.086913],[-75.775794,43.086898],[-75.775706,43.086854],[-75.775622,43.086778],[-75.77553899999999,43.086667],[-75.774947,43.086801],[-75.774505,43.086861],[-75.774056,43.086903],[-75.77372,43.086916],[-75.773788,43.087064],[-75.774,43.087422],[-75.774621,43.088346],[-75.77495500000001,43.088871],[-75.77516,43.089162],[-75.77525300000001,43.089277],[-75.776478,43.091041],[-75.776618,43.091235],[-75.776731,43.091388],[-75.776815,43.091504],[-75.77694200000001,43.091688],[-75.77733499999999,43.092175],[-75.777596,43.092421],[-75.77781,43.09259],[-75.778184,43.092856],[-75.77804,43.093022],[-75.777957,43.093103],[-75.777795,43.093204],[-75.77734,43.093435],[-75.77711600000001,43.093511],[-75.776931,43.093552],[-75.776888,43.093558],[-75.776741,43.093555],[-75.77643399999999,43.093516],[-75.776106,43.093462],[-75.775801,43.093424],[-75.775687,43.09342],[-75.775384,43.093438],[-75.77504500000001,43.093498],[-75.77480199999999,43.093586],[-75.774621,43.093664],[-75.77440300000001,43.093787],[-75.77418900000001,43.093941],[-75.77400799999999,43.094168],[-75.773703,43.094591],[-75.77361999999999,43.094716],[-75.77327699999999,43.095234],[-75.773078,43.095522],[-75.77305699999999,43.095552],[-75.772882,43.095805],[-75.772734,43.096004],[-75.77264099999999,43.096127],[-75.772355,43.096519],[-75.772046,43.09699],[-75.77187499999999,43.097233],[-75.771771,43.097402],[-75.77161099999999,43.097661],[-75.77157099999999,43.097742],[-75.77144199999999,43.097681],[-75.77123,43.097462],[-75.771103,43.097332],[-75.77104199999999,43.09725],[-75.770977,43.097218],[-75.770732,43.097137],[-75.77063699999999,43.097094],[-75.770567,43.097018],[-75.77038,43.096741],[-75.770286,43.096684],[-75.7702,43.096672],[-75.76977599999999,43.096676],[-75.76974,43.096668],[-75.76964599999999,43.096623],[-75.769621,43.096586],[-75.769552,43.096334],[-75.76951099999999,43.096269],[-75.769454,43.096252],[-75.769346,43.096278],[-75.768823,43.096463],[-75.768514,43.096537],[-75.768253,43.096574],[-75.767687,43.096676],[-75.76753600000001,43.09668],[-75.767436,43.096668],[-75.767358,43.096643],[-75.767212,43.09657],[-75.767155,43.096554],[-75.767083,43.096536],[-75.76658500000001,43.09654],[-75.76619700000001,43.096532],[-75.766121,43.096548],[-75.765787,43.096664],[-75.765613,43.096683],[-75.765525,43.096679],[-75.765197,43.096604],[-75.764979,43.096584],[-75.76475499999999,43.096608],[-75.76435600000001,43.096731],[-75.764104,43.096799],[-75.763842,43.096827],[-75.763722,43.096827],[-75.763492,43.096811],[-75.763301,43.096819],[-75.762908,43.096851],[-75.762788,43.096847],[-75.762596,43.096811],[-75.76235,43.096719],[-75.76216599999999,43.096707],[-75.761619,43.096787],[-75.761504,43.096843],[-75.76136200000001,43.096947],[-75.76124799999999,43.096987],[-75.761062,43.096995],[-75.760887,43.096987],[-75.76067399999999,43.096959],[-75.760205,43.096935],[-75.760064,43.096643],[-75.759587,43.095704],[-75.759142,43.094754],[-75.758672,43.093819],[-75.75822700000001,43.092908],[-75.757738,43.091959],[-75.75744299999999,43.091473],[-75.756925,43.090656],[-75.756823,43.090497],[-75.756452,43.089896],[-75.756229,43.089528],[-75.755802,43.088871],[-75.755662,43.088652],[-75.755599,43.088553],[-75.754637,43.087059],[-75.75437599999999,43.086626],[-75.75433200000001,43.086491],[-75.75435,43.086157],[-75.75444899999999,43.085101],[-75.754537,43.084192],[-75.754559,43.08371],[-75.75462,43.083116],[-75.75469699999999,43.082265],[-75.754758,43.081797],[-75.754831,43.080886],[-75.754856,43.080623],[-75.754955,43.079611],[-75.754971,43.079449],[-75.75499499999999,43.079165],[-75.75500099999999,43.079082],[-75.755073,43.078265],[-75.755127,43.077644],[-75.75518,43.077065],[-75.755206,43.076799],[-75.75905,43.076461],[-75.760115,43.076357],[-75.76069,43.076303],[-75.762683,43.076114],[-75.764285,43.075983],[-75.76554899999999,43.075852],[-75.765655,43.075841],[-75.767296,43.075723],[-75.768372,43.075622],[-75.77060299999999,43.07543],[-75.772293,43.075312],[-75.77397499999999,43.07521],[-75.775502,43.075104],[-75.777216,43.075002],[-75.78085299999999,43.074729],[-75.78416,43.074448],[-75.78482700000001,43.07438],[-75.784862,43.074603],[-75.784925,43.075262],[-75.78494499999999,43.075432],[-75.784989,43.075755],[-75.78507999999999,43.076462],[-75.785144,43.076908],[-75.78519799999999,43.077126],[-75.785282,43.077322],[-75.785454,43.077579],[-75.786598,43.078934],[-75.78693,43.079376],[-75.787221,43.079853],[-75.787454,43.08035],[-75.787541,43.080671],[-75.78758500000001,43.08091],[-75.787628,43.081626],[-75.787611,43.081929]]],"type":"Polygon"}
}