{
  "id": "360070132023",
  "type": "Feature",
  "properties": {
    "area_land":388509,
    "area_water":0,
    "geoid":"360070132023",
    "name":"Block Group 3",
    "state":"ny"
},
  "bbox": [
    -76.03893,
    42.115291,
    -76.017691,
    42.118488
],
  "geometry": {"coordinates":[[[-76.03892999999999,42.117217],[-76.037362,42.117282],[-76.03644199999999,42.117326],[-76.03264299999999,42.117488],[-76.03175400000001,42.117533],[-76.03092599999999,42.117572],[-76.030091,42.117598],[-76.029589,42.117624],[-76.028774,42.117687],[-76.028319,42.117732],[-76.027918,42.117791],[-76.027546,42.117878],[-76.02726699999999,42.117958],[-76.026819,42.118076],[-76.026606,42.118093],[-76.026329,42.118104],[-76.02485,42.11817],[-76.022372,42.118304],[-76.021863,42.11833],[-76.021066,42.11837],[-76.019794,42.11843],[-76.018681,42.118488],[-76.018022,42.117175],[-76.017911,42.116916],[-76.017843,42.116739],[-76.017691,42.11624],[-76.019352,42.116207],[-76.019944,42.116178],[-76.0205,42.116146],[-76.020695,42.116136],[-76.02213500000001,42.116075],[-76.02328199999999,42.116025],[-76.02430699999999,42.115978],[-76.025013,42.115948],[-76.025272,42.115937],[-76.02636200000001,42.11589],[-76.027733,42.115829],[-76.02815699999999,42.115811],[-76.02916399999999,42.115773],[-76.032021,42.115643],[-76.033162,42.115593],[-76.035353,42.115497],[-76.03628399999999,42.115455],[-76.03717399999999,42.115414],[-76.03743299999999,42.115402],[-76.038093,42.115355],[-76.038777,42.115291],[-76.03886300000001,42.116316],[-76.03889700000001,42.116779],[-76.03892999999999,42.117217]]],"type":"Polygon"}
}