{
  "id": "360850177004",
  "type": "Feature",
  "properties": {
    "area_land":650684,
    "area_water":1404,
    "geoid":"360850177004",
    "name":"Block Group 4",
    "state":"ny"
},
  "bbox": [
    -74.11132,
    40.590376,
    -74.093755,
    40.599065
],
  "geometry": {"coordinates":[[[-74.11132000000001,40.597551],[-74.110252,40.597819],[-74.108695,40.598307],[-74.107405,40.59888],[-74.10699200000001,40.599065],[-74.106506,40.598922],[-74.106298,40.598829],[-74.106123,40.598697],[-74.106049,40.598484],[-74.106013,40.59825],[-74.106105,40.597996],[-74.106122,40.59795],[-74.10632,40.597737],[-74.10654,40.597561],[-74.106892,40.597269],[-74.10712599999999,40.597005],[-74.107311,40.596669],[-74.107591,40.596268],[-74.106996,40.595182],[-74.10665400000001,40.594557],[-74.105976,40.594986],[-74.105619,40.595215],[-74.105638,40.595383],[-74.10568000000001,40.595561],[-74.10573100000001,40.595712],[-74.10580899999999,40.595884],[-74.105915,40.596064],[-74.106025,40.596215],[-74.106163,40.59637],[-74.10630999999999,40.596509],[-74.106341,40.596542],[-74.106156,40.596585],[-74.105214,40.596367],[-74.104883,40.59598],[-74.10427199999999,40.595264],[-74.103966,40.595541],[-74.10338400000001,40.596087],[-74.101534,40.594953],[-74.100949,40.595505],[-74.099864,40.596049],[-74.100545,40.596541],[-74.101304,40.59708],[-74.10072599999999,40.597692],[-74.100019,40.597298],[-74.099332,40.598011],[-74.098066,40.597544],[-74.097065,40.597945],[-74.096153,40.597616],[-74.095015,40.597204],[-74.093755,40.596745],[-74.09427599999999,40.596449],[-74.094903,40.596296],[-74.095862,40.595951],[-74.097221,40.595365],[-74.097987,40.594931],[-74.098069,40.594881],[-74.098738,40.594488],[-74.09902700000001,40.59432],[-74.099492,40.594048],[-74.099796,40.593871],[-74.100067,40.593641],[-74.100415,40.593343],[-74.10053000000001,40.593196],[-74.100641,40.593028],[-74.10074,40.592847],[-74.10081700000001,40.592668],[-74.10083,40.592632],[-74.100976,40.591832],[-74.100905,40.59102],[-74.10126200000001,40.591032],[-74.10533599999999,40.590545],[-74.10688,40.590376],[-74.107223,40.590809],[-74.10762200000001,40.591315],[-74.107879,40.591618],[-74.108285,40.591976],[-74.109167,40.592446],[-74.110641,40.593252],[-74.11018,40.594859],[-74.110378,40.5953],[-74.110786,40.596127],[-74.11131,40.597057],[-74.11132000000001,40.597551]]],"type":"Polygon"}
}