{
  "id": "360610267001",
  "type": "Feature",
  "properties": {
    "area_land":47338,
    "area_water":0,
    "geoid":"360610267001",
    "name":"Block Group 1",
    "state":"ny"
},
  "bbox": [
    -73.930621,
    40.84815,
    -73.92708,
    40.852488
],
  "geometry": {"coordinates":[[[-73.930466,40.848697],[-73.930013,40.849314],[-73.929835,40.849595],[-73.929633,40.849913],[-73.929423,40.850209],[-73.92920100000001,40.850523],[-73.928659,40.851184],[-73.928151,40.851863],[-73.92797299999999,40.852107],[-73.927927,40.852171],[-73.927695,40.852488],[-73.927234,40.852221],[-73.927139,40.85215],[-73.927103,40.85205],[-73.927086,40.851872],[-73.92708,40.851432],[-73.927477,40.850694],[-73.927969,40.85015],[-73.928692,40.849549],[-73.928963,40.849223],[-73.929777,40.84815],[-73.930621,40.848481],[-73.930466,40.848697]]],"type":"Polygon"}
}