{
  "id": "360670044002",
  "type": "Feature",
  "properties": {
    "area_land":356530,
    "area_water":0,
    "geoid":"360670044002",
    "name":"Block Group 2",
    "state":"ny"
},
  "bbox": [
    -76.129797,
    43.029999,
    -76.12256,
    43.036537
],
  "geometry": {"coordinates":[[[-76.129797,43.036278],[-76.128929,43.036321],[-76.128174,43.03635],[-76.12734399999999,43.036381],[-76.12691700000001,43.036405],[-76.12594,43.036458],[-76.125653,43.036467],[-76.12499800000001,43.036493],[-76.124393,43.036537],[-76.124174,43.034229],[-76.122955,43.034276],[-76.122889,43.033631],[-76.122748,43.032131],[-76.12259,43.030475],[-76.12255999999999,43.030206],[-76.123805,43.030143],[-76.12430000000001,43.030121],[-76.124438,43.030135],[-76.127906,43.03005],[-76.129222,43.029999],[-76.129268,43.030524],[-76.129413,43.032097],[-76.12944299999999,43.032389],[-76.129458,43.03253],[-76.129586,43.033963],[-76.129797,43.036278]]],"type":"Polygon"}
}