{
  "id": "361031244021",
  "type": "Feature",
  "properties": {
    "area_land":576151,
    "area_water":19056,
    "geoid":"361031244021",
    "name":"Block Group 1",
    "state":"ny"
},
  "bbox": [
    -73.360707,
    40.674695,
    -73.348704,
    40.684283
],
  "geometry": {"coordinates":[[[-73.360527,40.679784],[-73.359954,40.680165],[-73.35932,40.680603],[-73.358739,40.681006],[-73.35864599999999,40.681085],[-73.35803,40.681615],[-73.35739599999999,40.68215],[-73.35704699999999,40.682382],[-73.35690099999999,40.682479],[-73.356758,40.682554],[-73.356708,40.68258],[-73.356337,40.682763],[-73.355903,40.682917],[-73.355435,40.683071],[-73.355046,40.683205],[-73.354242,40.683489],[-73.352926,40.683928],[-73.352323,40.684134],[-73.351889,40.684283],[-73.350875,40.682603],[-73.350562,40.681699],[-73.350352,40.680923],[-73.350241,40.680519],[-73.34936500000001,40.6773],[-73.348704,40.676229],[-73.349563,40.675784],[-73.35034,40.676646],[-73.350741,40.677096],[-73.35165000000001,40.678115],[-73.352412,40.677724],[-73.353154,40.67734],[-73.353905,40.676951],[-73.35370399999999,40.67673],[-73.35445300000001,40.676347],[-73.355194,40.67596],[-73.35696299999999,40.675052],[-73.357162,40.674825],[-73.35746,40.674695],[-73.358737,40.676012],[-73.359903,40.678153],[-73.360707,40.679681],[-73.360527,40.679784]]],"type":"Polygon"}
}