{
  "id": "360594119013",
  "type": "Feature",
  "properties": {
    "area_land":310340,
    "area_water":0,
    "geoid":"360594119013",
    "name":"Block Group 3",
    "state":"ny"
},
  "bbox": [
    -73.690139,
    40.652349,
    -73.6738,
    40.657963
],
  "geometry": {"coordinates":[[[-73.690076,40.65756],[-73.689982,40.657779],[-73.689896,40.657963],[-73.68949600000001,40.657894],[-73.68794800000001,40.657716],[-73.686308,40.657557],[-73.681546,40.656941],[-73.67956,40.656621],[-73.677358,40.656266],[-73.67556399999999,40.655934],[-73.6738,40.655625],[-73.674052,40.655437],[-73.674128,40.655376],[-73.674289,40.655272],[-73.674418,40.655188],[-73.674665,40.655014],[-73.67471500000001,40.654972],[-73.675391,40.654521],[-73.675532,40.654437],[-73.67564400000001,40.654388],[-73.67613900000001,40.654175],[-73.676303,40.654118],[-73.67655499999999,40.654009],[-73.677317,40.653681],[-73.677623,40.653556],[-73.678054,40.653314],[-73.678483,40.653072],[-73.678556,40.653018],[-73.678861,40.652845],[-73.678923,40.652811],[-73.679744,40.652349],[-73.68036499999999,40.652856],[-73.681308,40.65365],[-73.68137299999999,40.653704],[-73.68149099999999,40.653784],[-73.68207099999999,40.654209],[-73.68281899999999,40.654758],[-73.68343900000001,40.655216],[-73.683583,40.655307],[-73.683684,40.655349],[-73.684152,40.655501],[-73.685164,40.655822],[-73.686689,40.65631],[-73.68732,40.656513],[-73.688158,40.656778],[-73.688936,40.657028],[-73.689622,40.657248],[-73.689668,40.65727],[-73.689768,40.657294],[-73.690139,40.657412],[-73.690076,40.65756]]],"type":"Polygon"}
}