{
  "id": "360470495002",
  "type": "Feature",
  "properties": {
    "area_land":46414,
    "area_water":0,
    "geoid":"360470495002",
    "name":"Block Group 2",
    "state":"ny"
},
  "bbox": [
    -73.944265,
    40.710901,
    -73.942105,
    40.713955
],
  "geometry": {"coordinates":[[[-73.944265,40.713796],[-73.942583,40.713955],[-73.942466,40.713244],[-73.94235,40.712537],[-73.942228,40.711801],[-73.942105,40.71106],[-73.943788,40.710901],[-73.943911,40.711641],[-73.94403200000001,40.712378],[-73.944148,40.713087],[-73.944265,40.713796]]],"type":"Polygon"}
}