{
  "id": "361059512006",
  "type": "Feature",
  "properties": {
    "area_land":4373135,
    "area_water":18955,
    "geoid":"361059512006",
    "name":"Block Group 6",
    "state":"ny"
},
  "bbox": [
    -74.456498,
    41.559268,
    -74.416374,
    41.587541
],
  "geometry": {"coordinates":[[[-74.456498,41.566094],[-74.45602,41.566258],[-74.45317300000001,41.567089],[-74.452674,41.567248],[-74.452372,41.567388],[-74.45216600000001,41.567534],[-74.452022,41.567663],[-74.45106,41.568668],[-74.45077499999999,41.568948],[-74.45043,41.569244],[-74.44855699999999,41.570703],[-74.448126,41.571071],[-74.447924,41.571266],[-74.44631099999999,41.573114],[-74.445905,41.573597],[-74.44514100000001,41.574555],[-74.444948,41.57479],[-74.44471900000001,41.575023],[-74.44455000000001,41.575159],[-74.44426900000001,41.575324],[-74.443226,41.575862],[-74.441588,41.576749],[-74.441068,41.577056],[-74.440229,41.577613],[-74.44001299999999,41.577743],[-74.43909499999999,41.578167],[-74.43836899999999,41.578497],[-74.437647,41.578869],[-74.437423,41.578972],[-74.437017,41.579174],[-74.43685000000001,41.579237],[-74.43646099999999,41.579352],[-74.436111,41.579431],[-74.434675,41.579787],[-74.433746,41.580109],[-74.433105,41.580371],[-74.43302199999999,41.580398],[-74.43291499999999,41.580406],[-74.43279200000001,41.580399],[-74.432413,41.580947],[-74.432115,41.581451],[-74.431871,41.581976],[-74.43182299999999,41.582141],[-74.431798,41.582286],[-74.431765,41.582689],[-74.43172300000001,41.582851],[-74.43162599999999,41.583036],[-74.43144700000001,41.583293],[-74.430797,41.584174],[-74.430576,41.584418],[-74.430482,41.584496],[-74.429858,41.584923],[-74.429699,41.585049],[-74.429559,41.585198],[-74.429413,41.585419],[-74.428945,41.586351],[-74.428792,41.586624],[-74.42820500000001,41.587541],[-74.427396,41.587123],[-74.42674700000001,41.58676],[-74.426587,41.586683],[-74.42640400000001,41.586621],[-74.426023,41.58654],[-74.42552499999999,41.586467],[-74.42530499999999,41.586425],[-74.424235,41.58616],[-74.424025,41.586123],[-74.423783,41.5861],[-74.423636,41.586115],[-74.422899,41.586233],[-74.422765,41.58624],[-74.422657,41.586229],[-74.422141,41.586113],[-74.421757,41.585984],[-74.421211,41.5858],[-74.420992,41.585742],[-74.420457,41.585646],[-74.419949,41.585592],[-74.419631,41.585586],[-74.419365,41.585598],[-74.41926100000001,41.585621],[-74.41912499999999,41.585676],[-74.419042,41.585732],[-74.41893399999999,41.585827],[-74.418727,41.58599],[-74.418616,41.586037],[-74.418491,41.586051],[-74.41834299999999,41.586038],[-74.41817,41.585984],[-74.417754,41.585807],[-74.41764999999999,41.585784],[-74.417562,41.585782],[-74.417187,41.585538],[-74.416792,41.585055],[-74.416636,41.584834],[-74.41660899999999,41.584734],[-74.416601,41.584634],[-74.416612,41.584492],[-74.416651,41.584257],[-74.416713,41.584069],[-74.416813,41.583893],[-74.416922,41.583705],[-74.416968,41.583586],[-74.41702600000001,41.583324],[-74.41708800000001,41.583105],[-74.417232,41.582696],[-74.41728999999999,41.582296],[-74.417342,41.582001],[-74.417419,41.581797],[-74.417484,41.581697],[-74.417615,41.58154],[-74.417888,41.581159],[-74.41806200000001,41.580867],[-74.418374,41.580397],[-74.418516,41.58024],[-74.418577,41.580194],[-74.41868100000001,41.580124],[-74.418785,41.580086],[-74.419151,41.57999],[-74.41932199999999,41.579922],[-74.41971100000001,41.579622],[-74.419877,41.579465],[-74.419949,41.579361],[-74.419988,41.579288],[-74.42014,41.57859],[-74.42020599999999,41.578397],[-74.420321,41.578167],[-74.42041399999999,41.578055],[-74.420658,41.577799],[-74.42107,41.577292],[-74.42125299999999,41.576997],[-74.421384,41.576709],[-74.42146099999999,41.576482],[-74.421871,41.575455],[-74.421994,41.575113],[-74.42208100000001,41.574825],[-74.422123,41.574661],[-74.422158,41.574446],[-74.42215400000001,41.574361],[-74.422135,41.574288],[-74.422077,41.574157],[-74.421988,41.574073],[-74.421684,41.573922],[-74.421482,41.573736],[-74.421125,41.573296],[-74.420801,41.573002],[-74.420208,41.572405],[-74.41958200000001,41.571726],[-74.41870400000001,41.570767],[-74.41864200000001,41.570814],[-74.418575,41.570849],[-74.418464,41.570887],[-74.417953,41.571005],[-74.41759399999999,41.571061],[-74.417419,41.571073],[-74.41733000000001,41.571072],[-74.41725,41.571071],[-74.416845,41.57103],[-74.41638399999999,41.570947],[-74.416374,41.570801],[-74.416428,41.570658],[-74.416552,41.570446],[-74.416783,41.570008],[-74.416934,41.569821],[-74.417175,41.569878],[-74.417575,41.569932],[-74.417878,41.569905],[-74.418145,41.569769],[-74.418302,41.569651],[-74.418363,41.569533],[-74.41839899999999,41.569397],[-74.41840999999999,41.568928],[-74.418363,41.568772],[-74.418254,41.568609],[-74.417975,41.568337],[-74.417817,41.568146],[-74.41778100000001,41.568019],[-74.41778100000001,41.567911],[-74.41783,41.56782],[-74.417951,41.567639],[-74.418384,41.566703],[-74.418594,41.56636],[-74.418824,41.566115],[-74.419321,41.565626],[-74.419406,41.565426],[-74.419393,41.565299],[-74.41927200000001,41.565009],[-74.419054,41.564828],[-74.418909,41.564683],[-74.418836,41.564529],[-74.418812,41.56432],[-74.418836,41.563767],[-74.418909,41.563586],[-74.41909099999999,41.563405],[-74.419309,41.563223],[-74.419381,41.563096],[-74.419442,41.562906],[-74.41958700000001,41.562643],[-74.41973299999999,41.562426],[-74.419878,41.562309],[-74.42006000000001,41.562254],[-74.420266,41.562218],[-74.420484,41.562209],[-74.42076299999999,41.562236],[-74.42117500000001,41.562345],[-74.421284,41.562426],[-74.421344,41.562535],[-74.42149000000001,41.562734],[-74.42156199999999,41.562861],[-74.42165900000001,41.562906],[-74.421768,41.562942],[-74.421998,41.56296],[-74.422374,41.563015],[-74.422568,41.563024],[-74.42266499999999,41.563033],[-74.422895,41.563006],[-74.423101,41.562969],[-74.423259,41.562879],[-74.423404,41.562743],[-74.42344,41.562643],[-74.423416,41.562508],[-74.42337999999999,41.562408],[-74.423331,41.562145],[-74.423162,41.56181],[-74.423028,41.561402],[-74.42300400000001,41.561275],[-74.42300400000001,41.561157],[-74.423053,41.560894],[-74.42300400000001,41.560595],[-74.42298,41.560296],[-74.42299199999999,41.560224],[-74.423028,41.560078],[-74.423113,41.559979],[-74.423198,41.559942],[-74.42330699999999,41.559879],[-74.423598,41.559843],[-74.423901,41.559788],[-74.424119,41.559716],[-74.42430400000001,41.559678],[-74.424519,41.559598],[-74.424639,41.559517],[-74.42481600000001,41.559461],[-74.425039,41.559401],[-74.425237,41.559387],[-74.425484,41.559348],[-74.42582299999999,41.559302],[-74.42608300000001,41.559268],[-74.426289,41.559666],[-74.426631,41.560307],[-74.427173,41.561184],[-74.427256,41.561311],[-74.427679,41.561913],[-74.427864,41.562167],[-74.428495,41.562973],[-74.42873299999999,41.563266],[-74.429193,41.563775],[-74.429384,41.563968],[-74.429894,41.564436],[-74.430486,41.5649],[-74.430921,41.565199],[-74.431202,41.565373],[-74.431596,41.565596],[-74.431916,41.565764],[-74.43239699999999,41.565998],[-74.43311300000001,41.566296],[-74.433807,41.566544],[-74.434786,41.566824],[-74.435768,41.567068],[-74.43646099999999,41.567218],[-74.437449,41.567392],[-74.43860599999999,41.567559],[-74.439168,41.567622],[-74.440352,41.567717],[-74.440738,41.567739],[-74.441489,41.567782],[-74.44171299999999,41.567793],[-74.442624,41.56782],[-74.443121,41.567831],[-74.44399300000001,41.567835],[-74.445256,41.567809],[-74.446956,41.567725],[-74.448669,41.567581],[-74.449399,41.567492],[-74.45012199999999,41.567383],[-74.450829,41.56725],[-74.45155,41.567076],[-74.45250900000001,41.5668],[-74.453484,41.566462],[-74.453976,41.566291],[-74.45484,41.565973],[-74.45540699999999,41.565781],[-74.456039,41.5656],[-74.456143,41.565754],[-74.456282,41.565906],[-74.456498,41.566094]]],"type":"Polygon"}
}