{
  "id": "360470393002",
  "type": "Feature",
  "properties": {
    "area_land":60954,
    "area_water":0,
    "geoid":"360470393002",
    "name":"Block Group 2",
    "state":"ny"
},
  "bbox": [
    -73.935222,
    40.694674,
    -73.929894,
    40.697315
],
  "geometry": {"coordinates":[[[-73.935222,40.696986],[-73.93400800000001,40.697118],[-73.932835,40.697247],[-73.932267,40.697315],[-73.931842,40.697077],[-73.931084,40.696659],[-73.93049999999999,40.696337],[-73.930348,40.696254],[-73.929894,40.696004],[-73.931145,40.694674],[-73.93145800000001,40.694855],[-73.93177300000001,40.695028],[-73.931929,40.695115],[-73.932366,40.695358],[-73.93311799999999,40.695791],[-73.93382800000001,40.696184],[-73.934134,40.696359],[-73.934797,40.696737],[-73.935222,40.696986]]],"type":"Polygon"}
}