{
  "id": "360811010014",
  "type": "Feature",
  "properties": {
    "area_land":117596,
    "area_water":0,
    "geoid":"360811010014",
    "name":"Block Group 4",
    "state":"ny"
},
  "bbox": [
    -73.753356,
    40.60063,
    -73.745405,
    40.60426
],
  "geometry": {"coordinates":[[[-73.75285,40.60426],[-73.752121,40.603809],[-73.751746,40.603603],[-73.751051,40.603273],[-73.750355,40.602893],[-73.74970500000001,40.60259],[-73.74878099999999,40.602802],[-73.747562,40.603078],[-73.747114,40.603147],[-73.746453,40.603291],[-73.74574,40.603403],[-73.745628,40.602638],[-73.74540500000001,40.601955],[-73.74666000000001,40.60174],[-73.74706999999999,40.601453],[-73.747637,40.601039],[-73.748749,40.601935],[-73.75058199999999,40.60063],[-73.75068899999999,40.600746],[-73.750815,40.600854],[-73.750957,40.600952],[-73.751114,40.601038],[-73.751283,40.601109],[-73.75145999999999,40.601166],[-73.751642,40.601206],[-73.751825,40.601231],[-73.75172000000001,40.601544],[-73.751499,40.602203],[-73.75217000000001,40.602295],[-73.753356,40.602274],[-73.75285,40.60426]]],"type":"Polygon"}
}