{
  "id": "360594071011",
  "type": "Feature",
  "properties": {
    "area_land":335813,
    "area_water":0,
    "geoid":"360594071011",
    "name":"Block Group 1",
    "state":"ny"
},
  "bbox": [
    -73.617451,
    40.695462,
    -73.608834,
    40.702545
],
  "geometry": {"coordinates":[[[-73.617368,40.700666],[-73.617299,40.70074],[-73.615663,40.701246],[-73.615475,40.701295],[-73.615323,40.701346],[-73.615223,40.70138],[-73.612554,40.702238],[-73.611633,40.702545],[-73.611171,40.70195],[-73.61096499999999,40.701686],[-73.61083600000001,40.701499],[-73.610465,40.700924],[-73.609981,40.700189],[-73.60986,40.700024],[-73.609619,40.69974],[-73.609011,40.698945],[-73.608834,40.698706],[-73.60950200000001,40.697981],[-73.610043,40.697408],[-73.60999200000001,40.69738],[-73.61062200000001,40.696719],[-73.610968,40.696584],[-73.611099,40.696801],[-73.613049,40.696131],[-73.61487,40.695499],[-73.614974,40.695462],[-73.615065,40.6956],[-73.61538400000001,40.696083],[-73.61546,40.696216],[-73.615562,40.696365],[-73.61557500000001,40.696403],[-73.615619,40.696524],[-73.615703,40.696983],[-73.61571000000001,40.697021],[-73.615864,40.697885],[-73.61587400000001,40.697988],[-73.61588500000001,40.69809],[-73.616023,40.698665],[-73.616851,40.6998],[-73.617451,40.700577],[-73.617368,40.700666]]],"type":"Polygon"}
}