{
  "id": "360070124002",
  "type": "Feature",
  "properties": {
    "area_land":28511598,
    "area_water":85014,
    "geoid":"360070124002",
    "name":"Block Group 2",
    "state":"ny"
},
  "bbox": [
    -75.496797,
    42.045218,
    -75.42219,
    42.107889
],
  "geometry": {"coordinates":[[[-75.496762,42.051551],[-75.49672700000001,42.051794],[-75.496686,42.052079],[-75.49658599999999,42.052718],[-75.496521,42.052982],[-75.49636700000001,42.053414],[-75.496292,42.053598],[-75.49582100000001,42.054761],[-75.495628,42.055363],[-75.49538699999999,42.056339],[-75.49528100000001,42.056799],[-75.495042,42.057829],[-75.495001,42.057998],[-75.494941,42.058248],[-75.49477899999999,42.058896],[-75.49475200000001,42.058987],[-75.49463799999999,42.059255],[-75.49444800000001,42.059581],[-75.49411499999999,42.060014],[-75.49363700000001,42.060588],[-75.49345099999999,42.060837],[-75.493252,42.061164],[-75.49313100000001,42.061427],[-75.49307,42.061624],[-75.49301699999999,42.061944],[-75.492913,42.063133],[-75.492836,42.063624],[-75.492757,42.063855],[-75.492651,42.064089],[-75.492484,42.06436],[-75.492317,42.064584],[-75.491991,42.064906],[-75.491124,42.065626],[-75.489779,42.066721],[-75.489278,42.067117],[-75.48835699999999,42.06788],[-75.488157,42.06809],[-75.487928,42.068386],[-75.48782199999999,42.068584],[-75.487218,42.070028],[-75.487077,42.070298],[-75.48686499999999,42.070591],[-75.48673599999999,42.070728],[-75.486496,42.07097],[-75.486205,42.071196],[-75.48556499999999,42.071559],[-75.484961,42.071879],[-75.48474400000001,42.072],[-75.484486,42.072176],[-75.484075,42.072492],[-75.483591,42.072924],[-75.48344400000001,42.073062],[-75.482473,42.073968],[-75.482185,42.074253],[-75.48197399999999,42.074497],[-75.48178299999999,42.074778],[-75.481554,42.075283],[-75.481413,42.075653],[-75.481337,42.075973],[-75.48127599999999,42.076231],[-75.481229,42.076841],[-75.481178,42.078476],[-75.481177,42.078605],[-75.481183,42.079087],[-75.481206,42.079601],[-75.481275,42.080484],[-75.481343,42.081785],[-75.48136100000001,42.082427],[-75.481362,42.082495],[-75.48133,42.08352],[-75.481335,42.083699],[-75.481324,42.084181],[-75.48133900000001,42.084702],[-75.48136599999999,42.085018],[-75.48169300000001,42.086554],[-75.481717,42.08678],[-75.481717,42.087431],[-75.481606,42.090815],[-75.481604,42.09157],[-75.481641,42.091993],[-75.48173199999999,42.092595],[-75.481855,42.093491],[-75.481944,42.094082],[-75.48196799999999,42.094408],[-75.481972,42.094812],[-75.481883,42.096296],[-75.481894,42.096606],[-75.481955,42.096928],[-75.482029,42.097195],[-75.48222800000001,42.097768],[-75.48229499999999,42.098163],[-75.48231699999999,42.098395],[-75.482327,42.098652],[-75.48239,42.098975],[-75.48241899999999,42.099071],[-75.48260999999999,42.09943],[-75.48275099999999,42.099667],[-75.48294,42.100022],[-75.483052,42.100291],[-75.48311200000001,42.100554],[-75.483136,42.100805],[-75.48316699999999,42.101901],[-75.48321799999999,42.102447],[-75.48293,42.102427],[-75.48229499999999,42.102448],[-75.481945,42.102506],[-75.481548,42.102591],[-75.480998,42.102709],[-75.47991500000001,42.102975],[-75.478515,42.103335],[-75.477013,42.103687],[-75.476619,42.103782],[-75.475239,42.104118],[-75.474619,42.104271],[-75.473465,42.104407],[-75.473034,42.104479],[-75.472692,42.104578],[-75.47193799999999,42.104841],[-75.471208,42.10507],[-75.470792,42.105182],[-75.470555,42.105237],[-75.470251,42.10527],[-75.46981100000001,42.105259],[-75.46931600000001,42.105201],[-75.468112,42.10508],[-75.466669,42.105],[-75.466114,42.104997],[-75.465221,42.105062],[-75.464251,42.105164],[-75.46404699999999,42.105193],[-75.46372599999999,42.10527],[-75.46357999999999,42.105325],[-75.462158,42.105933],[-75.460762,42.106574],[-75.460087,42.106855],[-75.45993,42.106906],[-75.45949299999999,42.107008],[-75.459219,42.107044],[-75.457753,42.10719],[-75.457228,42.107266],[-75.45676899999999,42.107357],[-75.456335,42.107478],[-75.455792,42.107678],[-75.455234,42.107846],[-75.455063,42.107871],[-75.454837,42.107889],[-75.45462499999999,42.107878],[-75.454425,42.107849],[-75.454228,42.107802],[-75.453998,42.107722],[-75.45371400000001,42.107605],[-75.45321800000001,42.107376],[-75.452386,42.106949],[-75.451938,42.106691],[-75.451723,42.106516],[-75.45147900000001,42.106232],[-75.451329,42.106015],[-75.45129900000001,42.105972],[-75.451143,42.105711],[-75.450946,42.105328],[-75.450782,42.105073],[-75.450549,42.10476],[-75.450301,42.104465],[-75.449416,42.103511],[-75.448779,42.102825],[-75.448398,42.10245],[-75.44794899999999,42.1021],[-75.44743099999999,42.10175],[-75.44723399999999,42.10159],[-75.447136,42.101488],[-75.446983,42.101277],[-75.446603,42.100648],[-75.446428,42.100382],[-75.446168,42.100067],[-75.445911,42.099783],[-75.445812,42.099688],[-75.44559700000001,42.09951],[-75.445437,42.099415],[-75.445185,42.099306],[-75.44495499999999,42.099229],[-75.44427,42.099029],[-75.443945,42.098919],[-75.443708,42.098828],[-75.44273099999999,42.098369],[-75.442531,42.098286],[-75.442392,42.098238],[-75.442246,42.098205],[-75.44194,42.098176],[-75.441513,42.098165],[-75.440591,42.098187],[-75.439876,42.098226],[-75.43970899999999,42.098216],[-75.43956300000001,42.098187],[-75.439395,42.098136],[-75.439297,42.098092],[-75.43919200000001,42.098018],[-75.438793,42.097626],[-75.43864000000001,42.097488],[-75.437999,42.096974],[-75.437856,42.096821],[-75.437769,42.096664],[-75.437663,42.096296],[-75.437535,42.095961],[-75.43734600000001,42.095624],[-75.437259,42.0955],[-75.437084,42.0953],[-75.436213,42.094536],[-75.43598,42.094294],[-75.43547100000001,42.093628],[-75.435393,42.093554],[-75.43517900000001,42.093413],[-75.435039,42.093345],[-75.43485,42.093274],[-75.43465999999999,42.093239],[-75.434651,42.093188],[-75.434444,42.092663],[-75.434181,42.091713],[-75.433992,42.090913],[-75.433944,42.090646],[-75.433896,42.090214],[-75.433893,42.090034],[-75.433999,42.087664],[-75.43395599999999,42.087286],[-75.43389999999999,42.087039],[-75.43379,42.086756],[-75.43360800000001,42.086456],[-75.433403,42.086184],[-75.433316,42.086078],[-75.433241,42.085961],[-75.433121,42.085724],[-75.433052,42.085599],[-75.432935,42.085439],[-75.432778,42.085289],[-75.43264000000001,42.085194],[-75.432163,42.084935],[-75.431027,42.084369],[-75.4306,42.084144],[-75.43032700000001,42.083962],[-75.430156,42.083833],[-75.42983700000001,42.083616],[-75.42963399999999,42.083492],[-75.429333,42.083325],[-75.42853100000001,42.08293],[-75.427809,42.082606],[-75.42636299999999,42.081938],[-75.426064,42.081778],[-75.425938,42.081692],[-75.425766,42.08155],[-75.42558,42.081363],[-75.425462,42.081197],[-75.425309,42.080892],[-75.425236,42.080642],[-75.424797,42.078352],[-75.424688,42.077624],[-75.42463600000001,42.077007],[-75.424544,42.07545],[-75.424531,42.075243],[-75.424452,42.074738],[-75.42423599999999,42.074693],[-75.424116,42.074638],[-75.42401700000001,42.074573],[-75.423928,42.074495],[-75.42376400000001,42.074252],[-75.42361,42.074064],[-75.423483,42.073951],[-75.423125,42.073667],[-75.423115,42.073657],[-75.42262599999999,42.073168],[-75.422472,42.073035],[-75.422369,42.072929],[-75.422222,42.072727],[-75.42219,42.072489],[-75.422245,42.070889],[-75.42229,42.07051],[-75.42232799999999,42.07037],[-75.422355,42.070315],[-75.42243499999999,42.070231],[-75.422194,42.070241],[-75.422224,42.068618],[-75.422225,42.068581],[-75.422231,42.068227],[-75.42223199999999,42.068127],[-75.422252,42.066765],[-75.422256,42.066496],[-75.422257,42.066456],[-75.42227200000001,42.065437],[-75.422324,42.06272],[-75.422326,42.062593],[-75.422346,42.061097],[-75.422346,42.061085],[-75.422358,42.060221],[-75.42236699999999,42.059564],[-75.422364,42.059533],[-75.422325,42.059145],[-75.422326,42.059123],[-75.422327,42.059098],[-75.422327,42.059087],[-75.422329,42.059018],[-75.42233299999999,42.058906],[-75.422347,42.058508],[-75.42235700000001,42.058192],[-75.422358,42.058147],[-75.422369,42.05785],[-75.42237,42.057823],[-75.42237,42.057813],[-75.422371,42.057796],[-75.422372,42.057779],[-75.422372,42.057766],[-75.422374,42.057701],[-75.422377,42.057604],[-75.422406,42.05679],[-75.422622,42.05597],[-75.422631,42.055936],[-75.42263699999999,42.055913],[-75.422814,42.055924],[-75.423137,42.055926],[-75.42334099999999,42.055927],[-75.42393300000001,42.055909],[-75.42418000000001,42.055891],[-75.42469,42.055832],[-75.424797,42.055819],[-75.424826,42.055816],[-75.42495099999999,42.055801],[-75.425015,42.055793],[-75.42530600000001,42.055742],[-75.42600299999999,42.0556],[-75.42638599999999,42.055498],[-75.4269,42.055345],[-75.42734400000001,42.055176],[-75.43253,42.05321],[-75.43440699999999,42.052507],[-75.43495799999999,42.052335],[-75.435261,42.052259],[-75.436026,42.05208],[-75.436679,42.051967],[-75.437178,42.051905],[-75.43750300000001,42.051876],[-75.437994,42.051848],[-75.43846000000001,42.051834],[-75.439015,42.051834],[-75.440009,42.051886],[-75.44028900000001,42.051911],[-75.440758,42.051938],[-75.441182,42.051962],[-75.44126199999999,42.051966],[-75.441734,42.051991],[-75.44326599999999,42.052087],[-75.443985,42.052111],[-75.444694,42.052087],[-75.44493,42.052066],[-75.445078,42.052053],[-75.44537,42.052022],[-75.445628,42.051985],[-75.446049,42.051901],[-75.44643000000001,42.051811],[-75.44687,42.051683],[-75.447446,42.051478],[-75.447744,42.051348],[-75.448249,42.051094],[-75.448701,42.050829],[-75.449134,42.050536],[-75.44942,42.050311],[-75.449454,42.050285],[-75.45099500000001,42.049051],[-75.452578,42.047786],[-75.453175,42.047301],[-75.454284,42.046485],[-75.454579,42.046294],[-75.455016,42.046057],[-75.45565999999999,42.04578],[-75.456075,42.045627],[-75.456487,42.045506],[-75.457161,42.045362],[-75.457398,42.045322],[-75.45784,42.045266],[-75.458268,42.045227],[-75.458556,42.045218],[-75.459279,42.045227],[-75.45966,42.045259],[-75.460081,42.045308],[-75.46066399999999,42.045411],[-75.461051,42.045501],[-75.461291,42.04557],[-75.46144200000001,42.045614],[-75.46174999999999,42.04572],[-75.462407,42.045985],[-75.466559,42.04795],[-75.467108,42.048192],[-75.467341,42.048285],[-75.46785,42.048463],[-75.467952,42.048496],[-75.46827999999999,42.048594],[-75.468968,42.048781],[-75.46992899999999,42.048972],[-75.47063199999999,42.049099],[-75.472159,42.049359],[-75.473195,42.049545],[-75.475371,42.049924],[-75.475753,42.049994],[-75.47638499999999,42.05011],[-75.477035,42.050219],[-75.477661,42.050327],[-75.47866,42.050466],[-75.479089,42.050502],[-75.479761,42.050543],[-75.480433,42.050544],[-75.48075799999999,42.050532],[-75.481126,42.050518],[-75.483164,42.050383],[-75.483887,42.050349],[-75.484758,42.050342],[-75.48554900000001,42.050393],[-75.486013,42.050439],[-75.486858,42.050568],[-75.489332,42.051044],[-75.490104,42.05117],[-75.490864,42.051275],[-75.491613,42.051351],[-75.49267500000001,42.051417],[-75.493133,42.051428],[-75.493492,42.051436],[-75.493967,42.051441],[-75.494469,42.051429],[-75.49479100000001,42.05142],[-75.495676,42.051363],[-75.496531,42.051284],[-75.496797,42.051251],[-75.496762,42.051551]]],"type":"Polygon"}
}