{
  "id": "360470996001",
  "type": "Feature",
  "properties": {
    "area_land":96547,
    "area_water":0,
    "geoid":"360470996001",
    "name":"Block Group 1",
    "state":"ny"
},
  "bbox": [
    -73.911437,
    40.632205,
    -73.90595,
    40.63622
],
  "geometry": {"coordinates":[[[-73.91143700000001,40.633857],[-73.910668,40.634355],[-73.909955,40.634816],[-73.909238,40.635275],[-73.90852700000001,40.63574],[-73.90778400000001,40.63622],[-73.907135,40.635634],[-73.90595,40.634575],[-73.90670900000001,40.634106],[-73.907421,40.633645],[-73.908135,40.633184],[-73.90885,40.632722],[-73.90959700000001,40.632205],[-73.91028,40.632818],[-73.910889,40.633368],[-73.91143700000001,40.633857]]],"type":"Polygon"}
}