{
  "id": "360550019001",
  "type": "Feature",
  "properties": {
    "area_land":1294096,
    "area_water":109709,
    "geoid":"360550019001",
    "name":"Block Group 1",
    "state":"ny"
},
  "bbox": [
    -77.63874,
    43.192635,
    -77.619678,
    43.205991
],
  "geometry": {"coordinates":[[[-77.638717,43.202027],[-77.63870900000001,43.202849],[-77.638687,43.204064],[-77.638679,43.204808],[-77.63866400000001,43.205716],[-77.62896600000001,43.205682],[-77.62748999999999,43.205922],[-77.626833,43.205978],[-77.62668499999999,43.205991],[-77.625629,43.203375],[-77.62240300000001,43.20063],[-77.62112500000001,43.199063],[-77.61971,43.196569],[-77.61967799999999,43.19406],[-77.62038200000001,43.192635],[-77.62063000000001,43.192746],[-77.620659,43.192759],[-77.621004,43.192923],[-77.621135,43.192985],[-77.621709,43.193248],[-77.622857,43.193716],[-77.623334,43.193909],[-77.62357900000001,43.194026],[-77.62364100000001,43.194055],[-77.62381999999999,43.194137],[-77.623999,43.194214],[-77.62423,43.194147],[-77.624526,43.194198],[-77.62491,43.194234],[-77.625294,43.194239],[-77.62567199999999,43.194234],[-77.626036,43.194214],[-77.62651200000001,43.194198],[-77.626946,43.194178],[-77.627785,43.194173],[-77.62813,43.194299],[-77.628319,43.194379],[-77.628518,43.194466],[-77.628787,43.194624],[-77.62907800000001,43.194821],[-77.629283,43.194947],[-77.629503,43.195085],[-77.63000700000001,43.195427],[-77.63030500000001,43.195634],[-77.63215,43.196757],[-77.632599,43.197039],[-77.632825,43.197163],[-77.63305099999999,43.197319],[-77.633191,43.197416],[-77.633262,43.197526],[-77.634925,43.198533],[-77.636021,43.199187],[-77.63637,43.199395],[-77.636572,43.199493],[-77.637565,43.199925],[-77.63874,43.200421],[-77.638717,43.202027]]],"type":"Polygon"}
}