{
  "id": "360810287004",
  "type": "Feature",
  "properties": {
    "area_land":33565,
    "area_water":0,
    "geoid":"360810287004",
    "name":"Block Group 4",
    "state":"ny"
},
  "bbox": [
    -73.890948,
    40.7512,
    -73.889332,
    40.755071
],
  "geometry": {"coordinates":[[[-73.89094799999999,40.754974],[-73.890013,40.755071],[-73.889684,40.753243],[-73.889332,40.751297],[-73.89026200000001,40.7512],[-73.890613,40.753145],[-73.89094799999999,40.754974]]],"type":"Polygon"}
}