{
  "id": "360470281001",
  "type": "Feature",
  "properties": {
    "area_land":41105,
    "area_water":0,
    "geoid":"360470281001",
    "name":"Block Group 1",
    "state":"ny"
},
  "bbox": [
    -73.940265,
    40.692683,
    -73.937049,
    40.694485
],
  "geometry": {"coordinates":[[[-73.940265,40.694148],[-73.937342,40.694485],[-73.937195,40.693752],[-73.937049,40.693021],[-73.938959,40.6928],[-73.939971,40.692683],[-73.940118,40.693416],[-73.940265,40.694148]]],"type":"Polygon"}
}