{
  "id": "360610154002",
  "type": "Feature",
  "properties": {
    "area_land":18264,
    "area_water":0,
    "geoid":"360610154002",
    "name":"Block Group 2",
    "state":"ny"
},
  "bbox": [
    -73.948501,
    40.781316,
    -73.94567,
    40.782942
],
  "geometry": {"coordinates":[[[-73.94803899999999,40.782942],[-73.94567000000001,40.781947],[-73.94613099999999,40.781316],[-73.94655899999999,40.781497],[-73.94850099999999,40.782317],[-73.94803899999999,40.782942]]],"type":"Polygon"}
}