{
  "id": "360670027001",
  "type": "Feature",
  "properties": {
    "area_land":207717,
    "area_water":0,
    "geoid":"360670027001",
    "name":"Block Group 1",
    "state":"ny"
},
  "bbox": [
    -76.197928,
    43.049409,
    -76.187716,
    43.054688
],
  "geometry": {"coordinates":[[[-76.19745399999999,43.052814],[-76.19646299999999,43.053193],[-76.196196,43.052801],[-76.195977,43.052515],[-76.195761,43.052179],[-76.19566399999999,43.052067],[-76.19564099999999,43.052057],[-76.195594,43.052059],[-76.194997,43.052286],[-76.194834,43.052339],[-76.194709,43.052367],[-76.19454500000001,43.052409],[-76.193297,43.052881],[-76.19277099999999,43.053079],[-76.19264200000001,43.053126],[-76.190709,43.053854],[-76.189751,43.054234],[-76.189002,43.054508],[-76.188593,43.054688],[-76.188574,43.054663],[-76.188405,43.054496],[-76.188339,43.054455],[-76.18832500000001,43.054378],[-76.188241,43.054227],[-76.188,43.053906],[-76.187979,43.05385],[-76.18788499999999,43.053664],[-76.18785099999999,43.053649],[-76.18780099999999,43.053599],[-76.18772199999999,43.053461],[-76.18771599999999,43.053353],[-76.187826,43.052444],[-76.18798,43.052437],[-76.188109,43.052409],[-76.188287,43.052349],[-76.189136,43.051986],[-76.189341,43.051908],[-76.18965300000001,43.051789],[-76.191322,43.051155],[-76.193321,43.050395],[-76.194751,43.049852],[-76.195262,43.049626],[-76.19529300000001,43.049607],[-76.19556300000001,43.049409],[-76.19638500000001,43.050516],[-76.197002,43.051376],[-76.19710600000001,43.051521],[-76.197928,43.052628],[-76.19745399999999,43.052814]]],"type":"Polygon"}
}