{
  "id": "360594121005",
  "type": "Feature",
  "properties": {
    "area_land":550322,
    "area_water":0,
    "geoid":"360594121005",
    "name":"Block Group 5",
    "state":"ny"
},
  "bbox": [
    -73.678385,
    40.639985,
    -73.664706,
    40.649128
],
  "geometry": {"coordinates":[[[-73.678376,40.640147],[-73.67823199999999,40.641197],[-73.678127,40.64209],[-73.67812499999999,40.64215],[-73.678073,40.642438],[-73.678033,40.642528],[-73.677964,40.642611],[-73.677784,40.642731],[-73.67686500000001,40.643276],[-73.676158,40.643697],[-73.67551400000001,40.644078],[-73.675449,40.64412],[-73.67473699999999,40.644542],[-73.67309299999999,40.645515],[-73.673028,40.645547],[-73.672995,40.645575],[-73.672653,40.64578],[-73.670732,40.646924],[-73.670345,40.647155],[-73.67016099999999,40.647077],[-73.669116,40.646634],[-73.668919,40.64654],[-73.66813500000001,40.647267],[-73.667012,40.648308],[-73.66628300000001,40.648984],[-73.66613599999999,40.649128],[-73.665372,40.648309],[-73.66517,40.648097],[-73.665052,40.647937],[-73.664731,40.64731],[-73.66471300000001,40.647255],[-73.664706,40.647124],[-73.664759,40.646873],[-73.664914,40.646065],[-73.664935,40.646002],[-73.664945,40.645913],[-73.66496600000001,40.645784],[-73.66502800000001,40.645456],[-73.665065,40.645335],[-73.66531500000001,40.644793],[-73.66542200000001,40.644556],[-73.665432,40.644486],[-73.66547,40.644359],[-73.66549999999999,40.644183],[-73.665504,40.643333],[-73.665504,40.641762],[-73.66548899999999,40.641437],[-73.66570400000001,40.6415],[-73.66592,40.641583],[-73.66597,40.641618],[-73.66668199999999,40.641898],[-73.66675499999999,40.641927],[-73.667056,40.642041],[-73.66712800000001,40.642053],[-73.66789199999999,40.64206],[-73.668014,40.64207],[-73.66873099999999,40.642076],[-73.669376,40.642081],[-73.66947999999999,40.642073],[-73.669596,40.642082],[-73.66995300000001,40.642039],[-73.670264,40.64199],[-73.670568,40.641962],[-73.67115699999999,40.641889],[-73.671853,40.641785],[-73.67234000000001,40.641708],[-73.67287,40.6416],[-73.67297000000001,40.64156],[-73.672994,40.641561],[-73.673593,40.641401],[-73.67438199999999,40.641179],[-73.67441100000001,40.641181],[-73.67443799999999,40.641165],[-73.674862,40.641049],[-73.675332,40.640922],[-73.675403,40.64091],[-73.675479,40.64088],[-73.675714,40.640815],[-73.675754,40.640776],[-73.675782,40.640763],[-73.676084,40.640671],[-73.676883,40.640397],[-73.677132,40.640305],[-73.67721899999999,40.640297],[-73.67727600000001,40.640281],[-73.677674,40.64014],[-73.677832,40.640085],[-73.678135,40.640003],[-73.678251,40.639985],[-73.67838500000001,40.640003],[-73.678376,40.640147]]],"type":"Polygon"}
}