{
  "id": "360850247001",
  "type": "Feature",
  "properties": {
    "area_land":211867,
    "area_water":0,
    "geoid":"360850247001",
    "name":"Block Group 1",
    "state":"ny"
},
  "bbox": [
    -74.147536,
    40.62493,
    -74.140602,
    40.631156
],
  "geometry": {"coordinates":[[[-74.14738,40.629827],[-74.14691000000001,40.631156],[-74.145916,40.630968],[-74.14570000000001,40.630927],[-74.14398199999999,40.6306],[-74.143756,40.630554],[-74.14340300000001,40.630488],[-74.14255,40.630327],[-74.140602,40.629658],[-74.140787,40.629512],[-74.141124,40.629214],[-74.14185500000001,40.62854],[-74.142189,40.62762],[-74.142318,40.62718],[-74.142404,40.626951],[-74.142689,40.626229],[-74.142951,40.625797],[-74.14301500000001,40.625711],[-74.14308800000001,40.625614],[-74.143278,40.625528],[-74.143641,40.625441],[-74.14387499999999,40.625412],[-74.144063,40.625338],[-74.14408400000001,40.625421],[-74.14502899999999,40.625127],[-74.14576700000001,40.624958],[-74.146145,40.62493],[-74.145776,40.625972],[-74.14559,40.626608],[-74.145509,40.62708],[-74.14547399999999,40.627406],[-74.14546300000001,40.627887],[-74.145644,40.627863],[-74.14593600000001,40.627824],[-74.14613300000001,40.629075],[-74.147536,40.629371],[-74.14738,40.629827]]],"type":"Polygon"}
}