{
  "id": "360210001001",
  "type": "Feature",
  "properties": {
    "area_land":55853655,
    "area_water":301438,
    "geoid":"360210001001",
    "name":"Block Group 1",
    "state":"ny"
},
  "bbox": [
    -73.521781,
    42.429441,
    -73.352429,
    42.510017
],
  "geometry": {"coordinates":[[[-73.521687,42.442852],[-73.520763,42.451999],[-73.52021499999999,42.458564],[-73.520051,42.460783],[-73.520155,42.464142],[-73.52018099999999,42.465051],[-73.52032199999999,42.470059],[-73.520332,42.470624],[-73.520337,42.470905],[-73.519899,42.471103],[-73.519738,42.471149],[-73.519671,42.471222],[-73.51963499999999,42.471243],[-73.519536,42.471217],[-73.519396,42.471279],[-73.519302,42.471352],[-73.519333,42.471435],[-73.519276,42.471487],[-73.519115,42.471482],[-73.51902200000001,42.47158],[-73.518953,42.471635],[-73.518756,42.471688],[-73.518591,42.471689],[-73.51855999999999,42.471725],[-73.51854400000001,42.471824],[-73.518529,42.471881],[-73.518466,42.471881],[-73.518435,42.471918],[-73.518399,42.471954],[-73.518368,42.472027],[-73.518331,42.472074],[-73.518243,42.47212],[-73.518129,42.472131],[-73.51803,42.47212],[-73.517994,42.472172],[-73.517875,42.472167],[-73.517698,42.472235],[-73.517438,42.472193],[-73.517048,42.472395],[-73.51628700000001,42.472841],[-73.516212,42.472912],[-73.51608899999999,42.47321],[-73.516025,42.473329],[-73.515942,42.473396],[-73.515826,42.473448],[-73.51537399999999,42.473579],[-73.514745,42.473816],[-73.51464300000001,42.473874],[-73.514607,42.473922],[-73.514591,42.474096],[-73.51455900000001,42.474136],[-73.51418200000001,42.474434],[-73.514122,42.474466],[-73.513991,42.474473],[-73.513801,42.474422],[-73.513685,42.474422],[-73.513189,42.474384],[-73.512927,42.474356],[-73.51275200000001,42.474321],[-73.512601,42.474269],[-73.51246999999999,42.47421],[-73.512371,42.47415],[-73.51233499999999,42.474126],[-73.512005,42.473789],[-73.511799,42.473614],[-73.5116,42.473509],[-73.511289,42.473374],[-73.51125500000001,42.473354],[-73.511155,42.473319],[-73.51102400000001,42.473251],[-73.510921,42.473152],[-73.510841,42.4731],[-73.510631,42.473033],[-73.51055100000001,42.472995],[-73.510317,42.472765],[-73.510194,42.472682],[-73.510015,42.472531],[-73.509809,42.472285],[-73.509697,42.47221],[-73.509435,42.472087],[-73.50933999999999,42.472023],[-73.509173,42.471846],[-73.50909,42.471771],[-73.508931,42.471696],[-73.508836,42.471668],[-73.50867700000001,42.471594],[-73.508416,42.471996],[-73.50822700000001,42.472375],[-73.508146,42.472634],[-73.50809099999999,42.473035],[-73.508048,42.47322],[-73.507982,42.473439],[-73.507544,42.474485],[-73.507424,42.474869],[-73.507357,42.475142],[-73.507214,42.475721],[-73.507209,42.475742],[-73.507136,42.475967],[-73.506936,42.476419],[-73.506826,42.476612],[-73.506489,42.477089],[-73.506214,42.477399],[-73.505138,42.478485],[-73.50414600000001,42.479465],[-73.50394,42.47963],[-73.50382,42.479709],[-73.50358799999999,42.479829],[-73.503373,42.479928],[-73.502931,42.480088],[-73.502731,42.480148],[-73.502392,42.480223],[-73.50177600000001,42.480314],[-73.500569,42.480529],[-73.499557,42.480755],[-73.499261,42.480816],[-73.49910800000001,42.480811],[-73.499009,42.480774],[-73.49893,42.4807],[-73.49888900000001,42.480627],[-73.498638,42.479945],[-73.49843300000001,42.479443],[-73.498327,42.479252],[-73.49826400000001,42.47916],[-73.498159,42.479037],[-73.49808299999999,42.478977],[-73.49781400000001,42.478848],[-73.49704199999999,42.478582],[-73.496487,42.478353],[-73.496174,42.478248],[-73.495717,42.478716],[-73.49547200000001,42.478951],[-73.49524700000001,42.479155],[-73.495137,42.479296],[-73.494978,42.479622],[-73.494652,42.480472],[-73.494535,42.480859],[-73.49441899999999,42.481299],[-73.494285,42.481692],[-73.49413300000001,42.482351],[-73.49406399999999,42.482791],[-73.494051,42.483041],[-73.49409799999999,42.483421],[-73.49421100000001,42.483849],[-73.49421100000001,42.484004],[-73.49419399999999,42.484094],[-73.494094,42.484241],[-73.493972,42.484351],[-73.49378400000001,42.484475],[-73.493055,42.484775],[-73.492903,42.484851],[-73.49273100000001,42.484994],[-73.492582,42.4852],[-73.492456,42.485347],[-73.492268,42.485472],[-73.49212900000001,42.485533],[-73.491945,42.485589],[-73.49173399999999,42.485617],[-73.491623,42.485621],[-73.491394,42.485612],[-73.49109,42.485538],[-73.49015900000001,42.485196],[-73.48954999999999,42.485002],[-73.489086,42.484902],[-73.488394,42.484843],[-73.487852,42.484877],[-73.487448,42.484936],[-73.48703399999999,42.485034],[-73.486688,42.485126],[-73.48652800000001,42.485181],[-73.486352,42.485246],[-73.486266,42.485278],[-73.486097,42.485385],[-73.486031,42.485441],[-73.485983,42.485502],[-73.485917,42.485603],[-73.485885,42.485739],[-73.48587499999999,42.486015],[-73.48581900000001,42.486204],[-73.485669,42.486515],[-73.485524,42.486685],[-73.485371,42.486806],[-73.485159,42.486956],[-73.48477099999999,42.48723],[-73.48462499999999,42.487399],[-73.48404600000001,42.488451],[-73.48358899999999,42.488226],[-73.48305499999999,42.487973],[-73.482287,42.487635],[-73.48133,42.487216],[-73.479995,42.486595],[-73.479045,42.486161],[-73.478453,42.485907],[-73.47788199999999,42.485696],[-73.47757300000001,42.485603],[-73.47683000000001,42.485429],[-73.47662800000001,42.485393],[-73.475915,42.485301],[-73.475489,42.485266],[-73.475466,42.485025],[-73.475431,42.484926],[-73.47535999999999,42.48479],[-73.475247,42.484609],[-73.475121,42.484435],[-73.474643,42.483858],[-73.473119,42.482055],[-73.47289600000001,42.481775],[-73.472793,42.481604],[-73.47269300000001,42.481398],[-73.472531,42.480805],[-73.472408,42.480513],[-73.47232700000001,42.480377],[-73.472312,42.480357],[-73.47224,42.480258],[-73.47196599999999,42.479958],[-73.47172,42.479748],[-73.471362,42.479472],[-73.471244,42.479377],[-73.47066100000001,42.478904],[-73.47049199999999,42.478741],[-73.470388,42.478615],[-73.470343,42.478545],[-73.470296,42.478424],[-73.47029000000001,42.478273],[-73.470316,42.478109],[-73.470348,42.478045],[-73.47044200000001,42.477932],[-73.4708,42.477593],[-73.471436,42.477032],[-73.471765,42.476761],[-73.472234,42.476318],[-73.472341,42.476202],[-73.472421,42.476095],[-73.47273800000001,42.475596],[-73.473145,42.474896],[-73.47335200000001,42.474585],[-73.473479,42.474405],[-73.473518,42.474361],[-73.473563,42.474312],[-73.473761,42.474127],[-73.474582,42.473475],[-73.475314,42.472865],[-73.475414,42.472573],[-73.475492,42.472362],[-73.474948,42.470731],[-73.475009,42.47028],[-73.474448,42.470013],[-73.47407699999999,42.469688],[-73.47339100000001,42.469225],[-73.472925,42.469023],[-73.471847,42.468682],[-73.471329,42.468363],[-73.47073399999999,42.467949],[-73.470141,42.467579],[-73.46940600000001,42.4673],[-73.46854500000001,42.467169],[-73.467553,42.467115],[-73.46661,42.467156],[-73.46610099999999,42.467077],[-73.46590399999999,42.467029],[-73.465816,42.467008],[-73.46493,42.466748],[-73.463621,42.466401],[-73.462284,42.466043],[-73.46164899999999,42.465699],[-73.461118,42.465229],[-73.460702,42.46456],[-73.460481,42.464135],[-73.460193,42.463182],[-73.460041,42.462844],[-73.45884,42.461575],[-73.458226,42.460946],[-73.457887,42.460652],[-73.456773,42.459986],[-73.45625800000001,42.459705],[-73.455956,42.459567],[-73.45565499999999,42.459459],[-73.455457,42.459408],[-73.455161,42.459354],[-73.454787,42.459306],[-73.454335,42.459267],[-73.454024,42.459259],[-73.453778,42.459269],[-73.45339800000001,42.459306],[-73.452557,42.45946],[-73.452037,42.459553],[-73.45138799999999,42.45965],[-73.450918,42.459697],[-73.449988,42.459719],[-73.448694,42.4597],[-73.447964,42.459629],[-73.445893,42.459356],[-73.44450000000001,42.459161],[-73.444185,42.459124],[-73.443876,42.459105],[-73.443327,42.459095],[-73.44225,42.4591],[-73.441869,42.459068],[-73.441633,42.459019],[-73.44131400000001,42.458939],[-73.440228,42.458608],[-73.439966,42.458556],[-73.43978199999999,42.458529],[-73.439716,42.458519],[-73.43946699999999,42.4585],[-73.43902799999999,42.458493],[-73.43805500000001,42.458563],[-73.43783500000001,42.458563],[-73.437516,42.458534],[-73.43734600000001,42.458501],[-73.437023,42.458418],[-73.43653399999999,42.458253],[-73.436318,42.458184],[-73.434991,42.457861],[-73.43481,42.45781],[-73.434639,42.457748],[-73.43416999999999,42.457532],[-73.433964,42.457414],[-73.433644,42.457201],[-73.43312400000001,42.45684],[-73.43168300000001,42.455886],[-73.43086599999999,42.455568],[-73.43025900000001,42.455489],[-73.42925099999999,42.455607],[-73.428183,42.456063],[-73.427301,42.456771],[-73.42676,42.458533],[-73.42653199999999,42.459438],[-73.42628999999999,42.460262],[-73.42616700000001,42.460564],[-73.42597000000001,42.460942],[-73.425614,42.461543],[-73.424919,42.462594],[-73.424603,42.463103],[-73.424493,42.463309],[-73.424398,42.463514],[-73.424136,42.464198],[-73.423783,42.465208],[-73.423686,42.465453],[-73.42359500000001,42.465613],[-73.423444,42.465843],[-73.423321,42.465981],[-73.423208,42.466084],[-73.42290300000001,42.466307],[-73.422743,42.466413],[-73.42219,42.466665],[-73.42191800000001,42.466789],[-73.421724,42.466886],[-73.421437,42.467079],[-73.42129799999999,42.467205],[-73.421192,42.467317],[-73.420962,42.467607],[-73.420749,42.467949],[-73.42064499999999,42.468152],[-73.4203,42.468052],[-73.419284,42.46771],[-73.418728,42.467523],[-73.418548,42.467474],[-73.418425,42.46744],[-73.418252,42.4674],[-73.418155,42.467378],[-73.41800499999999,42.467343],[-73.41661000000001,42.467101],[-73.4164,42.467065],[-73.41435199999999,42.466715],[-73.41399,42.466653],[-73.413506,42.46657],[-73.409755,42.465883],[-73.40814899999999,42.465575],[-73.406463,42.465284],[-73.406372,42.465269],[-73.406282,42.465253],[-73.406147,42.46523],[-73.403396,42.464768],[-73.402728,42.464678],[-73.401886,42.46458],[-73.40020199999999,42.464389],[-73.399553,42.464325],[-73.398821,42.464239],[-73.39762500000001,42.464079],[-73.39698,42.464062],[-73.396664,42.464099],[-73.39643100000001,42.464163],[-73.396241,42.464237],[-73.395991,42.464353],[-73.39549,42.464652],[-73.394019,42.4656],[-73.392515,42.466549],[-73.39259699999999,42.466707],[-73.392664,42.466891],[-73.392713,42.467143],[-73.3927,42.467462],[-73.39264799999999,42.467815],[-73.39255900000001,42.468321],[-73.39187699999999,42.472016],[-73.391811,42.472282],[-73.39176399999999,42.472434],[-73.391673,42.47267],[-73.39109999999999,42.473942],[-73.39099400000001,42.474158],[-73.390664,42.47492],[-73.3905,42.475362],[-73.39032899999999,42.475913],[-73.390258,42.476244],[-73.390248,42.47638],[-73.390258,42.476722],[-73.390311,42.477227],[-73.390356,42.478032],[-73.390353,42.478324],[-73.390413,42.479429],[-73.390632,42.481155],[-73.390632,42.481291],[-73.390593,42.481452],[-73.39051600000001,42.481607],[-73.390275,42.482034],[-73.390199,42.482182],[-73.38990699999999,42.48275],[-73.38968,42.483223],[-73.389275,42.484124],[-73.389116,42.484366],[-73.388913,42.484618],[-73.38865,42.484922],[-73.388498,42.485168],[-73.388334,42.485549],[-73.38825799999999,42.485889],[-73.38821900000001,42.486427],[-73.388189,42.487925],[-73.388147,42.488443],[-73.38808,42.488827],[-73.387736,42.490124],[-73.387581,42.490594],[-73.387294,42.49132],[-73.387235,42.491535],[-73.387005,42.492477],[-73.386815,42.493624],[-73.386495,42.495865],[-73.386421,42.496117],[-73.38630499999999,42.496336],[-73.386224,42.496452],[-73.386004,42.496688],[-73.38561199999999,42.497041],[-73.38511200000001,42.497428],[-73.384789,42.497644],[-73.38437500000001,42.497966],[-73.383762,42.498516],[-73.383168,42.499065],[-73.383087,42.499127],[-73.382093,42.499743],[-73.381834,42.499953],[-73.381668,42.500109],[-73.381501,42.500302],[-73.381114,42.50085],[-73.380701,42.501479],[-73.380608,42.501673],[-73.38054200000001,42.501874],[-73.380217,42.502773],[-73.379948,42.503339],[-73.379887,42.503505],[-73.37979900000001,42.503886],[-73.379606,42.505147],[-73.379536,42.505462],[-73.37952799999999,42.505499],[-73.37945999999999,42.505718],[-73.379293,42.506308],[-73.37910599999999,42.506935],[-73.378951,42.507516],[-73.378924,42.507633],[-73.37455199999999,42.508034],[-73.37392,42.508034],[-73.371759,42.508242],[-73.3668,42.508658],[-73.366759,42.508662],[-73.353703,42.509891],[-73.352429,42.510017],[-73.35423900000001,42.505123],[-73.356337,42.49943],[-73.356759,42.498314],[-73.35714299999999,42.49728],[-73.358639,42.493247],[-73.35930999999999,42.491417],[-73.362111,42.483793],[-73.36235000000001,42.483186],[-73.36281200000001,42.481948],[-73.363523,42.480036],[-73.364627,42.477043],[-73.365003,42.476013],[-73.369021,42.46513],[-73.369422,42.464046],[-73.369816,42.46299],[-73.374514,42.450267],[-73.374585,42.450029],[-73.37533500000001,42.44806],[-73.378595,42.439223],[-73.37883100000001,42.438569],[-73.379456,42.436883],[-73.382205,42.429441],[-73.402293,42.430906],[-73.404381,42.431056],[-73.42426399999999,42.432454],[-73.42955000000001,42.432847],[-73.432569,42.433078],[-73.434364,42.433214],[-73.440973,42.433654],[-73.443719,42.433834],[-73.449967,42.434298],[-73.451211,42.434394],[-73.452855,42.434522],[-73.457032,42.434849],[-73.462389,42.43526],[-73.46278100000001,42.435287],[-73.46709300000001,42.435583],[-73.469466,42.435764],[-73.472685,42.436011],[-73.474001,42.436113],[-73.47651,42.436307],[-73.479185,42.436515],[-73.47926200000001,42.43652],[-73.479315,42.436525],[-73.485342,42.437064],[-73.486114,42.437139],[-73.49122,42.437647],[-73.496334,42.438185],[-73.499762,42.438507],[-73.507105,42.4395],[-73.507555,42.439563],[-73.512771,42.440264],[-73.521781,42.441488],[-73.521687,42.442852]]],"type":"Polygon"}
}