{
  "id": "361190014032",
  "type": "Feature",
  "properties": {
    "area_land":124914,
    "area_water":0,
    "geoid":"361190014032",
    "name":"Block Group 2",
    "state":"ny"
},
  "bbox": [
    -73.886237,
    40.907423,
    -73.881427,
    40.913401
],
  "geometry": {"coordinates":[[[-73.88623699999999,40.908052],[-73.886111,40.908316],[-73.885469,40.909619],[-73.885385,40.909794],[-73.885144,40.9103],[-73.88503300000001,40.91056],[-73.88493200000001,40.910802],[-73.88485799999999,40.911049],[-73.884754,40.911035],[-73.884703,40.911028],[-73.884452,40.910996],[-73.88415500000001,40.910958],[-73.883753,40.910907],[-73.883251,40.910832],[-73.88318200000001,40.910822],[-73.883168,40.910889],[-73.88385599999999,40.911132],[-73.883926,40.911197],[-73.88397399999999,40.911269],[-73.88399,40.91134],[-73.883989,40.911384],[-73.883983,40.91151],[-73.883799,40.91212],[-73.883774,40.912167],[-73.883728,40.912188],[-73.88369400000001,40.912192],[-73.883321,40.912107],[-73.88287699999999,40.912041],[-73.882501,40.913401],[-73.881552,40.913219],[-73.881743,40.912631],[-73.881845,40.91222],[-73.882097,40.911951],[-73.882164,40.911849],[-73.881652,40.911573],[-73.881427,40.911453],[-73.881756,40.911093],[-73.88192600000001,40.910937],[-73.882121,40.910828],[-73.88222,40.910785],[-73.882355,40.910766],[-73.88221799999999,40.910295],[-73.882221,40.910178],[-73.882289,40.909983],[-73.882552,40.909438],[-73.882739,40.909063],[-73.882856,40.908784],[-73.882915,40.908582],[-73.882982,40.908328],[-73.883009,40.9081],[-73.88301199999999,40.907716],[-73.882998,40.907502],[-73.882993,40.907423],[-73.88405400000001,40.907497],[-73.884106,40.907501],[-73.88412700000001,40.907503],[-73.884246,40.907512],[-73.884726,40.907685],[-73.884832,40.907723],[-73.885401,40.907977],[-73.88601,40.907979],[-73.886124,40.908016],[-73.88616500000001,40.90803],[-73.88623699999999,40.908052]]],"type":"Polygon"}
}