{
  "id": "360470936001",
  "type": "Feature",
  "properties": {
    "area_land":61655,
    "area_water":0,
    "geoid":"360470936001",
    "name":"Block Group 1",
    "state":"ny"
},
  "bbox": [
    -73.923585,
    40.648658,
    -73.920581,
    40.652554
],
  "geometry": {"coordinates":[[[-73.923467,40.650834],[-73.923081,40.651855],[-73.922849,40.652463],[-73.921784,40.652491],[-73.921352,40.652517],[-73.920773,40.652554],[-73.92074599999999,40.652271],[-73.92062199999999,40.651098],[-73.920581,40.650707],[-73.920985,40.650681],[-73.92158499999999,40.650644],[-73.92138199999999,40.648717],[-73.92231200000001,40.648658],[-73.92251899999999,40.650587],[-73.92342600000001,40.65053],[-73.923585,40.65052],[-73.923467,40.650834]]],"type":"Polygon"}
}