{
  "id": "360010147001",
  "type": "Feature",
  "properties": {
    "area_land":45802111,
    "area_water":69818,
    "geoid":"360010147001",
    "name":"Block Group 1",
    "state":"ny"
},
  "bbox": [
    -74.180274,
    42.665384,
    -74.055999,
    42.739235
],
  "geometry": {"coordinates":[[[-74.180274,42.729979],[-74.168808,42.73145],[-74.155935,42.7331],[-74.155283,42.733184],[-74.15463099999999,42.733268],[-74.153716,42.733385],[-74.146111,42.734361],[-74.14017200000001,42.735125],[-74.139736,42.735179],[-74.139492,42.735209],[-74.139199,42.735248],[-74.139082,42.735263],[-74.138131,42.73535],[-74.137765,42.735384],[-74.13740900000001,42.73543],[-74.136448,42.735555],[-74.13551099999999,42.735676],[-74.12755300000001,42.736699],[-74.124566,42.737083],[-74.12032600000001,42.737573],[-74.113753,42.73833],[-74.113732,42.738333],[-74.11283899999999,42.738473],[-74.11279999999999,42.738478],[-74.112599,42.738502],[-74.112398,42.738526],[-74.11108900000001,42.738682],[-74.110646,42.738735],[-74.110203,42.738788],[-74.107648,42.739095],[-74.107074,42.739165],[-74.106499,42.739235],[-74.106448,42.739182],[-74.106315,42.739038],[-74.106269,42.738983],[-74.106179,42.738875],[-74.105965,42.738696],[-74.105755,42.738473],[-74.105312,42.737965],[-74.10525,42.737863],[-74.10513,42.7376],[-74.105068,42.737502],[-74.10499900000001,42.737447],[-74.104878,42.737378],[-74.104421,42.737083],[-74.104184,42.736883],[-74.103978,42.736588],[-74.103711,42.736153],[-74.10357999999999,42.736],[-74.103291,42.735753],[-74.10308499999999,42.735637],[-74.10298299999999,42.735604],[-74.102891,42.735593],[-74.102576,42.735615],[-74.102397,42.735597],[-74.102248,42.735571],[-74.101687,42.735407],[-74.101444,42.735318],[-74.10124,42.735243],[-74.10110899999999,42.735167],[-74.10099200000001,42.735123],[-74.100832,42.735094],[-74.100325,42.735094],[-74.09996599999999,42.735065],[-74.09974699999999,42.735036],[-74.09943,42.734916],[-74.098484,42.734449],[-74.09839599999999,42.734391],[-74.09832299999999,42.734318],[-74.098207,42.734158],[-74.098116,42.734001],[-74.097919,42.73373],[-74.09775399999999,42.733603],[-74.097578,42.733533],[-74.097326,42.733551],[-74.097134,42.733582],[-74.09702799999999,42.733604],[-74.09669,42.733673],[-74.096504,42.733699],[-74.096344,42.733699],[-74.096231,42.733688],[-74.096121,42.733659],[-74.096034,42.733619],[-74.09584,42.733491],[-74.095775,42.733422],[-74.09571699999999,42.733342],[-74.095583,42.732996],[-74.095474,42.732806],[-74.095365,42.732708],[-74.09522800000001,42.732679],[-74.0951,42.732668],[-74.094871,42.732675],[-74.09479399999999,42.732653],[-74.094758,42.732606],[-74.09474299999999,42.732559],[-74.09474299999999,42.73238],[-74.09472100000001,42.732322],[-74.09465899999999,42.732245],[-74.094112,42.731834],[-74.094021,42.731797],[-74.09369700000001,42.731761],[-74.092652,42.731616],[-74.092375,42.731586],[-74.092156,42.731572],[-74.091926,42.731586],[-74.091831,42.731565],[-74.091314,42.731328],[-74.09022400000001,42.73081],[-74.090125,42.730752],[-74.09005999999999,42.730694],[-74.090012,42.730636],[-74.089983,42.730566],[-74.089932,42.730259],[-74.089889,42.730193],[-74.089843,42.730158],[-74.089569,42.730074],[-74.089338,42.729991],[-74.08873800000001,42.729667],[-74.088537,42.729539],[-74.088392,42.729426],[-74.08831499999999,42.729339],[-74.088014,42.72904],[-74.08777600000001,42.72888],[-74.086904,42.728242],[-74.086547,42.728005],[-74.08632299999999,42.727818],[-74.08609300000001,42.727641],[-74.08541200000001,42.727046],[-74.085134,42.726957],[-74.084884,42.727003],[-74.084743,42.727085],[-74.084653,42.727222],[-74.084489,42.727404],[-74.084394,42.727488],[-74.084191,42.727582],[-74.08402,42.727619],[-74.083861,42.727582],[-74.083496,42.727346],[-74.083181,42.727117],[-74.082815,42.726892],[-74.081952,42.726468],[-74.0817,42.726285],[-74.081141,42.725857],[-74.081005,42.725721],[-74.08089,42.725569],[-74.080775,42.725501],[-74.080628,42.725464],[-74.080304,42.725485],[-74.07997400000001,42.725491],[-74.079724,42.725506],[-74.078913,42.725514],[-74.07879200000001,42.725499],[-74.07871900000001,42.725477],[-74.07840899999999,42.725284],[-74.078146,42.725188],[-74.078034,42.725153],[-74.077817,42.725066],[-74.077708,42.725],[-74.077144,42.72453],[-74.07704699999999,42.724403],[-74.07698000000001,42.724253],[-74.076892,42.723897],[-74.076866,42.723674],[-74.07678799999999,42.723571],[-74.076669,42.723524],[-74.07640499999999,42.723442],[-74.076173,42.723318],[-74.076043,42.723194],[-74.075976,42.723054],[-74.07596100000001,42.722842],[-74.075862,42.722599],[-74.075547,42.722056],[-74.075489,42.72179],[-74.07552099999999,42.721505],[-74.07550999999999,42.721288],[-74.075474,42.721185],[-74.07538099999999,42.721086],[-74.07532399999999,42.721009],[-74.07532399999999,42.720875],[-74.075371,42.720554],[-74.075462,42.720191],[-74.075684,42.71947],[-74.075677,42.719285],[-74.075616,42.719053],[-74.07545,42.718818],[-74.075249,42.718589],[-74.074963,42.7184],[-74.07471099999999,42.718303],[-74.07438399999999,42.718246],[-74.073446,42.718122],[-74.07310699999999,42.718049],[-74.072873,42.718009],[-74.07268000000001,42.718005],[-74.071966,42.718053],[-74.071718,42.718021],[-74.071511,42.717987],[-74.071347,42.717946],[-74.071209,42.717882],[-74.071071,42.717707],[-74.071006,42.717543],[-74.070911,42.717117],[-74.070882,42.716818],[-74.07089499999999,42.716581],[-74.070931,42.716506],[-74.07103499999999,42.71641],[-74.07115899999999,42.716335],[-74.07120500000001,42.716284],[-74.071229,42.716219],[-74.071209,42.71612],[-74.071123,42.716051],[-74.070961,42.715944],[-74.070775,42.715851],[-74.07051,42.71576],[-74.069759,42.71555],[-74.06905,42.715316],[-74.06783,42.71493],[-74.067528,42.714852],[-74.067229,42.714846],[-74.06686999999999,42.714972],[-74.066667,42.71503],[-74.06635900000001,42.715082],[-74.066062,42.715113],[-74.065946,42.715118],[-74.06521100000001,42.715144],[-74.06486200000001,42.715217],[-74.064643,42.715395],[-74.064491,42.715572],[-74.064314,42.715733],[-74.06399500000001,42.715857],[-74.063963,42.715869],[-74.063829,42.715885],[-74.063031,42.716384],[-74.06276,42.716539],[-74.062586,42.716601],[-74.06227,42.71679],[-74.06204200000001,42.717109],[-74.061954,42.717333],[-74.061639,42.717651],[-74.061193,42.717806],[-74.060692,42.718476],[-74.06041999999999,42.718698],[-74.05994099999999,42.718851],[-74.059408,42.718811],[-74.059138,42.7188],[-74.05892799999999,42.71869],[-74.05873099999999,42.718557],[-74.05870899999999,42.718485],[-74.05870899999999,42.71824],[-74.058543,42.718095],[-74.05832700000001,42.718021],[-74.05814100000001,42.71801],[-74.05807,42.717983],[-74.05750999999999,42.717691],[-74.05712200000001,42.717425],[-74.056596,42.7171],[-74.056527,42.717043],[-74.056292,42.716855],[-74.056518,42.716629],[-74.058181,42.715155],[-74.057993,42.714799],[-74.05753300000001,42.713892],[-74.057149,42.714023],[-74.05707200000001,42.71405],[-74.056445,42.713129],[-74.056922,42.71184],[-74.057261,42.710841],[-74.05801200000001,42.708623],[-74.056877,42.70713],[-74.055999,42.70595],[-74.05612000000001,42.705903],[-74.056331,42.705817],[-74.05710999999999,42.705499],[-74.05760600000001,42.705296],[-74.058176,42.705062],[-74.059243,42.704647],[-74.06071900000001,42.704041],[-74.061549,42.703672],[-74.06404999999999,42.702452],[-74.065954,42.701527],[-74.068333,42.700299],[-74.06895299999999,42.700024],[-74.069087,42.699985],[-74.069345,42.699941],[-74.071207,42.699746],[-74.071451,42.699713],[-74.07172199999999,42.699706],[-74.072192,42.699724],[-74.072436,42.699747],[-74.07382200000001,42.69993],[-74.07462599999999,42.700025],[-74.076294,42.700227],[-74.076624,42.700258],[-74.07789699999999,42.700347],[-74.079599,42.700424],[-74.08020399999999,42.700424],[-74.08069399999999,42.700396],[-74.081452,42.700313],[-74.081915,42.700276],[-74.083527,42.700197],[-74.08419000000001,42.700197],[-74.084503,42.700215],[-74.085868,42.700341],[-74.087422,42.700516],[-74.08832700000001,42.700605],[-74.08917,42.700712],[-74.090053,42.700779],[-74.091764,42.700822],[-74.092321,42.700817],[-74.09251,42.700807],[-74.094942,42.70056],[-74.095546,42.700513],[-74.095769,42.700489],[-74.09650999999999,42.70042],[-74.09868,42.700189],[-74.101304,42.699899],[-74.101906,42.699861],[-74.102823,42.699886],[-74.10296700000001,42.699774],[-74.103723,42.699729],[-74.105256,42.699679],[-74.106633,42.699596],[-74.107619,42.699513],[-74.108437,42.699395],[-74.1091,42.699259],[-74.109641,42.699124],[-74.110339,42.698897],[-74.112544,42.698061],[-74.114024,42.697484],[-74.114718,42.697177],[-74.11631800000001,42.696401],[-74.11675099999999,42.696191],[-74.11746100000001,42.695877],[-74.118613,42.695384],[-74.118955,42.69526],[-74.119348,42.695137],[-74.119652,42.695071],[-74.121703,42.694827],[-74.12267900000001,42.694684],[-74.122606,42.694472],[-74.122567,42.694314],[-74.122507,42.693834],[-74.12241899999999,42.692762],[-74.12243100000001,42.69251],[-74.12245799999999,42.692353],[-74.122559,42.692064],[-74.122648,42.691847],[-74.12275,42.691643],[-74.122821,42.691458],[-74.122879,42.691263],[-74.12307800000001,42.690282],[-74.123178,42.689708],[-74.12318399999999,42.689534],[-74.12318399999999,42.68934],[-74.12314600000001,42.688891],[-74.123138,42.688836],[-74.122983,42.68781],[-74.122784,42.687019],[-74.122237,42.685071],[-74.122142,42.684831],[-74.121987,42.684535],[-74.12183400000001,42.684304],[-74.12161999999999,42.684046],[-74.120814,42.683268],[-74.12071400000001,42.68316],[-74.12026400000001,42.682674],[-74.119277,42.681402],[-74.119096,42.681191],[-74.118731,42.68083],[-74.11850099999999,42.680636],[-74.11803999999999,42.680297],[-74.11777600000001,42.680065],[-74.11753400000001,42.679811],[-74.117425,42.679671],[-74.11716699999999,42.679239],[-74.116956,42.678826],[-74.116857,42.678596],[-74.116754,42.67828],[-74.11675,42.678266],[-74.116696,42.678035],[-74.11660500000001,42.677469],[-74.11647000000001,42.676406],[-74.116359,42.675575],[-74.116192,42.674346],[-74.11615,42.673941],[-74.116139,42.673458],[-74.11615500000001,42.673225],[-74.116196,42.673059],[-74.11635,42.672584],[-74.11638000000001,42.67235],[-74.11637500000001,42.672219],[-74.116355,42.672121],[-74.116314,42.672004],[-74.116175,42.671751],[-74.11568800000001,42.671095],[-74.116632,42.670511],[-74.118568,42.66937],[-74.119265,42.668944],[-74.119978,42.668537],[-74.12161,42.667583],[-74.122333,42.667206],[-74.122754,42.667023],[-74.122957,42.666948],[-74.12342,42.666777],[-74.12459200000001,42.666404],[-74.12566099999999,42.66609],[-74.12604399999999,42.66602],[-74.126831,42.665905],[-74.127292,42.665853],[-74.128491,42.665766],[-74.129351,42.665725],[-74.129932,42.665711],[-74.130336,42.66568],[-74.130577,42.665655],[-74.130747,42.665631],[-74.130933,42.665579],[-74.131199,42.665476],[-74.13136,42.665432],[-74.13150899999999,42.665397],[-74.131624,42.665384],[-74.131699,42.665384],[-74.13180199999999,42.665393],[-74.132133,42.665475],[-74.13230900000001,42.665582],[-74.133112,42.666036],[-74.13399800000001,42.666609],[-74.13432899999999,42.666841],[-74.13463299999999,42.66709],[-74.135533,42.667809],[-74.136261,42.668375],[-74.136799,42.668755],[-74.13745900000001,42.669167],[-74.137838,42.669372],[-74.138244,42.669546],[-74.138525,42.669653],[-74.138848,42.669765],[-74.139343,42.669909],[-74.139554,42.669964],[-74.139771,42.670033],[-74.139983,42.67011],[-74.14018799999999,42.670202],[-74.14051600000001,42.670388],[-74.141226,42.670853],[-74.14150600000001,42.671],[-74.141747,42.671113],[-74.142026,42.671226],[-74.14226600000001,42.671302],[-74.1425,42.671349],[-74.142729,42.671381],[-74.143016,42.671404],[-74.143334,42.671397],[-74.144126,42.671298],[-74.14505699999999,42.671166],[-74.14585099999999,42.671075],[-74.146582,42.670982],[-74.15068599999999,42.670462],[-74.15102,42.670406],[-74.15132199999999,42.670337],[-74.151591,42.670261],[-74.15183500000001,42.670179],[-74.152469,42.669955],[-74.152941,42.669783],[-74.153257,42.669652],[-74.153536,42.669516],[-74.154546,42.668963],[-74.15638800000001,42.667902],[-74.15685000000001,42.667658],[-74.15742299999999,42.66739],[-74.157769,42.667245],[-74.158536,42.667002],[-74.159075,42.666867],[-74.15963000000001,42.666741],[-74.16085099999999,42.666486],[-74.161222,42.666434],[-74.16148800000001,42.666423],[-74.16175200000001,42.666434],[-74.161991,42.666459],[-74.162772,42.666595],[-74.16325999999999,42.666668],[-74.163858,42.666719],[-74.164388,42.666742],[-74.16655299999999,42.666791],[-74.167705,42.666883],[-74.167755,42.666887],[-74.16829199999999,42.666988],[-74.16835,42.667001],[-74.16862399999999,42.667064],[-74.168952,42.667172],[-74.16915299999999,42.66723],[-74.169725,42.667426],[-74.169703,42.667588],[-74.16947,42.66929],[-74.169436,42.669462],[-74.16857,42.673868],[-74.168525,42.67431],[-74.168705,42.67866],[-74.16874300000001,42.679248],[-74.168756,42.679452],[-74.16886700000001,42.681187],[-74.168869,42.681216],[-74.168891,42.681549],[-74.16889500000001,42.681609],[-74.169111,42.684953],[-74.169498,42.690953],[-74.16952499999999,42.691365],[-74.169496,42.691501],[-74.16904599999999,42.694107],[-74.169034,42.694177],[-74.16901799999999,42.69427],[-74.169015,42.694288],[-74.169011,42.694312],[-74.169009,42.694321],[-74.16900699999999,42.694331],[-74.169004,42.694349],[-74.16898399999999,42.694466],[-74.168193,42.699051],[-74.168148,42.699314],[-74.16804500000001,42.69991],[-74.167181,42.704931],[-74.166253,42.709479],[-74.166241,42.709536],[-74.165155,42.714867],[-74.165066,42.715304],[-74.16476900000001,42.71676],[-74.16467799999999,42.717207],[-74.16616,42.71842],[-74.166985,42.719096],[-74.167084,42.719177],[-74.16967,42.721295],[-74.16971599999999,42.721333],[-74.171317,42.722645],[-74.171558,42.722842],[-74.172518,42.723628],[-74.172928,42.723964],[-74.180274,42.729979]]],"type":"Polygon"}
}