{
  "id": "360050213024",
  "type": "Feature",
  "properties": {
    "area_land":27624,
    "area_water":0,
    "geoid":"360050213024",
    "name":"Block Group 4",
    "state":"ny"
},
  "bbox": [
    -73.921945,
    40.840349,
    -73.919182,
    40.843661
],
  "geometry": {"coordinates":[[[-73.92194499999999,40.841045],[-73.920913,40.842434],[-73.920035,40.843661],[-73.91918200000001,40.843307],[-73.920107,40.842082],[-73.92149499999999,40.840349],[-73.92194499999999,40.841045]]],"type":"Polygon"}
}