{
  "id": "360610088003",
  "type": "Feature",
  "properties": {
    "area_land":13185,
    "area_water":0,
    "geoid":"360610088003",
    "name":"Block Group 3",
    "state":"ny"
},
  "bbox": [
    -73.973141,
    40.747802,
    -73.970937,
    40.749157
],
  "geometry": {"coordinates":[[[-73.972979,40.74876],[-73.972692,40.749157],[-73.97093700000001,40.748407],[-73.971255,40.747988],[-73.971317,40.747905],[-73.97139199999999,40.747802],[-73.972283,40.748178],[-73.973141,40.748538],[-73.972979,40.74876]]],"type":"Polygon"}
}