{
  "id": "360050072001",
  "type": "Feature",
  "properties": {
    "area_land":72062,
    "area_water":0,
    "geoid":"360050072001",
    "name":"Block Group 1",
    "state":"ny"
},
  "bbox": [
    -73.862721,
    40.828419,
    -73.85699,
    40.833328
],
  "geometry": {"coordinates":[[[-73.86272099999999,40.833021],[-73.861634,40.833328],[-73.861565,40.832988],[-73.861204,40.832041],[-73.86088599999999,40.831344],[-73.86057,40.830646],[-73.857157,40.831102],[-73.85699,40.830385],[-73.86026099999999,40.829947],[-73.859938,40.829247],[-73.85962000000001,40.828548],[-73.860674,40.828419],[-73.861619,40.830503],[-73.862646,40.832823],[-73.86272099999999,40.833021]]],"type":"Polygon"}
}