{
  "id": "360470094002",
  "type": "Feature",
  "properties": {
    "area_land":56721,
    "area_water":0,
    "geoid":"360470094002",
    "name":"Block Group 2",
    "state":"ny"
},
  "bbox": [
    -74.004747,
    40.640905,
    -73.999757,
    40.644689
],
  "geometry": {"coordinates":[[[-74.004165,40.644127],[-74.003581,40.644689],[-74.00138,40.643357],[-74.00196,40.642799],[-73.999757,40.641467],[-74.00034100000001,40.640905],[-74.002545,40.642236],[-74.00474699999999,40.643567],[-74.004165,40.644127]]],"type":"Polygon"}
}