{
  "id": "360710139002",
  "type": "Feature",
  "properties": {
    "area_land":882508,
    "area_water":3202,
    "geoid":"360710139002",
    "name":"Block Group 2",
    "state":"ny"
},
  "bbox": [
    -74.134479,
    41.320312,
    -74.1211,
    41.334886
],
  "geometry": {"coordinates":[[[-74.134479,41.325829],[-74.134428,41.325927],[-74.134377,41.325987],[-74.13421200000001,41.326135],[-74.134078,41.32624],[-74.134056,41.326262],[-74.13401,41.326307],[-74.133533,41.326884],[-74.13348499999999,41.326927],[-74.133426,41.326963],[-74.13336099999999,41.326989],[-74.13328199999999,41.327006],[-74.132814,41.32705],[-74.132616,41.327079],[-74.13247200000001,41.327139],[-74.132336,41.327237],[-74.132182,41.32738],[-74.13128,41.328269],[-74.131196,41.328396],[-74.131181,41.328473],[-74.131187,41.328548],[-74.131247,41.328879],[-74.131247,41.329056],[-74.131214,41.32919],[-74.131123,41.329347],[-74.130864,41.329745],[-74.13075000000001,41.329922],[-74.130174,41.330817],[-74.129875,41.331312],[-74.129515,41.331853],[-74.129482,41.331885],[-74.12942700000001,41.331924],[-74.129379,41.331942],[-74.12929099999999,41.331946],[-74.12914000000001,41.331915],[-74.129054,41.331886],[-74.12872299999999,41.331648],[-74.128889,41.331989],[-74.128957,41.33216],[-74.128997,41.33258],[-74.12899299999999,41.332768],[-74.128979,41.332799],[-74.128857,41.332848],[-74.128801,41.332834],[-74.12872900000001,41.332771],[-74.128676,41.332711],[-74.128647,41.33269],[-74.12863,41.332924],[-74.128536,41.333047],[-74.12820600000001,41.33326],[-74.12794,41.333436],[-74.127909,41.333385],[-74.12773799999999,41.333238],[-74.12721500000001,41.332899],[-74.127076,41.332815],[-74.126752,41.33262],[-74.12649500000001,41.332831],[-74.12646700000001,41.332852],[-74.12631,41.332852],[-74.126041,41.33308],[-74.12567300000001,41.333075],[-74.125584,41.333694],[-74.125165,41.334184],[-74.124591,41.334561],[-74.12432099999999,41.334814],[-74.124089,41.334886],[-74.124082,41.334788],[-74.124077,41.334747],[-74.12402299999999,41.334537],[-74.12395600000001,41.334395],[-74.123797,41.334129],[-74.123682,41.333984],[-74.12355599999999,41.333842],[-74.123345,41.333619],[-74.12261100000001,41.332941],[-74.122184,41.332569],[-74.121306,41.331735],[-74.121263,41.331681],[-74.121224,41.331617],[-74.12117600000001,41.331539],[-74.12110800000001,41.331343],[-74.1211,41.331185],[-74.121123,41.331038],[-74.121471,41.330247],[-74.12177699999999,41.329487],[-74.122032,41.32886],[-74.12226099999999,41.328291],[-74.122479,41.327735],[-74.122533,41.327584],[-74.12261100000001,41.327367],[-74.12275,41.326895],[-74.12276300000001,41.326807],[-74.122777,41.32672],[-74.12281900000001,41.325959],[-74.12282399999999,41.325629],[-74.122854,41.324529],[-74.122884,41.324064],[-74.122922,41.323873],[-74.122951,41.323766],[-74.12305499999999,41.323531],[-74.12317299999999,41.323353],[-74.12330300000001,41.323204],[-74.12378200000001,41.322778],[-74.124156,41.322459],[-74.125028,41.321725],[-74.12528,41.32151],[-74.125556,41.321283],[-74.125713,41.321152],[-74.12629099999999,41.320653],[-74.126738,41.320312],[-74.127116,41.320404],[-74.127168,41.320937],[-74.127202,41.321159],[-74.127272,41.321354],[-74.127427,41.321601],[-74.127583,41.321757],[-74.12768699999999,41.321848],[-74.12824500000001,41.322153],[-74.128772,41.322476],[-74.128927,41.322583],[-74.129504,41.323042],[-74.129716,41.323231],[-74.12976999999999,41.3233],[-74.12984299999999,41.323459],[-74.129897,41.323642],[-74.129907,41.323823],[-74.129836,41.324274],[-74.129744,41.324795],[-74.129687,41.325036],[-74.129651,41.325303],[-74.129628,41.325356],[-74.129588,41.325412],[-74.129525,41.325465],[-74.12934199999999,41.325585],[-74.12897700000001,41.325777],[-74.128669,41.325884],[-74.128761,41.326006],[-74.12897700000001,41.326326],[-74.129926,41.326175],[-74.130129,41.326132],[-74.13036700000001,41.32607],[-74.13137399999999,41.325734],[-74.13253400000001,41.325354],[-74.133014,41.325172],[-74.13308000000001,41.325358],[-74.133173,41.325403],[-74.133253,41.325415],[-74.13337,41.325417],[-74.13367700000001,41.325423],[-74.13397399999999,41.32544],[-74.134174,41.325485],[-74.13426200000001,41.325524],[-74.13438600000001,41.325632],[-74.13447600000001,41.325736],[-74.134479,41.325829]]],"type":"Polygon"}
}