{
  "id": "360550007001",
  "type": "Feature",
  "properties": {
    "area_land":170611,
    "area_water":0,
    "geoid":"360550007001",
    "name":"Block Group 1",
    "state":"ny"
},
  "bbox": [
    -77.619604,
    43.170915,
    -77.612432,
    43.174924
],
  "geometry": {"coordinates":[[[-77.619604,43.174733],[-77.619108,43.174748],[-77.617682,43.17479],[-77.616446,43.174821],[-77.613264,43.174924],[-77.61315,43.174534],[-77.61300900000001,43.174048],[-77.612791,43.173341],[-77.61272200000001,43.17312],[-77.61263099999999,43.172799],[-77.61252399999999,43.172452],[-77.612432,43.172166],[-77.61417899999999,43.172101],[-77.614672,43.172087],[-77.614605,43.171002],[-77.615049,43.170987],[-77.61559099999999,43.170968],[-77.615866,43.170961],[-77.61722399999999,43.170915],[-77.617316,43.172464],[-77.617361,43.1732],[-77.619124,43.173149],[-77.61949,43.173139],[-77.619551,43.173967],[-77.619584,43.174453],[-77.619604,43.174733]]],"type":"Polygon"}
}