{
  "id": "361070201005",
  "type": "Feature",
  "properties": {
    "area_land":15018291,
    "area_water":14787,
    "geoid":"361070201005",
    "name":"Block Group 5",
    "state":"ny"
},
  "bbox": [
    -76.191628,
    42.218213,
    -76.081088,
    42.243394
],
  "geometry": {"coordinates":[[[-76.191627,42.224308],[-76.191622,42.224538],[-76.19160100000001,42.224588],[-76.19157800000001,42.224602],[-76.19151599999999,42.224613],[-76.191433,42.224621],[-76.190968,42.224613],[-76.190667,42.224608],[-76.18995700000001,42.224616],[-76.18913499999999,42.224614],[-76.188525,42.224614],[-76.18853,42.224962],[-76.188546,42.226009],[-76.188552,42.226358],[-76.188554,42.226688],[-76.188558,42.227293],[-76.188571,42.227679],[-76.18858299999999,42.22801],[-76.18819499999999,42.228025],[-76.18750300000001,42.228052],[-76.187032,42.228062],[-76.186645,42.228072],[-76.185309,42.228115],[-76.185382,42.230706],[-76.185385,42.230886],[-76.185396,42.231426],[-76.1854,42.231606],[-76.18540299999999,42.231742],[-76.18541500000001,42.23215],[-76.18541999999999,42.232287],[-76.185427,42.232546],[-76.185451,42.233324],[-76.185457,42.233498],[-76.18545899999999,42.233584],[-76.185463,42.233792],[-76.18546499999999,42.233921],[-76.18546600000001,42.23395],[-76.185501,42.234932],[-76.185513,42.235245],[-76.185514,42.235269],[-76.185524,42.235581],[-76.185526,42.235621],[-76.18554899999999,42.23652],[-76.185557,42.236834],[-76.185564,42.23717],[-76.18556700000001,42.237304],[-76.18556,42.237855],[-76.18555600000001,42.238181],[-76.185552,42.238519],[-76.185067,42.238539],[-76.18361299999999,42.2386],[-76.18312899999999,42.238621],[-76.18306699999999,42.238623],[-76.18288,42.23863],[-76.18281899999999,42.238633],[-76.18267299999999,42.238639],[-76.18257699999999,42.238643],[-76.182306,42.238655],[-76.182236,42.238657],[-76.182091,42.238662],[-76.18203099999999,42.238665],[-76.181679,42.238678],[-76.181653,42.23868],[-76.180986,42.238698],[-76.180446,42.238722],[-76.180035,42.238741],[-76.17966199999999,42.238763],[-76.17854199999999,42.238829],[-76.17816999999999,42.238851],[-76.178133,42.23924],[-76.17803600000001,42.240271],[-76.17802500000001,42.240408],[-76.177997,42.240799],[-76.17771399999999,42.240819],[-76.176866,42.240879],[-76.17658400000001,42.2409],[-76.17625700000001,42.240928],[-76.175393,42.241003],[-76.175279,42.241017],[-76.174955,42.241059],[-76.17470899999999,42.241106],[-76.17429300000001,42.241208],[-76.17357699999999,42.241403],[-76.17346499999999,42.241434],[-76.17225000000001,42.241751],[-76.17197400000001,42.241831],[-76.170548,42.242222],[-76.16946299999999,42.242507],[-76.16809000000001,42.242869],[-76.167903,42.242907],[-76.16642,42.24309],[-76.166376,42.243096],[-76.165093,42.243242],[-76.164029,42.243351],[-76.163427,42.243394],[-76.163129,42.243385],[-76.16299600000001,42.243366],[-76.162875,42.243338],[-76.16267000000001,42.243258],[-76.161969,42.24287],[-76.161703,42.24274],[-76.16154400000001,42.242677],[-76.16153,42.242672],[-76.161343,42.242613],[-76.161129,42.242557],[-76.16092500000001,42.24252],[-76.160751,42.242504],[-76.160529,42.242498],[-76.160265,42.242514],[-76.160144,42.242532],[-76.159891,42.242596],[-76.159452,42.242712],[-76.159229,42.242746],[-76.15902199999999,42.242762],[-76.158732,42.242746],[-76.157929,42.242693],[-76.15784499999999,42.242692],[-76.15762599999999,42.24269],[-76.15722599999999,42.242712],[-76.156356,42.242805],[-76.15633800000001,42.242808],[-76.15602199999999,42.242817],[-76.155467,42.242817],[-76.15523899999999,42.242835],[-76.15507100000001,42.242864],[-76.154853,42.242921],[-76.15459199999999,42.243004],[-76.154557,42.243017],[-76.154341,42.243106],[-76.15410300000001,42.243062],[-76.153235,42.242847],[-76.15315200000001,42.242827],[-76.152582,42.242694],[-76.15240799999999,42.242674],[-76.15161999999999,42.242675],[-76.150273,42.24274],[-76.14984800000001,42.24275],[-76.149806,42.242752],[-76.14906499999999,42.242725],[-76.148714,42.242702],[-76.148691,42.2427],[-76.148623,42.242696],[-76.148601,42.242695],[-76.148276,42.242672],[-76.147704,42.242656],[-76.146151,42.242715],[-76.141206,42.242829],[-76.13920299999999,42.242884],[-76.137297,42.242939],[-76.13483100000001,42.24298],[-76.13431,42.24297],[-76.13407100000001,42.242956],[-76.133994,42.242941],[-76.133861,42.242902],[-76.133515,42.24273],[-76.133308,42.242606],[-76.133033,42.242457],[-76.13288799999999,42.242388],[-76.132654,42.242307],[-76.132411,42.24225],[-76.132107,42.242203],[-76.13184099999999,42.242178],[-76.131128,42.242151],[-76.13011400000001,42.242086],[-76.129746,42.242038],[-76.129587,42.241997],[-76.129276,42.241882],[-76.129131,42.241807],[-76.12895,42.241699],[-76.12843100000001,42.241241],[-76.127754,42.240652],[-76.12720899999999,42.240166],[-76.127062,42.240056],[-76.12653899999999,42.239653],[-76.12558,42.239009],[-76.12464199999999,42.238346],[-76.12426600000001,42.238124],[-76.123902,42.237935],[-76.12326899999999,42.237635],[-76.12263400000001,42.237361],[-76.122227,42.237201],[-76.12169299999999,42.237008],[-76.120807,42.236741],[-76.12053400000001,42.236671],[-76.120323,42.236628],[-76.11989199999999,42.236577],[-76.11977899999999,42.236569],[-76.11893499999999,42.236571],[-76.118703,42.236562],[-76.118318,42.236526],[-76.11803999999999,42.236477],[-76.117299,42.236346],[-76.11713,42.236327],[-76.11698,42.23632],[-76.116772,42.236325],[-76.11623,42.236568],[-76.115842,42.236718],[-76.115121,42.23695],[-76.114347,42.237212],[-76.114007,42.237318],[-76.113659,42.237402],[-76.11331300000001,42.237468],[-76.112978,42.237518],[-76.112351,42.237578],[-76.112168,42.237596],[-76.111608,42.237674],[-76.111158,42.237717],[-76.109448,42.237787],[-76.10910800000001,42.237778],[-76.108891,42.237735],[-76.108841,42.237719],[-76.10867399999999,42.237655],[-76.108362,42.237504],[-76.10782500000001,42.237204],[-76.10740300000001,42.236996],[-76.106993,42.236774],[-76.10688399999999,42.236725],[-76.10632099999999,42.236463],[-76.104417,42.235647],[-76.10402000000001,42.235485],[-76.103483,42.235287],[-76.103016,42.235132],[-76.101337,42.234694],[-76.10020900000001,42.234382],[-76.09942700000001,42.234185],[-76.09919499999999,42.234135],[-76.098315,42.233948],[-76.095237,42.233166],[-76.094708,42.233043],[-76.094323,42.232953],[-76.093461,42.232753],[-76.093171,42.232681],[-76.092788,42.232586],[-76.09173699999999,42.232322],[-76.091129,42.232166],[-76.09003,42.231884],[-76.089175,42.231673],[-76.08615500000001,42.230898],[-76.086084,42.23088],[-76.085097,42.230637],[-76.084828,42.230562],[-76.08449899999999,42.230471],[-76.08113400000001,42.230495],[-76.081102,42.229787],[-76.081095,42.229392],[-76.08111599999999,42.22761],[-76.081118,42.227488],[-76.081112,42.224993],[-76.081112,42.224886],[-76.08108799999999,42.218643],[-76.081451,42.218646],[-76.081659,42.218651],[-76.08261400000001,42.218612],[-76.082761,42.218606],[-76.082854,42.218601],[-76.08311999999999,42.218584],[-76.083688,42.218577],[-76.084853,42.218539],[-76.08690799999999,42.218446],[-76.087739,42.218418],[-76.088579,42.218401],[-76.090379,42.218347],[-76.092136,42.218275],[-76.09223,42.218258],[-76.092349,42.218213],[-76.092545,42.218402],[-76.09277899999999,42.21857],[-76.093405,42.218977],[-76.09404600000001,42.219424],[-76.094702,42.219913],[-76.095207,42.220269],[-76.095704,42.220598],[-76.096896,42.221265],[-76.09761899999999,42.221695],[-76.097936,42.221862],[-76.09843100000001,42.222092],[-76.09868899999999,42.22217],[-76.09917900000001,42.222277],[-76.09924599999999,42.222288],[-76.099519,42.222335],[-76.099907,42.222381],[-76.100346,42.222405],[-76.102159,42.222444],[-76.10235900000001,42.222449],[-76.103449,42.222431],[-76.104783,42.222371],[-76.10626499999999,42.222316],[-76.107741,42.222206],[-76.108536,42.222187],[-76.1087,42.222196],[-76.10906900000001,42.222242],[-76.110868,42.222642],[-76.110928,42.222656],[-76.11194,42.222897],[-76.112369,42.222962],[-76.11285100000001,42.222998],[-76.113753,42.223021],[-76.113827,42.223023],[-76.113906,42.22303],[-76.113951,42.223034],[-76.11404,42.223042],[-76.114158,42.223061],[-76.11425199999999,42.223089],[-76.11435400000001,42.223127],[-76.114384,42.223139],[-76.11447699999999,42.223219],[-76.11452800000001,42.223263],[-76.11456699999999,42.22331],[-76.114637,42.223446],[-76.114704,42.223652],[-76.114762,42.223771],[-76.11488799999999,42.223974],[-76.115239,42.224407],[-76.11581700000001,42.225056],[-76.11600900000001,42.225209],[-76.116263,42.225344],[-76.116518,42.225424],[-76.116731,42.225463],[-76.116961,42.225506],[-76.117734,42.225625],[-76.118533,42.22576],[-76.11934100000001,42.225891],[-76.12020200000001,42.225954],[-76.121323,42.226019],[-76.12392199999999,42.226097],[-76.124264,42.226124],[-76.124821,42.226188],[-76.12537500000001,42.226289],[-76.12620099999999,42.226411],[-76.126604,42.226478],[-76.12697799999999,42.226541],[-76.128418,42.226825],[-76.129051,42.226941],[-76.12936999999999,42.226987],[-76.12961300000001,42.226997],[-76.129746,42.22699],[-76.12987,42.226972],[-76.129998,42.226939],[-76.13015,42.226885],[-76.13038299999999,42.226784],[-76.13135200000001,42.226369],[-76.131884,42.226117],[-76.13238,42.225883],[-76.132649,42.225752],[-76.13287099999999,42.225658],[-76.133011,42.2256],[-76.133771,42.225304],[-76.134389,42.225087],[-76.1349,42.224909],[-76.135079,42.224884],[-76.135578,42.224871],[-76.13609700000001,42.224888],[-76.136421,42.224929],[-76.13659699999999,42.224962],[-76.136934,42.225047],[-76.13755,42.225238],[-76.138313,42.2255],[-76.138998,42.225694],[-76.139163,42.225732],[-76.139517,42.225779],[-76.139726,42.225795],[-76.14048200000001,42.225827],[-76.14153,42.225849],[-76.142574,42.225803],[-76.145073,42.225605],[-76.14580599999999,42.225534],[-76.147015,42.225371],[-76.14737,42.225339],[-76.147941,42.225312],[-76.148938,42.225293],[-76.149585,42.225268],[-76.151999,42.225192],[-76.152406,42.22519],[-76.152562,42.225188],[-76.153035,42.225182],[-76.15445699999999,42.225165],[-76.154623,42.225164],[-76.154931,42.225156],[-76.156437,42.225114],[-76.15679900000001,42.225097],[-76.15880799999999,42.225009],[-76.159268,42.224975],[-76.159756,42.224923],[-76.160129,42.224873],[-76.16069,42.224752],[-76.161444,42.224544],[-76.16182000000001,42.224405],[-76.162274,42.224172],[-76.163101,42.22375],[-76.16339600000001,42.223617],[-76.16368799999999,42.223499],[-76.163974,42.223401],[-76.16408699999999,42.22337],[-76.16413900000001,42.223356],[-76.16443200000001,42.223294],[-76.164548,42.223271],[-76.164733,42.223236],[-76.16493,42.223209],[-76.165013,42.223198],[-76.16559100000001,42.223136],[-76.16606899999999,42.223108],[-76.16608600000001,42.223107],[-76.16647399999999,42.223106],[-76.167294,42.223102],[-76.16731,42.223102],[-76.16793699999999,42.223056],[-76.169743,42.222856],[-76.170275,42.222798],[-76.170424,42.222762],[-76.170547,42.222714],[-76.17145499999999,42.222174],[-76.171803,42.221998],[-76.17205800000001,42.221899],[-76.172251,42.221844],[-76.17227699999999,42.221838],[-76.172608,42.22177],[-76.172799,42.221747],[-76.17393300000001,42.221667],[-76.175336,42.221574],[-76.17595,42.221524],[-76.17631299999999,42.221471],[-76.176588,42.221414],[-76.176911,42.22132],[-76.177565,42.221077],[-76.177795,42.221012],[-76.177984,42.220984],[-76.178026,42.220982],[-76.178579,42.220957],[-76.178693,42.220944],[-76.178793,42.220935],[-76.179444,42.220823],[-76.179643,42.220832],[-76.179767,42.220857],[-76.179935,42.220907],[-76.179952,42.220914],[-76.180002,42.220936],[-76.18012299999999,42.220989],[-76.180166,42.221008],[-76.180407,42.221114],[-76.18113,42.221435],[-76.18114799999999,42.221443],[-76.181235,42.221493],[-76.181341,42.22159],[-76.18141799999999,42.221707],[-76.18146400000001,42.221818],[-76.18161600000001,42.222178],[-76.181731,42.222361],[-76.181877,42.222459],[-76.18209400000001,42.222606],[-76.182355,42.22278],[-76.18313999999999,42.223303],[-76.183402,42.223478],[-76.18349000000001,42.223534],[-76.183757,42.223705],[-76.183846,42.223762],[-76.184061,42.223898],[-76.18421499999999,42.223995],[-76.184701,42.224316],[-76.18491400000001,42.224457],[-76.18497000000001,42.224494],[-76.18514,42.224606],[-76.185197,42.224644],[-76.185408,42.224634],[-76.18591499999999,42.224612],[-76.186042,42.224612],[-76.18613999999999,42.224613],[-76.18625400000001,42.224614],[-76.186396,42.224614],[-76.186436,42.224615],[-76.18682200000001,42.224617],[-76.186965,42.224618],[-76.186965,42.224461],[-76.186969,42.223991],[-76.18697,42.223919],[-76.186986,42.223837],[-76.187016,42.2238],[-76.187091,42.223769],[-76.18727199999999,42.22375],[-76.1875,42.223727],[-76.188202,42.223634],[-76.188508,42.223613],[-76.188624,42.223572],[-76.18871,42.223554],[-76.18890399999999,42.223517],[-76.18915800000001,42.223494],[-76.18938,42.223475],[-76.189733,42.22342],[-76.1901,42.223338],[-76.190893,42.223104],[-76.19108900000001,42.223037],[-76.191338,42.222953],[-76.191548,42.222895],[-76.191568,42.222906],[-76.19158400000001,42.222956],[-76.191587,42.223064],[-76.191597,42.223375],[-76.19162799999999,42.22429],[-76.191627,42.224308]]],"type":"Polygon"}
}