{
  "id": "360130364013",
  "type": "Feature",
  "properties": {
    "area_land":1743284,
    "area_water":18293179,
    "geoid":"360130364013",
    "name":"Block Group 3",
    "state":"ny"
},
  "bbox": [
    -79.504956,
    42.172746,
    -79.425742,
    42.263262
],
  "geometry": {"coordinates":[[[-79.504559,42.254436],[-79.504198,42.254696],[-79.503671,42.255106],[-79.503367,42.255343],[-79.50315000000001,42.255521],[-79.501293,42.256935],[-79.500337,42.257641],[-79.499842,42.258008],[-79.49949100000001,42.258279],[-79.498965,42.258655],[-79.49867,42.258861],[-79.498442,42.25904],[-79.49764500000001,42.259683],[-79.49715999999999,42.260044],[-79.49712599999999,42.26007],[-79.496624,42.260453],[-79.49654200000001,42.260516],[-79.496357,42.260657],[-79.49623200000001,42.260754],[-79.49552799999999,42.261279],[-79.49493099999999,42.261747],[-79.49453099999999,42.262046],[-79.49409900000001,42.262369],[-79.49395699999999,42.262475],[-79.493156,42.263089],[-79.49293,42.263262],[-79.48992800000001,42.261006],[-79.48758599999999,42.262332],[-79.485872,42.260949],[-79.485451,42.260609],[-79.48459699999999,42.259965],[-79.48420400000001,42.259714],[-79.48415,42.259691],[-79.484111,42.259675],[-79.484073,42.259672],[-79.48373599999999,42.259305],[-79.483716,42.259317],[-79.483688,42.259317],[-79.483639,42.259288],[-79.48361199999999,42.259249],[-79.48359000000001,42.25924],[-79.483553,42.259242],[-79.48349,42.259295],[-79.48338800000001,42.259342],[-79.483288,42.259349],[-79.48311699999999,42.259413],[-79.483007,42.259442],[-79.482642,42.259512],[-79.48246,42.259517],[-79.4824,42.259515],[-79.48225600000001,42.259528],[-79.48217699999999,42.259557],[-79.482133,42.25959],[-79.482028,42.259634],[-79.481903,42.259657],[-79.48176599999999,42.259652],[-79.481638,42.25961],[-79.48150699999999,42.259597],[-79.48144499999999,42.259615],[-79.481353,42.259685],[-79.481264,42.259697],[-79.480563,42.259697],[-79.480474,42.259679],[-79.48041499999999,42.259639],[-79.480377,42.259604],[-79.480317,42.259601],[-79.480206,42.259637],[-79.479727,42.259666],[-79.479423,42.259641],[-79.47933399999999,42.259636],[-79.478718,42.259606],[-79.47780400000001,42.259592],[-79.477625,42.259603],[-79.47760599999999,42.259604],[-79.47745999999999,42.259632],[-79.477127,42.259663],[-79.47672799999999,42.259659],[-79.476676,42.259666],[-79.476615,42.259696],[-79.476574,42.259705],[-79.47642,42.259737],[-79.476128,42.259748],[-79.475995,42.259741],[-79.47568800000001,42.259685],[-79.475452,42.259608],[-79.47541699999999,42.25959],[-79.474941,42.259353],[-79.474737,42.259264],[-79.474526,42.259149],[-79.474467,42.259069],[-79.474418,42.259036],[-79.474327,42.259027],[-79.474238,42.259034],[-79.47418500000001,42.259022],[-79.473896,42.258869],[-79.473772,42.258783],[-79.47365600000001,42.258645],[-79.47357599999999,42.258572],[-79.473494,42.258557],[-79.47326,42.258557],[-79.47319299999999,42.258548],[-79.473111,42.258521],[-79.47288399999999,42.258421],[-79.47270399999999,42.258357],[-79.472612,42.258342],[-79.472487,42.258302],[-79.47228800000001,42.258191],[-79.472048,42.258011],[-79.471771,42.257765],[-79.471718,42.257703],[-79.471495,42.257502],[-79.47133599999999,42.25741],[-79.471234,42.257333],[-79.47118,42.257271],[-79.471154,42.257195],[-79.471057,42.257047],[-79.47086299999999,42.256916],[-79.47073899999999,42.256785],[-79.470615,42.25661],[-79.470529,42.256488],[-79.47045,42.256353],[-79.47027300000001,42.256009],[-79.470144,42.255659],[-79.469936,42.255277],[-79.469915,42.255136],[-79.469959,42.254989],[-79.470037,42.254914],[-79.470071,42.254863],[-79.470068,42.254821],[-79.470017,42.254794],[-79.46995800000001,42.254787],[-79.469882,42.254768],[-79.46982300000001,42.254712],[-79.469803,42.254632],[-79.46979899999999,42.254007],[-79.46982,42.253783],[-79.469832,42.253748],[-79.469973,42.253548],[-79.47004200000001,42.253495],[-79.47010899999999,42.253397],[-79.470163,42.253339],[-79.47023299999999,42.253166],[-79.470249,42.253071],[-79.47024,42.253034],[-79.470285,42.252768],[-79.470277,42.252663],[-79.47013099999999,42.252297],[-79.47010299999999,42.252116],[-79.470089,42.251677],[-79.47005,42.251466],[-79.46988,42.25114],[-79.469836,42.251087],[-79.46972,42.250763],[-79.469441,42.250275],[-79.469357,42.250097],[-79.469297,42.249928],[-79.469257,42.249873],[-79.469092,42.249749],[-79.46902300000001,42.249666],[-79.46887700000001,42.249392],[-79.46876399999999,42.249312],[-79.468677,42.24921],[-79.468553,42.249119],[-79.468447,42.248992],[-79.46838200000001,42.248948],[-79.468316,42.248919],[-79.468053,42.248769],[-79.46765600000001,42.248671],[-79.467448,42.248595],[-79.46707600000001,42.248398],[-79.46654599999999,42.248241],[-79.466477,42.248205],[-79.46642199999999,42.248154],[-79.46637800000001,42.24807],[-79.466218,42.247888],[-79.46605700000001,42.247753],[-79.465937,42.247629],[-79.465846,42.24748],[-79.46561,42.246994],[-79.465552,42.246875],[-79.46535900000001,42.246521],[-79.465244,42.246346],[-79.465219,42.246288],[-79.46517900000001,42.246102],[-79.464736,42.245228],[-79.464608,42.2449],[-79.46446400000001,42.244623],[-79.464482,42.244539],[-79.464493,42.244456],[-79.464478,42.244405],[-79.46437299999999,42.244251],[-79.46432900000001,42.244149],[-79.464303,42.244026],[-79.464269,42.24365],[-79.464241,42.243497],[-79.46424500000001,42.243246],[-79.464296,42.242696],[-79.464365,42.24227],[-79.464369,42.242098],[-79.464355,42.241967],[-79.464294,42.241658],[-79.464298,42.24149],[-79.46432,42.241443],[-79.46440699999999,42.241344],[-79.464411,42.241293],[-79.46439700000001,42.241278],[-79.464353,42.241264],[-79.464225,42.241264],[-79.46420000000001,42.241246],[-79.464189,42.241198],[-79.464192,42.241144],[-79.464207,42.2411],[-79.464309,42.241042],[-79.464342,42.241009],[-79.464349,42.240965],[-79.464331,42.240903],[-79.464209,42.240779],[-79.464172,42.240707],[-79.464117,42.24047],[-79.464074,42.24039],[-79.46405900000001,42.240335],[-79.46408099999999,42.24028],[-79.46410299999999,42.240178],[-79.46408099999999,42.240146],[-79.464021,42.24012],[-79.46397399999999,42.24008],[-79.463937,42.240029],[-79.463922,42.239978],[-79.46393,42.239923],[-79.463955,42.239876],[-79.463959,42.239847],[-79.463944,42.239814],[-79.46387,42.239801],[-79.46382,42.239792],[-79.463791,42.239774],[-79.463747,42.239727],[-79.46369300000001,42.239628],[-79.463685,42.239468],[-79.463667,42.239442],[-79.46362000000001,42.239428],[-79.46355800000001,42.239395],[-79.46328099999999,42.23894],[-79.46263,42.238014],[-79.46250000000001,42.237624],[-79.462417,42.237424],[-79.462402,42.237121],[-79.462349,42.236451],[-79.46228499999999,42.236043],[-79.46229599999999,42.235974],[-79.46234699999999,42.235937],[-79.46243800000001,42.235897],[-79.46257300000001,42.235803],[-79.462613,42.235741],[-79.462613,42.235693],[-79.462569,42.235515],[-79.462538,42.235504],[-79.462345,42.235564],[-79.462295,42.235562],[-79.46225,42.2355],[-79.46222400000001,42.235488],[-79.46199799999999,42.235466],[-79.461978,42.235455],[-79.461499,42.234875],[-79.461152,42.23454],[-79.460981,42.234398],[-79.460824,42.234307],[-79.46057399999999,42.23411],[-79.46038799999999,42.233936],[-79.460082,42.233713],[-79.459772,42.23352],[-79.459001,42.233094],[-79.458735,42.232988],[-79.458461,42.232904],[-79.458307,42.232872],[-79.458073,42.232846],[-79.457818,42.232843],[-79.457431,42.232894],[-79.457351,42.232926],[-79.45719800000001,42.23324],[-79.45713600000001,42.233316],[-79.457089,42.233473],[-79.45703399999999,42.233524],[-79.456879,42.233622],[-79.45685,42.233677],[-79.456824,42.233768],[-79.456773,42.233863],[-79.4567,42.233954],[-79.456536,42.234078],[-79.456485,42.234132],[-79.456219,42.234413],[-79.455904,42.234697],[-79.455853,42.23473],[-79.455769,42.234744],[-79.455732,42.234766],[-79.455703,42.234814],[-79.45567800000001,42.234912],[-79.455645,42.234974],[-79.455583,42.235032],[-79.45550799999999,42.235072],[-79.455426,42.235116],[-79.45514799999999,42.235279],[-79.45489000000001,42.235433],[-79.454584,42.235593],[-79.453973,42.235947],[-79.45377999999999,42.236038],[-79.453481,42.236147],[-79.453288,42.236205],[-79.45308900000001,42.236224],[-79.452547,42.236277],[-79.452026,42.23634],[-79.45177700000001,42.236349],[-79.451708,42.236353],[-79.451346,42.236371],[-79.451053,42.236386],[-79.450757,42.236395],[-79.45066199999999,42.236388],[-79.45003199999999,42.236344],[-79.44930600000001,42.236209],[-79.448971,42.236111],[-79.448708,42.236005],[-79.44842,42.235866],[-79.447529,42.235375],[-79.44735,42.235233],[-79.447186,42.23508],[-79.44712699999999,42.23501],[-79.447091,42.234941],[-79.447084,42.234835],[-79.44711599999999,42.234737],[-79.4472,42.234544],[-79.447204,42.23446],[-79.447193,42.234416],[-79.447142,42.234347],[-79.446974,42.234234],[-79.446786,42.234092],[-79.44664400000001,42.23395],[-79.44645300000001,42.23379],[-79.44641300000001,42.233728],[-79.446303,42.233313],[-79.44627,42.233283],[-79.446175,42.233259],[-79.446153,42.233238],[-79.446128,42.233214],[-79.44596799999999,42.232956],[-79.44592799999999,42.232846],[-79.44593500000001,42.232722],[-79.445953,42.232639],[-79.44601900000001,42.232478],[-79.446022,42.232431],[-79.446004,42.232394],[-79.44593999999999,42.232322],[-79.445919,42.232172],[-79.44588899999999,42.232121],[-79.445835,42.232077],[-79.44576499999999,42.232048],[-79.445652,42.232026],[-79.445548,42.231993],[-79.445364,42.231935],[-79.445244,42.231924],[-79.445131,42.231939],[-79.445007,42.231994],[-79.44489,42.232128],[-79.44470800000001,42.2323],[-79.444613,42.232358],[-79.44454899999999,42.23242],[-79.44447599999999,42.232474],[-79.444305,42.232682],[-79.444192,42.232777],[-79.444002,42.232864],[-79.44374000000001,42.232959],[-79.44344599999999,42.233028],[-79.443049,42.233079],[-79.442841,42.233083],[-79.44211,42.233032],[-79.44177500000001,42.232974],[-79.44153799999999,42.232912],[-79.441253,42.232821],[-79.44094699999999,42.232755],[-79.440848,42.232741],[-79.44056,42.232496],[-79.440358,42.23238],[-79.440281,42.232325],[-79.44022699999999,42.23226],[-79.440066,42.232008],[-79.43997899999999,42.231801],[-79.439859,42.231454],[-79.439808,42.231199],[-79.439806,42.230955],[-79.43981700000001,42.230777],[-79.439853,42.230704],[-79.439948,42.230609],[-79.439999,42.230525],[-79.440043,42.230409],[-79.440054,42.230303],[-79.440043,42.23023],[-79.44001799999999,42.230187],[-79.44000800000001,42.230168],[-79.43995700000001,42.230037],[-79.439886,42.229698],[-79.439797,42.229366],[-79.439725,42.22905],[-79.43970400000001,42.228824],[-79.4397,42.228456],[-79.43968599999999,42.22832],[-79.439705,42.228109],[-79.43967000000001,42.227426],[-79.454848,42.220514],[-79.451324,42.21572],[-79.44878199999999,42.210658],[-79.446032,42.206688],[-79.441878,42.201181],[-79.438008,42.196914],[-79.434257,42.193775],[-79.43224499999999,42.19155],[-79.431589,42.190014],[-79.43133,42.18887],[-79.431062,42.187283],[-79.430717,42.185583],[-79.43034,42.183916],[-79.429654,42.182518],[-79.42864899999999,42.180832],[-79.427645,42.179219],[-79.427136,42.178029],[-79.426349,42.176454],[-79.426011,42.174496],[-79.425742,42.172764],[-79.434228,42.172746],[-79.434243,42.172759],[-79.435945,42.173196],[-79.436206,42.17325],[-79.436295,42.173288],[-79.436395,42.173353],[-79.43648399999999,42.173427],[-79.436576,42.173453],[-79.43688,42.173488],[-79.437046,42.173523],[-79.437274,42.173605],[-79.437482,42.173654],[-79.437629,42.173682],[-79.43789099999999,42.173788],[-79.43799300000001,42.173879],[-79.438076,42.173976],[-79.43809400000001,42.174084],[-79.438069,42.174182],[-79.438073,42.174207],[-79.438091,42.174229],[-79.43819000000001,42.17428],[-79.438281,42.174378],[-79.438427,42.17459],[-79.438631,42.174834],[-79.438751,42.174939],[-79.43911199999999,42.175136],[-79.439232,42.17522],[-79.439593,42.175395],[-79.440082,42.175566],[-79.440403,42.175635],[-79.440844,42.175763],[-79.44122299999999,42.175952],[-79.441715,42.176185],[-79.441795,42.176254],[-79.441923,42.176426],[-79.44202199999999,42.176499],[-79.442714,42.176899],[-79.442904,42.177045],[-79.44305300000001,42.177176],[-79.443174,42.177307],[-79.44363300000001,42.177919],[-79.44371099999999,42.178048],[-79.44374999999999,42.178112],[-79.443877,42.178367],[-79.44394699999999,42.178477],[-79.444067,42.178593],[-79.44418,42.178659],[-79.444388,42.178721],[-79.444457,42.17875],[-79.444632,42.178885],[-79.444738,42.179016],[-79.44476899999999,42.179066],[-79.44482600000001,42.179158],[-79.44488,42.179282],[-79.44495999999999,42.179537],[-79.445015,42.179814],[-79.445037,42.180174],[-79.445018,42.180262],[-79.444935,42.180397],[-79.444913,42.180462],[-79.44491600000001,42.180535],[-79.444976,42.180645],[-79.44501099999999,42.18071],[-79.445088,42.180768],[-79.44515,42.180783],[-79.44532100000001,42.18075],[-79.44539,42.180761],[-79.44567499999999,42.180999],[-79.44580999999999,42.181111],[-79.445966,42.181205],[-79.44607600000001,42.181326],[-79.446119,42.181398],[-79.446141,42.181468],[-79.446145,42.181708],[-79.446134,42.181868],[-79.446105,42.182054],[-79.446032,42.182291],[-79.445988,42.182364],[-79.445875,42.182509],[-79.44579899999999,42.182582],[-79.44491600000001,42.18318],[-79.444614,42.183351],[-79.44435900000001,42.18346],[-79.444147,42.183537],[-79.443928,42.183588],[-79.443774,42.183599],[-79.443724,42.183602],[-79.443487,42.183588],[-79.442784,42.183413],[-79.442674,42.183406],[-79.442543,42.183417],[-79.442397,42.183453],[-79.442317,42.183486],[-79.44224,42.183533],[-79.44219699999999,42.183613],[-79.442193,42.18373],[-79.442218,42.183792],[-79.44239,42.184029],[-79.44293999999999,42.184615],[-79.442977,42.184684],[-79.442984,42.184757],[-79.442948,42.184823],[-79.44286,42.184925],[-79.442729,42.185016],[-79.442605,42.185049],[-79.442514,42.185049],[-79.442441,42.185016],[-79.442404,42.18502],[-79.44237200000001,42.185081],[-79.44232599999999,42.185212],[-79.44228,42.185267],[-79.442094,42.18538],[-79.442065,42.185431],[-79.442065,42.185464],[-79.442087,42.185519],[-79.442142,42.185573],[-79.442412,42.185737],[-79.44247,42.185759],[-79.44255699999999,42.185755],[-79.442718,42.185701],[-79.442787,42.185686],[-79.44286,42.185686],[-79.442922,42.185701],[-79.44297299999999,42.185744],[-79.443119,42.185956],[-79.44316999999999,42.18605],[-79.443181,42.186182],[-79.443152,42.186244],[-79.443101,42.186313],[-79.44301,42.186393],[-79.44262999999999,42.186641],[-79.442572,42.186692],[-79.44250599999999,42.186775],[-79.442448,42.186877],[-79.442393,42.186932],[-79.44222499999999,42.187017],[-79.442114,42.187107],[-79.442042,42.187174],[-79.441951,42.187322],[-79.44186000000001,42.187704],[-79.441822,42.187814],[-79.441774,42.1879],[-79.441689,42.187982],[-79.441546,42.188085],[-79.441046,42.188566],[-79.441013,42.188617],[-79.441006,42.188748],[-79.44103699999999,42.188949],[-79.44102599999999,42.189025],[-79.44096399999999,42.189164],[-79.44091,42.189251],[-79.440895,42.189317],[-79.44091,42.189393],[-79.440935,42.189433],[-79.440997,42.189477],[-79.441188,42.18956],[-79.441278,42.189615],[-79.441321,42.189659],[-79.441373,42.18976],[-79.441506,42.18998],[-79.44178100000001,42.190286],[-79.441987,42.190617],[-79.4423,42.190967],[-79.442373,42.191033],[-79.442424,42.191058],[-79.442494,42.191069],[-79.442938,42.191095],[-79.44331,42.19116],[-79.44356999999999,42.191191],[-79.443989,42.191293],[-79.44435799999999,42.191421],[-79.44450399999999,42.191494],[-79.44466,42.191585],[-79.445785,42.192416],[-79.44594499999999,42.192528],[-79.446099,42.192601],[-79.446208,42.192638],[-79.446855,42.192787],[-79.44736899999999,42.192798],[-79.447914,42.19278],[-79.448483,42.192813],[-79.44902999999999,42.192922],[-79.44918699999999,42.192962],[-79.449304,42.19298],[-79.449575,42.192969],[-79.44981199999999,42.193035],[-79.4499,42.193031],[-79.45004900000001,42.192984],[-79.450367,42.192922],[-79.450542,42.192918],[-79.450687,42.192936],[-79.451003,42.193017],[-79.451313,42.193064],[-79.45149499999999,42.193108],[-79.451849,42.193246],[-79.451965,42.193308],[-79.45207499999999,42.193385],[-79.45214799999999,42.193461],[-79.45218800000001,42.193523],[-79.452206,42.193647],[-79.45216600000001,42.193807],[-79.45215899999999,42.193895],[-79.45218800000001,42.193968],[-79.452448,42.194215],[-79.452467,42.194394],[-79.45252499999999,42.194485],[-79.452715,42.194733],[-79.45286400000001,42.194809],[-79.45302599999999,42.194868],[-79.45330300000001,42.194941],[-79.454222,42.195184],[-79.454441,42.195261],[-79.45455,42.195316],[-79.454612,42.19537],[-79.454764,42.195582],[-79.45524500000001,42.195935],[-79.455493,42.196154],[-79.455899,42.19662],[-79.456056,42.19682],[-79.45617300000001,42.197003],[-79.45649400000001,42.197418],[-79.456762,42.19804],[-79.45676899999999,42.198057],[-79.456875,42.198281],[-79.45696599999999,42.198442],[-79.457212,42.198795],[-79.45742,42.199032],[-79.457604,42.199203],[-79.457885,42.199651],[-79.457994,42.19979],[-79.458151,42.199921],[-79.458315,42.200023],[-79.45853700000001,42.20026],[-79.458696,42.200507],[-79.458754,42.200617],[-79.458951,42.200861],[-79.45930300000001,42.201433],[-79.459478,42.201739],[-79.45953299999999,42.201892],[-79.45953799999999,42.201965],[-79.459491,42.202231],[-79.459451,42.202304],[-79.459361,42.202408],[-79.459345,42.202428],[-79.458966,42.202766],[-79.458922,42.202825],[-79.458904,42.202901],[-79.458904,42.202952],[-79.45893,42.203003],[-79.459006,42.203065],[-79.459132,42.203236],[-79.45917900000001,42.20332],[-79.459245,42.203393],[-79.459329,42.20344],[-79.459518,42.203506],[-79.459828,42.203644],[-79.45990500000001,42.203692],[-79.459945,42.20375],[-79.460009,42.203907],[-79.460082,42.204176],[-79.460224,42.20453],[-79.460251,42.204843],[-79.460244,42.204971],[-79.46025899999999,42.205138],[-79.46038299999999,42.205506],[-79.460437,42.205594],[-79.46055800000001,42.205717],[-79.460598,42.205779],[-79.46072700000001,42.206089],[-79.46081100000001,42.20622],[-79.46085100000001,42.206362],[-79.460942,42.206818],[-79.46108599999999,42.207033],[-79.46148599999999,42.207601],[-79.461628,42.207783],[-79.46171200000001,42.207929],[-79.461832,42.20822],[-79.462198,42.208749],[-79.462249,42.208851],[-79.462271,42.208953],[-79.46228600000001,42.209113],[-79.4623,42.20916],[-79.462636,42.209598],[-79.462805,42.209871],[-79.46281999999999,42.209936],[-79.462805,42.210071],[-79.46261699999999,42.210543],[-79.46249400000001,42.210833],[-79.46240299999999,42.210916],[-79.46235900000001,42.210924],[-79.462199,42.210902],[-79.462096,42.210909],[-79.46201600000001,42.210931],[-79.461932,42.211018],[-79.461827,42.211222],[-79.46181199999999,42.211299],[-79.461867,42.211354],[-79.462011,42.21143],[-79.462109,42.211467],[-79.462226,42.211485],[-79.463212,42.211386],[-79.46351799999999,42.211332],[-79.46360199999999,42.211328],[-79.463697,42.211335],[-79.463814,42.211361],[-79.463956,42.211408],[-79.464153,42.211452],[-79.464477,42.21147],[-79.464598,42.211488],[-79.464691,42.211514],[-79.46534699999999,42.211594],[-79.46552200000001,42.211631],[-79.46564600000001,42.211671],[-79.46579199999999,42.211732],[-79.466007,42.211864],[-79.466054,42.211904],[-79.46609100000001,42.211951],[-79.46611300000001,42.212028],[-79.466235,42.212199],[-79.46629299999999,42.212257],[-79.466326,42.212275],[-79.466403,42.212286],[-79.46668,42.21225],[-79.466763,42.212261],[-79.466855,42.212319],[-79.46694599999999,42.212392],[-79.467021,42.212431],[-79.46710299999999,42.212454],[-79.467259,42.212479],[-79.467358,42.212505],[-79.467438,42.212538],[-79.467929,42.212851],[-79.46826,42.213117],[-79.469615,42.21401],[-79.4709,42.214844],[-79.47125699999999,42.215088],[-79.4717,42.215347],[-79.472605,42.215831],[-79.472758,42.21593],[-79.472875,42.215984],[-79.473412,42.216152],[-79.473536,42.216203],[-79.473671,42.216243],[-79.474683,42.216308],[-79.47481399999999,42.216363],[-79.474909,42.216385],[-79.475087,42.216381],[-79.47535000000001,42.216352],[-79.475837,42.216349],[-79.476026,42.216363],[-79.47615399999999,42.216392],[-79.476311,42.216443],[-79.47657700000001,42.216549],[-79.47676300000001,42.216604],[-79.477239,42.216859],[-79.47729,42.216906],[-79.477323,42.216964],[-79.477356,42.217066],[-79.47737600000001,42.217077],[-79.47741000000001,42.217074],[-79.477447,42.217055],[-79.477487,42.217048],[-79.47754500000001,42.217059],[-79.477574,42.217099],[-79.477581,42.217154],[-79.4776,42.21719],[-79.477625,42.217212],[-79.47772399999999,42.217256],[-79.477994,42.217409],[-79.47819800000001,42.217569],[-79.478263,42.217642],[-79.478433,42.217802],[-79.47851300000001,42.218006],[-79.47862600000001,42.218196],[-79.47871000000001,42.218436],[-79.478847,42.218698],[-79.478931,42.219063],[-79.478934,42.219168],[-79.47889000000001,42.219405],[-79.47890099999999,42.21946],[-79.478942,42.219507],[-79.478978,42.219533],[-79.47903599999999,42.219555],[-79.479366,42.219613],[-79.47958199999999,42.219638],[-79.479782,42.219649],[-79.479902,42.219671],[-79.47999299999999,42.219704],[-79.480271,42.219748],[-79.480442,42.21981],[-79.480479,42.219857],[-79.480508,42.219915],[-79.48053299999999,42.22005],[-79.48057,42.220076],[-79.480594,42.220073],[-79.48062400000001,42.220057],[-79.480756,42.219915],[-79.480796,42.219908],[-79.481206,42.219963],[-79.481556,42.219988],[-79.48166500000001,42.219999],[-79.48177800000001,42.220039],[-79.482015,42.22017],[-79.482063,42.220221],[-79.482178,42.220312],[-79.482232,42.220367],[-79.48225100000001,42.2204],[-79.482243,42.220462],[-79.482196,42.220516],[-79.48218900000001,42.220568],[-79.48224,42.220622],[-79.48227199999999,42.22064],[-79.48231199999999,42.220648],[-79.482433,42.220637],[-79.482495,42.220659],[-79.482586,42.220772],[-79.482721,42.220877],[-79.482776,42.220906],[-79.482907,42.220932],[-79.48298,42.220979],[-79.48300500000001,42.221019],[-79.48312900000001,42.221132],[-79.48322,42.22118],[-79.483313,42.221249],[-79.483645,42.22158],[-79.483794,42.221693],[-79.483831,42.221715],[-79.483915,42.221741],[-79.483999,42.221748],[-79.484116,42.221825],[-79.484302,42.221821],[-79.484375,42.221843],[-79.484444,42.221879],[-79.484579,42.221988],[-79.48461500000001,42.222036],[-79.48466000000001,42.222144],[-79.48467100000001,42.222186],[-79.485828,42.221922],[-79.485884,42.22192],[-79.486417,42.221771],[-79.486634,42.221691],[-79.487177,42.222035],[-79.487533,42.222286],[-79.487619,42.222347],[-79.487762,42.222488],[-79.487837,42.222562],[-79.487886,42.222614],[-79.488028,42.222832],[-79.4881,42.222974],[-79.48817200000001,42.223275],[-79.488213,42.223816],[-79.48826699999999,42.22492],[-79.48827300000001,42.225375],[-79.488249,42.225742],[-79.48816100000001,42.226218],[-79.487956,42.227211],[-79.487803,42.227827],[-79.487753,42.227986],[-79.487649,42.228318],[-79.48756299999999,42.228534],[-79.487512,42.228657],[-79.487345,42.229057],[-79.487296,42.229175],[-79.487081,42.229687],[-79.487015,42.229935],[-79.486958,42.230459],[-79.48697300000001,42.230868],[-79.486998,42.231003],[-79.4871,42.231303],[-79.487225,42.231532],[-79.48741200000001,42.231791],[-79.48815999999999,42.232656],[-79.488738,42.233281],[-79.489002,42.233505],[-79.48914600000001,42.233611],[-79.48941600000001,42.23379],[-79.489767,42.234001],[-79.48979,42.234015],[-79.490285,42.234315],[-79.49086,42.234695],[-79.491214,42.234986],[-79.49211699999999,42.235858],[-79.49301800000001,42.236724],[-79.493396,42.237122],[-79.493543,42.237293],[-79.494454,42.238474],[-79.494821,42.238943],[-79.495042,42.239238],[-79.495358,42.239651],[-79.495925,42.240397],[-79.496049,42.240556],[-79.496837,42.241614],[-79.49695199999999,42.241795],[-79.497069,42.242052],[-79.497123,42.242243],[-79.497148,42.242387],[-79.497153,42.242604],[-79.497142,42.242819],[-79.497113,42.243045],[-79.49703,42.24332],[-79.496934,42.243514],[-79.496785,42.24374],[-79.49645099999999,42.244139],[-79.496341,42.244256],[-79.49500399999999,42.245791],[-79.494832,42.246021],[-79.494777,42.246131],[-79.49475,42.246265],[-79.494756,42.246369],[-79.494776,42.246501],[-79.49482500000001,42.246608],[-79.494938,42.246755],[-79.49511800000001,42.246916],[-79.49549399999999,42.247207],[-79.496101,42.247654],[-79.496427,42.247897],[-79.498014,42.249065],[-79.498324,42.249296],[-79.49964900000001,42.25024],[-79.499824,42.25037],[-79.501665,42.251723],[-79.50224300000001,42.252153],[-79.503578,42.253126],[-79.50378000000001,42.253275],[-79.503911,42.253372],[-79.50495600000001,42.25415],[-79.504559,42.254436]]],"type":"Polygon"}
}