{
  "id": "360050414001",
  "type": "Feature",
  "properties": {
    "area_land":120001,
    "area_water":0,
    "geoid":"360050414001",
    "name":"Block Group 1",
    "state":"ny"
},
  "bbox": [
    -73.856997,
    40.89845,
    -73.851551,
    40.903194
],
  "geometry": {"coordinates":[[[-73.85699700000001,40.899504],[-73.855648,40.901198],[-73.85405299999999,40.903194],[-73.85327700000001,40.902838],[-73.852504,40.902486],[-73.851551,40.902045],[-73.853004,40.899991],[-73.854299,40.89845],[-73.855386,40.898876],[-73.856194,40.899188],[-73.85699700000001,40.899504]]],"type":"Polygon"}
}