{
  "id": "360894901002",
  "type": "Feature",
  "properties": {
    "area_land":44305474,
    "area_water":26094214,
    "geoid":"360894901002",
    "name":"Block Group 2",
    "state":"ny"
},
  "bbox": [
    -74.949388,
    44.934978,
    -74.757191,
    45.015865
],
  "geometry": {"coordinates":[[[-74.949388,44.970353],[-74.948824,44.972543],[-74.947777,44.975493],[-74.94653599999999,44.977559],[-74.94561299999999,44.978349],[-74.944906,44.978884],[-74.939447,44.984417],[-74.934468,44.984243],[-74.918538,44.983706],[-74.91356,44.983539],[-74.91099199999999,44.983463],[-74.90964,44.983422],[-74.908289,44.983382],[-74.907948,44.983369],[-74.901731,44.991456],[-74.90072499999999,44.992761],[-74.891831,44.997597],[-74.891762,44.997634],[-74.888042,44.999658],[-74.887837,45.000046],[-74.882774,45.000701],[-74.88268600000001,45.000717],[-74.88176,45.000826],[-74.87723200000001,45.001362],[-74.874641,45.001144],[-74.86664,45.000536],[-74.86264300000001,45.004591],[-74.856448,45.004524],[-74.85642199999999,45.004524],[-74.854778,45.005303],[-74.847722,45.009467],[-74.846175,45.01029],[-74.84583600000001,45.010385],[-74.84574499999999,45.01041],[-74.84179,45.011415],[-74.841731,45.011438],[-74.839529,45.012485],[-74.835829,45.014247],[-74.835762,45.014275],[-74.83467400000001,45.014698],[-74.833438,45.014875],[-74.826576,45.015865],[-74.82178999999999,45.013751],[-74.817195,45.011728],[-74.81326300000001,45.013543],[-74.812924,45.013573],[-74.801638,45.014569],[-74.800173,45.011315],[-74.799885,45.010707],[-74.795147,45.006431],[-74.793149,45.004645],[-74.785766,45.004792],[-74.78312200000001,45.00485],[-74.777749,45.005061],[-74.763407,45.005613],[-74.761735,45.00005],[-74.760791,44.996474],[-74.760217,44.994945],[-74.759027,44.994602],[-74.757744,44.994233],[-74.757453,44.994148],[-74.75719100000001,44.994069],[-74.760549,44.992441],[-74.764347,44.990223],[-74.76706900000001,44.988849],[-74.769882,44.987548],[-74.770442,44.986932],[-74.771109,44.986198],[-74.77305800000001,44.983855],[-74.774124,44.982673],[-74.77446500000001,44.982357],[-74.77582700000001,44.9811],[-74.77778000000001,44.979576],[-74.780462,44.978547],[-74.782742,44.978046],[-74.78363899999999,44.97781],[-74.786497,44.977191],[-74.787589,44.976739],[-74.788089,44.976485],[-74.78885099999999,44.975868],[-74.78909400000001,44.975672],[-74.789199,44.975444],[-74.78943099999999,44.974945],[-74.789511,44.974774],[-74.789484,44.97463],[-74.78933600000001,44.973844],[-74.788523,44.971742],[-74.788048,44.969897],[-74.787907,44.968967],[-74.788251,44.968121],[-74.78998199999999,44.96754],[-74.791453,44.967158],[-74.797973,44.965571],[-74.805634,44.962639],[-74.811966,44.960751],[-74.818651,44.958401],[-74.822917,44.957379],[-74.82408,44.957304],[-74.825253,44.957618],[-74.826426,44.958565],[-74.827308,44.959371],[-74.828326,44.959684],[-74.829177,44.959655],[-74.830028,44.959453],[-74.830455,44.95921],[-74.830814,44.958989],[-74.83187599999999,44.958326],[-74.832291,44.957797],[-74.833342,44.956137],[-74.834171,44.955341],[-74.83558499999999,44.954611],[-74.83722299999999,44.954192],[-74.838769,44.953963],[-74.839072,44.95399],[-74.84020200000001,44.954068],[-74.842557,44.954588],[-74.843943,44.95465],[-74.845641,44.954297],[-74.847618,44.953515],[-74.85089499999999,44.952056],[-74.85442500000001,44.95074],[-74.856216,44.950234],[-74.857496,44.949548],[-74.859937,44.948174],[-74.86271000000001,44.946663],[-74.864362,44.945552],[-74.86523800000001,44.944689],[-74.866399,44.943664],[-74.868315,44.942099],[-74.870498,44.940663],[-74.871499,44.939997],[-74.87168,44.939874],[-74.873041,44.938974],[-74.87395600000001,44.938453],[-74.874623,44.93791],[-74.875387,44.937399],[-74.875739,44.93685],[-74.875934,44.93626],[-74.87593699999999,44.93576],[-74.876042,44.935226],[-74.87630299999999,44.934978],[-74.876414,44.935243],[-74.876743,44.935861],[-74.876903,44.936134],[-74.87700700000001,44.93628],[-74.877369,44.936676],[-74.877673,44.936938],[-74.877865,44.937088],[-74.878068,44.93723],[-74.878336,44.93738],[-74.878489,44.937256],[-74.878533,44.937221],[-74.87960099999999,44.937631],[-74.880971,44.938179],[-74.881409,44.93835],[-74.88219100000001,44.938678],[-74.88324299999999,44.939098],[-74.885116,44.939854],[-74.887002,44.940606],[-74.88851099999999,44.941216],[-74.888704,44.941294],[-74.889802,44.941739],[-74.89091000000001,44.942187],[-74.89202299999999,44.942631],[-74.89313799999999,44.943079],[-74.893959,44.94272],[-74.895473,44.942028],[-74.89617699999999,44.941701],[-74.89626199999999,44.941858],[-74.89633000000001,44.941963],[-74.896479,44.94213],[-74.896629,44.942253],[-74.896838,44.942364],[-74.897088,44.942448],[-74.897173,44.942471],[-74.89745499999999,44.942506],[-74.897561,44.942512],[-74.89773099999999,44.942546],[-74.897899,44.942599],[-74.898048,44.942673],[-74.898184,44.942785],[-74.898268,44.942881],[-74.89834399999999,44.943055],[-74.89838399999999,44.943078],[-74.898813,44.943925],[-74.899052,44.944382],[-74.900133,44.944119],[-74.900886,44.945586],[-74.90089999999999,44.945613],[-74.901256,44.946292],[-74.901596,44.94691],[-74.901811,44.947245],[-74.902119,44.947636],[-74.902986,44.948588],[-74.904425,44.95011],[-74.904754,44.95047],[-74.905304,44.951028],[-74.9057,44.951465],[-74.906019,44.951887],[-74.906193,44.952211],[-74.906408,44.952594],[-74.906464,44.952673],[-74.906615,44.952859],[-74.90672499999999,44.952982],[-74.906879,44.953121],[-74.90799,44.953964],[-74.908163,44.954112],[-74.908316,44.954244],[-74.908967,44.954941],[-74.90920800000001,44.955199],[-74.909674,44.955706],[-74.910088,44.95616],[-74.911158,44.957295],[-74.912335,44.958538],[-74.913208,44.959502],[-74.91406600000001,44.96047],[-74.915959,44.96256],[-74.916267,44.962895],[-74.91655299999999,44.963187],[-74.919336,44.960318],[-74.91979600000001,44.959827],[-74.92025,44.959363],[-74.92076299999999,44.958875],[-74.921334,44.95839],[-74.92276699999999,44.957202],[-74.922785,44.957187],[-74.922912,44.957063],[-74.92296899999999,44.956956],[-74.922995,44.956852],[-74.92325599999999,44.955889],[-74.92336400000001,44.955616],[-74.923519,44.955352],[-74.923604,44.955233],[-74.92385299999999,44.954959],[-74.92410099999999,44.954751],[-74.924384,44.95456],[-74.924564,44.954461],[-74.930643,44.95163],[-74.930854,44.9515],[-74.930969,44.951408],[-74.931065,44.95132],[-74.93171700000001,44.952039],[-74.93185,44.952171],[-74.93477300000001,44.955263],[-74.93546000000001,44.955989],[-74.940489,44.961293],[-74.941151,44.961786],[-74.94185899999999,44.962023],[-74.943727,44.962749],[-74.947001,44.963995],[-74.948803,44.965562],[-74.949208,44.968006],[-74.949388,44.970353]]],"type":"Polygon"}
}