{
  "id": "360810373002",
  "type": "Feature",
  "properties": {
    "area_land":151083,
    "area_water":0,
    "geoid":"360810373002",
    "name":"Block Group 2",
    "state":"ny"
},
  "bbox": [
    -73.861617,
    40.757825,
    -73.854496,
    40.761836
],
  "geometry": {"coordinates":[[[-73.86138800000001,40.760496],[-73.86112799999999,40.760775],[-73.860522,40.761426],[-73.859942,40.761703],[-73.859756,40.761836],[-73.859695,40.761782],[-73.85912399999999,40.761275],[-73.858966,40.761159],[-73.858806,40.761047],[-73.858637,40.760937],[-73.858465,40.760833],[-73.858289,40.760733],[-73.858109,40.760637],[-73.857924,40.760546],[-73.857736,40.760459],[-73.857544,40.760378],[-73.857349,40.760301],[-73.856706,40.760044],[-73.856559,40.759982],[-73.856382,40.759907],[-73.85603999999999,40.759726],[-73.85577000000001,40.759538],[-73.85553299999999,40.759343],[-73.855251,40.759148],[-73.855009,40.758879],[-73.85464,40.758466],[-73.85458,40.758388],[-73.854496,40.758279],[-73.854629,40.758307],[-73.854766,40.758328],[-73.85490900000001,40.758336],[-73.855054,40.75833],[-73.85530199999999,40.758293],[-73.85540399999999,40.75834],[-73.855608,40.758305],[-73.85695200000001,40.758133],[-73.857753,40.758027],[-73.85856099999999,40.757912],[-73.858889,40.7579],[-73.85951300000001,40.757879],[-73.859927,40.757864],[-73.860462,40.757844],[-73.86099900000001,40.757825],[-73.861386,40.759963],[-73.861617,40.760553],[-73.86138800000001,40.760496]]],"type":"Polygon"}
}