{
  "id": "360339504005",
  "type": "Feature",
  "properties": {
    "area_land":76392499,
    "area_water":1768609,
    "geoid":"360339504005",
    "name":"Block Group 5",
    "state":"ny"
},
  "bbox": [
    -74.316941,
    44.69554,
    -74.195228,
    44.812945
],
  "geometry": {"coordinates":[[[-74.31692200000001,44.703373],[-74.31680900000001,44.703921],[-74.316726,44.704195],[-74.316503,44.704711],[-74.316299,44.705082],[-74.315986,44.705502],[-74.315748,44.705787],[-74.31547,44.706065],[-74.31527,44.706247],[-74.314807,44.706611],[-74.314379,44.706893],[-74.31326199999999,44.707523],[-74.31220999999999,44.708103],[-74.31138,44.708594],[-74.310998,44.708858],[-74.31054899999999,44.709209],[-74.31027,44.709437],[-74.309866,44.709805],[-74.30942400000001,44.710276],[-74.309195,44.710554],[-74.308842,44.71107],[-74.307435,44.713288],[-74.306996,44.713999],[-74.306468,44.71483],[-74.30490500000001,44.717354],[-74.304793,44.717528],[-74.30410999999999,44.718594],[-74.303809,44.719107],[-74.30353700000001,44.719657],[-74.303393,44.720019],[-74.303085,44.721008],[-74.302516,44.722891],[-74.302297,44.723673],[-74.301834,44.725451],[-74.301737,44.72582],[-74.301586,44.726328],[-74.30143099999999,44.726747],[-74.301013,44.727706],[-74.30083399999999,44.728099],[-74.300569,44.728688],[-74.299927,44.730114],[-74.29967499999999,44.730658],[-74.29935500000001,44.73135],[-74.298804,44.732548],[-74.298575,44.732929],[-74.29841999999999,44.733163],[-74.298174,44.733476],[-74.29780700000001,44.733869],[-74.29752999999999,44.734125],[-74.297132,44.734439],[-74.29685000000001,44.734632],[-74.296088,44.735093],[-74.29561699999999,44.735365],[-74.29528999999999,44.735565],[-74.294742,44.735895],[-74.294495,44.736063],[-74.294382,44.736139],[-74.293958,44.736483],[-74.293515,44.736911],[-74.292725,44.737767],[-74.29253300000001,44.737973],[-74.291156,44.739451],[-74.291106,44.739504],[-74.290389,44.740302],[-74.289745,44.741058],[-74.289598,44.741232],[-74.288996,44.7421],[-74.288205,44.743163],[-74.287909,44.743578],[-74.287488,44.744232],[-74.287324,44.744545],[-74.28720800000001,44.744832],[-74.287075,44.745272],[-74.286616,44.7471],[-74.286193,44.748871],[-74.286124,44.749122],[-74.28600299999999,44.749717],[-74.28597600000001,44.750047],[-74.28596899999999,44.750383],[-74.286028,44.75101],[-74.286197,44.75243],[-74.28630200000001,44.753183],[-74.28645400000001,44.753862],[-74.287541,44.757463],[-74.28767999999999,44.757806],[-74.287763,44.757986],[-74.287997,44.758363],[-74.288177,44.758592],[-74.288708,44.75917],[-74.290097,44.760615],[-74.29065199999999,44.761208],[-74.290779,44.761339],[-74.291298,44.761873],[-74.291965,44.762558],[-74.292873,44.763519],[-74.295423,44.766146],[-74.295885,44.766558],[-74.29598,44.76663],[-74.297037,44.76742],[-74.298338,44.768375],[-74.299021,44.768879],[-74.29968599999999,44.769363],[-74.30021000000001,44.769777],[-74.300467,44.77001],[-74.300753,44.770327],[-74.300985,44.770633],[-74.301226,44.771021],[-74.30170699999999,44.771965],[-74.301832,44.772231],[-74.302538,44.773657],[-74.302949,44.774521],[-74.30313,44.774905],[-74.303641,44.776047],[-74.304974,44.778957],[-74.305319,44.779766],[-74.305448,44.780241],[-74.305481,44.780476],[-74.305497,44.780739],[-74.30549499999999,44.781295],[-74.305421,44.78376],[-74.305418,44.784257],[-74.30538,44.785224],[-74.305342,44.786673],[-74.305301,44.788131],[-74.305269,44.788437],[-74.30522999999999,44.788723],[-74.304677,44.791667],[-74.304518,44.792514],[-74.30446499999999,44.793151],[-74.304481,44.79365],[-74.30449900000001,44.793904],[-74.304935,44.797305],[-74.305099,44.798638],[-74.30522000000001,44.799257],[-74.30534,44.799735],[-74.30555099999999,44.80037],[-74.305719,44.800766],[-74.306166,44.801681],[-74.30685099999999,44.803015],[-74.307046,44.803502],[-74.307211,44.804123],[-74.30727899999999,44.804618],[-74.307294,44.804893],[-74.307293,44.805217],[-74.307231,44.805764],[-74.307075,44.80649],[-74.30683999999999,44.807454],[-74.30669,44.807929],[-74.30649699999999,44.808412],[-74.306293,44.808886],[-74.30581100000001,44.80993],[-74.30579400000001,44.809963],[-74.30534900000001,44.81082],[-74.30494899999999,44.81146],[-74.304796,44.811429],[-74.30462,44.811451],[-74.30446600000001,44.811508],[-74.30381199999999,44.811839],[-74.303473,44.811997],[-74.30316999999999,44.812107],[-74.301929,44.812485],[-74.300825,44.812793],[-74.300487,44.812861],[-74.30017700000001,44.812894],[-74.299997,44.812905],[-74.298956,44.812925],[-74.29840900000001,44.812945],[-74.298089,44.812936],[-74.29808300000001,44.812611],[-74.298052,44.812139],[-74.29790800000001,44.810124],[-74.296671,44.810218],[-74.296198,44.810254],[-74.29537999999999,44.810307],[-74.29459900000001,44.810376],[-74.293834,44.810429],[-74.292918,44.81051],[-74.29200899999999,44.810577],[-74.289571,44.810816],[-74.28752799999999,44.811009],[-74.287216,44.81108],[-74.28689300000001,44.810762],[-74.285961,44.8098],[-74.283552,44.807417],[-74.28119,44.805096],[-74.28067799999999,44.804636],[-74.27908100000001,44.805449],[-74.27821299999999,44.805865],[-74.277612,44.806134],[-74.276428,44.806654],[-74.276163,44.806729],[-74.27597,44.806772],[-74.27441399999999,44.807038],[-74.273329,44.80723],[-74.272975,44.807283],[-74.27019199999999,44.807539],[-74.269671,44.807577],[-74.26858300000001,44.807677],[-74.268095,44.807729],[-74.26796299999999,44.807753],[-74.267144,44.807942],[-74.265638,44.808329],[-74.26487299999999,44.808556],[-74.26446799999999,44.808694],[-74.263102,44.80924],[-74.26241400000001,44.809503],[-74.26169,44.809806],[-74.261398,44.809552],[-74.261212,44.809335],[-74.261092,44.809098],[-74.261015,44.808819],[-74.26097900000001,44.80815],[-74.260949,44.807783],[-74.260819,44.807349],[-74.26061,44.806728],[-74.260408,44.806288],[-74.260296,44.806093],[-74.260071,44.805754],[-74.259191,44.80452],[-74.259073,44.804353],[-74.25838,44.803401],[-74.258229,44.80325],[-74.258101,44.803122],[-74.25726899999999,44.802388],[-74.25622199999999,44.801426],[-74.25568,44.800955],[-74.255189,44.8005],[-74.25505800000001,44.800369],[-74.254885,44.800172],[-74.254503,44.799637],[-74.254176,44.799049],[-74.253934,44.798702],[-74.253441,44.798116],[-74.25324999999999,44.79787],[-74.253045,44.797564],[-74.252837,44.797156],[-74.252634,44.79668],[-74.252543,44.79631],[-74.252421,44.795418],[-74.252291,44.794751],[-74.252122,44.794179],[-74.25196200000001,44.793807],[-74.251818,44.79357],[-74.25146100000001,44.793053],[-74.251322,44.792854],[-74.250989,44.792437],[-74.25066200000001,44.792095],[-74.249999,44.791552],[-74.248734,44.79058],[-74.248193,44.790171],[-74.247606,44.789675],[-74.247412,44.789469],[-74.246852,44.78872],[-74.246499,44.788324],[-74.245965,44.787765],[-74.245059,44.786912],[-74.244947,44.786807],[-74.244686,44.786577],[-74.244462,44.786412],[-74.244281,44.786301],[-74.242677,44.785441],[-74.24177400000001,44.784947],[-74.241456,44.78477],[-74.241133,44.784582],[-74.24099200000001,44.784482],[-74.240784,44.784298],[-74.24069,44.784191],[-74.240504,44.783945],[-74.240326,44.783645],[-74.24003999999999,44.782982],[-74.239906,44.782636],[-74.23944299999999,44.781435],[-74.239338,44.781127],[-74.239062,44.780507],[-74.23878999999999,44.780018],[-74.238122,44.77905],[-74.23777800000001,44.778579],[-74.23741800000001,44.778109],[-74.236755,44.777206],[-74.23664599999999,44.777024],[-74.236558,44.776827],[-74.236498,44.776683],[-74.236492,44.776662],[-74.236406,44.776365],[-74.23635899999999,44.775925],[-74.236338,44.775716],[-74.236299,44.775477],[-74.236041,44.774731],[-74.235882,44.774216],[-74.235793,44.773843],[-74.235715,44.773363],[-74.235602,44.772334],[-74.23548,44.771421],[-74.23538000000001,44.770882],[-74.235327,44.770734],[-74.235255,44.770582],[-74.235148,44.770379],[-74.23494100000001,44.770063],[-74.234915,44.770023],[-74.23470399999999,44.769789],[-74.234368,44.769486],[-74.23392800000001,44.769189],[-74.233558,44.768963],[-74.232158,44.768122],[-74.23137800000001,44.767616],[-74.22995,44.766732],[-74.229248,44.766264],[-74.228568,44.765777],[-74.227301,44.764824],[-74.22663900000001,44.764355],[-74.22649800000001,44.764225],[-74.226418,44.764115],[-74.226309,44.763893],[-74.226206,44.763534],[-74.22615999999999,44.763373],[-74.22591300000001,44.762581],[-74.225708,44.761868],[-74.225635,44.761672],[-74.22556299999999,44.761557],[-74.225374,44.761335],[-74.225112,44.761064],[-74.224988,44.760946],[-74.224541,44.760521],[-74.224071,44.760143],[-74.22388599999999,44.760012],[-74.22373399999999,44.759916],[-74.223602,44.759849],[-74.223466,44.759787],[-74.223259,44.759714],[-74.22211,44.759384],[-74.22197300000001,44.75933],[-74.22175900000001,44.759225],[-74.221586,44.759131],[-74.22063,44.758525],[-74.22023900000001,44.758238],[-74.21997500000001,44.758016],[-74.2196,44.757671],[-74.219167,44.757302],[-74.218446,44.756752],[-74.218322,44.756705],[-74.21805000000001,44.756623],[-74.217923,44.756594],[-74.21776199999999,44.756573],[-74.217214,44.756562],[-74.21677699999999,44.756544],[-74.216542,44.756521],[-74.215982,44.756442],[-74.215664,44.756381],[-74.215485,44.756328],[-74.21511700000001,44.756175],[-74.21494800000001,44.756082],[-74.214867,44.756037],[-74.214579,44.755837],[-74.214242,44.755515],[-74.21406899999999,44.755284],[-74.213155,44.753592],[-74.212885,44.753122],[-74.211929,44.751423],[-74.21154799999999,44.750742],[-74.211156,44.750099],[-74.211095,44.749999],[-74.210943,44.749784],[-74.210785,44.749602],[-74.210581,44.749406],[-74.21019699999999,44.74911],[-74.209988,44.748971],[-74.20968999999999,44.748809],[-74.209287,44.748631],[-74.20902599999999,44.748544],[-74.207227,44.748028],[-74.206385,44.747777],[-74.205674,44.747544],[-74.205399,44.747439],[-74.205067,44.74729],[-74.204864,44.747198],[-74.204386,44.746953],[-74.203954,44.746708],[-74.20375300000001,44.746574],[-74.203129,44.746117],[-74.202932,44.745922],[-74.202507,44.745423],[-74.20244099999999,44.745346],[-74.20154100000001,44.744407],[-74.200857,44.743636],[-74.199862,44.742504],[-74.19930100000001,44.741889],[-74.199271,44.741855],[-74.19909,44.739339],[-74.198986,44.737663],[-74.198716,44.733243],[-74.198598,44.733128],[-74.19824,44.728022],[-74.197864,44.724934],[-74.197213,44.719495],[-74.19673299999999,44.715452],[-74.19653,44.71364],[-74.196358,44.712114],[-74.196106,44.710102],[-74.195228,44.702328],[-74.199489,44.702067],[-74.212481,44.701444],[-74.213466,44.701368],[-74.21857199999999,44.701102],[-74.22484900000001,44.700772],[-74.225527,44.700743],[-74.229207,44.700529],[-74.232634,44.700348],[-74.246949,44.699544],[-74.249218,44.69999],[-74.250241,44.69991],[-74.258976,44.699315],[-74.273884,44.698283],[-74.29164299999999,44.697119],[-74.307982,44.695983],[-74.314527,44.69554],[-74.31514300000001,44.696758],[-74.315319,44.697091],[-74.315747,44.697915],[-74.31601999999999,44.698432],[-74.316164,44.698719],[-74.316348,44.699153],[-74.316484,44.699557],[-74.31659999999999,44.699998],[-74.316638,44.700167],[-74.316714,44.700638],[-74.316754,44.701091],[-74.31687599999999,44.702079],[-74.316919,44.702515],[-74.316941,44.703067],[-74.31692200000001,44.703373]]],"type":"Polygon"}
}