{
  "id": "360050239006",
  "type": "Feature",
  "properties": {
    "area_land":18184,
    "area_water":0,
    "geoid":"360050239006",
    "name":"Block Group 6",
    "state":"ny"
},
  "bbox": [
    -73.902779,
    40.858094,
    -73.900788,
    40.860266
],
  "geometry": {"coordinates":[[[-73.902779,40.85839],[-73.901633,40.860266],[-73.90078800000001,40.859977],[-73.901161,40.859349],[-73.90191299999999,40.858094],[-73.902779,40.85839]]],"type":"Polygon"}
}