{
  "id": "360050426004",
  "type": "Feature",
  "properties": {
    "area_land":71445,
    "area_water":0,
    "geoid":"360050426004",
    "name":"Block Group 4",
    "state":"ny"
},
  "bbox": [
    -73.840147,
    40.890935,
    -73.836459,
    40.894061
],
  "geometry": {"coordinates":[[[-73.839279,40.893869],[-73.838407,40.894061],[-73.837368,40.893821],[-73.83733700000001,40.893814],[-73.836459,40.891516],[-73.83734699999999,40.891321],[-73.83823099999999,40.891126],[-73.8391,40.890935],[-73.840147,40.893677],[-73.839279,40.893869]]],"type":"Polygon"}
}