{
  "id": "360811333003",
  "type": "Feature",
  "properties": {
    "area_land":196241,
    "area_water":0,
    "geoid":"360811333003",
    "name":"Block Group 3",
    "state":"ny"
},
  "bbox": [
    -73.788209,
    40.727445,
    -73.779365,
    40.731972
],
  "geometry": {"coordinates":[[[-73.78820899999999,40.731363],[-73.787353,40.731665],[-73.78649900000001,40.731972],[-73.785804,40.730347],[-73.784932,40.73056],[-73.783951,40.730799],[-73.783058,40.731017],[-73.78213100000001,40.731248],[-73.781215,40.7315],[-73.780333,40.731742],[-73.779365,40.729702],[-73.780248,40.72946],[-73.781161,40.729213],[-73.782059,40.728919],[-73.782923,40.728636],[-73.783601,40.728413],[-73.78397699999999,40.728291],[-73.78482099999999,40.728015],[-73.785685,40.72773],[-73.78619,40.727564],[-73.78655000000001,40.727445],[-73.787589,40.72991],[-73.78820899999999,40.731363]]],"type":"Polygon"}
}