{
  "id": "361190133041",
  "type": "Feature",
  "properties": {
    "area_land":259657,
    "area_water":0,
    "geoid":"361190133041",
    "name":"Block Group 1",
    "state":"ny"
},
  "bbox": [
    -73.868642,
    41.144281,
    -73.864047,
    41.156408
],
  "geometry": {"coordinates":[[[-73.86864199999999,41.148842],[-73.867436,41.148947],[-73.867295,41.149182],[-73.866597,41.149192],[-73.866191,41.149099],[-73.866057,41.149069],[-73.865725,41.149206],[-73.86565400000001,41.149469],[-73.865616,41.149582],[-73.865437,41.149566],[-73.865171,41.149542],[-73.865151,41.149918],[-73.865222,41.150651],[-73.865326,41.150664],[-73.865368,41.150953],[-73.86541,41.151192],[-73.86533300000001,41.15154],[-73.865425,41.152838],[-73.86545,41.153137],[-73.86544600000001,41.153221],[-73.867633,41.153468],[-73.86761199999999,41.153618],[-73.867544,41.154111],[-73.868379,41.154234],[-73.868354,41.154307],[-73.868025,41.155002],[-73.867898,41.155357],[-73.867625,41.155391],[-73.867531,41.155572],[-73.867435,41.155927],[-73.86742700000001,41.15596],[-73.867358,41.156098],[-73.86696000000001,41.156223],[-73.866204,41.156391],[-73.866129,41.156408],[-73.86604199999999,41.155677],[-73.866044,41.155616],[-73.865934,41.15566],[-73.86579,41.155666],[-73.865118,41.155659],[-73.864047,41.155646],[-73.86413,41.154217],[-73.864192,41.153138],[-73.86424599999999,41.152219],[-73.864294,41.151324],[-73.864392,41.149724],[-73.864397,41.149677],[-73.864588,41.149069],[-73.86496200000001,41.147718],[-73.86499499999999,41.147628],[-73.865261,41.146908],[-73.865377,41.146473],[-73.86539500000001,41.146359],[-73.865497,41.146066],[-73.865509,41.146024],[-73.86557999999999,41.14591],[-73.86574299999999,41.145751],[-73.865815,41.145683],[-73.865888,41.145593],[-73.86594100000001,41.145475],[-73.865959,41.145325],[-73.86595,41.145184],[-73.865861,41.144928],[-73.86716199999999,41.14475],[-73.867153,41.14452],[-73.86719100000001,41.144443],[-73.86729699999999,41.144386],[-73.867586,41.144347],[-73.86783699999999,41.144347],[-73.868167,41.144281],[-73.86847299999999,41.14744],[-73.868599,41.148488],[-73.86864199999999,41.148842]]],"type":"Polygon"}
}