{
  "id": "360810506001",
  "type": "Feature",
  "properties": {
    "area_land":73252,
    "area_water":0,
    "geoid":"360810506001",
    "name":"Block Group 1",
    "state":"ny"
},
  "bbox": [
    -73.762301,
    40.706159,
    -73.757617,
    40.708811
],
  "geometry": {"coordinates":[[[-73.76230099999999,40.70795],[-73.76140599999999,40.708163],[-73.76051,40.708379],[-73.75961599999999,40.708595],[-73.758718,40.708811],[-73.758101,40.707318],[-73.757617,40.706166],[-73.757932,40.706159],[-73.758273,40.706194],[-73.758489,40.706236],[-73.758655,40.706265],[-73.759547,40.706415],[-73.759719,40.706444],[-73.760581,40.706523],[-73.760744,40.706536],[-73.76160900000001,40.706598],[-73.761759,40.706606],[-73.76230099999999,40.70795]]],"type":"Polygon"}
}