{
  "id": "360594056004",
  "type": "Feature",
  "properties": {
    "area_land":242330,
    "area_water":0,
    "geoid":"360594056004",
    "name":"Block Group 4",
    "state":"ny"
},
  "bbox": [
    -73.683431,
    40.692347,
    -73.676031,
    40.698398
],
  "geometry": {"coordinates":[[[-73.683263,40.693783],[-73.683176,40.693958],[-73.68311199999999,40.694119],[-73.683048,40.69426],[-73.682953,40.694534],[-73.68289300000001,40.694786],[-73.68285400000001,40.69494],[-73.68262799999999,40.696251],[-73.682531,40.69688],[-73.68224499999999,40.697765],[-73.682194,40.697963],[-73.68210500000001,40.698398],[-73.681713,40.698247],[-73.680986,40.697946],[-73.68015,40.697602],[-73.67935,40.697274],[-73.678504,40.696924],[-73.677674,40.69658],[-73.67688,40.696255],[-73.67603099999999,40.695913],[-73.67644799999999,40.695326],[-73.676676,40.695],[-73.67675699999999,40.69486],[-73.677222,40.694968],[-73.67749499999999,40.694319],[-73.67720300000001,40.69422],[-73.677513,40.693489],[-73.678172,40.693647],[-73.678307,40.693352],[-73.67845,40.693],[-73.67872699999999,40.692347],[-73.680167,40.692695],[-73.680196,40.692712],[-73.680269,40.692719],[-73.680837,40.692848],[-73.681822,40.69309],[-73.683431,40.693478],[-73.683263,40.693783]]],"type":"Polygon"}
}