{
  "id": "360470738001",
  "type": "Feature",
  "properties": {
    "area_land":70519,
    "area_water":0,
    "geoid":"360470738001",
    "name":"Block Group 1",
    "state":"ny"
},
  "bbox": [
    -73.941681,
    40.622517,
    -73.937226,
    40.625158
],
  "geometry": {"coordinates":[[[-73.941681,40.624907],[-73.94072,40.625015],[-73.939803,40.625127],[-73.93955699999999,40.625158],[-73.93857800000001,40.624228],[-73.937984,40.623678],[-73.937226,40.622958],[-73.938412,40.622827],[-73.939335,40.622725],[-73.94026599999999,40.622623],[-73.94122900000001,40.622517],[-73.941681,40.624907]]],"type":"Polygon"}
}