%YAML 1.1
%TAG !u! tag:unity3d.com,2011:
--- !u!74 &7400000
AnimationClip:
  m_ObjectHideFlags: 0
  m_PrefabParentObject: {fileID: 0}
  m_PrefabInternal: {fileID: 0}
  m_Name: JumpUp
  serializedVersion: 4
  m_AnimationType: 2
  m_Compressed: 0
  m_UseHighQualityCurve: 1
  m_RotationCurves: []
  m_CompressedRotationCurves: []
  m_PositionCurves: []
  m_ScaleCurves: []
  m_FloatCurves: []
  m_PPtrCurves:
  - curve:
    - time: 0
      value: {fileID: 21300000, guid: bb40880322dfc4f67970a60d454aa8a5, type: 3}
    - time: .0833333358
      value: {fileID: 21300000, guid: 3b65cd1354fb64e94bcb0ccd3ed4865a, type: 3}
    - time: .166666672
      value: {fileID: 21300000, guid: eebd57f42007c4dfca3286786cdf7f2d, type: 3}
    - time: .25
      value: {fileID: 21300000, guid: caf73954a6e58446aa5f32aeb7d2b3d1, type: 3}
    - time: .333333343
      value: {fileID: 21300000, guid: 06539b5e1acaf449d8fcfd456633d91f, type: 3}
    - time: .416666657
      value: {fileID: 21300000, guid: 924b5eaee61ae4844a19ee5b66d32e32, type: 3}
    - time: .5
      value: {fileID: 21300000, guid: fce875b570f944d298f75e2f809690dc, type: 3}
    - time: .583333313
      value: {fileID: 21300000, guid: be2edcb97b0c440aa9bae8672e0fad53, type: 3}
    - time: .666666687
      value: {fileID: 21300000, guid: 1a5512baae6d74c7bbb7c26c536c399b, type: 3}
    - time: .75
      value: {fileID: 21300000, guid: 4652f57e9b4b843e88052e7c826c7643, type: 3}
    - time: .833333313
      value: {fileID: 21300000, guid: 7bc19a40e457248048e702461139e7d3, type: 3}
    - time: .916666687
      value: {fileID: 21300000, guid: f51175f9652fb45c9a214790354ffba1, type: 3}
    - time: 1
      value: {fileID: 21300000, guid: a9debcead90304bdfae128d5ca0fd974, type: 3}
    - time: 1.08333337
      value: {fileID: 21300000, guid: 7ecfe726861924f37bbd8a9f48ac7984, type: 3}
    - time: 1.16666663
      value: {fileID: 21300000, guid: 5a7a4f53556a943dbbb1f371a74a54cb, type: 3}
    - time: 1.25
      value: {fileID: 21300000, guid: a836ebab973984b24ad171295316e95a, type: 3}
    - time: 1.33333337
      value: {fileID: 21300000, guid: 9f9b584ce56bd420982bb00044a9a2b5, type: 3}
    - time: 1.41666663
      value: {fileID: 21300000, guid: 2d3d494c90c58499fb676350f0b3dc3c, type: 3}
    - time: 1.5
      value: {fileID: 21300000, guid: f8466482f5b3c4c1795b6d19e6a6b2c3, type: 3}
    - time: 1.58333337
      value: {fileID: 21300000, guid: 4a20c92d670f84c5f9e324af7163000e, type: 3}
    attribute: m_Sprite
    path: 
    classID: 212
    script: {fileID: 0}
  m_SampleRate: 12
  m_WrapMode: 0
  m_Bounds:
    m_Center: {x: 0, y: 0, z: 0}
    m_Extent: {x: 0, y: 0, z: 0}
  m_AnimationClipSettings:
    serializedVersion: 2
    m_StartTime: 0
    m_StopTime: 1.66666675
    m_OrientationOffsetY: 0
    m_Level: 0
    m_CycleOffset: 0
    m_LoopTime: 1
    m_LoopBlend: 0
    m_LoopBlendOrientation: 0
    m_LoopBlendPositionY: 0
    m_LoopBlendPositionXZ: 0
    m_KeepOriginalOrientation: 0
    m_KeepOriginalPositionY: 1
    m_KeepOriginalPositionXZ: 0
    m_HeightFromFeet: 0
    m_Mirror: 0
  m_EditorCurves: []
  m_EulerEditorCurves: []
  m_Events: []
