{
  "files": {
    "main.js": "/static/js/main.a80a147a.js",
    "runtime-main.js": "/static/js/runtime-main.206b2522.js",
    "static/css/382.11025948.css": "/static/css/382.11025948.css",
    "static/js/382.70082b29.js": "/static/js/382.70082b29.js",
    "workbox-343947c7.js": "/workbox-343947c7.js",
    "service-worker.js": "/service-worker.js",
    "index.html": "/index.html"
  },
  "entrypoints": [
    "static/js/runtime-main.206b2522.js",
    "static/css/382.11025948.css",
    "static/js/382.70082b29.js",
    "static/js/main.a80a147a.js"
  ]
}