Name,Eng,Hindi,Science,Total marks out of 300,Percentage,Division
zafar,66,75,52,193,64%,first
vishal,57,44,72,173,58%,second
barkha,81,93,90,264,88%,First
shatrujeet,52,57,89,198,66%,First
aditya,20,23,10,53,18%,fail
radhika,30,40,45,115,38%,third