{
    "type": "FeatureCollection",
    "name": "track",
    "features": [
        {
            "type": "Feature",
            "properties": {
                "label": "",
                "index": 140725058770416,
                "when": "2000-Jan-01 00:00:00"
            },
            "geometry": {
                "type": "Point",
                "coordinates": [
                    -0.6524357144946924,
                    -1.9268448002249464
                ]
            }
        },
        {
            "type": "Feature",
            "properties": {
                "label": "",
                "index": 455316976,
                "when": "2000-Jan-01 21:00:00"
            },
            "geometry": {
                "type": "Point",
                "coordinates": [
                    -0.6524832183425748,
                    -1.926531164377029
                ]
            }
        }
    ]
}