{
    "type": "FeatureCollection",
    "name": "track",
    "features": [
        {
            "type": "Feature",
            "properties": {
                "label": "",
                "index": 6176769055304157696,
                "when": "2018-Dec-01 10:12:59"
            },
            "geometry": {
                "type": "Point",
                "coordinates": [
                    88.26824493494959,
                    27.04058752683232
                ]
            }
        },
        {
            "type": "Feature",
            "properties": {
                "label": "",
                "index": 3641149952,
                "when": "2018-Dec-01 10:57:59"
            },
            "geometry": {
                "type": "Point",
                "coordinates": [
                    88.26959726204422,
                    27.038414394757944
                ]
            }
        },
        {
            "type": "Feature",
            "properties": {
                "label": "",
                "index": 3641149952,
                "when": "2018-Dec-01 12:00:59"
            },
            "geometry": {
                "type": "Point",
                "coordinates": [
                    88.27085120115368,
                    27.037428849581358
                ]
            }
        },
        {
            "type": "Feature",
            "properties": {
                "label": "",
                "index": 3641149952,
                "when": "2018-Dec-01 12:15:59"
            },
            "geometry": {
                "type": "Point",
                "coordinates": [
                    88.27226272514248,
                    27.037387381686835
                ]
            }
        },
        {
            "type": "Feature",
            "properties": {
                "label": "",
                "index": 3641149952,
                "when": "2018-Dec-01 15:44:59"
            },
            "geometry": {
                "type": "Point",
                "coordinates": [
                    88.27283227415464,
                    27.039168640980514
                ]
            }
        },
        {
            "type": "Feature",
            "properties": {
                "label": "",
                "index": 3641149952,
                "when": "2018-Dec-01 15:59:59"
            },
            "geometry": {
                "type": "Point",
                "coordinates": [
                    88.27455382476704,
                    27.03884998789835
                ]
            }
        },
        {
            "type": "Feature",
            "properties": {
                "label": "",
                "index": 3641149952,
                "when": "2018-Dec-01 16:05:59"
            },
            "geometry": {
                "type": "Point",
                "coordinates": [
                    88.27576792163689,
                    27.03864271247856
                ]
            }
        },
        {
            "type": "Feature",
            "properties": {
                "label": "",
                "index": 3641149952,
                "when": "2018-Dec-01 17:58:19"
            },
            "geometry": {
                "type": "Point",
                "coordinates": [
                    88.27640588024454,
                    27.03851886668194
                ]
            }
        },
        {
            "type": "Feature",
            "properties": {
                "label": "",
                "index": 3641149952,
                "when": "2018-Dec-01 18:49:19"
            },
            "geometry": {
                "type": "Point",
                "coordinates": [
                    88.27644738566412,
                    27.039557498051935
                ]
            }
        }
    ]
}