{
"type": "FeatureCollection",
"name": "track1",
"features": [
{ "type": "Feature", "properties": { "when": "2017/06/18 15:26:06" }, "geometry": { "type": "Point", "coordinates": [ 88.321622061599996, 22.599583618499999 ] } },
{ "type": "Feature", "properties": { "when": "2017/06/18 15:27:06" }, "geometry": { "type": "Point", "coordinates": [ 88.321265528599994, 22.6002008956 ] } },
{ "type": "Feature", "properties": { "when": "2017/06/18 15:28:00" }, "geometry": { "type": "Point", "coordinates": [ 88.321211893699996, 22.6003970057 ] } },
{ "type": "Feature", "properties": { "when": "2017/06/18 15:28:36" }, "geometry": { "type": "Point", "coordinates": [ 88.321070818699994, 22.6008850272 ] } },
{ "type": "Feature", "properties": { "when": "2017/06/18 15:29:26" }, "geometry": { "type": "Point", "coordinates": [ 88.321133931700004, 22.601286412499999 ] } },
{ "type": "Feature", "properties": { "when": "2017/06/18 15:30:36" }, "geometry": { "type": "Point", "coordinates": [ 88.3215916204, 22.601954986300001 ] } },
{ "type": "Feature", "properties": { "when": "2017/06/18 15:31:36" }, "geometry": { "type": "Point", "coordinates": [ 88.321624802599999, 22.6029439259 ] } },
{ "type": "Feature", "properties": { "when": "2017/06/18 15:32:00" }, "geometry": { "type": "Point", "coordinates": [ 88.321696942800003, 22.60348607 ] } },
{ "type": "Feature", "properties": { "when": "2017/06/18 15:33:00" }, "geometry": { "type": "Point", "coordinates": [ 88.321786397699995, 22.603739675100002 ] } },
{ "type": "Feature", "properties": { "when": "2017/06/18 15:34:06" }, "geometry": { "type": "Point", "coordinates": [ 88.321903505700007, 22.604151710699998 ] } },
{ "type": "Feature", "properties": { "when": "2017/06/18 15:35:26" }, "geometry": { "type": "Point", "coordinates": [ 88.321567443399999, 22.604307389799999 ] } }
]
}
