{
    "type": "FeatureCollection",
    "name": "track",
    "features": [
        {
            "type": "Feature",
            "properties": {
                "label": "",
                "index": 140732256166304,
                "when": "2018-Nov-21 17:32:15"
            },
            "geometry": {
                "type": "Point",
                "coordinates": [
                    110.48238556472342,
                    29.04988176659758
                ]
            }
        },
        {
            "type": "Feature",
            "properties": {
                "label": "",
                "index": 3357745568,
                "when": "2018-Nov-21 17:33:46"
            },
            "geometry": {
                "type": "Point",
                "coordinates": [
                    110.48283473592936,
                    29.050290721598925
                ]
            }
        },
        {
            "type": "Feature",
            "properties": {
                "label": "",
                "index": 3357745568,
                "when": "2018-Nov-21 17:34:29"
            },
            "geometry": {
                "type": "Point",
                "coordinates": [
                    110.48293841771108,
                    29.05024899963714
                ]
            }
        },
        {
            "type": "Feature",
            "properties": {
                "label": "",
                "index": 3357745568,
                "when": "2018-Nov-21 17:35:45"
            },
            "geometry": {
                "type": "Point",
                "coordinates": [
                    110.48296639508308,
                    29.05034395366038
                ]
            }
        },
        {
            "type": "Feature",
            "properties": {
                "label": "",
                "index": 3357745568,
                "when": "2018-Nov-21 17:36:34"
            },
            "geometry": {
                "type": "Point",
                "coordinates": [
                    110.48329389782549,
                    29.050484946084425
                ]
            }
        },
        {
            "type": "Feature",
            "properties": {
                "label": "",
                "index": 3357745568,
                "when": "2018-Nov-21 17:37:01"
            },
            "geometry": {
                "type": "Point",
                "coordinates": [
                    110.48345682647127,
                    29.05048062977922
                ]
            }
        },
        {
            "type": "Feature",
            "properties": {
                "label": "",
                "index": 3357745568,
                "when": "2018-Nov-21 17:38:55"
            },
            "geometry": {
                "type": "Point",
                "coordinates": [
                    110.48394217224076,
                    29.050473213735637
                ]
            }
        },
        {
            "type": "Feature",
            "properties": {
                "label": "",
                "index": 3357745568,
                "when": "2018-Nov-21 17:45:41"
            },
            "geometry": {
                "type": "Point",
                "coordinates": [
                    110.48430069864705,
                    29.051439927867916
                ]
            }
        },
        {
            "type": "Feature",
            "properties": {
                "label": "",
                "index": 3357745568,
                "when": "2018-Nov-21 17:49:48"
            },
            "geometry": {
                "type": "Point",
                "coordinates": [
                    110.48436956417346,
                    29.05221857359287
                ]
            }
        },
        {
            "type": "Feature",
            "properties": {
                "label": "",
                "index": 3357745568,
                "when": "2018-Nov-21 17:50:41"
            },
            "geometry": {
                "type": "Point",
                "coordinates": [
                    110.483993687833,
                    29.05234850665904
                ]
            }
        },
        {
            "type": "Feature",
            "properties": {
                "label": "",
                "index": 3357745568,
                "when": "2018-Nov-21 18:00:36"
            },
            "geometry": {
                "type": "Point",
                "coordinates": [
                    110.48283928869826,
                    29.052858171487327
                ]
            }
        },
        {
            "type": "Feature",
            "properties": {
                "label": "",
                "index": 3357745568,
                "when": "2018-Nov-21 18:01:42"
            },
            "geometry": {
                "type": "Point",
                "coordinates": [
                    110.4831285083438,
                    29.052549358146299
                ]
            }
        },
        {
            "type": "Feature",
            "properties": {
                "label": "",
                "index": 3357745568,
                "when": "2018-Nov-21 18:03:13"
            },
            "geometry": {
                "type": "Point",
                "coordinates": [
                    110.4834642474479,
                    29.05211199516756
                ]
            }
        },
        {
            "type": "Feature",
            "properties": {
                "label": "",
                "index": 3357745568,
                "when": "2018-Nov-21 18:03:56"
            },
            "geometry": {
                "type": "Point",
                "coordinates": [
                    110.4833623822251,
                    29.052045967789718
                ]
            }
        },
        {
            "type": "Feature",
            "properties": {
                "label": "",
                "index": 3357745568,
                "when": "2018-Nov-21 18:15:02"
            },
            "geometry": {
                "type": "Point",
                "coordinates": [
                    110.48255339151227,
                    29.051019631549076
                ]
            }
        },
        {
            "type": "Feature",
            "properties": {
                "label": "",
                "index": 3357745568,
                "when": "2018-Nov-21 18:17:12"
            },
            "geometry": {
                "type": "Point",
                "coordinates": [
                    110.48206506508996,
                    29.051292836706059
                ]
            }
        }
    ]
}