{
    "type": "FeatureCollection",
    "name": "track",
    "features": [
        {
            "type": "Feature",
            "properties": {
                "label": "N",
                "index": 0,
                "when": "2018-Dec-15 16:27:36"
            },
            "geometry": {
                "type": "Point",
                "coordinates": [
                    88.37390681970562,
                    22.60185993736724
                ]
            }
        },
        {
            "type": "Feature",
            "properties": {
                "label": "",
                "index": 139961557513522,
                "when": "2018-Dec-15 16:28:59"
            },
            "geometry": {
                "type": "Point",
                "coordinates": [
                    88.37046716711177,
                    22.600681033366865
                ]
            }
        },
        {
            "type": "Feature",
            "properties": {
                "label": "",
                "index": 139961557513522,
                "when": "2018-Dec-15 16:29:34"
            },
            "geometry": {
                "type": "Point",
                "coordinates": [
                    88.36839565593553,
                    22.600161870650805
                ]
            }
        },
        {
            "type": "Feature",
            "properties": {
                "label": "",
                "index": 139961557513522,
                "when": "2018-Dec-15 16:31:34"
            },
            "geometry": {
                "type": "Point",
                "coordinates": [
                    88.3662543095713,
                    22.59882559841023
                ]
            }
        },
        {
            "type": "Feature",
            "properties": {
                "label": "",
                "index": 139961557513522,
                "when": "2018-Dec-15 16:32:14"
            },
            "geometry": {
                "type": "Point",
                "coordinates": [
                    88.36516501936727,
                    22.596213301668268
                ]
            }
        },
        {
            "type": "Feature",
            "properties": {
                "label": "",
                "index": 139961557513522,
                "when": "2018-Dec-15 16:33:03"
            },
            "geometry": {
                "type": "Point",
                "coordinates": [
                    88.36702516869717,
                    22.59525189350354
                ]
            }
        },
        {
            "type": "Feature",
            "properties": {
                "label": "",
                "index": 139961557513522,
                "when": "2018-Dec-15 16:34:03"
            },
            "geometry": {
                "type": "Point",
                "coordinates": [
                    88.37007585268977,
                    22.594690983500712
                ]
            }
        },
        {
            "type": "Feature",
            "properties": {},
            "geometry": {
                "type": "LineString",
                "coordinates": [
                    [
                        88.37390681970562,
                        22.60185993736724
                    ],
                    [
                        88.37046716711177,
                        22.600681033366865
                    ],
                    [
                        88.36839565593553,
                        22.600161870650805
                    ],
                    [
                        88.3662543095713,
                        22.59882559841023
                    ],
                    [
                        88.36516501936727,
                        22.596213301668268
                    ],
                    [
                        88.36702516869717,
                        22.59525189350354
                    ],
                    [
                        88.37007585268977,
                        22.594690983500712
                    ]
                ]
            }
        }
    ]
}
