{
    "type": "FeatureCollection",
    "name": "track",
    "features": [
        {
            "type": "Feature",
            "properties": {
                "label": "",
                "index": 17512136208279645440,
                "when": "2018-Dec-05 10:36:08"
            },
            "geometry": {
                "type": "Point",
                "coordinates": [
                    88.2684023851466,
                    27.040162226297349
                ]
            }
        },
        {
            "type": "Feature",
            "properties": {
                "label": "",
                "index": 549694720,
                "when": "2018-Dec-05 10:42:08"
            },
            "geometry": {
                "type": "Point",
                "coordinates": [
                    88.26930737119963,
                    27.038867109061149
                ]
            }
        },
        {
            "type": "Feature",
            "properties": {
                "label": "",
                "index": 549694720,
                "when": "2018-Dec-05 10:46:08"
            },
            "geometry": {
                "type": "Point",
                "coordinates": [
                    88.2700077340986,
                    27.037989583263227
                ]
            }
        },
        {
            "type": "Feature",
            "properties": {
                "label": "",
                "index": 549694720,
                "when": "2018-Dec-05 10:56:08"
            },
            "geometry": {
                "type": "Point",
                "coordinates": [
                    88.27099130364182,
                    27.038333357971096
                ]
            }
        },
        {
            "type": "Feature",
            "properties": {
                "label": "",
                "index": 549694720,
                "when": "2018-Dec-05 11:11:48"
            },
            "geometry": {
                "type": "Point",
                "coordinates": [
                    88.2710351112151,
                    27.037957488758619
                ]
            }
        },
        {
            "type": "Feature",
            "properties": {
                "label": "",
                "index": 549694720,
                "when": "2018-Dec-05 11:48:42"
            },
            "geometry": {
                "type": "Point",
                "coordinates": [
                    88.2718658404933,
                    27.03839076166643
                ]
            }
        },
        {
            "type": "Feature",
            "properties": {
                "label": "",
                "index": 549694720,
                "when": "2018-Dec-05 11:54:42"
            },
            "geometry": {
                "type": "Point",
                "coordinates": [
                    88.27346030688944,
                    27.038294535709328
                ]
            }
        },
        {
            "type": "Feature",
            "properties": {
                "label": "",
                "index": 549694720,
                "when": "2018-Dec-05 12:04:54"
            },
            "geometry": {
                "type": "Point",
                "coordinates": [
                    88.27389097289523,
                    27.038504263938799
                ]
            }
        },
        {
            "type": "Feature",
            "properties": {
                "label": "",
                "index": 549694720,
                "when": "2018-Dec-05 12:09:56"
            },
            "geometry": {
                "type": "Point",
                "coordinates": [
                    88.27542449642289,
                    27.038476603271879
                ]
            }
        },
        {
            "type": "Feature",
            "properties": {
                "label": "",
                "index": 549694720,
                "when": "2018-Dec-05 12:15:56"
            },
            "geometry": {
                "type": "Point",
                "coordinates": [
                    88.27664608496935,
                    27.038867036440565
                ]
            }
        },
        {
            "type": "Feature",
            "properties": {
                "label": "",
                "index": 549694720,
                "when": "2018-Dec-05 12:30:56"
            },
            "geometry": {
                "type": "Point",
                "coordinates": [
                    88.27559383255103,
                    27.03988284894856
                ]
            }
        }
    ]
}