{
    "orgName": "Ebikes-demo-nedkov",
    "edition": "Developer",
    "hasSampleData": false,
    "features": ["Communities", "Sites"],
    "settings": {
        "communitiesSettings": {
            "enableNetworksEnabled": true
        },
        "lightningExperienceSettings": {
            "enableS1DesktopEnabled": true
        },
        "securitySettings": {
            "passwordPolicies": {
                "enableSetPasswordInApi": true
            }
        },
        "mobileSettings": {
            "enableS1EncryptedStoragePref2": false
        }
    }
}
