%YAML 1.1
%TAG !u! tag:unity3d.com,2011:
--- !u!1045 &1
EditorBuildSettings:
  m_ObjectHideFlags: 0
  serializedVersion: 2
  m_Scenes:
  - enabled: 1
    path: Assets/Scenes/SampleScene.unity
    guid: d1c3109bdb54ad54c8a2b2838528e640
  m_configObjects:
    Unity.XR.Oculus.Settings: {fileID: 11400000, guid: 2e2d3bce6d524894c9b57baba2cfe77e, type: 2}
    com.unity.xr.management.loader_settings: {fileID: 11400000, guid: 63bcda4d345fcd247b225e9ed327aa66, type: 2}
    com.unity.xr.openxr.settings4: {fileID: 11400000, guid: 0d36556dd3252b548b5cd6e700ea2051, type: 2}
