{
   "testbeds": [
      {
         "testbed": {
            "cost_per_cluster": [
               {
                  "cluster": "pcgen01-2p", 
                  "price": 0.3163857140686829
               }, 
               {
                  "cluster": "pcgen01-4p", 
                  "price": 0.2195716692400581
               }, 
               {
                  "cluster": "pcgen01-5p", 
                  "price": 0.49383273776864334
               }, 
               {
                  "cluster": "pcgen02-1p", 
                  "price": 0.29530725733270824
               }, 
               {
                  "cluster": "pcgen02-2p", 
                  "price": 0.4558323519526388
               }, 
               {
                  "cluster": "pcgen02-4p", 
                  "price": 0.4564874167658415
               }, 
               {
                  "cluster": "pcgen02-5p", 
                  "price": 0.492937851162223
               }
            ], 
            "dc-slice-controller": {
               "dc-slice-provider": "vwall1", 
               "ip": "67.189.58.202", 
               "port": 934
            }, 
            "dc-slice-point-of-presence": {
               "ip": "67.189.58.1", 
               "pop-name": "Edge Router 1", 
               "requirements": {
                  "bandwidth_gb": 1
               }, 
               "reservation-protocol": "BGP", 
               "router-type": "Wired Router-cisco"
            }, 
            "description": "Fed4Fire testbed vwall1.", 
            "id": "vwall1", 
            "location": {
               "continent": "EUROPE", 
               "country": "Belgium"
            }, 
            "nodes": [
               {
                  "node_cluster": {
                     "available_nodes": 8, 
                     "cpu_cores": 2, 
                     "cpu_ghz": 2.0, 
                     "cpu_model": "Dual core", 
                     "cpu_number": 2, 
                     "cpu_vendor": "AMD", 
                     "memory_mb": 8192, 
                     "min_storage_gb": 80, 
                     "name": "pcgen01-2p", 
                     "nics_bw": 6, 
                     "nics_description": "4-6 gigabit nics per node", 
                     "rspec_hwtype": " ['pcgen01-2p', 'pc', 'delay', 'delay-pcgen01-2p', 'bridge', 'bridge-pcgen01-2p', 'pcvm']", 
                     "storage_description": "4 X 80", 
                     "total_cpu_cores": 4, 
                     "total_nodes": 8
                  }
               }, 
               {
                  "node_cluster": {
                     "available_nodes": 16, 
                     "cpu_cores": 2, 
                     "cpu_ghz": 2.0, 
                     "cpu_model": "Dual core", 
                     "cpu_number": 2, 
                     "cpu_vendor": "AMD", 
                     "memory_mb": 8192, 
                     "min_storage_gb": 80, 
                     "name": "pcgen01-4p", 
                     "nics_bw": 6, 
                     "nics_description": "4-6 gigabit nics per node", 
                     "rspec_hwtype": " ['pcgen01-4p', 'pc', 'pcvm']", 
                     "storage_description": "4 X 80", 
                     "total_cpu_cores": 4, 
                     "total_nodes": 18
                  }
               }, 
               {
                  "node_cluster": {
                     "available_nodes": 57, 
                     "cpu_cores": 2, 
                     "cpu_ghz": 2.0, 
                     "cpu_model": "Dual core", 
                     "cpu_number": 2, 
                     "cpu_vendor": "AMD", 
                     "memory_mb": 8192, 
                     "min_storage_gb": 80, 
                     "name": "pcgen01-5p", 
                     "nics_bw": 6, 
                     "nics_description": "4-6 gigabit nics per node", 
                     "rspec_hwtype": "['pcgen01-5p', 'pc', 'pcvm']", 
                     "storage_description": "4 X 80", 
                     "total_cpu_cores": 4, 
                     "total_nodes": 71
                  }
               }, 
               {
                  "node_cluster": {
                     "available_nodes": 10, 
                     "cpu_cores": 4, 
                     "cpu_ghz": 2.2, 
                     "cpu_model": "Quad core", 
                     "cpu_number": 2, 
                     "cpu_vendor": "Intel", 
                     "memory_mb": 12288, 
                     "min_storage_gb": 160, 
                     "name": "pcgen02-1p", 
                     "nics_bw": 4, 
                     "nics_description": "2-4 gigabit nics per node", 
                     "rspec_hwtype": " ['pcgen02-1p', 'pc', 'pcgen02-1p-vm', 'pcvmgen02-1p', 'pcvm', 'lan']", 
                     "storage_description": "1 x 160", 
                     "total_cpu_cores": 8, 
                     "total_nodes": 36
                  }
               }, 
               {
                  "node_cluster": {
                     "available_nodes": 6, 
                     "cpu_cores": 4, 
                     "cpu_ghz": 2.2, 
                     "cpu_model": "Quad core", 
                     "cpu_number": 2, 
                     "cpu_vendor": "Intel", 
                     "memory_mb": 12288, 
                     "min_storage_gb": 160, 
                     "name": "pcgen02-2p", 
                     "nics_bw": 4, 
                     "nics_description": "2-4 gigabit nics per node", 
                     "rspec_hwtype": " ['pcgen02-2p', 'pc', 'delay', 'delay-pcgen02-2p', 'bridge', 'bridge-pcgen02-2p', 'pcgen02-2p-vm', 'pcvmgen02-2p', 'pcvm', 'lan']", 
                     "storage_description": "1 x 160", 
                     "total_cpu_cores": 8, 
                     "total_nodes": 19
                  }
               }, 
               {
                  "node_cluster": {
                     "available_nodes": 21, 
                     "cpu_cores": 4, 
                     "cpu_ghz": 2.2, 
                     "cpu_model": "Quad core", 
                     "cpu_number": 2, 
                     "cpu_vendor": "Intel", 
                     "memory_mb": 12288, 
                     "min_storage_gb": 160, 
                     "name": "pcgen02-4p", 
                     "nics_bw": 4, 
                     "nics_description": "2-4 gigabit nics per node", 
                     "rspec_hwtype": " ['pcgen02-4p', 'pc', 'delay', 'delay-pcgen02-4p', 'bridge', 'bridge-pcgen02-4p', 'pcgen02-4p-vm', 'pcvmgen02-4p', 'pcvm', 'lan']", 
                     "storage_description": "1 x 160", 
                     "total_cpu_cores": 8, 
                     "total_nodes": 25
                  }
               }, 
               {
                  "node_cluster": {
                     "available_nodes": 21, 
                     "cpu_cores": 4, 
                     "cpu_ghz": 2.2, 
                     "cpu_model": "Quad core", 
                     "cpu_number": 2, 
                     "cpu_vendor": "Intel", 
                     "memory_mb": 12288, 
                     "min_storage_gb": 160, 
                     "name": "pcgen02-5p", 
                     "nics_bw": 4, 
                     "nics_description": "2-4 gigabit nics per node", 
                     "rspec_hwtype": " ['pcgen02-5p', 'pc', 'delay', 'delay-pcgen02-5p', 'bridge', 'bridge-pcgen02-5p', 'pcgen02-5p-vm', 'pcvmgen02-5p', 'pcvm', 'lan']", 
                     "storage_description": "1 x 160", 
                     "total_cpu_cores": 8, 
                     "total_nodes": 30
                  }
               }
            ]
         }
      }
   ]
}