<?xml version="1.0" encoding="UTF-8" standalone="no"?>
<svg
   xmlns:dc="http://purl.org/dc/elements/1.1/"
   xmlns:cc="http://creativecommons.org/ns#"
   xmlns:rdf="http://www.w3.org/1999/02/22-rdf-syntax-ns#"
   xmlns:svg="http://www.w3.org/2000/svg"
   xmlns="http://www.w3.org/2000/svg"
   xmlns:sodipodi="http://sodipodi.sourceforge.net/DTD/sodipodi-0.dtd"
   xmlns:inkscape="http://www.inkscape.org/namespaces/inkscape"
   version="1.0"
   height="300"
   width="128"
   id="svg2"
   sodipodi:docname="listitem.svg"
   inkscape:version="1.0.2 (e86c870879, 2021-01-15)">
  <sodipodi:namedview
     pagecolor="#ffffff"
     bordercolor="#666666"
     borderopacity="1"
     objecttolerance="10"
     gridtolerance="10"
     guidetolerance="10"
     inkscape:pageopacity="0"
     inkscape:pageshadow="2"
     inkscape:window-width="1920"
     inkscape:window-height="1007"
     id="namedview58"
     showgrid="false"
     inkscape:zoom="2.2250293"
     inkscape:cx="94.852027"
     inkscape:cy="138.3915"
     inkscape:window-x="0"
     inkscape:window-y="0"
     inkscape:window-maximized="1"
     inkscape:current-layer="svg2"
     inkscape:document-rotation="0" />
  <metadata
     id="metadata7">
    <rdf:RDF>
      <cc:Work
         rdf:about="">
        <dc:format>image/svg+xml</dc:format>
        <dc:type
           rdf:resource="http://purl.org/dc/dcmitype/StillImage" />
        <dc:title />
      </cc:Work>
      <cc:Work
         rdf:about="">
        <dc:format>image/svg+xml</dc:format>
        <dc:type
           rdf:resource="http://purl.org/dc/dcmitype/StillImage" />
      </cc:Work>
    </rdf:RDF>
  </metadata>
  <defs
     id="defs5">
    <style
       type="text/css"
       id="current-color-scheme" />
  </defs>
  <rect
     style="fill:#2e75bc;fill-opacity:1;fill-rule:nonzero;stroke:none;opacity:0.01"
     id="hint-tile-center"
     width="2.0329318"
     height="2.077126"
     x="-10"
     y="-10"
     rx="0"
     ry="2.077126" />
  <rect
     y="2.1588984"
     x="25.21928"
     height="6"
     width="2"
     id="pressed-hint-top-margin"
     style="fill:#2e75bc;fill-opacity:1;fill-rule:nonzero;stroke:none;opacity:0.01" />
  <rect
     style="fill:#2e75bc;fill-opacity:1;fill-rule:nonzero;stroke:none;opacity:0.01"
     id="pressed-hint-bottom-margin"
     width="2"
     height="6"
     x="24.471399"
     y="22.13983" />
  <rect
     style="fill:#2e75bc;fill-opacity:1;fill-rule:nonzero;stroke:none;opacity:0.01"
     id="pressed-hint-left-margin"
     width="4"
     height="2"
     x="13.257415"
     y="14.887712" />
  <rect
     y="14.728813"
     x="33.569916"
     height="2"
     width="4"
     id="pressed-hint-right-margin"
     style="fill:#2e75bc;fill-opacity:1;fill-rule:nonzero;stroke:none;opacity:0.01" />
  <rect
     y="58"
     x="17"
     height="1.9999999"
     width="4"
     id="normal-hint-left-margin"
     style="fill:#2e75bc;fill-opacity:1;fill-rule:nonzero;stroke:none;opacity:0.01" />
  <rect
     style="fill:#2e75bc;fill-opacity:1;fill-rule:nonzero;stroke:none;opacity:0.01"
     id="normal-hint-top-margin"
     width="2"
     height="6"
     x="28"
     y="44" />
  <rect
     y="67"
     x="29"
     height="6"
     width="2"
     id="normal-hint-bottom-margin"
     style="fill:#2e75bc;fill-opacity:1;fill-rule:nonzero;stroke:none;opacity:0.01" />
  <rect
     style="fill:#2e75bc;fill-opacity:1;fill-rule:nonzero;stroke:none;opacity:0.01"
     id="normal-hint-right-margin"
     width="4"
     height="2"
     x="38"
     y="58" />
  <g
     transform="translate(11,-4)"
     style="opacity:1"
     id="separator">
    <rect
       style="opacity:0.2;fill:currentColor;fill-opacity:1;stroke:none"
       id="rect4052"
       width="40"
       height="1"
       x="63"
       y="-49"
       transform="scale(1,-1)"
       class="ColorScheme-ViewBackground" />
    <rect
       class="ColorScheme-ViewText"
       transform="scale(1,-1)"
       y="-49"
       x="63"
       height="1"
       width="40"
       id="rect4054"
       style="opacity:0.3;fill:#2e75bc;fill-opacity:1;stroke:none" />
  </g>
  <path
     class="ColorScheme-ViewBackground"
     style="opacity:0.1;fill:#2e75bc;fill-opacity:1;fill-rule:nonzero;stroke:none"
     d="m 24,53.000345 0,11 10.999999,0 0,-11 -10.999999,0 z"
     id="normal-center" />
  <path
     class="ColorScheme-ViewBackground"
     style="opacity:0.1;fill:#2e75bc;fill-opacity:1;fill-rule:nonzero;stroke:none"
     d="m 35,53.000345 0,11 2,0 c 6.68e-4,-0.01835 0,-0.03439 0,-0.05288 l 0,-10.89423 c 0,-0.0185 6.68e-4,-0.03453 0,-0.05288 l -2,0 z"
     id="normal-right" />
  <path
     class="ColorScheme-ViewBackground"
     style="opacity:0.1;fill:#2e75bc;fill-opacity:1;fill-rule:nonzero;stroke:none"
     d="m 24,51.000298 0,2.000047 10.999999,0 0,-2.000047 c -0.0041,-6.7e-4 0.0042,0 10e-7,0 l -10.98814,0 c -0.004,0 -0.008,-6.7e-4 -0.0119,0 z"
     id="normal-top" />
  <path
     class="ColorScheme-ViewBackground"
     style="opacity:0.1;fill:#2e75bc;fill-opacity:1;fill-rule:nonzero;stroke:none"
     d="m 22.0003,53.000345 c -6.7e-4,0.01835 0,0.03439 0,0.05288 l 0,10.89423 c 0,0.0185 -6.7e-4,0.03453 0,0.05288 l 2,0 0,-11 -2,0 z"
     id="normal-left" />
  <path
     class="ColorScheme-ViewBackground"
     style="opacity:0.1;fill:#2e75bc;fill-opacity:1;fill-rule:nonzero;stroke:none"
     d="m 24,64 0,2 11,0 0,-1.999655 z"
     id="normal-bottom" />
  <path
     class="ColorScheme-ViewBackground"
     id="normal-topleft"
     d="m 21.999967,51.000298 0,2.000047 1.999771,0 0,-2.000047 c -7.46e-4,-6.7e-4 7.63e-4,0 0,0 l -1.997614,0 c -7.28e-4,0 -0.0015,-6.7e-4 -0.0022,0 z"
     style="opacity:0.1;fill:#2e75bc;fill-opacity:1;fill-rule:nonzero;stroke:none" />
  <path
     class="ColorScheme-ViewBackground"
     id="normal-topright"
     d="m 35.000007,51.000643 0,1.999702 1.999771,0 0,-1.999702 c -7.46e-4,-6.7e-4 7.63e-4,0 0,0 l -1.997614,0 c -7.28e-4,0 -0.0015,-6.7e-4 -0.0022,0 z"
     style="opacity:0.1;fill:#2e75bc;fill-opacity:1;fill-rule:nonzero;stroke:none" />
  <path
     class="ColorScheme-ViewBackground"
     style="opacity:0.1;fill:#2e75bc;fill-opacity:1;fill-rule:nonzero;stroke:none"
     d="m 35.000007,64.000298 0,1.999702 1.999771,0 0,-1.999702 c -7.46e-4,-6.7e-4 7.63e-4,0 0,0 l -1.997614,0 c -7.28e-4,0 -0.0015,-6.7e-4 -0.0022,0 z"
     id="normal-bottomright" />
  <path
     class="ColorScheme-ViewBackground"
     id="normal-bottomleft"
     d="m 22.000007,64.000298 0,1.999702 1.999771,0 0,-1.999702 c -7.46e-4,-6.7e-4 7.63e-4,0 0,0 l -1.997614,0 c -7.28e-4,0 -0.0015,-6.7e-4 -0.0022,0 z"
     style="opacity:0.1;fill:#2e75bc;fill-opacity:1;fill-rule:nonzero;stroke:none" />
  <path
     class="ColorScheme-ViewFocus"
     style="opacity:0.1;fill:#2e75bc;fill-opacity:1;fill-rule:nonzero;stroke:none"
     d="m 19.9997,10.000015 0,11.000005 10.999999,0 0,-11.000005 -10.999999,0 z"
     id="pressed-center" />
  <path
     class="ColorScheme-ViewFocus"
     style="opacity:0.15;fill:#2e75bc;fill-opacity:1;fill-rule:nonzero;stroke:none"
     d="m 30.9997,10.000015 0,11.000005 2,0 c 6.68e-4,-0.01835 0,-0.0344 0,-0.05289 l 0,-10.89423 c 0,-0.0185 6.68e-4,-0.03453 0,-0.05288 l -2,0 z"
     id="pressed-right" />
  <path
     class="ColorScheme-ViewFocus"
     style="opacity:0.15;fill:#2e75bc;fill-opacity:1;fill-rule:nonzero;stroke:none"
     d="m 19.9997,7.999968 0,2.000047 10.999999,0 0,-2.000047 c -0.0041,-6.7e-4 0.0045,0 3.01e-4,0 l -10.98844,0 c -0.004,0 -0.008,-6.7e-4 -0.0119,0 z"
     id="pressed-top" />
  <path
     class="ColorScheme-ViewFocus"
     style="opacity:0.15;fill:#2e75bc;fill-opacity:1;fill-rule:nonzero;stroke:none"
     d="m 18,10.000015 c -6.7e-4,0.01835 0,0.03439 0,0.05288 l 0,10.89423 c 0,0.0185 -6.7e-4,0.03453 0,0.05288 l 2,0 L 20,10 18,10 z"
     id="pressed-left" />
  <path
     class="ColorScheme-ViewFocus"
     style="opacity:0.15;fill:#2e75bc;fill-opacity:1;fill-rule:nonzero"
     d="m 20,21 0,2 11,0 0,-2 -11,0 z"
     id="pressed-bottom" />
  <path
     class="ColorScheme-ViewFocus"
     id="pressed-topleft"
     d="m 17.999667,7.999968 0,2.000047 1.999722,0 0,-2.000047 c -7.45e-4,-6.7e-4 8.18e-4,0 5.5e-5,0 l -1.997621,0 c -7.27e-4,0 -0.0015,-6.7e-4 -0.0022,0 z"
     style="opacity:0.15;fill:#2e75bc;fill-opacity:1;fill-rule:nonzero;stroke:none" />
  <path
     class="ColorScheme-ViewFocus"
     style="opacity:0.15;fill:#2e75bc;fill-opacity:1;fill-rule:nonzero;stroke:none"
     d="m 31.000044,7.999968 0,2.000047 1.999722,0 0,-2.000047 c -7.45e-4,-6.7e-4 8.18e-4,0 5.5e-5,0 l -1.997621,0 c -7.27e-4,0 -0.0015,-6.7e-4 -0.0022,0 z"
     id="pressed-topright" />
  <path
     class="ColorScheme-ViewFocus"
     id="pressed-bottomright"
     d="m 31.000044,20.999953 0,2.000047 1.999722,0 0,-2.000047 c -7.45e-4,-6.7e-4 8.18e-4,0 5.5e-5,0 l -1.997621,0 c -7.27e-4,0 -0.0015,-6.7e-4 -0.0022,0 z"
     style="opacity:0.15;fill:#2e75bc;fill-opacity:1;fill-rule:nonzero;stroke:none" />
  <path
     class="ColorScheme-ViewFocus"
     style="opacity:0.15;fill:#2e75bc;fill-opacity:1;fill-rule:nonzero;stroke:none"
     d="m 18.000044,20.999953 0,2.000047 1.999722,0 0,-2.000047 c -7.45e-4,-6.7e-4 8.18e-4,0 5.5e-5,0 l -1.997621,0 c -7.27e-4,0 -0.0015,-6.7e-4 -0.0022,0 z"
     id="pressed-bottomleft" />
  <path
     class="ColorScheme-ViewBackground"
     style="opacity:0.1;fill:#2e75bc;fill-opacity:1;fill-rule:nonzero;stroke:none"
     d="m 21.9997,88 0,11 10.999999,0 0,-11 -10.999999,0 z"
     id="section-center" />
  <path
     class="ColorScheme-ViewBackground"
     style="opacity:0.1;fill:#2e75bc;fill-opacity:1;fill-rule:nonzero;stroke:none"
     d="m 32.9997,88 0,11 2,0 c 6.68e-4,-0.0183 0,-0.0344 0,-0.0529 l 0,-10.89423 c 0,-0.0185 6.68e-4,-0.03453 0,-0.05288 l -2,0 z"
     id="section-right" />
  <path
     class="ColorScheme-ViewBackground"
     style="opacity:0.1;fill:#2e75bc;fill-opacity:1;fill-rule:nonzero;stroke:none"
     d="m 21.9997,85.999953 0,2.000047 10.999999,0 0,-2.000047 c -0.0041,-6.7e-4 0.0042,0 10e-7,0 l -10.98814,0 c -0.004,0 -0.008,-6.7e-4 -0.0119,0 z"
     id="section-top" />
  <path
     class="ColorScheme-ViewBackground"
     style="opacity:0.1;fill:#2e75bc;fill-opacity:1;fill-rule:nonzero;stroke:none"
     d="m 20,88 c -6.7e-4,0.01835 0,0.03439 0,0.05288 l 0,10.89423 c 0,0.0185 -6.7e-4,0.0345 0,0.0529 l 2,0 0,-11 -2,0 z"
     id="section-left" />
  <path
     class="ColorScheme-ViewBackground"
     style="opacity:0.1;fill:#2e75bc;fill-opacity:1;fill-rule:nonzero;stroke:none"
     d="m 21.9997,98.99966 0,2 11,0 0,-1.99966 z"
     id="section-bottom" />
  <g
     id="g872"
     style="fill:#00b8b8;fill-opacity:1">
    <path
       style="opacity:0.1;fill:#2e75bc;fill-opacity:1;fill-rule:nonzero;stroke:none"
       d="m 19.999667,85.999953 0,2.000047 1.999771,0 0,-2.000047 c -7.46e-4,-6.7e-4 7.63e-4,0 0,0 l -1.997614,0 c -7.28e-4,0 -0.0015,-6.7e-4 -0.0022,0 z"
       id="section-topleft"
       class="ColorScheme-ViewBackground" />
  </g>
  <path
     class="ColorScheme-ViewBackground"
     id="section-topright"
     d="m 32.999707,86.000298 0,1.999702 1.999771,0 0,-1.999702 c -7.46e-4,-6.7e-4 7.63e-4,0 0,0 l -1.997614,0 c -7.28e-4,0 -0.0015,-6.7e-4 -0.0022,0 z"
     style="opacity:0.1;fill:#2e75bc;fill-opacity:1;fill-rule:nonzero;stroke:none" />
  <path
     class="ColorScheme-ViewBackground"
     style="opacity:0.1;fill:#2e75bc;fill-opacity:1;fill-rule:nonzero;stroke:none"
     d="m 32.999707,98.99995 0,1.99971 1.999771,0 0,-1.99971 c -7.46e-4,-6.7e-4 7.63e-4,0 0,0 l -1.997614,0 c -7.28e-4,0 -0.0015,-6.7e-4 -0.0022,0 z"
     id="section-bottomright" />
  <path
     class="ColorScheme-ViewBackground"
     id="section-bottomleft"
     d="m 19.999707,98.99995 0,1.99971 1.999771,0 0,-1.99971 c -7.46e-4,-6.7e-4 7.63e-4,0 0,0 l -1.997614,0 c -7.28e-4,0 -0.0015,-6.7e-4 -0.0022,0 z"
     style="opacity:0.1;fill:#2e75bc;fill-opacity:1;fill-rule:nonzero;stroke:none" />
  <rect
     y="81.280891"
     x="26.25845"
     height="6"
     width="2"
     id="section-hint-top-margin"
     style="fill:#2e75bc;fill-opacity:1;fill-rule:nonzero;stroke:none;opacity:0.01" />
  <rect
     style="fill:#2e75bc;fill-opacity:1;fill-rule:nonzero;stroke:none;opacity:0.01"
     id="section-hint-left-margin"
     width="4"
     height="1.9999999"
     x="17.022379"
     y="92.471947" />
  <rect
     style="fill:#2e75bc;fill-opacity:1;fill-rule:nonzero;stroke:none;opacity:0.01"
     id="section-hint-bottom-margin"
     width="2"
     height="6"
     x="26.696659"
     y="99.775284" />
  <path
     class="ColorScheme-ViewFocus"
     style="opacity:0.1;fill:#2e75bc;fill-opacity:1;fill-rule:nonzero;stroke:none"
     d="m 59.9997,7.3841577 0,11.0000053 10.999999,0 0,-11.0000053 -10.999999,0 z"
     id="hover-center" />
  <path
     class="ColorScheme-ViewFocus"
     style="opacity:0.1;fill:#2e75bc;fill-opacity:1;fill-rule:nonzero;stroke:none"
     d="m 70.9997,7.3841577 0,11.0000053 2,0 c 6.68e-4,-0.01835 0,-0.0344 0,-0.05289 l 0,-10.8942303 c 0,-0.0185 6.68e-4,-0.03453 0,-0.05288 l -2,0 z"
     id="hover-right" />
  <path
     class="ColorScheme-ViewFocus"
     style="opacity:0.1;fill:#2e75bc;fill-opacity:1;fill-rule:nonzero;stroke:none"
     d="m 59.9997,5.3841107 0,2.000047 10.999999,0 0,-2.000047 c -0.0041,-6.7e-4 0.0045,0 3.01e-4,0 l -10.98844,0 c -0.004,0 -0.008,-6.7e-4 -0.0119,0 z"
     id="hover-top" />
  <path
     class="ColorScheme-ViewFocus"
     style="opacity:0.1;fill:#2e75bc;fill-opacity:1;fill-rule:nonzero;stroke:none"
     d="m 58,7.3841577 c -6.7e-4,0.01835 0,0.03439 0,0.05288 l 0,10.8942303 c 0,0.0185 -6.7e-4,0.03453 0,0.05288 l 2,0 0,-11.0000053 -2,0 z"
     id="hover-left" />
  <path
     class="ColorScheme-ViewFocus"
     style="opacity:0.1;fill:#2e75bc;fill-opacity:1;fill-rule:nonzero"
     d="m 60,18.384143 0,2 11,0 0,-2 -11,0 z"
     id="hover-bottom" />
  <path
     class="ColorScheme-ViewFocus"
     id="hover-topleft"
     d="m 57.999667,5.3841107 0,2.000047 1.999722,0 0,-2.000047 c -7.45e-4,-6.7e-4 8.18e-4,0 5.5e-5,0 l -1.997621,0 c -7.27e-4,0 -0.0015,-6.7e-4 -0.0022,0 z"
     style="opacity:0.1;fill:#2e75bc;fill-opacity:1;fill-rule:nonzero;stroke:none" />
  <path
     class="ColorScheme-ViewFocus"
     style="opacity:0.1;fill:#2e75bc;fill-opacity:1;fill-rule:nonzero;stroke:none"
     d="m 71.000044,5.3841107 0,2.000047 1.999722,0 0,-2.000047 c -7.45e-4,-6.7e-4 8.18e-4,0 5.5e-5,0 l -1.997621,0 c -7.27e-4,0 -0.0015,-6.7e-4 -0.0022,0 z"
     id="hover-topright" />
  <path
     class="ColorScheme-ViewFocus"
     id="hover-bottomright"
     d="m 71.000044,18.384096 0,2.000047 1.999722,0 0,-2.000047 c -7.45e-4,-6.7e-4 8.18e-4,0 5.5e-5,0 l -1.997621,0 c -7.27e-4,0 -0.0015,-6.7e-4 -0.0022,0 z"
     style="opacity:0.1;fill:#2e75bc;fill-opacity:1;fill-rule:nonzero;stroke:none" />
  <path
     class="ColorScheme-ViewFocus"
     style="opacity:0.1;fill:#2e75bc;fill-opacity:1;fill-rule:nonzero;stroke:none"
     d="m 58.000044,18.384096 0,2.000047 1.999722,0 0,-2.000047 c -7.45e-4,-6.7e-4 8.18e-4,0 5.5e-5,0 l -1.997621,0 c -7.27e-4,0 -0.0015,-6.7e-4 -0.0022,0 z"
     id="hover-bottomleft" />
  <rect
     y="92.191048"
     x="33.616932"
     height="2"
     width="4"
     id="section-hint-right-margin"
     style="fill:#2e75bc;fill-opacity:1;fill-rule:nonzero;stroke:none;opacity:0.01" />
</svg>
