[2024-01-07T20:12:09.156334 61292] === CCACHE 4.5.1 STARTED =========================================
[2024-01-07T20:12:09.156334 61292] Config: (default) absolute_paths_in_stderr = false
[2024-01-07T20:12:09.156334 61292] Config: (default) base_dir = 
[2024-01-07T20:12:09.156334 61292] Config: (environment) cache_dir = /Users/azk12/.cache/Nuitka/ccache
[2024-01-07T20:12:09.156334 61292] Config: (default) compiler = 
[2024-01-07T20:12:09.156334 61292] Config: (default) compiler_check = mtime
[2024-01-07T20:12:09.156334 61292] Config: (default) compiler_type = auto
[2024-01-07T20:12:09.156334 61292] Config: (default) compression = true
[2024-01-07T20:12:09.156334 61292] Config: (default) compression_level = 0
[2024-01-07T20:12:09.156334 61292] Config: (default) cpp_extension = 
[2024-01-07T20:12:09.156334 61292] Config: (default) debug = false
[2024-01-07T20:12:09.156334 61292] Config: (default) debug_dir = 
[2024-01-07T20:12:09.156334 61292] Config: (default) depend_mode = false
[2024-01-07T20:12:09.156334 61292] Config: (default) direct_mode = true
[2024-01-07T20:12:09.156334 61292] Config: (default) disable = false
[2024-01-07T20:12:09.156334 61292] Config: (default) extra_files_to_hash = 
[2024-01-07T20:12:09.156334 61292] Config: (default) file_clone = false
[2024-01-07T20:12:09.156334 61292] Config: (default) hard_link = false
[2024-01-07T20:12:09.156334 61292] Config: (default) hash_dir = true
[2024-01-07T20:12:09.156334 61292] Config: (default) ignore_headers_in_manifest = 
[2024-01-07T20:12:09.156334 61292] Config: (default) ignore_options = 
[2024-01-07T20:12:09.156334 61292] Config: (default) inode_cache = false
[2024-01-07T20:12:09.156334 61292] Config: (default) keep_comments_cpp = false
[2024-01-07T20:12:09.156334 61292] Config: (default) limit_multiple = 0.8
[2024-01-07T20:12:09.156334 61292] Config: (environment) log_file = /Users/azk12/Documents/nebios-system-apps/Welcome Screen/nebide-welcome-screen.build/ccache-61277.txt
[2024-01-07T20:12:09.156334 61292] Config: (default) max_files = 0
[2024-01-07T20:12:09.156334 61292] Config: (default) max_size = 5.0G
[2024-01-07T20:12:09.156334 61292] Config: (default) namespace = 
[2024-01-07T20:12:09.156334 61292] Config: (default) path = 
[2024-01-07T20:12:09.156334 61292] Config: (default) pch_external_checksum = false
[2024-01-07T20:12:09.156334 61292] Config: (default) prefix_command = 
[2024-01-07T20:12:09.156334 61292] Config: (default) prefix_command_cpp = 
[2024-01-07T20:12:09.156334 61292] Config: (default) read_only = false
[2024-01-07T20:12:09.156334 61292] Config: (default) read_only_direct = false
[2024-01-07T20:12:09.156334 61292] Config: (default) recache = false
[2024-01-07T20:12:09.156334 61292] Config: (default) reshare = false
[2024-01-07T20:12:09.156334 61292] Config: (default) run_second_cpp = true
[2024-01-07T20:12:09.156334 61292] Config: (default) secondary_storage = 
[2024-01-07T20:12:09.156334 61292] Config: (default) sloppiness = 
[2024-01-07T20:12:09.156334 61292] Config: (default) stats = true
[2024-01-07T20:12:09.156334 61292] Config: (default) stats_log = 
[2024-01-07T20:12:09.156334 61292] Config: (default) temporary_dir = /run/user/1000/ccache-tmp
[2024-01-07T20:12:09.156334 61292] Config: (default) umask = 
[2024-01-07T20:12:09.156503 61292] Command line: /usr/bin/ccache /usr/bin/gcc -o __constants.o -c -flto -fuse-linker-plugin -fno-fat-lto-objects -std=c11 -fvisibility=hidden -fwrapv -pipe -fpartial-inlining -ftrack-macro-expansion=0 -Wno-deprecated-declarations -fno-var-tracking -Wno-misleading-indentation -fcompare-debug-second -O2 -D__NUITKA_NO_ASSERT__ -DPy_NO_ENABLE_SHARED -D_NUITKA_STATIC_LIBPYTHON -D_NUITKA_USE_UNEXPOSED_API -D_NUITKA_CONSTANTS_FROM_LINKER -D_NUITKA_FROZEN=0 -D_NUITKA_EXE -I/usr/include/python3.10 -I. -I/usr/lib/python3/dist-packages/nuitka/build/include -I/usr/lib/python3/dist-packages/nuitka/build/static_src __constants.c
[2024-01-07T20:12:09.156533 61292] Hostname: azk12-MacBookAir
[2024-01-07T20:12:09.156544 61292] Working directory: /Users/azk12/Documents/nebios-system-apps/Welcome Screen/nebide-welcome-screen.build
[2024-01-07T20:12:09.156568 61292] Compiler type: gcc
[2024-01-07T20:12:09.156746 61292] Source file: __constants.c
[2024-01-07T20:12:09.156761 61292] Object file: __constants.o
[2024-01-07T20:12:09.156786 61292] Trying direct lookup
[2024-01-07T20:12:09.157513 61292] Retrieved b706ncflqotmtr7rg4smegqusqhemde52 from primary storage (/Users/azk12/.cache/Nuitka/ccache/b/7/06ncflqotmtr7rg4smegqusqhemde52M)
[2024-01-07T20:12:09.157551 61292] Looking for result key in /Users/azk12/.cache/Nuitka/ccache/b/7/06ncflqotmtr7rg4smegqusqhemde52M
[2024-01-07T20:12:09.158139 61295] === CCACHE 4.5.1 STARTED =========================================
[2024-01-07T20:12:09.158139 61295] Config: (default) absolute_paths_in_stderr = false
[2024-01-07T20:12:09.158139 61295] Config: (default) base_dir = 
[2024-01-07T20:12:09.158139 61295] Config: (environment) cache_dir = /Users/azk12/.cache/Nuitka/ccache
[2024-01-07T20:12:09.158139 61295] Config: (default) compiler = 
[2024-01-07T20:12:09.158139 61295] Config: (default) compiler_check = mtime
[2024-01-07T20:12:09.158139 61295] Config: (default) compiler_type = auto
[2024-01-07T20:12:09.158139 61295] Config: (default) compression = true
[2024-01-07T20:12:09.158139 61295] Config: (default) compression_level = 0
[2024-01-07T20:12:09.158139 61295] Config: (default) cpp_extension = 
[2024-01-07T20:12:09.158139 61295] Config: (default) debug = false
[2024-01-07T20:12:09.158139 61295] Config: (default) debug_dir = 
[2024-01-07T20:12:09.158139 61295] Config: (default) depend_mode = false
[2024-01-07T20:12:09.158139 61295] Config: (default) direct_mode = true
[2024-01-07T20:12:09.158139 61295] Config: (default) disable = false
[2024-01-07T20:12:09.158139 61295] Config: (default) extra_files_to_hash = 
[2024-01-07T20:12:09.158139 61295] Config: (default) file_clone = false
[2024-01-07T20:12:09.158139 61295] Config: (default) hard_link = false
[2024-01-07T20:12:09.158139 61295] Config: (default) hash_dir = true
[2024-01-07T20:12:09.158139 61295] Config: (default) ignore_headers_in_manifest = 
[2024-01-07T20:12:09.158139 61295] Config: (default) ignore_options = 
[2024-01-07T20:12:09.158139 61295] Config: (default) inode_cache = false
[2024-01-07T20:12:09.158139 61295] Config: (default) keep_comments_cpp = false
[2024-01-07T20:12:09.158139 61295] Config: (default) limit_multiple = 0.8
[2024-01-07T20:12:09.158139 61295] Config: (environment) log_file = /Users/azk12/Documents/nebios-system-apps/Welcome Screen/nebide-welcome-screen.build/ccache-61277.txt
[2024-01-07T20:12:09.158139 61295] Config: (default) max_files = 0
[2024-01-07T20:12:09.158139 61295] Config: (default) max_size = 5.0G
[2024-01-07T20:12:09.158139 61295] Config: (default) namespace = 
[2024-01-07T20:12:09.158139 61295] Config: (default) path = 
[2024-01-07T20:12:09.158139 61295] Config: (default) pch_external_checksum = false
[2024-01-07T20:12:09.158139 61295] Config: (default) prefix_command = 
[2024-01-07T20:12:09.158139 61295] Config: (default) prefix_command_cpp = 
[2024-01-07T20:12:09.158139 61295] Config: (default) read_only = false
[2024-01-07T20:12:09.158139 61295] Config: (default) read_only_direct = false
[2024-01-07T20:12:09.158139 61295] Config: (default) recache = false
[2024-01-07T20:12:09.158139 61295] Config: (default) reshare = false
[2024-01-07T20:12:09.158139 61295] Config: (default) run_second_cpp = true
[2024-01-07T20:12:09.158139 61295] Config: (default) secondary_storage = 
[2024-01-07T20:12:09.158139 61295] Config: (default) sloppiness = 
[2024-01-07T20:12:09.158139 61295] Config: (default) stats = true
[2024-01-07T20:12:09.158139 61295] Config: (default) stats_log = 
[2024-01-07T20:12:09.158139 61295] Config: (default) temporary_dir = /run/user/1000/ccache-tmp
[2024-01-07T20:12:09.158139 61295] Config: (default) umask = 
[2024-01-07T20:12:09.158269 61295] Command line: /usr/bin/ccache /usr/bin/gcc -o __helpers.o -c -flto -fuse-linker-plugin -fno-fat-lto-objects -std=c11 -fvisibility=hidden -fwrapv -pipe -fpartial-inlining -ftrack-macro-expansion=0 -Wno-deprecated-declarations -fno-var-tracking -Wno-misleading-indentation -fcompare-debug-second -O2 -D__NUITKA_NO_ASSERT__ -DPy_NO_ENABLE_SHARED -D_NUITKA_STATIC_LIBPYTHON -D_NUITKA_USE_UNEXPOSED_API -D_NUITKA_CONSTANTS_FROM_LINKER -D_NUITKA_FROZEN=0 -D_NUITKA_EXE -I/usr/include/python3.10 -I. -I/usr/lib/python3/dist-packages/nuitka/build/include -I/usr/lib/python3/dist-packages/nuitka/build/static_src __helpers.c
[2024-01-07T20:12:09.158301 61295] Hostname: azk12-MacBookAir
[2024-01-07T20:12:09.158311 61295] Working directory: /Users/azk12/Documents/nebios-system-apps/Welcome Screen/nebide-welcome-screen.build
[2024-01-07T20:12:09.158319 61295] Compiler type: gcc
[2024-01-07T20:12:09.158477 61295] Source file: __helpers.c
[2024-01-07T20:12:09.158491 61295] Object file: __helpers.o
[2024-01-07T20:12:09.158521 61295] Trying direct lookup
[2024-01-07T20:12:09.158632 61295] Retrieved d59cn61oqqvot35sa26mt3rmncvdv10f0 from primary storage (/Users/azk12/.cache/Nuitka/ccache/d/5/9cn61oqqvot35sa26mt3rmncvdv10f0M)
[2024-01-07T20:12:09.158658 61295] Looking for result key in /Users/azk12/.cache/Nuitka/ccache/d/5/9cn61oqqvot35sa26mt3rmncvdv10f0M
[2024-01-07T20:12:09.170845 61298] === CCACHE 4.5.1 STARTED =========================================
[2024-01-07T20:12:09.170845 61298] Config: (default) absolute_paths_in_stderr = false
[2024-01-07T20:12:09.170845 61298] Config: (default) base_dir = 
[2024-01-07T20:12:09.170845 61298] Config: (environment) cache_dir = /Users/azk12/.cache/Nuitka/ccache
[2024-01-07T20:12:09.170845 61298] Config: (default) compiler = 
[2024-01-07T20:12:09.170845 61298] Config: (default) compiler_check = mtime
[2024-01-07T20:12:09.170845 61298] Config: (default) compiler_type = auto
[2024-01-07T20:12:09.170845 61298] Config: (default) compression = true
[2024-01-07T20:12:09.170845 61298] Config: (default) compression_level = 0
[2024-01-07T20:12:09.170845 61298] Config: (default) cpp_extension = 
[2024-01-07T20:12:09.170845 61298] Config: (default) debug = false
[2024-01-07T20:12:09.170845 61298] Config: (default) debug_dir = 
[2024-01-07T20:12:09.170845 61298] Config: (default) depend_mode = false
[2024-01-07T20:12:09.170845 61298] Config: (default) direct_mode = true
[2024-01-07T20:12:09.170845 61298] Config: (default) disable = false
[2024-01-07T20:12:09.170845 61298] Config: (default) extra_files_to_hash = 
[2024-01-07T20:12:09.170845 61298] Config: (default) file_clone = false
[2024-01-07T20:12:09.170845 61298] Config: (default) hard_link = false
[2024-01-07T20:12:09.170845 61298] Config: (default) hash_dir = true
[2024-01-07T20:12:09.170845 61298] Config: (default) ignore_headers_in_manifest = 
[2024-01-07T20:12:09.170845 61298] Config: (default) ignore_options = 
[2024-01-07T20:12:09.170845 61298] Config: (default) inode_cache = false
[2024-01-07T20:12:09.170845 61298] Config: (default) keep_comments_cpp = false
[2024-01-07T20:12:09.170845 61298] Config: (default) limit_multiple = 0.8
[2024-01-07T20:12:09.170845 61298] Config: (environment) log_file = /Users/azk12/Documents/nebios-system-apps/Welcome Screen/nebide-welcome-screen.build/ccache-61277.txt
[2024-01-07T20:12:09.170845 61298] Config: (default) max_files = 0
[2024-01-07T20:12:09.170845 61298] Config: (default) max_size = 5.0G
[2024-01-07T20:12:09.170845 61298] Config: (default) namespace = 
[2024-01-07T20:12:09.170845 61298] Config: (default) path = 
[2024-01-07T20:12:09.170845 61298] Config: (default) pch_external_checksum = false
[2024-01-07T20:12:09.170845 61298] Config: (default) prefix_command = 
[2024-01-07T20:12:09.170845 61298] Config: (default) prefix_command_cpp = 
[2024-01-07T20:12:09.170845 61298] Config: (default) read_only = false
[2024-01-07T20:12:09.170845 61298] Config: (default) read_only_direct = false
[2024-01-07T20:12:09.170845 61298] Config: (default) recache = false
[2024-01-07T20:12:09.170845 61298] Config: (default) reshare = false
[2024-01-07T20:12:09.170845 61298] Config: (default) run_second_cpp = true
[2024-01-07T20:12:09.170845 61298] Config: (default) secondary_storage = 
[2024-01-07T20:12:09.170845 61298] Config: (default) sloppiness = 
[2024-01-07T20:12:09.170845 61298] Config: (default) stats = true
[2024-01-07T20:12:09.170845 61298] Config: (default) stats_log = 
[2024-01-07T20:12:09.170845 61298] Config: (default) temporary_dir = /run/user/1000/ccache-tmp
[2024-01-07T20:12:09.170845 61298] Config: (default) umask = 
[2024-01-07T20:12:09.171028 61298] Command line: /usr/bin/ccache /usr/bin/gcc -o __loader.o -c -flto -fuse-linker-plugin -fno-fat-lto-objects -std=c11 -fvisibility=hidden -fwrapv -pipe -fpartial-inlining -ftrack-macro-expansion=0 -Wno-deprecated-declarations -fno-var-tracking -Wno-misleading-indentation -fcompare-debug-second -O2 -D__NUITKA_NO_ASSERT__ -DPy_NO_ENABLE_SHARED -D_NUITKA_STATIC_LIBPYTHON -D_NUITKA_USE_UNEXPOSED_API -D_NUITKA_CONSTANTS_FROM_LINKER -D_NUITKA_FROZEN=0 -D_NUITKA_EXE -I/usr/include/python3.10 -I. -I/usr/lib/python3/dist-packages/nuitka/build/include -I/usr/lib/python3/dist-packages/nuitka/build/static_src __loader.c
[2024-01-07T20:12:09.171065 61298] Hostname: azk12-MacBookAir
[2024-01-07T20:12:09.171077 61298] Working directory: /Users/azk12/Documents/nebios-system-apps/Welcome Screen/nebide-welcome-screen.build
[2024-01-07T20:12:09.171086 61298] Compiler type: gcc
[2024-01-07T20:12:09.171255 61298] Source file: __loader.c
[2024-01-07T20:12:09.171271 61298] Object file: __loader.o
[2024-01-07T20:12:09.171295 61298] Trying direct lookup
[2024-01-07T20:12:09.171430 61298] Retrieved 593f1603kuqf76slih471vp6sv33u59ms from primary storage (/Users/azk12/.cache/Nuitka/ccache/5/9/3f1603kuqf76slih471vp6sv33u59msM)
[2024-01-07T20:12:09.171460 61298] Looking for result key in /Users/azk12/.cache/Nuitka/ccache/5/9/3f1603kuqf76slih471vp6sv33u59msM
[2024-01-07T20:12:09.182268 61301] === CCACHE 4.5.1 STARTED =========================================
[2024-01-07T20:12:09.182268 61301] Config: (default) absolute_paths_in_stderr = false
[2024-01-07T20:12:09.182268 61301] Config: (default) base_dir = 
[2024-01-07T20:12:09.182268 61301] Config: (environment) cache_dir = /Users/azk12/.cache/Nuitka/ccache
[2024-01-07T20:12:09.182268 61301] Config: (default) compiler = 
[2024-01-07T20:12:09.182268 61301] Config: (default) compiler_check = mtime
[2024-01-07T20:12:09.182268 61301] Config: (default) compiler_type = auto
[2024-01-07T20:12:09.182268 61301] Config: (default) compression = true
[2024-01-07T20:12:09.182268 61301] Config: (default) compression_level = 0
[2024-01-07T20:12:09.182268 61301] Config: (default) cpp_extension = 
[2024-01-07T20:12:09.182268 61301] Config: (default) debug = false
[2024-01-07T20:12:09.182268 61301] Config: (default) debug_dir = 
[2024-01-07T20:12:09.182268 61301] Config: (default) depend_mode = false
[2024-01-07T20:12:09.182268 61301] Config: (default) direct_mode = true
[2024-01-07T20:12:09.182268 61301] Config: (default) disable = false
[2024-01-07T20:12:09.182268 61301] Config: (default) extra_files_to_hash = 
[2024-01-07T20:12:09.182268 61301] Config: (default) file_clone = false
[2024-01-07T20:12:09.182268 61301] Config: (default) hard_link = false
[2024-01-07T20:12:09.182268 61301] Config: (default) hash_dir = true
[2024-01-07T20:12:09.182268 61301] Config: (default) ignore_headers_in_manifest = 
[2024-01-07T20:12:09.182268 61301] Config: (default) ignore_options = 
[2024-01-07T20:12:09.182268 61301] Config: (default) inode_cache = false
[2024-01-07T20:12:09.182268 61301] Config: (default) keep_comments_cpp = false
[2024-01-07T20:12:09.182268 61301] Config: (default) limit_multiple = 0.8
[2024-01-07T20:12:09.182268 61301] Config: (environment) log_file = /Users/azk12/Documents/nebios-system-apps/Welcome Screen/nebide-welcome-screen.build/ccache-61277.txt
[2024-01-07T20:12:09.182268 61301] Config: (default) max_files = 0
[2024-01-07T20:12:09.182268 61301] Config: (default) max_size = 5.0G
[2024-01-07T20:12:09.182268 61301] Config: (default) namespace = 
[2024-01-07T20:12:09.182268 61301] Config: (default) path = 
[2024-01-07T20:12:09.182268 61301] Config: (default) pch_external_checksum = false
[2024-01-07T20:12:09.182268 61301] Config: (default) prefix_command = 
[2024-01-07T20:12:09.182268 61301] Config: (default) prefix_command_cpp = 
[2024-01-07T20:12:09.182268 61301] Config: (default) read_only = false
[2024-01-07T20:12:09.182268 61301] Config: (default) read_only_direct = false
[2024-01-07T20:12:09.182268 61301] Config: (default) recache = false
[2024-01-07T20:12:09.182268 61301] Config: (default) reshare = false
[2024-01-07T20:12:09.182268 61301] Config: (default) run_second_cpp = true
[2024-01-07T20:12:09.182268 61301] Config: (default) secondary_storage = 
[2024-01-07T20:12:09.182268 61301] Config: (default) sloppiness = 
[2024-01-07T20:12:09.182268 61301] Config: (default) stats = true
[2024-01-07T20:12:09.182268 61301] Config: (default) stats_log = 
[2024-01-07T20:12:09.182268 61301] Config: (default) temporary_dir = /run/user/1000/ccache-tmp
[2024-01-07T20:12:09.182268 61301] Config: (default) umask = 
[2024-01-07T20:12:09.182407 61301] Command line: /usr/bin/ccache /usr/bin/gcc -o module.__main__.o -c -flto -fuse-linker-plugin -fno-fat-lto-objects -std=c11 -fvisibility=hidden -fwrapv -pipe -fpartial-inlining -ftrack-macro-expansion=0 -Wno-deprecated-declarations -fno-var-tracking -Wno-misleading-indentation -fcompare-debug-second -O2 -D__NUITKA_NO_ASSERT__ -DPy_NO_ENABLE_SHARED -D_NUITKA_STATIC_LIBPYTHON -D_NUITKA_USE_UNEXPOSED_API -D_NUITKA_CONSTANTS_FROM_LINKER -D_NUITKA_FROZEN=0 -D_NUITKA_EXE -I/usr/include/python3.10 -I. -I/usr/lib/python3/dist-packages/nuitka/build/include -I/usr/lib/python3/dist-packages/nuitka/build/static_src module.__main__.c
[2024-01-07T20:12:09.182435 61301] Hostname: azk12-MacBookAir
[2024-01-07T20:12:09.182442 61301] Working directory: /Users/azk12/Documents/nebios-system-apps/Welcome Screen/nebide-welcome-screen.build
[2024-01-07T20:12:09.182447 61301] Compiler type: gcc
[2024-01-07T20:12:09.182572 61301] Source file: module.__main__.c
[2024-01-07T20:12:09.182585 61301] Object file: module.__main__.o
[2024-01-07T20:12:09.182614 61301] Trying direct lookup
[2024-01-07T20:12:09.183262 61301] No 15b9f6qrnl1rhcln9f38m2uogvh4soheg in primary storage
[2024-01-07T20:12:09.183381 61301] Running preprocessor
[2024-01-07T20:12:09.183402 61301] Executing /usr/bin/gcc -flto -fuse-linker-plugin -fno-fat-lto-objects -std=c11 -fvisibility=hidden -fwrapv -pipe -fpartial-inlining -ftrack-macro-expansion=0 -Wno-deprecated-declarations -fno-var-tracking -Wno-misleading-indentation -fcompare-debug-second -O2 -D__NUITKA_NO_ASSERT__ -DPy_NO_ENABLE_SHARED -D_NUITKA_STATIC_LIBPYTHON -D_NUITKA_USE_UNEXPOSED_API -D_NUITKA_CONSTANTS_FROM_LINKER -D_NUITKA_FROZEN=0 -D_NUITKA_EXE -I/usr/include/python3.10 -I. -I/usr/lib/python3/dist-packages/nuitka/build/include -I/usr/lib/python3/dist-packages/nuitka/build/static_src -E module.__main__.c
[2024-01-07T20:12:09.186497 61295] Got result key from manifest
[2024-01-07T20:12:09.186492 61298] Got result key from manifest
[2024-01-07T20:12:09.186559 61295] Retrieved e3e40m8vbnhnrk2ab7eelgnnosnj5b8iq from primary storage (/Users/azk12/.cache/Nuitka/ccache/e/3/e40m8vbnhnrk2ab7eelgnnosnj5b8iqR)
[2024-01-07T20:12:09.186578 61295] Reading result /Users/azk12/.cache/Nuitka/ccache/e/3/e40m8vbnhnrk2ab7eelgnnosnj5b8iqR
[2024-01-07T20:12:09.186582 61298] Retrieved 7456p34p2gah3dhjhkqnhk4sgaf0mi1hk from primary storage (/Users/azk12/.cache/Nuitka/ccache/7/4/56p34p2gah3dhjhkqnhk4sgaf0mi1hkR)
[2024-01-07T20:12:09.186608 61298] Reading result /Users/azk12/.cache/Nuitka/ccache/7/4/56p34p2gah3dhjhkqnhk4sgaf0mi1hkR
[2024-01-07T20:12:09.186717 61295] Reading embedded entry #0 .o (2840 bytes)
[2024-01-07T20:12:09.186730 61295] Writing to __helpers.o
[2024-01-07T20:12:09.186789 61295] Succeeded getting cached result
[2024-01-07T20:12:09.186795 61292] Got result key from manifest
[2024-01-07T20:12:09.186804 61295] Result: direct_cache_hit
[2024-01-07T20:12:09.186815 61295] Result: primary_storage_hit
[2024-01-07T20:12:09.186838 61292] Retrieved db16ttsv0q71q36cr0hm7k8nbe1b879c6 from primary storage (/Users/azk12/.cache/Nuitka/ccache/d/b/16ttsv0q71q36cr0hm7k8nbe1b879c6R)
[2024-01-07T20:12:09.186859 61292] Reading result /Users/azk12/.cache/Nuitka/ccache/d/b/16ttsv0q71q36cr0hm7k8nbe1b879c6R
[2024-01-07T20:12:09.186886 61295] lockfile_acquire: symlink /Users/azk12/.cache/Nuitka/ccache/6/f/stats.lock: No such file or directory
[2024-01-07T20:12:09.186988 61298] Reading embedded entry #0 .o (9144 bytes)
[2024-01-07T20:12:09.187024 61295] Acquired lock /Users/azk12/.cache/Nuitka/ccache/6/f/stats.lock
[2024-01-07T20:12:09.187036 61298] Writing to __loader.o
[2024-01-07T20:12:09.187102 61298] Succeeded getting cached result
[2024-01-07T20:12:09.187118 61298] Result: direct_cache_hit
[2024-01-07T20:12:09.187123 61298] Result: primary_storage_hit
[2024-01-07T20:12:09.187162 61298] lockfile_acquire: symlink /Users/azk12/.cache/Nuitka/ccache/7/2/stats.lock: No such file or directory
[2024-01-07T20:12:09.187228 61298] Acquired lock /Users/azk12/.cache/Nuitka/ccache/7/2/stats.lock
[2024-01-07T20:12:09.187308 61295] Releasing lock /Users/azk12/.cache/Nuitka/ccache/6/f/stats.lock
[2024-01-07T20:12:09.187315 61292] Reading embedded entry #0 .o (14240 bytes)
[2024-01-07T20:12:09.187338 61292] Writing to __constants.o
[2024-01-07T20:12:09.187387 61295] Unlink /Users/azk12/.cache/Nuitka/ccache/6/f/stats.lock
[2024-01-07T20:12:09.187432 61292] Succeeded getting cached result
[2024-01-07T20:12:09.187456 61292] Result: direct_cache_hit
[2024-01-07T20:12:09.187462 61298] Releasing lock /Users/azk12/.cache/Nuitka/ccache/7/2/stats.lock
[2024-01-07T20:12:09.187467 61292] Result: primary_storage_hit
[2024-01-07T20:12:09.187512 61298] Unlink /Users/azk12/.cache/Nuitka/ccache/7/2/stats.lock
[2024-01-07T20:12:09.187526 61292] lockfile_acquire: symlink /Users/azk12/.cache/Nuitka/ccache/6/c/stats.lock: No such file or directory
[2024-01-07T20:12:09.187595 61292] Acquired lock /Users/azk12/.cache/Nuitka/ccache/6/c/stats.lock
[2024-01-07T20:12:09.187796 61292] Releasing lock /Users/azk12/.cache/Nuitka/ccache/6/c/stats.lock
[2024-01-07T20:12:09.187840 61292] Unlink /Users/azk12/.cache/Nuitka/ccache/6/c/stats.lock
[2024-01-07T20:12:09.214869 61306] === CCACHE 4.5.1 STARTED =========================================
[2024-01-07T20:12:09.214869 61306] Config: (default) absolute_paths_in_stderr = false
[2024-01-07T20:12:09.214869 61306] Config: (default) base_dir = 
[2024-01-07T20:12:09.214869 61306] Config: (environment) cache_dir = /Users/azk12/.cache/Nuitka/ccache
[2024-01-07T20:12:09.214869 61306] Config: (default) compiler = 
[2024-01-07T20:12:09.214869 61306] Config: (default) compiler_check = mtime
[2024-01-07T20:12:09.214869 61306] Config: (default) compiler_type = auto
[2024-01-07T20:12:09.214869 61306] Config: (default) compression = true
[2024-01-07T20:12:09.214869 61306] Config: (default) compression_level = 0
[2024-01-07T20:12:09.214869 61306] Config: (default) cpp_extension = 
[2024-01-07T20:12:09.214869 61306] Config: (default) debug = false
[2024-01-07T20:12:09.214869 61306] Config: (default) debug_dir = 
[2024-01-07T20:12:09.214869 61306] Config: (default) depend_mode = false
[2024-01-07T20:12:09.214869 61306] Config: (default) direct_mode = true
[2024-01-07T20:12:09.214869 61306] Config: (default) disable = false
[2024-01-07T20:12:09.214869 61306] Config: (default) extra_files_to_hash = 
[2024-01-07T20:12:09.214869 61306] Config: (default) file_clone = false
[2024-01-07T20:12:09.214869 61306] Config: (default) hard_link = false
[2024-01-07T20:12:09.214869 61306] Config: (default) hash_dir = true
[2024-01-07T20:12:09.214869 61306] Config: (default) ignore_headers_in_manifest = 
[2024-01-07T20:12:09.214869 61306] Config: (default) ignore_options = 
[2024-01-07T20:12:09.214869 61306] Config: (default) inode_cache = false
[2024-01-07T20:12:09.214869 61306] Config: (default) keep_comments_cpp = false
[2024-01-07T20:12:09.214869 61306] Config: (default) limit_multiple = 0.8
[2024-01-07T20:12:09.214869 61306] Config: (environment) log_file = /Users/azk12/Documents/nebios-system-apps/Welcome Screen/nebide-welcome-screen.build/ccache-61277.txt
[2024-01-07T20:12:09.214869 61306] Config: (default) max_files = 0
[2024-01-07T20:12:09.214869 61306] Config: (default) max_size = 5.0G
[2024-01-07T20:12:09.214869 61306] Config: (default) namespace = 
[2024-01-07T20:12:09.214869 61306] Config: (default) path = 
[2024-01-07T20:12:09.214869 61306] Config: (default) pch_external_checksum = false
[2024-01-07T20:12:09.214869 61306] Config: (default) prefix_command = 
[2024-01-07T20:12:09.214869 61306] Config: (default) prefix_command_cpp = 
[2024-01-07T20:12:09.214869 61306] Config: (default) read_only = false
[2024-01-07T20:12:09.214869 61306] Config: (default) read_only_direct = false
[2024-01-07T20:12:09.214869 61306] Config: (default) recache = false
[2024-01-07T20:12:09.214869 61306] Config: (default) reshare = false
[2024-01-07T20:12:09.214869 61306] Config: (default) run_second_cpp = true
[2024-01-07T20:12:09.214869 61306] Config: (default) secondary_storage = 
[2024-01-07T20:12:09.214869 61306] Config: (default) sloppiness = 
[2024-01-07T20:12:09.214869 61306] Config: (default) stats = true
[2024-01-07T20:12:09.214869 61306] Config: (default) stats_log = 
[2024-01-07T20:12:09.214869 61306] Config: (default) temporary_dir = /run/user/1000/ccache-tmp
[2024-01-07T20:12:09.214869 61306] Config: (default) umask = 
[2024-01-07T20:12:09.214977 61306] Command line: /usr/bin/ccache /usr/bin/gcc -o static_src/MainProgram.o -c -flto -fuse-linker-plugin -fno-fat-lto-objects -std=c11 -fvisibility=hidden -fwrapv -pipe -fpartial-inlining -ftrack-macro-expansion=0 -Wno-deprecated-declarations -fno-var-tracking -Wno-misleading-indentation -fcompare-debug-second -O2 -D__NUITKA_NO_ASSERT__ -DPy_NO_ENABLE_SHARED -D_NUITKA_STATIC_LIBPYTHON -D_NUITKA_USE_UNEXPOSED_API -D_NUITKA_CONSTANTS_FROM_LINKER -D_NUITKA_FROZEN=0 -D_NUITKA_EXE -I/usr/include/python3.10 -I. -I/usr/lib/python3/dist-packages/nuitka/build/include -I/usr/lib/python3/dist-packages/nuitka/build/static_src static_src/MainProgram.c
[2024-01-07T20:12:09.215208 61306] Hostname: azk12-MacBookAir
[2024-01-07T20:12:09.215222 61306] Working directory: /Users/azk12/Documents/nebios-system-apps/Welcome Screen/nebide-welcome-screen.build
[2024-01-07T20:12:09.215229 61306] Compiler type: gcc
[2024-01-07T20:12:09.215381 61306] Source file: static_src/MainProgram.c
[2024-01-07T20:12:09.215394 61306] Object file: static_src/MainProgram.o
[2024-01-07T20:12:09.215419 61306] Trying direct lookup
[2024-01-07T20:12:09.215598 61306] No 81fcrp1ohusg9a8gpsk1js8omao1j0n86 in primary storage
[2024-01-07T20:12:09.215704 61306] Running preprocessor
[2024-01-07T20:12:09.215721 61306] Executing /usr/bin/gcc -flto -fuse-linker-plugin -fno-fat-lto-objects -std=c11 -fvisibility=hidden -fwrapv -pipe -fpartial-inlining -ftrack-macro-expansion=0 -Wno-deprecated-declarations -fno-var-tracking -Wno-misleading-indentation -fcompare-debug-second -O2 -D__NUITKA_NO_ASSERT__ -DPy_NO_ENABLE_SHARED -D_NUITKA_STATIC_LIBPYTHON -D_NUITKA_USE_UNEXPOSED_API -D_NUITKA_CONSTANTS_FROM_LINKER -D_NUITKA_FROZEN=0 -D_NUITKA_EXE -I/usr/include/python3.10 -I. -I/usr/lib/python3/dist-packages/nuitka/build/include -I/usr/lib/python3/dist-packages/nuitka/build/static_src -E static_src/MainProgram.c
[2024-01-07T20:12:09.237771 61311] === CCACHE 4.5.1 STARTED =========================================
[2024-01-07T20:12:09.237771 61311] Config: (default) absolute_paths_in_stderr = false
[2024-01-07T20:12:09.237771 61311] Config: (default) base_dir = 
[2024-01-07T20:12:09.237771 61311] Config: (environment) cache_dir = /Users/azk12/.cache/Nuitka/ccache
[2024-01-07T20:12:09.237771 61311] Config: (default) compiler = 
[2024-01-07T20:12:09.237771 61311] Config: (default) compiler_check = mtime
[2024-01-07T20:12:09.237771 61311] Config: (default) compiler_type = auto
[2024-01-07T20:12:09.237771 61311] Config: (default) compression = true
[2024-01-07T20:12:09.237771 61311] Config: (default) compression_level = 0
[2024-01-07T20:12:09.237771 61311] Config: (default) cpp_extension = 
[2024-01-07T20:12:09.237771 61311] Config: (default) debug = false
[2024-01-07T20:12:09.237771 61311] Config: (default) debug_dir = 
[2024-01-07T20:12:09.237771 61311] Config: (default) depend_mode = false
[2024-01-07T20:12:09.237771 61311] Config: (default) direct_mode = true
[2024-01-07T20:12:09.237771 61311] Config: (default) disable = false
[2024-01-07T20:12:09.237771 61311] Config: (default) extra_files_to_hash = 
[2024-01-07T20:12:09.237771 61311] Config: (default) file_clone = false
[2024-01-07T20:12:09.237771 61311] Config: (default) hard_link = false
[2024-01-07T20:12:09.237771 61311] Config: (default) hash_dir = true
[2024-01-07T20:12:09.237771 61311] Config: (default) ignore_headers_in_manifest = 
[2024-01-07T20:12:09.237771 61311] Config: (default) ignore_options = 
[2024-01-07T20:12:09.237771 61311] Config: (default) inode_cache = false
[2024-01-07T20:12:09.237771 61311] Config: (default) keep_comments_cpp = false
[2024-01-07T20:12:09.237771 61311] Config: (default) limit_multiple = 0.8
[2024-01-07T20:12:09.237771 61311] Config: (environment) log_file = /Users/azk12/Documents/nebios-system-apps/Welcome Screen/nebide-welcome-screen.build/ccache-61277.txt
[2024-01-07T20:12:09.237771 61311] Config: (default) max_files = 0
[2024-01-07T20:12:09.237771 61311] Config: (default) max_size = 5.0G
[2024-01-07T20:12:09.237771 61311] Config: (default) namespace = 
[2024-01-07T20:12:09.237771 61311] Config: (default) path = 
[2024-01-07T20:12:09.237771 61311] Config: (default) pch_external_checksum = false
[2024-01-07T20:12:09.237771 61311] Config: (default) prefix_command = 
[2024-01-07T20:12:09.237771 61311] Config: (default) prefix_command_cpp = 
[2024-01-07T20:12:09.237771 61311] Config: (default) read_only = false
[2024-01-07T20:12:09.237771 61311] Config: (default) read_only_direct = false
[2024-01-07T20:12:09.237771 61311] Config: (default) recache = false
[2024-01-07T20:12:09.237771 61311] Config: (default) reshare = false
[2024-01-07T20:12:09.237771 61311] Config: (default) run_second_cpp = true
[2024-01-07T20:12:09.237771 61311] Config: (default) secondary_storage = 
[2024-01-07T20:12:09.237771 61311] Config: (default) sloppiness = 
[2024-01-07T20:12:09.237771 61311] Config: (default) stats = true
[2024-01-07T20:12:09.237771 61311] Config: (default) stats_log = 
[2024-01-07T20:12:09.237771 61311] Config: (default) temporary_dir = /run/user/1000/ccache-tmp
[2024-01-07T20:12:09.237771 61311] Config: (default) umask = 
[2024-01-07T20:12:09.237871 61311] Command line: /usr/bin/ccache /usr/bin/gcc -o static_src/CompiledCellType.o -c -flto -fuse-linker-plugin -fno-fat-lto-objects -std=c11 -fvisibility=hidden -fwrapv -pipe -fpartial-inlining -ftrack-macro-expansion=0 -Wno-deprecated-declarations -fno-var-tracking -Wno-misleading-indentation -fcompare-debug-second -O2 -D__NUITKA_NO_ASSERT__ -DPy_NO_ENABLE_SHARED -D_NUITKA_STATIC_LIBPYTHON -D_NUITKA_USE_UNEXPOSED_API -D_NUITKA_CONSTANTS_FROM_LINKER -D_NUITKA_FROZEN=0 -D_NUITKA_EXE -I/usr/include/python3.10 -I. -I/usr/lib/python3/dist-packages/nuitka/build/include -I/usr/lib/python3/dist-packages/nuitka/build/static_src static_src/CompiledCellType.c
[2024-01-07T20:12:09.237896 61311] Hostname: azk12-MacBookAir
[2024-01-07T20:12:09.237904 61311] Working directory: /Users/azk12/Documents/nebios-system-apps/Welcome Screen/nebide-welcome-screen.build
[2024-01-07T20:12:09.237909 61311] Compiler type: gcc
[2024-01-07T20:12:09.238016 61311] Source file: static_src/CompiledCellType.c
[2024-01-07T20:12:09.238026 61311] Object file: static_src/CompiledCellType.o
[2024-01-07T20:12:09.238047 61311] Trying direct lookup
[2024-01-07T20:12:09.238141 61311] Retrieved ba24igq13258b6goh4dhkich465irv1b8 from primary storage (/Users/azk12/.cache/Nuitka/ccache/b/a/24igq13258b6goh4dhkich465irv1b8M)
[2024-01-07T20:12:09.238163 61311] Looking for result key in /Users/azk12/.cache/Nuitka/ccache/b/a/24igq13258b6goh4dhkich465irv1b8M
[2024-01-07T20:12:09.246162 61311] Got result key from manifest
[2024-01-07T20:12:09.246262 61311] Retrieved 25a3q4f2u8nafki1o92snaprvl9b6h7le from primary storage (/Users/azk12/.cache/Nuitka/ccache/2/5/a3q4f2u8nafki1o92snaprvl9b6h7leR)
[2024-01-07T20:12:09.246293 61311] Reading result /Users/azk12/.cache/Nuitka/ccache/2/5/a3q4f2u8nafki1o92snaprvl9b6h7leR
[2024-01-07T20:12:09.251490 61311] Reading embedded entry #0 .o (36040 bytes)
[2024-01-07T20:12:09.251533 61311] Writing to static_src/CompiledCellType.o
[2024-01-07T20:12:09.251669 61311] Succeeded getting cached result
[2024-01-07T20:12:09.251697 61311] Result: direct_cache_hit
[2024-01-07T20:12:09.251706 61311] Result: primary_storage_hit
[2024-01-07T20:12:09.251773 61311] lockfile_acquire: symlink /Users/azk12/.cache/Nuitka/ccache/7/f/stats.lock: No such file or directory
[2024-01-07T20:12:09.251847 61311] Acquired lock /Users/azk12/.cache/Nuitka/ccache/7/f/stats.lock
[2024-01-07T20:12:09.252106 61311] Releasing lock /Users/azk12/.cache/Nuitka/ccache/7/f/stats.lock
[2024-01-07T20:12:09.252199 61311] Unlink /Users/azk12/.cache/Nuitka/ccache/7/f/stats.lock
[2024-01-07T20:12:09.338526 61306] Got result key from preprocessor
[2024-01-07T20:12:09.338646 61306] Retrieved 9389gd3g2c6ppgkir6ck3qllnp2il88fe from primary storage (/Users/azk12/.cache/Nuitka/ccache/9/3/89gd3g2c6ppgkir6ck3qllnp2il88feR)
[2024-01-07T20:12:09.338682 61306] Reading result /Users/azk12/.cache/Nuitka/ccache/9/3/89gd3g2c6ppgkir6ck3qllnp2il88feR
[2024-01-07T20:12:09.339762 61306] Reading embedded entry #0 .o (28568 bytes)
[2024-01-07T20:12:09.339787 61306] Writing to static_src/MainProgram.o
[2024-01-07T20:12:09.339911 61306] Succeeded getting cached result
[2024-01-07T20:12:09.339940 61306] Adding result key to /Users/azk12/.cache/Nuitka/ccache/8/1/fcrp1ohusg9a8gpsk1js8omao1j0n86M
[2024-01-07T20:12:09.341347 61306] Using default compression level 1
[2024-01-07T20:12:09.342633 61306] Stored 81fcrp1ohusg9a8gpsk1js8omao1j0n86 in primary storage (/Users/azk12/.cache/Nuitka/ccache/8/1/fcrp1ohusg9a8gpsk1js8omao1j0n86M)
[2024-01-07T20:12:09.342687 61306] Result: direct_cache_miss
[2024-01-07T20:12:09.342698 61306] Result: preprocessed_cache_hit
[2024-01-07T20:12:09.342706 61306] Result: primary_storage_hit
[2024-01-07T20:12:09.342713 61306] Result: primary_storage_miss
[2024-01-07T20:12:09.342803 61306] Acquired lock /Users/azk12/.cache/Nuitka/ccache/8/stats.lock
[2024-01-07T20:12:09.343051 61306] Releasing lock /Users/azk12/.cache/Nuitka/ccache/8/stats.lock
[2024-01-07T20:12:09.343101 61306] Unlink /Users/azk12/.cache/Nuitka/ccache/8/stats.lock
[2024-01-07T20:12:09.343138 61306] lockfile_acquire: symlink /Users/azk12/.cache/Nuitka/ccache/7/a/stats.lock: No such file or directory
[2024-01-07T20:12:09.343205 61306] Acquired lock /Users/azk12/.cache/Nuitka/ccache/7/a/stats.lock
[2024-01-07T20:12:09.343432 61306] Releasing lock /Users/azk12/.cache/Nuitka/ccache/7/a/stats.lock
[2024-01-07T20:12:09.343477 61306] Unlink /Users/azk12/.cache/Nuitka/ccache/7/a/stats.lock
[2024-01-07T20:12:09.343500 61306] Unlink /run/user/1000/ccache-tmp/tmp.cpp_stderr.peRiI0
[2024-01-07T20:12:09.343512 61306] Unlink /run/user/1000/ccache-tmp/tmp.cpp_stdout.6cw67Q.i
[2024-01-07T20:12:09.343728 61306] Unlink /run/user/1000/ccache-tmp/tmp.cpp_stdout.6cw67Q
[2024-01-07T20:12:09.374024 61301] Got result key from preprocessor
[2024-01-07T20:12:09.374084 61301] No 63e692mq938g8agi87bpavkl4agb22qeu in primary storage
[2024-01-07T20:12:09.374096 61301] Running real compiler
[2024-01-07T20:12:09.374147 61301] Executing /usr/bin/gcc -flto -fuse-linker-plugin -fno-fat-lto-objects -std=c11 -fvisibility=hidden -fwrapv -pipe -fpartial-inlining -ftrack-macro-expansion=0 -Wno-deprecated-declarations -fno-var-tracking -Wno-misleading-indentation -fcompare-debug-second -O2 -D__NUITKA_NO_ASSERT__ -DPy_NO_ENABLE_SHARED -D_NUITKA_STATIC_LIBPYTHON -D_NUITKA_USE_UNEXPOSED_API -D_NUITKA_CONSTANTS_FROM_LINKER -D_NUITKA_FROZEN=0 -D_NUITKA_EXE -I/usr/include/python3.10 -I. -I/usr/lib/python3/dist-packages/nuitka/build/include -I/usr/lib/python3/dist-packages/nuitka/build/static_src -c -fdiagnostics-color -o module.__main__.o module.__main__.c
[2024-01-07T20:12:09.487342 61317] === CCACHE 4.5.1 STARTED =========================================
[2024-01-07T20:12:09.487342 61317] Config: (default) absolute_paths_in_stderr = false
[2024-01-07T20:12:09.487342 61317] Config: (default) base_dir = 
[2024-01-07T20:12:09.487342 61317] Config: (environment) cache_dir = /Users/azk12/.cache/Nuitka/ccache
[2024-01-07T20:12:09.487342 61317] Config: (default) compiler = 
[2024-01-07T20:12:09.487342 61317] Config: (default) compiler_check = mtime
[2024-01-07T20:12:09.487342 61317] Config: (default) compiler_type = auto
[2024-01-07T20:12:09.487342 61317] Config: (default) compression = true
[2024-01-07T20:12:09.487342 61317] Config: (default) compression_level = 0
[2024-01-07T20:12:09.487342 61317] Config: (default) cpp_extension = 
[2024-01-07T20:12:09.487342 61317] Config: (default) debug = false
[2024-01-07T20:12:09.487342 61317] Config: (default) debug_dir = 
[2024-01-07T20:12:09.487342 61317] Config: (default) depend_mode = false
[2024-01-07T20:12:09.487342 61317] Config: (default) direct_mode = true
[2024-01-07T20:12:09.487342 61317] Config: (default) disable = false
[2024-01-07T20:12:09.487342 61317] Config: (default) extra_files_to_hash = 
[2024-01-07T20:12:09.487342 61317] Config: (default) file_clone = false
[2024-01-07T20:12:09.487342 61317] Config: (default) hard_link = false
[2024-01-07T20:12:09.487342 61317] Config: (default) hash_dir = true
[2024-01-07T20:12:09.487342 61317] Config: (default) ignore_headers_in_manifest = 
[2024-01-07T20:12:09.487342 61317] Config: (default) ignore_options = 
[2024-01-07T20:12:09.487342 61317] Config: (default) inode_cache = false
[2024-01-07T20:12:09.487342 61317] Config: (default) keep_comments_cpp = false
[2024-01-07T20:12:09.487342 61317] Config: (default) limit_multiple = 0.8
[2024-01-07T20:12:09.487342 61317] Config: (environment) log_file = /Users/azk12/Documents/nebios-system-apps/Welcome Screen/nebide-welcome-screen.build/ccache-61277.txt
[2024-01-07T20:12:09.487342 61317] Config: (default) max_files = 0
[2024-01-07T20:12:09.487342 61317] Config: (default) max_size = 5.0G
[2024-01-07T20:12:09.487342 61317] Config: (default) namespace = 
[2024-01-07T20:12:09.487342 61317] Config: (default) path = 
[2024-01-07T20:12:09.487342 61317] Config: (default) pch_external_checksum = false
[2024-01-07T20:12:09.487342 61317] Config: (default) prefix_command = 
[2024-01-07T20:12:09.487342 61317] Config: (default) prefix_command_cpp = 
[2024-01-07T20:12:09.487342 61317] Config: (default) read_only = false
[2024-01-07T20:12:09.487342 61317] Config: (default) read_only_direct = false
[2024-01-07T20:12:09.487342 61317] Config: (default) recache = false
[2024-01-07T20:12:09.487342 61317] Config: (default) reshare = false
[2024-01-07T20:12:09.487342 61317] Config: (default) run_second_cpp = true
[2024-01-07T20:12:09.487342 61317] Config: (default) secondary_storage = 
[2024-01-07T20:12:09.487342 61317] Config: (default) sloppiness = 
[2024-01-07T20:12:09.487342 61317] Config: (default) stats = true
[2024-01-07T20:12:09.487342 61317] Config: (default) stats_log = 
[2024-01-07T20:12:09.487342 61317] Config: (default) temporary_dir = /run/user/1000/ccache-tmp
[2024-01-07T20:12:09.487342 61317] Config: (default) umask = 
[2024-01-07T20:12:09.487490 61317] Command line: /usr/bin/ccache /usr/bin/gcc -o static_src/CompiledFunctionType.o -c -flto -fuse-linker-plugin -fno-fat-lto-objects -std=c11 -fvisibility=hidden -fwrapv -pipe -fpartial-inlining -ftrack-macro-expansion=0 -Wno-deprecated-declarations -fno-var-tracking -Wno-misleading-indentation -fcompare-debug-second -O2 -D__NUITKA_NO_ASSERT__ -DPy_NO_ENABLE_SHARED -D_NUITKA_STATIC_LIBPYTHON -D_NUITKA_USE_UNEXPOSED_API -D_NUITKA_CONSTANTS_FROM_LINKER -D_NUITKA_FROZEN=0 -D_NUITKA_EXE -I/usr/include/python3.10 -I. -I/usr/lib/python3/dist-packages/nuitka/build/include -I/usr/lib/python3/dist-packages/nuitka/build/static_src static_src/CompiledFunctionType.c
[2024-01-07T20:12:09.487532 61317] Hostname: azk12-MacBookAir
[2024-01-07T20:12:09.487545 61317] Working directory: /Users/azk12/Documents/nebios-system-apps/Welcome Screen/nebide-welcome-screen.build
[2024-01-07T20:12:09.487554 61317] Compiler type: gcc
[2024-01-07T20:12:09.487735 61317] Source file: static_src/CompiledFunctionType.c
[2024-01-07T20:12:09.487750 61317] Object file: static_src/CompiledFunctionType.o
[2024-01-07T20:12:09.487776 61317] Trying direct lookup
[2024-01-07T20:12:09.488398 61317] Retrieved f1e7l7vcic3kalmm137r1hra14270doqg from primary storage (/Users/azk12/.cache/Nuitka/ccache/f/1/e7l7vcic3kalmm137r1hra14270doqgM)
[2024-01-07T20:12:09.488451 61317] Looking for result key in /Users/azk12/.cache/Nuitka/ccache/f/1/e7l7vcic3kalmm137r1hra14270doqgM
[2024-01-07T20:12:09.505724 61317] Got result key from manifest
[2024-01-07T20:12:09.505833 61317] Retrieved 4e20e24qsb78d2cor8aplo5icpqlv8ae4 from primary storage (/Users/azk12/.cache/Nuitka/ccache/4/e/20e24qsb78d2cor8aplo5icpqlv8ae4R)
[2024-01-07T20:12:09.505865 61317] Reading result /Users/azk12/.cache/Nuitka/ccache/4/e/20e24qsb78d2cor8aplo5icpqlv8ae4R
[2024-01-07T20:12:09.508953 61317] Reading embedded entry #0 .o (2692144 bytes)
[2024-01-07T20:12:09.508995 61317] Writing to static_src/CompiledFunctionType.o
[2024-01-07T20:12:09.515171 61317] Succeeded getting cached result
[2024-01-07T20:12:09.515214 61317] Result: direct_cache_hit
[2024-01-07T20:12:09.515227 61317] Result: primary_storage_hit
[2024-01-07T20:12:09.515307 61317] lockfile_acquire: symlink /Users/azk12/.cache/Nuitka/ccache/8/5/stats.lock: No such file or directory
[2024-01-07T20:12:09.515413 61317] Acquired lock /Users/azk12/.cache/Nuitka/ccache/8/5/stats.lock
[2024-01-07T20:12:09.515689 61317] Releasing lock /Users/azk12/.cache/Nuitka/ccache/8/5/stats.lock
[2024-01-07T20:12:09.515748 61317] Unlink /Users/azk12/.cache/Nuitka/ccache/8/5/stats.lock
[2024-01-07T20:12:09.518409 61320] === CCACHE 4.5.1 STARTED =========================================
[2024-01-07T20:12:09.518409 61320] Config: (default) absolute_paths_in_stderr = false
[2024-01-07T20:12:09.518409 61320] Config: (default) base_dir = 
[2024-01-07T20:12:09.518409 61320] Config: (environment) cache_dir = /Users/azk12/.cache/Nuitka/ccache
[2024-01-07T20:12:09.518409 61320] Config: (default) compiler = 
[2024-01-07T20:12:09.518409 61320] Config: (default) compiler_check = mtime
[2024-01-07T20:12:09.518409 61320] Config: (default) compiler_type = auto
[2024-01-07T20:12:09.518409 61320] Config: (default) compression = true
[2024-01-07T20:12:09.518409 61320] Config: (default) compression_level = 0
[2024-01-07T20:12:09.518409 61320] Config: (default) cpp_extension = 
[2024-01-07T20:12:09.518409 61320] Config: (default) debug = false
[2024-01-07T20:12:09.518409 61320] Config: (default) debug_dir = 
[2024-01-07T20:12:09.518409 61320] Config: (default) depend_mode = false
[2024-01-07T20:12:09.518409 61320] Config: (default) direct_mode = true
[2024-01-07T20:12:09.518409 61320] Config: (default) disable = false
[2024-01-07T20:12:09.518409 61320] Config: (default) extra_files_to_hash = 
[2024-01-07T20:12:09.518409 61320] Config: (default) file_clone = false
[2024-01-07T20:12:09.518409 61320] Config: (default) hard_link = false
[2024-01-07T20:12:09.518409 61320] Config: (default) hash_dir = true
[2024-01-07T20:12:09.518409 61320] Config: (default) ignore_headers_in_manifest = 
[2024-01-07T20:12:09.518409 61320] Config: (default) ignore_options = 
[2024-01-07T20:12:09.518409 61320] Config: (default) inode_cache = false
[2024-01-07T20:12:09.518409 61320] Config: (default) keep_comments_cpp = false
[2024-01-07T20:12:09.518409 61320] Config: (default) limit_multiple = 0.8
[2024-01-07T20:12:09.518409 61320] Config: (environment) log_file = /Users/azk12/Documents/nebios-system-apps/Welcome Screen/nebide-welcome-screen.build/ccache-61277.txt
[2024-01-07T20:12:09.518409 61320] Config: (default) max_files = 0
[2024-01-07T20:12:09.518409 61320] Config: (default) max_size = 5.0G
[2024-01-07T20:12:09.518409 61320] Config: (default) namespace = 
[2024-01-07T20:12:09.518409 61320] Config: (default) path = 
[2024-01-07T20:12:09.518409 61320] Config: (default) pch_external_checksum = false
[2024-01-07T20:12:09.518409 61320] Config: (default) prefix_command = 
[2024-01-07T20:12:09.518409 61320] Config: (default) prefix_command_cpp = 
[2024-01-07T20:12:09.518409 61320] Config: (default) read_only = false
[2024-01-07T20:12:09.518409 61320] Config: (default) read_only_direct = false
[2024-01-07T20:12:09.518409 61320] Config: (default) recache = false
[2024-01-07T20:12:09.518409 61320] Config: (default) reshare = false
[2024-01-07T20:12:09.518409 61320] Config: (default) run_second_cpp = true
[2024-01-07T20:12:09.518409 61320] Config: (default) secondary_storage = 
[2024-01-07T20:12:09.518409 61320] Config: (default) sloppiness = 
[2024-01-07T20:12:09.518409 61320] Config: (default) stats = true
[2024-01-07T20:12:09.518409 61320] Config: (default) stats_log = 
[2024-01-07T20:12:09.518409 61320] Config: (default) temporary_dir = /run/user/1000/ccache-tmp
[2024-01-07T20:12:09.518409 61320] Config: (default) umask = 
[2024-01-07T20:12:09.518550 61320] Command line: /usr/bin/ccache /usr/bin/gcc -o static_src/CompiledGeneratorType.o -c -flto -fuse-linker-plugin -fno-fat-lto-objects -std=c11 -fvisibility=hidden -fwrapv -pipe -fpartial-inlining -ftrack-macro-expansion=0 -Wno-deprecated-declarations -fno-var-tracking -Wno-misleading-indentation -fcompare-debug-second -O2 -D__NUITKA_NO_ASSERT__ -DPy_NO_ENABLE_SHARED -D_NUITKA_STATIC_LIBPYTHON -D_NUITKA_USE_UNEXPOSED_API -D_NUITKA_CONSTANTS_FROM_LINKER -D_NUITKA_FROZEN=0 -D_NUITKA_EXE -I/usr/include/python3.10 -I. -I/usr/lib/python3/dist-packages/nuitka/build/include -I/usr/lib/python3/dist-packages/nuitka/build/static_src static_src/CompiledGeneratorType.c
[2024-01-07T20:12:09.518579 61320] Hostname: azk12-MacBookAir
[2024-01-07T20:12:09.518587 61320] Working directory: /Users/azk12/Documents/nebios-system-apps/Welcome Screen/nebide-welcome-screen.build
[2024-01-07T20:12:09.518592 61320] Compiler type: gcc
[2024-01-07T20:12:09.518709 61320] Source file: static_src/CompiledGeneratorType.c
[2024-01-07T20:12:09.518719 61320] Object file: static_src/CompiledGeneratorType.o
[2024-01-07T20:12:09.518735 61320] Trying direct lookup
[2024-01-07T20:12:09.518935 61320] Retrieved d73eg77rosr72v12haef3mfl8u41e5bce from primary storage (/Users/azk12/.cache/Nuitka/ccache/d/7/3eg77rosr72v12haef3mfl8u41e5bceM)
[2024-01-07T20:12:09.518960 61320] Looking for result key in /Users/azk12/.cache/Nuitka/ccache/d/7/3eg77rosr72v12haef3mfl8u41e5bceM
[2024-01-07T20:12:09.525282 61320] Got result key from manifest
[2024-01-07T20:12:09.525354 61320] Retrieved e3be9ehh40nhbq9taqm6j5dmgphoaoke8 from primary storage (/Users/azk12/.cache/Nuitka/ccache/e/3/be9ehh40nhbq9taqm6j5dmgphoaoke8R)
[2024-01-07T20:12:09.525375 61320] Reading result /Users/azk12/.cache/Nuitka/ccache/e/3/be9ehh40nhbq9taqm6j5dmgphoaoke8R
[2024-01-07T20:12:09.527130 61320] Reading embedded entry #0 .o (312800 bytes)
[2024-01-07T20:12:09.527169 61320] Writing to static_src/CompiledGeneratorType.o
[2024-01-07T20:12:09.527937 61320] Succeeded getting cached result
[2024-01-07T20:12:09.527974 61320] Result: direct_cache_hit
[2024-01-07T20:12:09.527985 61320] Result: primary_storage_hit
[2024-01-07T20:12:09.528061 61320] lockfile_acquire: symlink /Users/azk12/.cache/Nuitka/ccache/8/8/stats.lock: No such file or directory
[2024-01-07T20:12:09.528160 61320] Acquired lock /Users/azk12/.cache/Nuitka/ccache/8/8/stats.lock
[2024-01-07T20:12:09.528424 61320] Releasing lock /Users/azk12/.cache/Nuitka/ccache/8/8/stats.lock
[2024-01-07T20:12:09.528484 61320] Unlink /Users/azk12/.cache/Nuitka/ccache/8/8/stats.lock
[2024-01-07T20:12:09.531791 61323] === CCACHE 4.5.1 STARTED =========================================
[2024-01-07T20:12:09.531791 61323] Config: (default) absolute_paths_in_stderr = false
[2024-01-07T20:12:09.531791 61323] Config: (default) base_dir = 
[2024-01-07T20:12:09.531791 61323] Config: (environment) cache_dir = /Users/azk12/.cache/Nuitka/ccache
[2024-01-07T20:12:09.531791 61323] Config: (default) compiler = 
[2024-01-07T20:12:09.531791 61323] Config: (default) compiler_check = mtime
[2024-01-07T20:12:09.531791 61323] Config: (default) compiler_type = auto
[2024-01-07T20:12:09.531791 61323] Config: (default) compression = true
[2024-01-07T20:12:09.531791 61323] Config: (default) compression_level = 0
[2024-01-07T20:12:09.531791 61323] Config: (default) cpp_extension = 
[2024-01-07T20:12:09.531791 61323] Config: (default) debug = false
[2024-01-07T20:12:09.531791 61323] Config: (default) debug_dir = 
[2024-01-07T20:12:09.531791 61323] Config: (default) depend_mode = false
[2024-01-07T20:12:09.531791 61323] Config: (default) direct_mode = true
[2024-01-07T20:12:09.531791 61323] Config: (default) disable = false
[2024-01-07T20:12:09.531791 61323] Config: (default) extra_files_to_hash = 
[2024-01-07T20:12:09.531791 61323] Config: (default) file_clone = false
[2024-01-07T20:12:09.531791 61323] Config: (default) hard_link = false
[2024-01-07T20:12:09.531791 61323] Config: (default) hash_dir = true
[2024-01-07T20:12:09.531791 61323] Config: (default) ignore_headers_in_manifest = 
[2024-01-07T20:12:09.531791 61323] Config: (default) ignore_options = 
[2024-01-07T20:12:09.531791 61323] Config: (default) inode_cache = false
[2024-01-07T20:12:09.531791 61323] Config: (default) keep_comments_cpp = false
[2024-01-07T20:12:09.531791 61323] Config: (default) limit_multiple = 0.8
[2024-01-07T20:12:09.531791 61323] Config: (environment) log_file = /Users/azk12/Documents/nebios-system-apps/Welcome Screen/nebide-welcome-screen.build/ccache-61277.txt
[2024-01-07T20:12:09.531791 61323] Config: (default) max_files = 0
[2024-01-07T20:12:09.531791 61323] Config: (default) max_size = 5.0G
[2024-01-07T20:12:09.531791 61323] Config: (default) namespace = 
[2024-01-07T20:12:09.531791 61323] Config: (default) path = 
[2024-01-07T20:12:09.531791 61323] Config: (default) pch_external_checksum = false
[2024-01-07T20:12:09.531791 61323] Config: (default) prefix_command = 
[2024-01-07T20:12:09.531791 61323] Config: (default) prefix_command_cpp = 
[2024-01-07T20:12:09.531791 61323] Config: (default) read_only = false
[2024-01-07T20:12:09.531791 61323] Config: (default) read_only_direct = false
[2024-01-07T20:12:09.531791 61323] Config: (default) recache = false
[2024-01-07T20:12:09.531791 61323] Config: (default) reshare = false
[2024-01-07T20:12:09.531791 61323] Config: (default) run_second_cpp = true
[2024-01-07T20:12:09.531791 61323] Config: (default) secondary_storage = 
[2024-01-07T20:12:09.531791 61323] Config: (default) sloppiness = 
[2024-01-07T20:12:09.531791 61323] Config: (default) stats = true
[2024-01-07T20:12:09.531791 61323] Config: (default) stats_log = 
[2024-01-07T20:12:09.531791 61323] Config: (default) temporary_dir = /run/user/1000/ccache-tmp
[2024-01-07T20:12:09.531791 61323] Config: (default) umask = 
[2024-01-07T20:12:09.531941 61323] Command line: /usr/bin/ccache /usr/bin/gcc -o static_src/InspectPatcher.o -c -flto -fuse-linker-plugin -fno-fat-lto-objects -std=c11 -fvisibility=hidden -fwrapv -pipe -fpartial-inlining -ftrack-macro-expansion=0 -Wno-deprecated-declarations -fno-var-tracking -Wno-misleading-indentation -fcompare-debug-second -O2 -D__NUITKA_NO_ASSERT__ -DPy_NO_ENABLE_SHARED -D_NUITKA_STATIC_LIBPYTHON -D_NUITKA_USE_UNEXPOSED_API -D_NUITKA_CONSTANTS_FROM_LINKER -D_NUITKA_FROZEN=0 -D_NUITKA_EXE -I/usr/include/python3.10 -I. -I/usr/lib/python3/dist-packages/nuitka/build/include -I/usr/lib/python3/dist-packages/nuitka/build/static_src static_src/InspectPatcher.c
[2024-01-07T20:12:09.531982 61323] Hostname: azk12-MacBookAir
[2024-01-07T20:12:09.531993 61323] Working directory: /Users/azk12/Documents/nebios-system-apps/Welcome Screen/nebide-welcome-screen.build
[2024-01-07T20:12:09.532003 61323] Compiler type: gcc
[2024-01-07T20:12:09.532190 61323] Source file: static_src/InspectPatcher.c
[2024-01-07T20:12:09.532206 61323] Object file: static_src/InspectPatcher.o
[2024-01-07T20:12:09.532238 61323] Trying direct lookup
[2024-01-07T20:12:09.532392 61323] Retrieved 5c6333mkb1gp00h2q7gqupch6rg4b13ai from primary storage (/Users/azk12/.cache/Nuitka/ccache/5/c/6333mkb1gp00h2q7gqupch6rg4b13aiM)
[2024-01-07T20:12:09.532423 61323] Looking for result key in /Users/azk12/.cache/Nuitka/ccache/5/c/6333mkb1gp00h2q7gqupch6rg4b13aiM
[2024-01-07T20:12:09.541360 61323] Got result key from manifest
[2024-01-07T20:12:09.541457 61323] Retrieved ebfdgbgv9j57un20julmq236shqcl7v3s from primary storage (/Users/azk12/.cache/Nuitka/ccache/e/b/fdgbgv9j57un20julmq236shqcl7v3sR)
[2024-01-07T20:12:09.541488 61323] Reading result /Users/azk12/.cache/Nuitka/ccache/e/b/fdgbgv9j57un20julmq236shqcl7v3sR
[2024-01-07T20:12:09.542298 61323] Reading embedded entry #0 .o (44664 bytes)
[2024-01-07T20:12:09.542327 61323] Writing to static_src/InspectPatcher.o
[2024-01-07T20:12:09.542467 61323] Succeeded getting cached result
[2024-01-07T20:12:09.542497 61323] Result: direct_cache_hit
[2024-01-07T20:12:09.542510 61323] Result: primary_storage_hit
[2024-01-07T20:12:09.542584 61323] lockfile_acquire: symlink /Users/azk12/.cache/Nuitka/ccache/8/b/stats.lock: No such file or directory
[2024-01-07T20:12:09.542668 61323] Acquired lock /Users/azk12/.cache/Nuitka/ccache/8/b/stats.lock
[2024-01-07T20:12:09.542923 61323] Releasing lock /Users/azk12/.cache/Nuitka/ccache/8/b/stats.lock
[2024-01-07T20:12:09.542979 61323] Unlink /Users/azk12/.cache/Nuitka/ccache/8/b/stats.lock
[2024-01-07T20:12:09.557089 61326] === CCACHE 4.5.1 STARTED =========================================
[2024-01-07T20:12:09.557089 61326] Config: (default) absolute_paths_in_stderr = false
[2024-01-07T20:12:09.557089 61326] Config: (default) base_dir = 
[2024-01-07T20:12:09.557089 61326] Config: (environment) cache_dir = /Users/azk12/.cache/Nuitka/ccache
[2024-01-07T20:12:09.557089 61326] Config: (default) compiler = 
[2024-01-07T20:12:09.557089 61326] Config: (default) compiler_check = mtime
[2024-01-07T20:12:09.557089 61326] Config: (default) compiler_type = auto
[2024-01-07T20:12:09.557089 61326] Config: (default) compression = true
[2024-01-07T20:12:09.557089 61326] Config: (default) compression_level = 0
[2024-01-07T20:12:09.557089 61326] Config: (default) cpp_extension = 
[2024-01-07T20:12:09.557089 61326] Config: (default) debug = false
[2024-01-07T20:12:09.557089 61326] Config: (default) debug_dir = 
[2024-01-07T20:12:09.557089 61326] Config: (default) depend_mode = false
[2024-01-07T20:12:09.557089 61326] Config: (default) direct_mode = true
[2024-01-07T20:12:09.557089 61326] Config: (default) disable = false
[2024-01-07T20:12:09.557089 61326] Config: (default) extra_files_to_hash = 
[2024-01-07T20:12:09.557089 61326] Config: (default) file_clone = false
[2024-01-07T20:12:09.557089 61326] Config: (default) hard_link = false
[2024-01-07T20:12:09.557089 61326] Config: (default) hash_dir = true
[2024-01-07T20:12:09.557089 61326] Config: (default) ignore_headers_in_manifest = 
[2024-01-07T20:12:09.557089 61326] Config: (default) ignore_options = 
[2024-01-07T20:12:09.557089 61326] Config: (default) inode_cache = false
[2024-01-07T20:12:09.557089 61326] Config: (default) keep_comments_cpp = false
[2024-01-07T20:12:09.557089 61326] Config: (default) limit_multiple = 0.8
[2024-01-07T20:12:09.557089 61326] Config: (environment) log_file = /Users/azk12/Documents/nebios-system-apps/Welcome Screen/nebide-welcome-screen.build/ccache-61277.txt
[2024-01-07T20:12:09.557089 61326] Config: (default) max_files = 0
[2024-01-07T20:12:09.557089 61326] Config: (default) max_size = 5.0G
[2024-01-07T20:12:09.557089 61326] Config: (default) namespace = 
[2024-01-07T20:12:09.557089 61326] Config: (default) path = 
[2024-01-07T20:12:09.557089 61326] Config: (default) pch_external_checksum = false
[2024-01-07T20:12:09.557089 61326] Config: (default) prefix_command = 
[2024-01-07T20:12:09.557089 61326] Config: (default) prefix_command_cpp = 
[2024-01-07T20:12:09.557089 61326] Config: (default) read_only = false
[2024-01-07T20:12:09.557089 61326] Config: (default) read_only_direct = false
[2024-01-07T20:12:09.557089 61326] Config: (default) recache = false
[2024-01-07T20:12:09.557089 61326] Config: (default) reshare = false
[2024-01-07T20:12:09.557089 61326] Config: (default) run_second_cpp = true
[2024-01-07T20:12:09.557089 61326] Config: (default) secondary_storage = 
[2024-01-07T20:12:09.557089 61326] Config: (default) sloppiness = 
[2024-01-07T20:12:09.557089 61326] Config: (default) stats = true
[2024-01-07T20:12:09.557089 61326] Config: (default) stats_log = 
[2024-01-07T20:12:09.557089 61326] Config: (default) temporary_dir = /run/user/1000/ccache-tmp
[2024-01-07T20:12:09.557089 61326] Config: (default) umask = 
[2024-01-07T20:12:09.557214 61326] Command line: /usr/bin/ccache /usr/bin/gcc -o static_src/MetaPathBasedLoader.o -c -flto -fuse-linker-plugin -fno-fat-lto-objects -std=c11 -fvisibility=hidden -fwrapv -pipe -fpartial-inlining -ftrack-macro-expansion=0 -Wno-deprecated-declarations -fno-var-tracking -Wno-misleading-indentation -fcompare-debug-second -O2 -D__NUITKA_NO_ASSERT__ -DPy_NO_ENABLE_SHARED -D_NUITKA_STATIC_LIBPYTHON -D_NUITKA_USE_UNEXPOSED_API -D_NUITKA_CONSTANTS_FROM_LINKER -D_NUITKA_FROZEN=0 -D_NUITKA_EXE -I/usr/include/python3.10 -I. -I/usr/lib/python3/dist-packages/nuitka/build/include -I/usr/lib/python3/dist-packages/nuitka/build/static_src static_src/MetaPathBasedLoader.c
[2024-01-07T20:12:09.557258 61326] Hostname: azk12-MacBookAir
[2024-01-07T20:12:09.557269 61326] Working directory: /Users/azk12/Documents/nebios-system-apps/Welcome Screen/nebide-welcome-screen.build
[2024-01-07T20:12:09.557277 61326] Compiler type: gcc
[2024-01-07T20:12:09.557438 61326] Source file: static_src/MetaPathBasedLoader.c
[2024-01-07T20:12:09.557453 61326] Object file: static_src/MetaPathBasedLoader.o
[2024-01-07T20:12:09.557484 61326] Trying direct lookup
[2024-01-07T20:12:09.557744 61326] Retrieved d1c1rl5lqr2dia6lok9jj3h3nuj4818e0 from primary storage (/Users/azk12/.cache/Nuitka/ccache/d/1/c1rl5lqr2dia6lok9jj3h3nuj4818e0M)
[2024-01-07T20:12:09.557777 61326] Looking for result key in /Users/azk12/.cache/Nuitka/ccache/d/1/c1rl5lqr2dia6lok9jj3h3nuj4818e0M
[2024-01-07T20:12:09.568104 61326] Got result key from manifest
[2024-01-07T20:12:09.568211 61326] Retrieved 3648c01iit189t0jfaa2bbevh08mu5jnq from primary storage (/Users/azk12/.cache/Nuitka/ccache/3/6/48c01iit189t0jfaa2bbevh08mu5jnqR)
[2024-01-07T20:12:09.568239 61326] Reading result /Users/azk12/.cache/Nuitka/ccache/3/6/48c01iit189t0jfaa2bbevh08mu5jnqR
[2024-01-07T20:12:09.569710 61326] Reading embedded entry #0 .o (101616 bytes)
[2024-01-07T20:12:09.569735 61326] Writing to static_src/MetaPathBasedLoader.o
[2024-01-07T20:12:09.569914 61326] Succeeded getting cached result
[2024-01-07T20:12:09.569937 61326] Result: direct_cache_hit
[2024-01-07T20:12:09.569945 61326] Result: primary_storage_hit
[2024-01-07T20:12:09.570011 61326] lockfile_acquire: symlink /Users/azk12/.cache/Nuitka/ccache/8/e/stats.lock: No such file or directory
[2024-01-07T20:12:09.570090 61326] Acquired lock /Users/azk12/.cache/Nuitka/ccache/8/e/stats.lock
[2024-01-07T20:12:09.570387 61326] Releasing lock /Users/azk12/.cache/Nuitka/ccache/8/e/stats.lock
[2024-01-07T20:12:09.570438 61326] Unlink /Users/azk12/.cache/Nuitka/ccache/8/e/stats.lock
[2024-01-07T20:12:09.702676 61301] Using default compression level 1
[2024-01-07T20:12:09.702789 61301] Storing result file module.__main__.o
[2024-01-07T20:12:09.702801 61301] Storing embedded file #0 .o (197328 bytes) from module.__main__.o
[2024-01-07T20:12:09.703779 61301] Stored 63e692mq938g8agi87bpavkl4agb22qeu in primary storage (/Users/azk12/.cache/Nuitka/ccache/6/3/e692mq938g8agi87bpavkl4agb22qeuR)
[2024-01-07T20:12:09.703910 61301] Adding result key to /Users/azk12/.cache/Nuitka/ccache/1/5/b9f6qrnl1rhcln9f38m2uogvh4sohegM
[2024-01-07T20:12:09.704810 61301] Using default compression level 1
[2024-01-07T20:12:09.705447 61301] Stored 15b9f6qrnl1rhcln9f38m2uogvh4soheg in primary storage (/Users/azk12/.cache/Nuitka/ccache/1/5/b9f6qrnl1rhcln9f38m2uogvh4sohegM)
[2024-01-07T20:12:09.705503 61301] Result: cache_miss
[2024-01-07T20:12:09.705510 61301] Result: direct_cache_miss
[2024-01-07T20:12:09.705515 61301] Result: preprocessed_cache_miss
[2024-01-07T20:12:09.705518 61301] Result: primary_storage_miss
[2024-01-07T20:12:09.705560 61301] Acquired lock /Users/azk12/.cache/Nuitka/ccache/1/stats.lock
[2024-01-07T20:12:09.705763 61301] Releasing lock /Users/azk12/.cache/Nuitka/ccache/1/stats.lock
[2024-01-07T20:12:09.705810 61301] Unlink /Users/azk12/.cache/Nuitka/ccache/1/stats.lock
[2024-01-07T20:12:09.705855 61301] Acquired lock /Users/azk12/.cache/Nuitka/ccache/6/stats.lock
[2024-01-07T20:12:09.705951 61301] Releasing lock /Users/azk12/.cache/Nuitka/ccache/6/stats.lock
[2024-01-07T20:12:09.705976 61301] Unlink /Users/azk12/.cache/Nuitka/ccache/6/stats.lock
[2024-01-07T20:12:09.706001 61301] Unlink /run/user/1000/ccache-tmp/tmp.stderr.NIjDfB
[2024-01-07T20:12:09.706011 61301] Unlink /run/user/1000/ccache-tmp/tmp.stdout.DiLZCp
[2024-01-07T20:12:09.706019 61301] Unlink /run/user/1000/ccache-tmp/tmp.cpp_stderr.V85eTV
[2024-01-07T20:12:09.706025 61301] Unlink /run/user/1000/ccache-tmp/tmp.cpp_stdout.83tSCe.i
[2024-01-07T20:12:09.706147 61301] Unlink /run/user/1000/ccache-tmp/tmp.cpp_stdout.83tSCe
