[2024-01-03T00:39:34.977176 15206] === CCACHE 4.5.1 STARTED =========================================
[2024-01-03T00:39:34.977176 15206] Config: (default) absolute_paths_in_stderr = false
[2024-01-03T00:39:34.977176 15206] Config: (default) base_dir = 
[2024-01-03T00:39:34.977176 15206] Config: (environment) cache_dir = /Users/th3s4rp/.cache/Nuitka/ccache
[2024-01-03T00:39:34.977176 15206] Config: (default) compiler = 
[2024-01-03T00:39:34.977176 15206] Config: (default) compiler_check = mtime
[2024-01-03T00:39:34.977176 15206] Config: (default) compiler_type = auto
[2024-01-03T00:39:34.977176 15206] Config: (default) compression = true
[2024-01-03T00:39:34.977176 15206] Config: (default) compression_level = 0
[2024-01-03T00:39:34.977176 15206] Config: (default) cpp_extension = 
[2024-01-03T00:39:34.977176 15206] Config: (default) debug = false
[2024-01-03T00:39:34.977176 15206] Config: (default) debug_dir = 
[2024-01-03T00:39:34.977176 15206] Config: (default) depend_mode = false
[2024-01-03T00:39:34.977176 15206] Config: (default) direct_mode = true
[2024-01-03T00:39:34.977176 15206] Config: (default) disable = false
[2024-01-03T00:39:34.977176 15206] Config: (default) extra_files_to_hash = 
[2024-01-03T00:39:34.977176 15206] Config: (default) file_clone = false
[2024-01-03T00:39:34.977176 15206] Config: (default) hard_link = false
[2024-01-03T00:39:34.977176 15206] Config: (default) hash_dir = true
[2024-01-03T00:39:34.977176 15206] Config: (default) ignore_headers_in_manifest = 
[2024-01-03T00:39:34.977176 15206] Config: (default) ignore_options = 
[2024-01-03T00:39:34.977176 15206] Config: (default) inode_cache = false
[2024-01-03T00:39:34.977176 15206] Config: (default) keep_comments_cpp = false
[2024-01-03T00:39:34.977176 15206] Config: (default) limit_multiple = 0.8
[2024-01-03T00:39:34.977176 15206] Config: (environment) log_file = /media/th3s4rp/ns1/odakProjeler/nebios-system-apps/Kernel_Switcher/Kernel_Switcher.build/ccache-15195.txt
[2024-01-03T00:39:34.977176 15206] Config: (default) max_files = 0
[2024-01-03T00:39:34.977176 15206] Config: (default) max_size = 5.0G
[2024-01-03T00:39:34.977176 15206] Config: (default) namespace = 
[2024-01-03T00:39:34.977176 15206] Config: (default) path = 
[2024-01-03T00:39:34.977176 15206] Config: (default) pch_external_checksum = false
[2024-01-03T00:39:34.977176 15206] Config: (default) prefix_command = 
[2024-01-03T00:39:34.977176 15206] Config: (default) prefix_command_cpp = 
[2024-01-03T00:39:34.977176 15206] Config: (default) read_only = false
[2024-01-03T00:39:34.977176 15206] Config: (default) read_only_direct = false
[2024-01-03T00:39:34.977176 15206] Config: (default) recache = false
[2024-01-03T00:39:34.977176 15206] Config: (default) reshare = false
[2024-01-03T00:39:34.977176 15206] Config: (default) run_second_cpp = true
[2024-01-03T00:39:34.977176 15206] Config: (default) secondary_storage = 
[2024-01-03T00:39:34.977176 15206] Config: (default) sloppiness = 
[2024-01-03T00:39:34.977176 15206] Config: (default) stats = true
[2024-01-03T00:39:34.977176 15206] Config: (default) stats_log = 
[2024-01-03T00:39:34.977176 15206] Config: (default) temporary_dir = /run/user/1000/ccache-tmp
[2024-01-03T00:39:34.977176 15206] Config: (default) umask = 
[2024-01-03T00:39:34.977493 15206] Command line: /usr/bin/ccache /usr/bin/gcc -o __constants.o -c -flto -fuse-linker-plugin -fno-fat-lto-objects -std=c11 -fvisibility=hidden -fwrapv -pipe -fpartial-inlining -ftrack-macro-expansion=0 -Wno-deprecated-declarations -fno-var-tracking -Wno-misleading-indentation -fcompare-debug-second -O2 -D__NUITKA_NO_ASSERT__ -DPy_NO_ENABLE_SHARED -D_NUITKA_STATIC_LIBPYTHON -D_NUITKA_USE_UNEXPOSED_API -D_NUITKA_CONSTANTS_FROM_LINKER -D_NUITKA_FROZEN=0 -D_NUITKA_EXE -I/usr/include/python3.10 -I. -I/usr/lib/python3/dist-packages/nuitka/build/include -I/usr/lib/python3/dist-packages/nuitka/build/static_src __constants.c
[2024-01-03T00:39:34.977539 15206] Hostname: padnther
[2024-01-03T00:39:34.977558 15206] Working directory: /media/th3s4rp/ns1/odakProjeler/nebios-system-apps/Kernel_Switcher/Kernel_Switcher.build
[2024-01-03T00:39:34.977603 15206] Compiler type: gcc
[2024-01-03T00:39:34.977845 15206] Source file: __constants.c
[2024-01-03T00:39:34.977889 15206] Object file: __constants.o
[2024-01-03T00:39:34.977963 15206] Trying direct lookup
[2024-01-03T00:39:34.978274 15206] Retrieved ec1c9f53a5l9aqg90l5pubj21a1or2lmg from primary storage (/Users/th3s4rp/.cache/Nuitka/ccache/e/c/1c9f53a5l9aqg90l5pubj21a1or2lmgM)
[2024-01-03T00:39:34.978388 15206] Looking for result key in /Users/th3s4rp/.cache/Nuitka/ccache/e/c/1c9f53a5l9aqg90l5pubj21a1or2lmgM
[2024-01-03T00:39:35.009172 15206] Got result key from manifest
[2024-01-03T00:39:35.009323 15206] Retrieved fb8ajll7iehjvtm9r9hi644k7clenvnsu from primary storage (/Users/th3s4rp/.cache/Nuitka/ccache/f/b/8ajll7iehjvtm9r9hi644k7clenvnsuR)
[2024-01-03T00:39:35.009408 15206] Reading result /Users/th3s4rp/.cache/Nuitka/ccache/f/b/8ajll7iehjvtm9r9hi644k7clenvnsuR
[2024-01-03T00:39:35.009810 15206] Reading embedded entry #0 .o (14648 bytes)
[2024-01-03T00:39:35.009888 15206] Writing to __constants.o
[2024-01-03T00:39:35.010223 15206] Succeeded getting cached result
[2024-01-03T00:39:35.010286 15206] Result: direct_cache_hit
[2024-01-03T00:39:35.010305 15206] Result: primary_storage_hit
[2024-01-03T00:39:35.010469 15206] lockfile_acquire: symlink /Users/th3s4rp/.cache/Nuitka/ccache/6/6/stats.lock: No such file or directory
[2024-01-03T00:39:35.010799 15206] Acquired lock /Users/th3s4rp/.cache/Nuitka/ccache/6/6/stats.lock
[2024-01-03T00:39:35.011408 15206] Releasing lock /Users/th3s4rp/.cache/Nuitka/ccache/6/6/stats.lock
[2024-01-03T00:39:35.011964 15206] Unlink /Users/th3s4rp/.cache/Nuitka/ccache/6/6/stats.lock
[2024-01-03T00:39:35.012634 15209] === CCACHE 4.5.1 STARTED =========================================
[2024-01-03T00:39:35.012634 15209] Config: (default) absolute_paths_in_stderr = false
[2024-01-03T00:39:35.012634 15209] Config: (default) base_dir = 
[2024-01-03T00:39:35.012634 15209] Config: (environment) cache_dir = /Users/th3s4rp/.cache/Nuitka/ccache
[2024-01-03T00:39:35.012634 15209] Config: (default) compiler = 
[2024-01-03T00:39:35.012634 15209] Config: (default) compiler_check = mtime
[2024-01-03T00:39:35.012634 15209] Config: (default) compiler_type = auto
[2024-01-03T00:39:35.012634 15209] Config: (default) compression = true
[2024-01-03T00:39:35.012634 15209] Config: (default) compression_level = 0
[2024-01-03T00:39:35.012634 15209] Config: (default) cpp_extension = 
[2024-01-03T00:39:35.012634 15209] Config: (default) debug = false
[2024-01-03T00:39:35.012634 15209] Config: (default) debug_dir = 
[2024-01-03T00:39:35.012634 15209] Config: (default) depend_mode = false
[2024-01-03T00:39:35.012634 15209] Config: (default) direct_mode = true
[2024-01-03T00:39:35.012634 15209] Config: (default) disable = false
[2024-01-03T00:39:35.012634 15209] Config: (default) extra_files_to_hash = 
[2024-01-03T00:39:35.012634 15209] Config: (default) file_clone = false
[2024-01-03T00:39:35.012634 15209] Config: (default) hard_link = false
[2024-01-03T00:39:35.012634 15209] Config: (default) hash_dir = true
[2024-01-03T00:39:35.012634 15209] Config: (default) ignore_headers_in_manifest = 
[2024-01-03T00:39:35.012634 15209] Config: (default) ignore_options = 
[2024-01-03T00:39:35.012634 15209] Config: (default) inode_cache = false
[2024-01-03T00:39:35.012634 15209] Config: (default) keep_comments_cpp = false
[2024-01-03T00:39:35.012634 15209] Config: (default) limit_multiple = 0.8
[2024-01-03T00:39:35.012634 15209] Config: (environment) log_file = /media/th3s4rp/ns1/odakProjeler/nebios-system-apps/Kernel_Switcher/Kernel_Switcher.build/ccache-15195.txt
[2024-01-03T00:39:35.012634 15209] Config: (default) max_files = 0
[2024-01-03T00:39:35.012634 15209] Config: (default) max_size = 5.0G
[2024-01-03T00:39:35.012634 15209] Config: (default) namespace = 
[2024-01-03T00:39:35.012634 15209] Config: (default) path = 
[2024-01-03T00:39:35.012634 15209] Config: (default) pch_external_checksum = false
[2024-01-03T00:39:35.012634 15209] Config: (default) prefix_command = 
[2024-01-03T00:39:35.012634 15209] Config: (default) prefix_command_cpp = 
[2024-01-03T00:39:35.012634 15209] Config: (default) read_only = false
[2024-01-03T00:39:35.012634 15209] Config: (default) read_only_direct = false
[2024-01-03T00:39:35.012634 15209] Config: (default) recache = false
[2024-01-03T00:39:35.012634 15209] Config: (default) reshare = false
[2024-01-03T00:39:35.012634 15209] Config: (default) run_second_cpp = true
[2024-01-03T00:39:35.012634 15209] Config: (default) secondary_storage = 
[2024-01-03T00:39:35.012634 15209] Config: (default) sloppiness = 
[2024-01-03T00:39:35.012634 15209] Config: (default) stats = true
[2024-01-03T00:39:35.012634 15209] Config: (default) stats_log = 
[2024-01-03T00:39:35.012634 15209] Config: (default) temporary_dir = /run/user/1000/ccache-tmp
[2024-01-03T00:39:35.012634 15209] Config: (default) umask = 
[2024-01-03T00:39:35.013426 15209] Command line: /usr/bin/ccache /usr/bin/gcc -o __helpers.o -c -flto -fuse-linker-plugin -fno-fat-lto-objects -std=c11 -fvisibility=hidden -fwrapv -pipe -fpartial-inlining -ftrack-macro-expansion=0 -Wno-deprecated-declarations -fno-var-tracking -Wno-misleading-indentation -fcompare-debug-second -O2 -D__NUITKA_NO_ASSERT__ -DPy_NO_ENABLE_SHARED -D_NUITKA_STATIC_LIBPYTHON -D_NUITKA_USE_UNEXPOSED_API -D_NUITKA_CONSTANTS_FROM_LINKER -D_NUITKA_FROZEN=0 -D_NUITKA_EXE -I/usr/include/python3.10 -I. -I/usr/lib/python3/dist-packages/nuitka/build/include -I/usr/lib/python3/dist-packages/nuitka/build/static_src __helpers.c
[2024-01-03T00:39:35.013524 15209] Hostname: padnther
[2024-01-03T00:39:35.013543 15209] Working directory: /media/th3s4rp/ns1/odakProjeler/nebios-system-apps/Kernel_Switcher/Kernel_Switcher.build
[2024-01-03T00:39:35.013561 15209] Compiler type: gcc
[2024-01-03T00:39:35.013787 15209] Source file: __helpers.c
[2024-01-03T00:39:35.013812 15209] Object file: __helpers.o
[2024-01-03T00:39:35.013878 15209] Trying direct lookup
[2024-01-03T00:39:35.014046 15209] Retrieved 32c3pa041uhl00l9mruopjnrq38ahaqvu from primary storage (/Users/th3s4rp/.cache/Nuitka/ccache/3/2/c3pa041uhl00l9mruopjnrq38ahaqvuM)
[2024-01-03T00:39:35.014114 15209] Looking for result key in /Users/th3s4rp/.cache/Nuitka/ccache/3/2/c3pa041uhl00l9mruopjnrq38ahaqvuM
[2024-01-03T00:39:35.036984 15212] === CCACHE 4.5.1 STARTED =========================================
[2024-01-03T00:39:35.036984 15212] Config: (default) absolute_paths_in_stderr = false
[2024-01-03T00:39:35.036984 15212] Config: (default) base_dir = 
[2024-01-03T00:39:35.036984 15212] Config: (environment) cache_dir = /Users/th3s4rp/.cache/Nuitka/ccache
[2024-01-03T00:39:35.036984 15212] Config: (default) compiler = 
[2024-01-03T00:39:35.036984 15212] Config: (default) compiler_check = mtime
[2024-01-03T00:39:35.036984 15212] Config: (default) compiler_type = auto
[2024-01-03T00:39:35.036984 15212] Config: (default) compression = true
[2024-01-03T00:39:35.036984 15212] Config: (default) compression_level = 0
[2024-01-03T00:39:35.036984 15212] Config: (default) cpp_extension = 
[2024-01-03T00:39:35.036984 15212] Config: (default) debug = false
[2024-01-03T00:39:35.036984 15212] Config: (default) debug_dir = 
[2024-01-03T00:39:35.036984 15212] Config: (default) depend_mode = false
[2024-01-03T00:39:35.036984 15212] Config: (default) direct_mode = true
[2024-01-03T00:39:35.036984 15212] Config: (default) disable = false
[2024-01-03T00:39:35.036984 15212] Config: (default) extra_files_to_hash = 
[2024-01-03T00:39:35.036984 15212] Config: (default) file_clone = false
[2024-01-03T00:39:35.036984 15212] Config: (default) hard_link = false
[2024-01-03T00:39:35.036984 15212] Config: (default) hash_dir = true
[2024-01-03T00:39:35.036984 15212] Config: (default) ignore_headers_in_manifest = 
[2024-01-03T00:39:35.036984 15212] Config: (default) ignore_options = 
[2024-01-03T00:39:35.036984 15212] Config: (default) inode_cache = false
[2024-01-03T00:39:35.036984 15212] Config: (default) keep_comments_cpp = false
[2024-01-03T00:39:35.036984 15212] Config: (default) limit_multiple = 0.8
[2024-01-03T00:39:35.036984 15212] Config: (environment) log_file = /media/th3s4rp/ns1/odakProjeler/nebios-system-apps/Kernel_Switcher/Kernel_Switcher.build/ccache-15195.txt
[2024-01-03T00:39:35.036984 15212] Config: (default) max_files = 0
[2024-01-03T00:39:35.036984 15212] Config: (default) max_size = 5.0G
[2024-01-03T00:39:35.036984 15212] Config: (default) namespace = 
[2024-01-03T00:39:35.036984 15212] Config: (default) path = 
[2024-01-03T00:39:35.036984 15212] Config: (default) pch_external_checksum = false
[2024-01-03T00:39:35.036984 15212] Config: (default) prefix_command = 
[2024-01-03T00:39:35.036984 15212] Config: (default) prefix_command_cpp = 
[2024-01-03T00:39:35.036984 15212] Config: (default) read_only = false
[2024-01-03T00:39:35.036984 15212] Config: (default) read_only_direct = false
[2024-01-03T00:39:35.036984 15212] Config: (default) recache = false
[2024-01-03T00:39:35.036984 15212] Config: (default) reshare = false
[2024-01-03T00:39:35.036984 15212] Config: (default) run_second_cpp = true
[2024-01-03T00:39:35.036984 15212] Config: (default) secondary_storage = 
[2024-01-03T00:39:35.036984 15212] Config: (default) sloppiness = 
[2024-01-03T00:39:35.036984 15212] Config: (default) stats = true
[2024-01-03T00:39:35.036984 15212] Config: (default) stats_log = 
[2024-01-03T00:39:35.036984 15212] Config: (default) temporary_dir = /run/user/1000/ccache-tmp
[2024-01-03T00:39:35.036984 15212] Config: (default) umask = 
[2024-01-03T00:39:35.037235 15212] Command line: /usr/bin/ccache /usr/bin/gcc -o __loader.o -c -flto -fuse-linker-plugin -fno-fat-lto-objects -std=c11 -fvisibility=hidden -fwrapv -pipe -fpartial-inlining -ftrack-macro-expansion=0 -Wno-deprecated-declarations -fno-var-tracking -Wno-misleading-indentation -fcompare-debug-second -O2 -D__NUITKA_NO_ASSERT__ -DPy_NO_ENABLE_SHARED -D_NUITKA_STATIC_LIBPYTHON -D_NUITKA_USE_UNEXPOSED_API -D_NUITKA_CONSTANTS_FROM_LINKER -D_NUITKA_FROZEN=0 -D_NUITKA_EXE -I/usr/include/python3.10 -I. -I/usr/lib/python3/dist-packages/nuitka/build/include -I/usr/lib/python3/dist-packages/nuitka/build/static_src __loader.c
[2024-01-03T00:39:35.037297 15212] Hostname: padnther
[2024-01-03T00:39:35.037315 15212] Working directory: /media/th3s4rp/ns1/odakProjeler/nebios-system-apps/Kernel_Switcher/Kernel_Switcher.build
[2024-01-03T00:39:35.037333 15212] Compiler type: gcc
[2024-01-03T00:39:35.037549 15212] Source file: __loader.c
[2024-01-03T00:39:35.037576 15212] Object file: __loader.o
[2024-01-03T00:39:35.037636 15212] Trying direct lookup
[2024-01-03T00:39:35.037910 15212] Retrieved ec7894ijb7na35rheasn9ktmesp9nmt1i from primary storage (/Users/th3s4rp/.cache/Nuitka/ccache/e/c/7894ijb7na35rheasn9ktmesp9nmt1iM)
[2024-01-03T00:39:35.037998 15212] Looking for result key in /Users/th3s4rp/.cache/Nuitka/ccache/e/c/7894ijb7na35rheasn9ktmesp9nmt1iM
[2024-01-03T00:39:35.043559 15209] Got result key from manifest
[2024-01-03T00:39:35.043692 15209] Retrieved 69c6cn61j934cbk6g1foijemlhlcimht0 from primary storage (/Users/th3s4rp/.cache/Nuitka/ccache/6/9/c6cn61j934cbk6g1foijemlhlcimht0R)
[2024-01-03T00:39:35.043758 15209] Reading result /Users/th3s4rp/.cache/Nuitka/ccache/6/9/c6cn61j934cbk6g1foijemlhlcimht0R
[2024-01-03T00:39:35.044111 15209] Reading embedded entry #0 .o (3176 bytes)
[2024-01-03T00:39:35.044177 15209] Writing to __helpers.o
[2024-01-03T00:39:35.044407 15209] Succeeded getting cached result
[2024-01-03T00:39:35.044461 15209] Result: direct_cache_hit
[2024-01-03T00:39:35.044481 15209] Result: primary_storage_hit
[2024-01-03T00:39:35.044742 15209] Acquired lock /Users/th3s4rp/.cache/Nuitka/ccache/6/9/stats.lock
[2024-01-03T00:39:35.045337 15209] Releasing lock /Users/th3s4rp/.cache/Nuitka/ccache/6/9/stats.lock
[2024-01-03T00:39:35.045448 15209] Unlink /Users/th3s4rp/.cache/Nuitka/ccache/6/9/stats.lock
[2024-01-03T00:39:35.061392 15212] Got result key from manifest
[2024-01-03T00:39:35.061528 15212] Retrieved a103p9po1evvtcgidnbu81912cq4j3740 from primary storage (/Users/th3s4rp/.cache/Nuitka/ccache/a/1/03p9po1evvtcgidnbu81912cq4j3740R)
[2024-01-03T00:39:35.061596 15212] Reading result /Users/th3s4rp/.cache/Nuitka/ccache/a/1/03p9po1evvtcgidnbu81912cq4j3740R
[2024-01-03T00:39:35.061956 15212] Reading embedded entry #0 .o (9616 bytes)
[2024-01-03T00:39:35.062009 15212] Writing to __loader.o
[2024-01-03T00:39:35.062284 15212] Succeeded getting cached result
[2024-01-03T00:39:35.062333 15212] Result: direct_cache_hit
[2024-01-03T00:39:35.062351 15212] Result: primary_storage_hit
[2024-01-03T00:39:35.062528 15212] Acquired lock /Users/th3s4rp/.cache/Nuitka/ccache/6/c/stats.lock
[2024-01-03T00:39:35.063227 15212] Releasing lock /Users/th3s4rp/.cache/Nuitka/ccache/6/c/stats.lock
[2024-01-03T00:39:35.063323 15212] Unlink /Users/th3s4rp/.cache/Nuitka/ccache/6/c/stats.lock
[2024-01-03T00:39:35.088335 15215] === CCACHE 4.5.1 STARTED =========================================
[2024-01-03T00:39:35.088335 15215] Config: (default) absolute_paths_in_stderr = false
[2024-01-03T00:39:35.088335 15215] Config: (default) base_dir = 
[2024-01-03T00:39:35.088335 15215] Config: (environment) cache_dir = /Users/th3s4rp/.cache/Nuitka/ccache
[2024-01-03T00:39:35.088335 15215] Config: (default) compiler = 
[2024-01-03T00:39:35.088335 15215] Config: (default) compiler_check = mtime
[2024-01-03T00:39:35.088335 15215] Config: (default) compiler_type = auto
[2024-01-03T00:39:35.088335 15215] Config: (default) compression = true
[2024-01-03T00:39:35.088335 15215] Config: (default) compression_level = 0
[2024-01-03T00:39:35.088335 15215] Config: (default) cpp_extension = 
[2024-01-03T00:39:35.088335 15215] Config: (default) debug = false
[2024-01-03T00:39:35.088335 15215] Config: (default) debug_dir = 
[2024-01-03T00:39:35.088335 15215] Config: (default) depend_mode = false
[2024-01-03T00:39:35.088335 15215] Config: (default) direct_mode = true
[2024-01-03T00:39:35.088335 15215] Config: (default) disable = false
[2024-01-03T00:39:35.088335 15215] Config: (default) extra_files_to_hash = 
[2024-01-03T00:39:35.088335 15215] Config: (default) file_clone = false
[2024-01-03T00:39:35.088335 15215] Config: (default) hard_link = false
[2024-01-03T00:39:35.088335 15215] Config: (default) hash_dir = true
[2024-01-03T00:39:35.088335 15215] Config: (default) ignore_headers_in_manifest = 
[2024-01-03T00:39:35.088335 15215] Config: (default) ignore_options = 
[2024-01-03T00:39:35.088335 15215] Config: (default) inode_cache = false
[2024-01-03T00:39:35.088335 15215] Config: (default) keep_comments_cpp = false
[2024-01-03T00:39:35.088335 15215] Config: (default) limit_multiple = 0.8
[2024-01-03T00:39:35.088335 15215] Config: (environment) log_file = /media/th3s4rp/ns1/odakProjeler/nebios-system-apps/Kernel_Switcher/Kernel_Switcher.build/ccache-15195.txt
[2024-01-03T00:39:35.088335 15215] Config: (default) max_files = 0
[2024-01-03T00:39:35.088335 15215] Config: (default) max_size = 5.0G
[2024-01-03T00:39:35.088335 15215] Config: (default) namespace = 
[2024-01-03T00:39:35.088335 15215] Config: (default) path = 
[2024-01-03T00:39:35.088335 15215] Config: (default) pch_external_checksum = false
[2024-01-03T00:39:35.088335 15215] Config: (default) prefix_command = 
[2024-01-03T00:39:35.088335 15215] Config: (default) prefix_command_cpp = 
[2024-01-03T00:39:35.088335 15215] Config: (default) read_only = false
[2024-01-03T00:39:35.088335 15215] Config: (default) read_only_direct = false
[2024-01-03T00:39:35.088335 15215] Config: (default) recache = false
[2024-01-03T00:39:35.088335 15215] Config: (default) reshare = false
[2024-01-03T00:39:35.088335 15215] Config: (default) run_second_cpp = true
[2024-01-03T00:39:35.088335 15215] Config: (default) secondary_storage = 
[2024-01-03T00:39:35.088335 15215] Config: (default) sloppiness = 
[2024-01-03T00:39:35.088335 15215] Config: (default) stats = true
[2024-01-03T00:39:35.088335 15215] Config: (default) stats_log = 
[2024-01-03T00:39:35.088335 15215] Config: (default) temporary_dir = /run/user/1000/ccache-tmp
[2024-01-03T00:39:35.088335 15215] Config: (default) umask = 
[2024-01-03T00:39:35.088624 15215] Command line: /usr/bin/ccache /usr/bin/gcc -o module.__main__.o -c -flto -fuse-linker-plugin -fno-fat-lto-objects -std=c11 -fvisibility=hidden -fwrapv -pipe -fpartial-inlining -ftrack-macro-expansion=0 -Wno-deprecated-declarations -fno-var-tracking -Wno-misleading-indentation -fcompare-debug-second -O2 -D__NUITKA_NO_ASSERT__ -DPy_NO_ENABLE_SHARED -D_NUITKA_STATIC_LIBPYTHON -D_NUITKA_USE_UNEXPOSED_API -D_NUITKA_CONSTANTS_FROM_LINKER -D_NUITKA_FROZEN=0 -D_NUITKA_EXE -I/usr/include/python3.10 -I. -I/usr/lib/python3/dist-packages/nuitka/build/include -I/usr/lib/python3/dist-packages/nuitka/build/static_src module.__main__.c
[2024-01-03T00:39:35.088704 15215] Hostname: padnther
[2024-01-03T00:39:35.088726 15215] Working directory: /media/th3s4rp/ns1/odakProjeler/nebios-system-apps/Kernel_Switcher/Kernel_Switcher.build
[2024-01-03T00:39:35.088747 15215] Compiler type: gcc
[2024-01-03T00:39:35.089012 15215] Source file: module.__main__.c
[2024-01-03T00:39:35.089045 15215] Object file: module.__main__.o
[2024-01-03T00:39:35.089126 15215] Trying direct lookup
[2024-01-03T00:39:35.091408 15215] Retrieved e834dulgg1gbn4vlrn4etjom2hkpbkmg6 from primary storage (/Users/th3s4rp/.cache/Nuitka/ccache/e/8/34dulgg1gbn4vlrn4etjom2hkpbkmg6M)
[2024-01-03T00:39:35.091579 15215] Looking for result key in /Users/th3s4rp/.cache/Nuitka/ccache/e/8/34dulgg1gbn4vlrn4etjom2hkpbkmg6M
[2024-01-03T00:39:35.121103 15215] Got result key from manifest
[2024-01-03T00:39:35.121222 15215] Retrieved 7ca4atmrihnr5epr6ovdrt6a0vemleh8u from primary storage (/Users/th3s4rp/.cache/Nuitka/ccache/7/c/a4atmrihnr5epr6ovdrt6a0vemleh8uR)
[2024-01-03T00:39:35.121279 15215] Reading result /Users/th3s4rp/.cache/Nuitka/ccache/7/c/a4atmrihnr5epr6ovdrt6a0vemleh8uR
[2024-01-03T00:39:35.121710 15215] Reading embedded entry #0 .o (214552 bytes)
[2024-01-03T00:39:35.121751 15215] Writing to module.__main__.o
[2024-01-03T00:39:35.124036 15215] Succeeded getting cached result
[2024-01-03T00:39:35.124127 15215] Result: direct_cache_hit
[2024-01-03T00:39:35.124149 15215] Result: primary_storage_hit
[2024-01-03T00:39:35.124302 15215] lockfile_acquire: symlink /Users/th3s4rp/.cache/Nuitka/ccache/6/f/stats.lock: No such file or directory
[2024-01-03T00:39:35.124603 15215] Acquired lock /Users/th3s4rp/.cache/Nuitka/ccache/6/f/stats.lock
[2024-01-03T00:39:35.125072 15215] Releasing lock /Users/th3s4rp/.cache/Nuitka/ccache/6/f/stats.lock
[2024-01-03T00:39:35.125158 15215] Unlink /Users/th3s4rp/.cache/Nuitka/ccache/6/f/stats.lock
[2024-01-03T00:39:35.131034 15218] === CCACHE 4.5.1 STARTED =========================================
[2024-01-03T00:39:35.131034 15218] Config: (default) absolute_paths_in_stderr = false
[2024-01-03T00:39:35.131034 15218] Config: (default) base_dir = 
[2024-01-03T00:39:35.131034 15218] Config: (environment) cache_dir = /Users/th3s4rp/.cache/Nuitka/ccache
[2024-01-03T00:39:35.131034 15218] Config: (default) compiler = 
[2024-01-03T00:39:35.131034 15218] Config: (default) compiler_check = mtime
[2024-01-03T00:39:35.131034 15218] Config: (default) compiler_type = auto
[2024-01-03T00:39:35.131034 15218] Config: (default) compression = true
[2024-01-03T00:39:35.131034 15218] Config: (default) compression_level = 0
[2024-01-03T00:39:35.131034 15218] Config: (default) cpp_extension = 
[2024-01-03T00:39:35.131034 15218] Config: (default) debug = false
[2024-01-03T00:39:35.131034 15218] Config: (default) debug_dir = 
[2024-01-03T00:39:35.131034 15218] Config: (default) depend_mode = false
[2024-01-03T00:39:35.131034 15218] Config: (default) direct_mode = true
[2024-01-03T00:39:35.131034 15218] Config: (default) disable = false
[2024-01-03T00:39:35.131034 15218] Config: (default) extra_files_to_hash = 
[2024-01-03T00:39:35.131034 15218] Config: (default) file_clone = false
[2024-01-03T00:39:35.131034 15218] Config: (default) hard_link = false
[2024-01-03T00:39:35.131034 15218] Config: (default) hash_dir = true
[2024-01-03T00:39:35.131034 15218] Config: (default) ignore_headers_in_manifest = 
[2024-01-03T00:39:35.131034 15218] Config: (default) ignore_options = 
[2024-01-03T00:39:35.131034 15218] Config: (default) inode_cache = false
[2024-01-03T00:39:35.131034 15218] Config: (default) keep_comments_cpp = false
[2024-01-03T00:39:35.131034 15218] Config: (default) limit_multiple = 0.8
[2024-01-03T00:39:35.131034 15218] Config: (environment) log_file = /media/th3s4rp/ns1/odakProjeler/nebios-system-apps/Kernel_Switcher/Kernel_Switcher.build/ccache-15195.txt
[2024-01-03T00:39:35.131034 15218] Config: (default) max_files = 0
[2024-01-03T00:39:35.131034 15218] Config: (default) max_size = 5.0G
[2024-01-03T00:39:35.131034 15218] Config: (default) namespace = 
[2024-01-03T00:39:35.131034 15218] Config: (default) path = 
[2024-01-03T00:39:35.131034 15218] Config: (default) pch_external_checksum = false
[2024-01-03T00:39:35.131034 15218] Config: (default) prefix_command = 
[2024-01-03T00:39:35.131034 15218] Config: (default) prefix_command_cpp = 
[2024-01-03T00:39:35.131034 15218] Config: (default) read_only = false
[2024-01-03T00:39:35.131034 15218] Config: (default) read_only_direct = false
[2024-01-03T00:39:35.131034 15218] Config: (default) recache = false
[2024-01-03T00:39:35.131034 15218] Config: (default) reshare = false
[2024-01-03T00:39:35.131034 15218] Config: (default) run_second_cpp = true
[2024-01-03T00:39:35.131034 15218] Config: (default) secondary_storage = 
[2024-01-03T00:39:35.131034 15218] Config: (default) sloppiness = 
[2024-01-03T00:39:35.131034 15218] Config: (default) stats = true
[2024-01-03T00:39:35.131034 15218] Config: (default) stats_log = 
[2024-01-03T00:39:35.131034 15218] Config: (default) temporary_dir = /run/user/1000/ccache-tmp
[2024-01-03T00:39:35.131034 15218] Config: (default) umask = 
[2024-01-03T00:39:35.131306 15218] Command line: /usr/bin/ccache /usr/bin/gcc -o static_src/MainProgram.o -c -flto -fuse-linker-plugin -fno-fat-lto-objects -std=c11 -fvisibility=hidden -fwrapv -pipe -fpartial-inlining -ftrack-macro-expansion=0 -Wno-deprecated-declarations -fno-var-tracking -Wno-misleading-indentation -fcompare-debug-second -O2 -D__NUITKA_NO_ASSERT__ -DPy_NO_ENABLE_SHARED -D_NUITKA_STATIC_LIBPYTHON -D_NUITKA_USE_UNEXPOSED_API -D_NUITKA_CONSTANTS_FROM_LINKER -D_NUITKA_FROZEN=0 -D_NUITKA_EXE -I/usr/include/python3.10 -I. -I/usr/lib/python3/dist-packages/nuitka/build/include -I/usr/lib/python3/dist-packages/nuitka/build/static_src static_src/MainProgram.c
[2024-01-03T00:39:35.131378 15218] Hostname: padnther
[2024-01-03T00:39:35.131397 15218] Working directory: /media/th3s4rp/ns1/odakProjeler/nebios-system-apps/Kernel_Switcher/Kernel_Switcher.build
[2024-01-03T00:39:35.131414 15218] Compiler type: gcc
[2024-01-03T00:39:35.131745 15218] Source file: static_src/MainProgram.c
[2024-01-03T00:39:35.131779 15218] Object file: static_src/MainProgram.o
[2024-01-03T00:39:35.131853 15218] Trying direct lookup
[2024-01-03T00:39:35.132317 15218] Retrieved bcaasi0ubrdc5qbng8oreb05fb1g4hofs from primary storage (/Users/th3s4rp/.cache/Nuitka/ccache/b/c/aasi0ubrdc5qbng8oreb05fb1g4hofsM)
[2024-01-03T00:39:35.132410 15218] Looking for result key in /Users/th3s4rp/.cache/Nuitka/ccache/b/c/aasi0ubrdc5qbng8oreb05fb1g4hofsM
[2024-01-03T00:39:35.164806 15218] Got result key from manifest
[2024-01-03T00:39:35.165221 15218] Retrieved 6525tt7cv9fs5f5855mo7n5gng2jt5jr8 from primary storage (/Users/th3s4rp/.cache/Nuitka/ccache/6/5/25tt7cv9fs5f5855mo7n5gng2jt5jr8R)
[2024-01-03T00:39:35.165352 15218] Reading result /Users/th3s4rp/.cache/Nuitka/ccache/6/5/25tt7cv9fs5f5855mo7n5gng2jt5jr8R
[2024-01-03T00:39:35.166149 15218] Reading embedded entry #0 .o (28976 bytes)
[2024-01-03T00:39:35.166348 15218] Writing to static_src/MainProgram.o
[2024-01-03T00:39:35.167139 15218] Succeeded getting cached result
[2024-01-03T00:39:35.167299 15218] Result: direct_cache_hit
[2024-01-03T00:39:35.167327 15218] Result: primary_storage_hit
[2024-01-03T00:39:35.167749 15218] lockfile_acquire: symlink /Users/th3s4rp/.cache/Nuitka/ccache/7/2/stats.lock: No such file or directory
[2024-01-03T00:39:35.168788 15218] Acquired lock /Users/th3s4rp/.cache/Nuitka/ccache/7/2/stats.lock
[2024-01-03T00:39:35.169111 15221] === CCACHE 4.5.1 STARTED =========================================
[2024-01-03T00:39:35.169111 15221] Config: (default) absolute_paths_in_stderr = false
[2024-01-03T00:39:35.169111 15221] Config: (default) base_dir = 
[2024-01-03T00:39:35.169111 15221] Config: (environment) cache_dir = /Users/th3s4rp/.cache/Nuitka/ccache
[2024-01-03T00:39:35.169111 15221] Config: (default) compiler = 
[2024-01-03T00:39:35.169111 15221] Config: (default) compiler_check = mtime
[2024-01-03T00:39:35.169111 15221] Config: (default) compiler_type = auto
[2024-01-03T00:39:35.169111 15221] Config: (default) compression = true
[2024-01-03T00:39:35.169111 15221] Config: (default) compression_level = 0
[2024-01-03T00:39:35.169111 15221] Config: (default) cpp_extension = 
[2024-01-03T00:39:35.169111 15221] Config: (default) debug = false
[2024-01-03T00:39:35.169111 15221] Config: (default) debug_dir = 
[2024-01-03T00:39:35.169111 15221] Config: (default) depend_mode = false
[2024-01-03T00:39:35.169111 15221] Config: (default) direct_mode = true
[2024-01-03T00:39:35.169111 15221] Config: (default) disable = false
[2024-01-03T00:39:35.169111 15221] Config: (default) extra_files_to_hash = 
[2024-01-03T00:39:35.169111 15221] Config: (default) file_clone = false
[2024-01-03T00:39:35.169111 15221] Config: (default) hard_link = false
[2024-01-03T00:39:35.169111 15221] Config: (default) hash_dir = true
[2024-01-03T00:39:35.169111 15221] Config: (default) ignore_headers_in_manifest = 
[2024-01-03T00:39:35.169111 15221] Config: (default) ignore_options = 
[2024-01-03T00:39:35.169111 15221] Config: (default) inode_cache = false
[2024-01-03T00:39:35.169111 15221] Config: (default) keep_comments_cpp = false
[2024-01-03T00:39:35.169111 15221] Config: (default) limit_multiple = 0.8
[2024-01-03T00:39:35.169111 15221] Config: (environment) log_file = /media/th3s4rp/ns1/odakProjeler/nebios-system-apps/Kernel_Switcher/Kernel_Switcher.build/ccache-15195.txt
[2024-01-03T00:39:35.169111 15221] Config: (default) max_files = 0
[2024-01-03T00:39:35.169111 15221] Config: (default) max_size = 5.0G
[2024-01-03T00:39:35.169111 15221] Config: (default) namespace = 
[2024-01-03T00:39:35.169111 15221] Config: (default) path = 
[2024-01-03T00:39:35.169111 15221] Config: (default) pch_external_checksum = false
[2024-01-03T00:39:35.169111 15221] Config: (default) prefix_command = 
[2024-01-03T00:39:35.169111 15221] Config: (default) prefix_command_cpp = 
[2024-01-03T00:39:35.169111 15221] Config: (default) read_only = false
[2024-01-03T00:39:35.169111 15221] Config: (default) read_only_direct = false
[2024-01-03T00:39:35.169111 15221] Config: (default) recache = false
[2024-01-03T00:39:35.169111 15221] Config: (default) reshare = false
[2024-01-03T00:39:35.169111 15221] Config: (default) run_second_cpp = true
[2024-01-03T00:39:35.169111 15221] Config: (default) secondary_storage = 
[2024-01-03T00:39:35.169111 15221] Config: (default) sloppiness = 
[2024-01-03T00:39:35.169111 15221] Config: (default) stats = true
[2024-01-03T00:39:35.169111 15221] Config: (default) stats_log = 
[2024-01-03T00:39:35.169111 15221] Config: (default) temporary_dir = /run/user/1000/ccache-tmp
[2024-01-03T00:39:35.169111 15221] Config: (default) umask = 
[2024-01-03T00:39:35.170236 15221] Command line: /usr/bin/ccache /usr/bin/gcc -o static_src/CompiledCellType.o -c -flto -fuse-linker-plugin -fno-fat-lto-objects -std=c11 -fvisibility=hidden -fwrapv -pipe -fpartial-inlining -ftrack-macro-expansion=0 -Wno-deprecated-declarations -fno-var-tracking -Wno-misleading-indentation -fcompare-debug-second -O2 -D__NUITKA_NO_ASSERT__ -DPy_NO_ENABLE_SHARED -D_NUITKA_STATIC_LIBPYTHON -D_NUITKA_USE_UNEXPOSED_API -D_NUITKA_CONSTANTS_FROM_LINKER -D_NUITKA_FROZEN=0 -D_NUITKA_EXE -I/usr/include/python3.10 -I. -I/usr/lib/python3/dist-packages/nuitka/build/include -I/usr/lib/python3/dist-packages/nuitka/build/static_src static_src/CompiledCellType.c
[2024-01-03T00:39:35.170384 15221] Hostname: padnther
[2024-01-03T00:39:35.170411 15221] Working directory: /media/th3s4rp/ns1/odakProjeler/nebios-system-apps/Kernel_Switcher/Kernel_Switcher.build
[2024-01-03T00:39:35.170430 15221] Compiler type: gcc
[2024-01-03T00:39:35.170523 15218] Releasing lock /Users/th3s4rp/.cache/Nuitka/ccache/7/2/stats.lock
[2024-01-03T00:39:35.170753 15218] Unlink /Users/th3s4rp/.cache/Nuitka/ccache/7/2/stats.lock
[2024-01-03T00:39:35.170878 15221] Source file: static_src/CompiledCellType.c
[2024-01-03T00:39:35.170919 15221] Object file: static_src/CompiledCellType.o
[2024-01-03T00:39:35.171064 15221] Trying direct lookup
[2024-01-03T00:39:35.171774 15221] Retrieved 88b7iahaq2frokhfnkk2ti5sor6fkk3re from primary storage (/Users/th3s4rp/.cache/Nuitka/ccache/8/8/b7iahaq2frokhfnkk2ti5sor6fkk3reM)
[2024-01-03T00:39:35.172151 15221] Looking for result key in /Users/th3s4rp/.cache/Nuitka/ccache/8/8/b7iahaq2frokhfnkk2ti5sor6fkk3reM
[2024-01-03T00:39:35.204129 15221] Got result key from manifest
[2024-01-03T00:39:35.204263 15221] Retrieved 3362nuth65qf1erc6v19im65r814p17v2 from primary storage (/Users/th3s4rp/.cache/Nuitka/ccache/3/3/62nuth65qf1erc6v19im65r814p17v2R)
[2024-01-03T00:39:35.204321 15221] Reading result /Users/th3s4rp/.cache/Nuitka/ccache/3/3/62nuth65qf1erc6v19im65r814p17v2R
[2024-01-03T00:39:35.204689 15221] Reading embedded entry #0 .o (36944 bytes)
[2024-01-03T00:39:35.204719 15221] Writing to static_src/CompiledCellType.o
[2024-01-03T00:39:35.205161 15221] Succeeded getting cached result
[2024-01-03T00:39:35.205203 15221] Result: direct_cache_hit
[2024-01-03T00:39:35.205221 15221] Result: primary_storage_hit
[2024-01-03T00:39:35.205367 15221] lockfile_acquire: symlink /Users/th3s4rp/.cache/Nuitka/ccache/7/5/stats.lock: No such file or directory
[2024-01-03T00:39:35.205611 15221] Acquired lock /Users/th3s4rp/.cache/Nuitka/ccache/7/5/stats.lock
[2024-01-03T00:39:35.206001 15221] Releasing lock /Users/th3s4rp/.cache/Nuitka/ccache/7/5/stats.lock
[2024-01-03T00:39:35.206081 15221] Unlink /Users/th3s4rp/.cache/Nuitka/ccache/7/5/stats.lock
[2024-01-03T00:39:35.520049 15224] === CCACHE 4.5.1 STARTED =========================================
[2024-01-03T00:39:35.520049 15224] Config: (default) absolute_paths_in_stderr = false
[2024-01-03T00:39:35.520049 15224] Config: (default) base_dir = 
[2024-01-03T00:39:35.520049 15224] Config: (environment) cache_dir = /Users/th3s4rp/.cache/Nuitka/ccache
[2024-01-03T00:39:35.520049 15224] Config: (default) compiler = 
[2024-01-03T00:39:35.520049 15224] Config: (default) compiler_check = mtime
[2024-01-03T00:39:35.520049 15224] Config: (default) compiler_type = auto
[2024-01-03T00:39:35.520049 15224] Config: (default) compression = true
[2024-01-03T00:39:35.520049 15224] Config: (default) compression_level = 0
[2024-01-03T00:39:35.520049 15224] Config: (default) cpp_extension = 
[2024-01-03T00:39:35.520049 15224] Config: (default) debug = false
[2024-01-03T00:39:35.520049 15224] Config: (default) debug_dir = 
[2024-01-03T00:39:35.520049 15224] Config: (default) depend_mode = false
[2024-01-03T00:39:35.520049 15224] Config: (default) direct_mode = true
[2024-01-03T00:39:35.520049 15224] Config: (default) disable = false
[2024-01-03T00:39:35.520049 15224] Config: (default) extra_files_to_hash = 
[2024-01-03T00:39:35.520049 15224] Config: (default) file_clone = false
[2024-01-03T00:39:35.520049 15224] Config: (default) hard_link = false
[2024-01-03T00:39:35.520049 15224] Config: (default) hash_dir = true
[2024-01-03T00:39:35.520049 15224] Config: (default) ignore_headers_in_manifest = 
[2024-01-03T00:39:35.520049 15224] Config: (default) ignore_options = 
[2024-01-03T00:39:35.520049 15224] Config: (default) inode_cache = false
[2024-01-03T00:39:35.520049 15224] Config: (default) keep_comments_cpp = false
[2024-01-03T00:39:35.520049 15224] Config: (default) limit_multiple = 0.8
[2024-01-03T00:39:35.520049 15224] Config: (environment) log_file = /media/th3s4rp/ns1/odakProjeler/nebios-system-apps/Kernel_Switcher/Kernel_Switcher.build/ccache-15195.txt
[2024-01-03T00:39:35.520049 15224] Config: (default) max_files = 0
[2024-01-03T00:39:35.520049 15224] Config: (default) max_size = 5.0G
[2024-01-03T00:39:35.520049 15224] Config: (default) namespace = 
[2024-01-03T00:39:35.520049 15224] Config: (default) path = 
[2024-01-03T00:39:35.520049 15224] Config: (default) pch_external_checksum = false
[2024-01-03T00:39:35.520049 15224] Config: (default) prefix_command = 
[2024-01-03T00:39:35.520049 15224] Config: (default) prefix_command_cpp = 
[2024-01-03T00:39:35.520049 15224] Config: (default) read_only = false
[2024-01-03T00:39:35.520049 15224] Config: (default) read_only_direct = false
[2024-01-03T00:39:35.520049 15224] Config: (default) recache = false
[2024-01-03T00:39:35.520049 15224] Config: (default) reshare = false
[2024-01-03T00:39:35.520049 15224] Config: (default) run_second_cpp = true
[2024-01-03T00:39:35.520049 15224] Config: (default) secondary_storage = 
[2024-01-03T00:39:35.520049 15224] Config: (default) sloppiness = 
[2024-01-03T00:39:35.520049 15224] Config: (default) stats = true
[2024-01-03T00:39:35.520049 15224] Config: (default) stats_log = 
[2024-01-03T00:39:35.520049 15224] Config: (default) temporary_dir = /run/user/1000/ccache-tmp
[2024-01-03T00:39:35.520049 15224] Config: (default) umask = 
[2024-01-03T00:39:35.520417 15224] Command line: /usr/bin/ccache /usr/bin/gcc -o static_src/CompiledFunctionType.o -c -flto -fuse-linker-plugin -fno-fat-lto-objects -std=c11 -fvisibility=hidden -fwrapv -pipe -fpartial-inlining -ftrack-macro-expansion=0 -Wno-deprecated-declarations -fno-var-tracking -Wno-misleading-indentation -fcompare-debug-second -O2 -D__NUITKA_NO_ASSERT__ -DPy_NO_ENABLE_SHARED -D_NUITKA_STATIC_LIBPYTHON -D_NUITKA_USE_UNEXPOSED_API -D_NUITKA_CONSTANTS_FROM_LINKER -D_NUITKA_FROZEN=0 -D_NUITKA_EXE -I/usr/include/python3.10 -I. -I/usr/lib/python3/dist-packages/nuitka/build/include -I/usr/lib/python3/dist-packages/nuitka/build/static_src static_src/CompiledFunctionType.c
[2024-01-03T00:39:35.520509 15224] Hostname: padnther
[2024-01-03T00:39:35.520538 15224] Working directory: /media/th3s4rp/ns1/odakProjeler/nebios-system-apps/Kernel_Switcher/Kernel_Switcher.build
[2024-01-03T00:39:35.520566 15224] Compiler type: gcc
[2024-01-03T00:39:35.520922 15224] Source file: static_src/CompiledFunctionType.c
[2024-01-03T00:39:35.520965 15224] Object file: static_src/CompiledFunctionType.o
[2024-01-03T00:39:35.521065 15224] Trying direct lookup
[2024-01-03T00:39:35.522001 15224] Retrieved b961jt28j6gjv01s8k327gobsd65st3fa from primary storage (/Users/th3s4rp/.cache/Nuitka/ccache/b/9/61jt28j6gjv01s8k327gobsd65st3faM)
[2024-01-03T00:39:35.522113 15224] Looking for result key in /Users/th3s4rp/.cache/Nuitka/ccache/b/9/61jt28j6gjv01s8k327gobsd65st3faM
[2024-01-03T00:39:35.593730 15224] Got result key from manifest
[2024-01-03T00:39:35.593861 15224] Retrieved 3bcdvfgokvk27a13ong3i36q8jr3hocu0 from primary storage (/Users/th3s4rp/.cache/Nuitka/ccache/3/b/cdvfgokvk27a13ong3i36q8jr3hocu0R)
[2024-01-03T00:39:35.593925 15224] Reading result /Users/th3s4rp/.cache/Nuitka/ccache/3/b/cdvfgokvk27a13ong3i36q8jr3hocu0R
[2024-01-03T00:39:35.593896 15227] === CCACHE 4.5.1 STARTED =========================================
[2024-01-03T00:39:35.593896 15227] Config: (default) absolute_paths_in_stderr = false
[2024-01-03T00:39:35.593896 15227] Config: (default) base_dir = 
[2024-01-03T00:39:35.593896 15227] Config: (environment) cache_dir = /Users/th3s4rp/.cache/Nuitka/ccache
[2024-01-03T00:39:35.593896 15227] Config: (default) compiler = 
[2024-01-03T00:39:35.593896 15227] Config: (default) compiler_check = mtime
[2024-01-03T00:39:35.593896 15227] Config: (default) compiler_type = auto
[2024-01-03T00:39:35.593896 15227] Config: (default) compression = true
[2024-01-03T00:39:35.593896 15227] Config: (default) compression_level = 0
[2024-01-03T00:39:35.593896 15227] Config: (default) cpp_extension = 
[2024-01-03T00:39:35.593896 15227] Config: (default) debug = false
[2024-01-03T00:39:35.593896 15227] Config: (default) debug_dir = 
[2024-01-03T00:39:35.593896 15227] Config: (default) depend_mode = false
[2024-01-03T00:39:35.593896 15227] Config: (default) direct_mode = true
[2024-01-03T00:39:35.593896 15227] Config: (default) disable = false
[2024-01-03T00:39:35.593896 15227] Config: (default) extra_files_to_hash = 
[2024-01-03T00:39:35.593896 15227] Config: (default) file_clone = false
[2024-01-03T00:39:35.593896 15227] Config: (default) hard_link = false
[2024-01-03T00:39:35.593896 15227] Config: (default) hash_dir = true
[2024-01-03T00:39:35.593896 15227] Config: (default) ignore_headers_in_manifest = 
[2024-01-03T00:39:35.593896 15227] Config: (default) ignore_options = 
[2024-01-03T00:39:35.593896 15227] Config: (default) inode_cache = false
[2024-01-03T00:39:35.593896 15227] Config: (default) keep_comments_cpp = false
[2024-01-03T00:39:35.593896 15227] Config: (default) limit_multiple = 0.8
[2024-01-03T00:39:35.593896 15227] Config: (environment) log_file = /media/th3s4rp/ns1/odakProjeler/nebios-system-apps/Kernel_Switcher/Kernel_Switcher.build/ccache-15195.txt
[2024-01-03T00:39:35.593896 15227] Config: (default) max_files = 0
[2024-01-03T00:39:35.593896 15227] Config: (default) max_size = 5.0G
[2024-01-03T00:39:35.593896 15227] Config: (default) namespace = 
[2024-01-03T00:39:35.593896 15227] Config: (default) path = 
[2024-01-03T00:39:35.593896 15227] Config: (default) pch_external_checksum = false
[2024-01-03T00:39:35.593896 15227] Config: (default) prefix_command = 
[2024-01-03T00:39:35.593896 15227] Config: (default) prefix_command_cpp = 
[2024-01-03T00:39:35.593896 15227] Config: (default) read_only = false
[2024-01-03T00:39:35.593896 15227] Config: (default) read_only_direct = false
[2024-01-03T00:39:35.593896 15227] Config: (default) recache = false
[2024-01-03T00:39:35.593896 15227] Config: (default) reshare = false
[2024-01-03T00:39:35.593896 15227] Config: (default) run_second_cpp = true
[2024-01-03T00:39:35.593896 15227] Config: (default) secondary_storage = 
[2024-01-03T00:39:35.593896 15227] Config: (default) sloppiness = 
[2024-01-03T00:39:35.593896 15227] Config: (default) stats = true
[2024-01-03T00:39:35.593896 15227] Config: (default) stats_log = 
[2024-01-03T00:39:35.593896 15227] Config: (default) temporary_dir = /run/user/1000/ccache-tmp
[2024-01-03T00:39:35.593896 15227] Config: (default) umask = 
[2024-01-03T00:39:35.594126 15227] Command line: /usr/bin/ccache /usr/bin/gcc -o static_src/CompiledGeneratorType.o -c -flto -fuse-linker-plugin -fno-fat-lto-objects -std=c11 -fvisibility=hidden -fwrapv -pipe -fpartial-inlining -ftrack-macro-expansion=0 -Wno-deprecated-declarations -fno-var-tracking -Wno-misleading-indentation -fcompare-debug-second -O2 -D__NUITKA_NO_ASSERT__ -DPy_NO_ENABLE_SHARED -D_NUITKA_STATIC_LIBPYTHON -D_NUITKA_USE_UNEXPOSED_API -D_NUITKA_CONSTANTS_FROM_LINKER -D_NUITKA_FROZEN=0 -D_NUITKA_EXE -I/usr/include/python3.10 -I. -I/usr/lib/python3/dist-packages/nuitka/build/include -I/usr/lib/python3/dist-packages/nuitka/build/static_src static_src/CompiledGeneratorType.c
[2024-01-03T00:39:35.594236 15227] Hostname: padnther
[2024-01-03T00:39:35.594258 15227] Working directory: /media/th3s4rp/ns1/odakProjeler/nebios-system-apps/Kernel_Switcher/Kernel_Switcher.build
[2024-01-03T00:39:35.594278 15227] Compiler type: gcc
[2024-01-03T00:39:35.594361 15224] Reading embedded entry #0 .o (2737736 bytes)
[2024-01-03T00:39:35.594392 15224] Writing to static_src/CompiledFunctionType.o
[2024-01-03T00:39:35.594561 15227] Source file: static_src/CompiledGeneratorType.c
[2024-01-03T00:39:35.594595 15227] Object file: static_src/CompiledGeneratorType.o
[2024-01-03T00:39:35.594692 15227] Trying direct lookup
[2024-01-03T00:39:35.595386 15227] Retrieved 9ee6d46l6pk7qum8kpk5efjif7l0lb79a from primary storage (/Users/th3s4rp/.cache/Nuitka/ccache/9/e/e6d46l6pk7qum8kpk5efjif7l0lb79aM)
[2024-01-03T00:39:35.595563 15227] Looking for result key in /Users/th3s4rp/.cache/Nuitka/ccache/9/e/e6d46l6pk7qum8kpk5efjif7l0lb79aM
[2024-01-03T00:39:35.616463 15224] Succeeded getting cached result
[2024-01-03T00:39:35.616547 15224] Result: direct_cache_hit
[2024-01-03T00:39:35.616568 15224] Result: primary_storage_hit
[2024-01-03T00:39:35.616719 15224] lockfile_acquire: symlink /Users/th3s4rp/.cache/Nuitka/ccache/7/8/stats.lock: No such file or directory
[2024-01-03T00:39:35.617028 15224] Acquired lock /Users/th3s4rp/.cache/Nuitka/ccache/7/8/stats.lock
[2024-01-03T00:39:35.617522 15224] Releasing lock /Users/th3s4rp/.cache/Nuitka/ccache/7/8/stats.lock
[2024-01-03T00:39:35.617632 15224] Unlink /Users/th3s4rp/.cache/Nuitka/ccache/7/8/stats.lock
[2024-01-03T00:39:35.628564 15227] Got result key from manifest
[2024-01-03T00:39:35.628731 15227] Retrieved fe4a7t8l050djikofc5cevubf7aob5dlu from primary storage (/Users/th3s4rp/.cache/Nuitka/ccache/f/e/4a7t8l050djikofc5cevubf7aob5dluR)
[2024-01-03T00:39:35.628837 15227] Reading result /Users/th3s4rp/.cache/Nuitka/ccache/f/e/4a7t8l050djikofc5cevubf7aob5dluR
[2024-01-03T00:39:35.629474 15227] Reading embedded entry #0 .o (318752 bytes)
[2024-01-03T00:39:35.629555 15227] Writing to static_src/CompiledGeneratorType.o
[2024-01-03T00:39:35.632016 15230] === CCACHE 4.5.1 STARTED =========================================
[2024-01-03T00:39:35.632016 15230] Config: (default) absolute_paths_in_stderr = false
[2024-01-03T00:39:35.632016 15230] Config: (default) base_dir = 
[2024-01-03T00:39:35.632016 15230] Config: (environment) cache_dir = /Users/th3s4rp/.cache/Nuitka/ccache
[2024-01-03T00:39:35.632016 15230] Config: (default) compiler = 
[2024-01-03T00:39:35.632016 15230] Config: (default) compiler_check = mtime
[2024-01-03T00:39:35.632016 15230] Config: (default) compiler_type = auto
[2024-01-03T00:39:35.632016 15230] Config: (default) compression = true
[2024-01-03T00:39:35.632016 15230] Config: (default) compression_level = 0
[2024-01-03T00:39:35.632016 15230] Config: (default) cpp_extension = 
[2024-01-03T00:39:35.632016 15230] Config: (default) debug = false
[2024-01-03T00:39:35.632016 15230] Config: (default) debug_dir = 
[2024-01-03T00:39:35.632016 15230] Config: (default) depend_mode = false
[2024-01-03T00:39:35.632016 15230] Config: (default) direct_mode = true
[2024-01-03T00:39:35.632016 15230] Config: (default) disable = false
[2024-01-03T00:39:35.632016 15230] Config: (default) extra_files_to_hash = 
[2024-01-03T00:39:35.632016 15230] Config: (default) file_clone = false
[2024-01-03T00:39:35.632016 15230] Config: (default) hard_link = false
[2024-01-03T00:39:35.632016 15230] Config: (default) hash_dir = true
[2024-01-03T00:39:35.632016 15230] Config: (default) ignore_headers_in_manifest = 
[2024-01-03T00:39:35.632016 15230] Config: (default) ignore_options = 
[2024-01-03T00:39:35.632016 15230] Config: (default) inode_cache = false
[2024-01-03T00:39:35.632016 15230] Config: (default) keep_comments_cpp = false
[2024-01-03T00:39:35.632016 15230] Config: (default) limit_multiple = 0.8
[2024-01-03T00:39:35.632016 15230] Config: (environment) log_file = /media/th3s4rp/ns1/odakProjeler/nebios-system-apps/Kernel_Switcher/Kernel_Switcher.build/ccache-15195.txt
[2024-01-03T00:39:35.632016 15230] Config: (default) max_files = 0
[2024-01-03T00:39:35.632016 15230] Config: (default) max_size = 5.0G
[2024-01-03T00:39:35.632016 15230] Config: (default) namespace = 
[2024-01-03T00:39:35.632016 15230] Config: (default) path = 
[2024-01-03T00:39:35.632016 15230] Config: (default) pch_external_checksum = false
[2024-01-03T00:39:35.632016 15230] Config: (default) prefix_command = 
[2024-01-03T00:39:35.632016 15230] Config: (default) prefix_command_cpp = 
[2024-01-03T00:39:35.632016 15230] Config: (default) read_only = false
[2024-01-03T00:39:35.632016 15230] Config: (default) read_only_direct = false
[2024-01-03T00:39:35.632016 15230] Config: (default) recache = false
[2024-01-03T00:39:35.632016 15230] Config: (default) reshare = false
[2024-01-03T00:39:35.632016 15230] Config: (default) run_second_cpp = true
[2024-01-03T00:39:35.632016 15230] Config: (default) secondary_storage = 
[2024-01-03T00:39:35.632016 15230] Config: (default) sloppiness = 
[2024-01-03T00:39:35.632016 15230] Config: (default) stats = true
[2024-01-03T00:39:35.632016 15230] Config: (default) stats_log = 
[2024-01-03T00:39:35.632016 15230] Config: (default) temporary_dir = /run/user/1000/ccache-tmp
[2024-01-03T00:39:35.632016 15230] Config: (default) umask = 
[2024-01-03T00:39:35.632272 15230] Command line: /usr/bin/ccache /usr/bin/gcc -o static_src/InspectPatcher.o -c -flto -fuse-linker-plugin -fno-fat-lto-objects -std=c11 -fvisibility=hidden -fwrapv -pipe -fpartial-inlining -ftrack-macro-expansion=0 -Wno-deprecated-declarations -fno-var-tracking -Wno-misleading-indentation -fcompare-debug-second -O2 -D__NUITKA_NO_ASSERT__ -DPy_NO_ENABLE_SHARED -D_NUITKA_STATIC_LIBPYTHON -D_NUITKA_USE_UNEXPOSED_API -D_NUITKA_CONSTANTS_FROM_LINKER -D_NUITKA_FROZEN=0 -D_NUITKA_EXE -I/usr/include/python3.10 -I. -I/usr/lib/python3/dist-packages/nuitka/build/include -I/usr/lib/python3/dist-packages/nuitka/build/static_src static_src/InspectPatcher.c
[2024-01-03T00:39:35.632327 15230] Hostname: padnther
[2024-01-03T00:39:35.632345 15230] Working directory: /media/th3s4rp/ns1/odakProjeler/nebios-system-apps/Kernel_Switcher/Kernel_Switcher.build
[2024-01-03T00:39:35.632362 15230] Compiler type: gcc
[2024-01-03T00:39:35.632603 15230] Source file: static_src/InspectPatcher.c
[2024-01-03T00:39:35.632628 15230] Object file: static_src/InspectPatcher.o
[2024-01-03T00:39:35.632690 15230] Trying direct lookup
[2024-01-03T00:39:35.632764 15227] Succeeded getting cached result
[2024-01-03T00:39:35.632826 15227] Result: direct_cache_hit
[2024-01-03T00:39:35.632848 15227] Result: primary_storage_hit
[2024-01-03T00:39:35.632981 15230] Retrieved 8f0fvlpo5mds4eo7vhqkvf314bq0umc92 from primary storage (/Users/th3s4rp/.cache/Nuitka/ccache/8/f/0fvlpo5mds4eo7vhqkvf314bq0umc92M)
[2024-01-03T00:39:35.633046 15230] Looking for result key in /Users/th3s4rp/.cache/Nuitka/ccache/8/f/0fvlpo5mds4eo7vhqkvf314bq0umc92M
[2024-01-03T00:39:35.633059 15227] Acquired lock /Users/th3s4rp/.cache/Nuitka/ccache/7/b/stats.lock
[2024-01-03T00:39:35.633810 15227] Releasing lock /Users/th3s4rp/.cache/Nuitka/ccache/7/b/stats.lock
[2024-01-03T00:39:35.633934 15227] Unlink /Users/th3s4rp/.cache/Nuitka/ccache/7/b/stats.lock
[2024-01-03T00:39:35.655159 15233] === CCACHE 4.5.1 STARTED =========================================
[2024-01-03T00:39:35.655159 15233] Config: (default) absolute_paths_in_stderr = false
[2024-01-03T00:39:35.655159 15233] Config: (default) base_dir = 
[2024-01-03T00:39:35.655159 15233] Config: (environment) cache_dir = /Users/th3s4rp/.cache/Nuitka/ccache
[2024-01-03T00:39:35.655159 15233] Config: (default) compiler = 
[2024-01-03T00:39:35.655159 15233] Config: (default) compiler_check = mtime
[2024-01-03T00:39:35.655159 15233] Config: (default) compiler_type = auto
[2024-01-03T00:39:35.655159 15233] Config: (default) compression = true
[2024-01-03T00:39:35.655159 15233] Config: (default) compression_level = 0
[2024-01-03T00:39:35.655159 15233] Config: (default) cpp_extension = 
[2024-01-03T00:39:35.655159 15233] Config: (default) debug = false
[2024-01-03T00:39:35.655159 15233] Config: (default) debug_dir = 
[2024-01-03T00:39:35.655159 15233] Config: (default) depend_mode = false
[2024-01-03T00:39:35.655159 15233] Config: (default) direct_mode = true
[2024-01-03T00:39:35.655159 15233] Config: (default) disable = false
[2024-01-03T00:39:35.655159 15233] Config: (default) extra_files_to_hash = 
[2024-01-03T00:39:35.655159 15233] Config: (default) file_clone = false
[2024-01-03T00:39:35.655159 15233] Config: (default) hard_link = false
[2024-01-03T00:39:35.655159 15233] Config: (default) hash_dir = true
[2024-01-03T00:39:35.655159 15233] Config: (default) ignore_headers_in_manifest = 
[2024-01-03T00:39:35.655159 15233] Config: (default) ignore_options = 
[2024-01-03T00:39:35.655159 15233] Config: (default) inode_cache = false
[2024-01-03T00:39:35.655159 15233] Config: (default) keep_comments_cpp = false
[2024-01-03T00:39:35.655159 15233] Config: (default) limit_multiple = 0.8
[2024-01-03T00:39:35.655159 15233] Config: (environment) log_file = /media/th3s4rp/ns1/odakProjeler/nebios-system-apps/Kernel_Switcher/Kernel_Switcher.build/ccache-15195.txt
[2024-01-03T00:39:35.655159 15233] Config: (default) max_files = 0
[2024-01-03T00:39:35.655159 15233] Config: (default) max_size = 5.0G
[2024-01-03T00:39:35.655159 15233] Config: (default) namespace = 
[2024-01-03T00:39:35.655159 15233] Config: (default) path = 
[2024-01-03T00:39:35.655159 15233] Config: (default) pch_external_checksum = false
[2024-01-03T00:39:35.655159 15233] Config: (default) prefix_command = 
[2024-01-03T00:39:35.655159 15233] Config: (default) prefix_command_cpp = 
[2024-01-03T00:39:35.655159 15233] Config: (default) read_only = false
[2024-01-03T00:39:35.655159 15233] Config: (default) read_only_direct = false
[2024-01-03T00:39:35.655159 15233] Config: (default) recache = false
[2024-01-03T00:39:35.655159 15233] Config: (default) reshare = false
[2024-01-03T00:39:35.655159 15233] Config: (default) run_second_cpp = true
[2024-01-03T00:39:35.655159 15233] Config: (default) secondary_storage = 
[2024-01-03T00:39:35.655159 15233] Config: (default) sloppiness = 
[2024-01-03T00:39:35.655159 15233] Config: (default) stats = true
[2024-01-03T00:39:35.655159 15233] Config: (default) stats_log = 
[2024-01-03T00:39:35.655159 15233] Config: (default) temporary_dir = /run/user/1000/ccache-tmp
[2024-01-03T00:39:35.655159 15233] Config: (default) umask = 
[2024-01-03T00:39:35.655764 15233] Command line: /usr/bin/ccache /usr/bin/gcc -o static_src/MetaPathBasedLoader.o -c -flto -fuse-linker-plugin -fno-fat-lto-objects -std=c11 -fvisibility=hidden -fwrapv -pipe -fpartial-inlining -ftrack-macro-expansion=0 -Wno-deprecated-declarations -fno-var-tracking -Wno-misleading-indentation -fcompare-debug-second -O2 -D__NUITKA_NO_ASSERT__ -DPy_NO_ENABLE_SHARED -D_NUITKA_STATIC_LIBPYTHON -D_NUITKA_USE_UNEXPOSED_API -D_NUITKA_CONSTANTS_FROM_LINKER -D_NUITKA_FROZEN=0 -D_NUITKA_EXE -I/usr/include/python3.10 -I. -I/usr/lib/python3/dist-packages/nuitka/build/include -I/usr/lib/python3/dist-packages/nuitka/build/static_src static_src/MetaPathBasedLoader.c
[2024-01-03T00:39:35.655964 15233] Hostname: padnther
[2024-01-03T00:39:35.655987 15233] Working directory: /media/th3s4rp/ns1/odakProjeler/nebios-system-apps/Kernel_Switcher/Kernel_Switcher.build
[2024-01-03T00:39:35.656006 15233] Compiler type: gcc
[2024-01-03T00:39:35.656344 15233] Source file: static_src/MetaPathBasedLoader.c
[2024-01-03T00:39:35.656410 15233] Object file: static_src/MetaPathBasedLoader.o
[2024-01-03T00:39:35.656485 15233] Trying direct lookup
[2024-01-03T00:39:35.657169 15233] Retrieved fc878lcmecruto3sfj366g2pv9r52qjmk from primary storage (/Users/th3s4rp/.cache/Nuitka/ccache/f/c/878lcmecruto3sfj366g2pv9r52qjmkM)
[2024-01-03T00:39:35.657333 15233] Looking for result key in /Users/th3s4rp/.cache/Nuitka/ccache/f/c/878lcmecruto3sfj366g2pv9r52qjmkM
[2024-01-03T00:39:35.668066 15230] Got result key from manifest
[2024-01-03T00:39:35.668359 15230] Retrieved a2eb5ro3gos3q02gal6riamffn66e2ck4 from primary storage (/Users/th3s4rp/.cache/Nuitka/ccache/a/2/eb5ro3gos3q02gal6riamffn66e2ck4R)
[2024-01-03T00:39:35.668434 15230] Reading result /Users/th3s4rp/.cache/Nuitka/ccache/a/2/eb5ro3gos3q02gal6riamffn66e2ck4R
[2024-01-03T00:39:35.668921 15230] Reading embedded entry #0 .o (45600 bytes)
[2024-01-03T00:39:35.669007 15230] Writing to static_src/InspectPatcher.o
[2024-01-03T00:39:35.669539 15230] Succeeded getting cached result
[2024-01-03T00:39:35.669592 15230] Result: direct_cache_hit
[2024-01-03T00:39:35.669610 15230] Result: primary_storage_hit
[2024-01-03T00:39:35.669762 15230] lockfile_acquire: symlink /Users/th3s4rp/.cache/Nuitka/ccache/7/e/stats.lock: No such file or directory
[2024-01-03T00:39:35.670033 15230] Acquired lock /Users/th3s4rp/.cache/Nuitka/ccache/7/e/stats.lock
[2024-01-03T00:39:35.670465 15230] Releasing lock /Users/th3s4rp/.cache/Nuitka/ccache/7/e/stats.lock
[2024-01-03T00:39:35.670561 15230] Unlink /Users/th3s4rp/.cache/Nuitka/ccache/7/e/stats.lock
[2024-01-03T00:39:35.692486 15233] Got result key from manifest
[2024-01-03T00:39:35.692722 15233] Retrieved 6194cihnj1q71kbtecvu9ef0gpetr1ohc from primary storage (/Users/th3s4rp/.cache/Nuitka/ccache/6/1/94cihnj1q71kbtecvu9ef0gpetr1ohcR)
[2024-01-03T00:39:35.692865 15233] Reading result /Users/th3s4rp/.cache/Nuitka/ccache/6/1/94cihnj1q71kbtecvu9ef0gpetr1ohcR
[2024-01-03T00:39:35.694131 15233] Reading embedded entry #0 .o (103520 bytes)
[2024-01-03T00:39:35.694236 15233] Writing to static_src/MetaPathBasedLoader.o
[2024-01-03T00:39:35.695033 15233] Succeeded getting cached result
[2024-01-03T00:39:35.695083 15233] Result: direct_cache_hit
[2024-01-03T00:39:35.695124 15233] Result: primary_storage_hit
[2024-01-03T00:39:35.695274 15233] lockfile_acquire: symlink /Users/th3s4rp/.cache/Nuitka/ccache/8/1/stats.lock: No such file or directory
[2024-01-03T00:39:35.695567 15233] Acquired lock /Users/th3s4rp/.cache/Nuitka/ccache/8/1/stats.lock
[2024-01-03T00:39:35.695981 15233] Releasing lock /Users/th3s4rp/.cache/Nuitka/ccache/8/1/stats.lock
[2024-01-03T00:39:35.696060 15233] Unlink /Users/th3s4rp/.cache/Nuitka/ccache/8/1/stats.lock
