<svg width="24" height="24" viewBox="0 0 24 24" fill="none" xmlns="http://www.w3.org/2000/svg">
<path d="M22 9.2C21.4 9.2 21 9.6 21 10.2V13.8C21 14.4 21.4 14.8 22 14.8C22.6 14.8 23 14.4 23 13.8V10.2C23 9.6 22.6 9.2 22 9.2Z" fill="white"/>
<path d="M6.05054 12.5706L6.09616 12.5304L9.23635 9L11.0153 7L12.6841 5.12376C12.7423 5.0657 12.8247 5.02209 12.9074 5.00619C12.9275 5.00232 12.9448 5.00053 12.9593 5C12.966 4.99976 12.972 4.99979 12.9776 5C13.0082 5.00119 13.0221 5.00821 13.0221 5.00821L13.046 5.02265L13.0713 5.03602C13.2446 5.12763 13.2836 5.26673 13.2562 5.38256L13.2517 5.40151L12.939 7L12.186 10.8485H14.6437C14.741 10.8485 14.887 10.9202 14.9601 11.1005C15.0009 11.2012 15.0052 11.2877 14.9958 11.3435C14.9876 11.3922 14.9706 11.4167 14.9495 11.4353L14.9038 11.4755L9.98999 17L8.31502 18.8831C8.22058 18.9793 8.13768 18.9992 8.08597 19C8.0821 18.9995 8.06436 18.9973 8.02763 18.9876C7.98683 18.9768 7.9424 18.9625 7.8811 18.9414C7.74834 18.851 7.71913 18.7277 7.74381 18.6234L7.74829 18.6044L8.06219 17L8.45349 15L8.81399 13.1574H6.35626C6.259 13.1574 6.113 13.0858 6.03992 12.9054C5.99911 12.8047 5.99479 12.7183 6.00421 12.6624C6.01244 12.6137 6.02941 12.5892 6.05054 12.5706Z" fill="white"/>
<path fill-rule="evenodd" clip-rule="evenodd" d="M9.23635 9H10.05C10.35 9 10.55 9.4 10.55 10V14C10.55 14.6 10.35 15 10.05 15H8.45349L8.81399 13.1574H6.35626C6.259 13.1574 6.113 13.0858 6.03992 12.9054C5.99911 12.8047 5.99479 12.7183 6.00421 12.6624C6.01244 12.6137 6.02941 12.5892 6.05054 12.5706L6.09616 12.5304L9.23635 9ZM7.89801 9H5.10001C4.80001 9 4.60001 9.4 4.60001 10V14C4.60001 14.6 4.80001 15 5.10001 15H7.43453L7.59938 14.1574H6.35626C5.80376 14.1574 5.32032 13.7923 5.11314 13.281C4.90595 12.7698 4.97501 12.1855 5.38938 11.8204L7.89801 9Z" fill="white"/>
<path fill-rule="evenodd" clip-rule="evenodd" d="M12.9593 5H12.9776C13.0082 5.00119 13.0221 5.00821 13.0221 5.00821L13.046 5.02265L13.0713 5.03602C13.2446 5.12763 13.2836 5.26673 13.2562 5.38256L13.2517 5.40151L12.939 7H11.0153L12.6841 5.12376C12.7423 5.0657 12.8247 5.02209 12.9074 5.00619C12.9275 5.00232 12.9448 5.00053 12.9593 5ZM14.2294 5.61263C14.2787 5.40399 14.2752 5.19534 14.2251 5H17.3C18.9 5 20.1 6.3 20.1 7.8V16.2C20.1 17.7 18.8 19 17.3 19H9.5494L11.3283 17H17.3C17.7 17 18.1 16.6 18.1 16.2V7.8C18.1 7.4 17.7 7 17.3 7H13.9579L14.2294 5.61263ZM9.98999 17H8.06219L7.74829 18.6044L7.74381 18.6234C7.71913 18.7277 7.74834 18.851 7.8811 18.9414C7.9424 18.9625 7.98683 18.9768 8.02763 18.9876C8.06436 18.9973 8.0821 18.9995 8.08597 19C8.13768 18.9992 8.22058 18.9793 8.31502 18.8831L9.98999 17ZM7.04323 17H3.8C3.4 17 3 16.6 3 16.2V7.8C3 7.4 3.4 7 3.8 7H9.67694L11.4559 5H3.8C2.3 5 1 6.3 1 7.8V16.2C1 17.7 2.3 19 3.8 19H6.7734C6.72476 18.8064 6.7218 18.5998 6.77063 18.3933L7.04323 17Z" fill="white"/>
</svg>
