<svg width="24" height="24" viewBox="0 0 24 24" fill="none" xmlns="http://www.w3.org/2000/svg">
<path d="M17.3 5H3.8C2.3 5 1 6.3 1 7.8V16.2C1 17.7 2.3 19 3.8 19H17.3C18.8 19 20.1 17.7 20.1 16.2V7.8C20.1 6.3 18.9 5 17.3 5ZM18.1 16.2C18.1 16.6 17.7 17 17.3 17H3.8C3.4 17 3 16.6 3 16.2V7.8C3 7.4 3.4 7 3.8 7H17.3C17.7 7 18.1 7.4 18.1 7.8V16.2Z" fill="white"/>
<path d="M22 9.20001C21.4 9.20001 21 9.60001 21 10.2V13.8C21 14.4 21.4 14.8 22 14.8C22.6 14.8 23 14.4 23 13.8V10.2C23 9.60001 22.6 9.20001 22 9.20001Z" fill="white"/>
<path d="M11.14 9H5.20001C4.84001 9 4.60001 9.4 4.60001 10V14C4.60001 14.6 4.84001 15 5.20001 15H11.14C11.5 15 11.74 14.6 11.74 14V10C11.74 9.4 11.5 9 11.14 9Z" fill="white"/>
</svg>
