<?xml version="1.0" encoding="UTF-8" standalone="no"?>
<svg viewBox="0 0 50 50"
 xmlns="http://www.w3.org/2000/svg" xmlns:xlink="http://www.w3.org/1999/xlink"  version="1.2" baseProfile="tiny">
<title>Qt SVG Document</title>
<desc>Generated with Qt</desc>
<defs>
</defs>
<g fill="none" stroke="black" stroke-width="1" fill-rule="evenodd" stroke-linecap="square" stroke-linejoin="bevel" >

<g fill="none" stroke="none" transform="matrix(2.27273,0,0,2.27273,-3.04315,-124.701)"
font-family="Karla" font-size="10" font-weight="400" font-style="normal" 
>
<rect x="1.33899" y="54.8683" width="22" height="22"/>
</g>

<g fill="none" stroke="none" transform="matrix(2.27273,0,0,2.27273,100,-115.909)"
font-family="Karla" font-size="10" font-weight="400" font-style="normal" 
>
<circle cx="-33" cy="62" r="4.16667"/>
</g>

<g fill="none" stroke="#5ce0b6" stroke-opacity="1" stroke-width="1.66667" stroke-linecap="round" stroke-linejoin="miter" stroke-miterlimit="4" transform="matrix(2.27273,0,0,2.27273,100,-115.909)"
font-family="Karla" font-size="10" font-weight="400" font-style="normal" 
>
<circle cx="-33" cy="62" r="4.16667"/>
</g>

<g fill="#5ce0b6" fill-opacity="1" stroke="none" transform="matrix(2.27273,0,0,2.27273,100,-115.909)"
font-family="Karla" font-size="10" font-weight="400" font-style="normal" 
opacity="0.4" >
<circle cx="-33" cy="62" r="11"/>
</g>

<g fill="none" stroke="#000000" stroke-opacity="1" stroke-width="1" stroke-linecap="square" stroke-linejoin="bevel" transform="matrix(1,0,0,1,0,0)"
font-family="Karla" font-size="10" font-weight="400" font-style="normal" 
>
</g>
</g>
</svg>
