<svg width="24" height="24" viewBox="0 0 24 24" fill="none" xmlns="http://www.w3.org/2000/svg">
<path d="M22 9.2C21.4 9.2 21 9.6 21 10.2V13.8C21 14.4 21.4 14.8 22 14.8C22.6 14.8 23 14.4 23 13.8V10.2C23 9.6 22.6 9.2 22 9.2Z" fill="white"/>
<path d="M6.05054 12.5706L6.09616 12.5304L9.23635 9L11.0153 7L12.6841 5.12376C12.7423 5.0657 12.8247 5.02209 12.9074 5.00619C12.9275 5.00232 12.9448 5.00053 12.9593 5C12.966 4.99976 12.972 4.99979 12.9776 5C13.0082 5.00119 13.0221 5.00821 13.0221 5.00821L13.046 5.02265L13.0713 5.03602C13.2446 5.12763 13.2836 5.26673 13.2562 5.38256L13.2517 5.40151L12.939 7L12.5477 9L12.186 10.8485H14.6437C14.741 10.8485 14.887 10.9202 14.9601 11.1005C15.0009 11.2012 15.0052 11.2877 14.9958 11.3435C14.9876 11.3922 14.9706 11.4167 14.9495 11.4353L14.9038 11.4755L11.7689 15L9.98999 17L8.31502 18.8831C8.22058 18.9793 8.13768 18.9992 8.08597 19C8.0821 18.9995 8.06436 18.9973 8.02763 18.9876C7.98683 18.9768 7.9424 18.9625 7.8811 18.9414C7.74834 18.851 7.71913 18.7277 7.74381 18.6234L7.74829 18.6044L8.06219 17L8.45349 15L8.81399 13.1574H6.35626C6.259 13.1574 6.113 13.0858 6.03992 12.9054C5.99911 12.8047 5.99479 12.7183 6.00421 12.6624C6.01244 12.6137 6.02941 12.5892 6.05054 12.5706Z" fill="white"/>
<path fill-rule="evenodd" clip-rule="evenodd" d="M12.9593 5H12.9776C13.0082 5.00119 13.0221 5.00821 13.0221 5.00821L13.046 5.02265L13.0713 5.03602C13.2446 5.12763 13.2836 5.26673 13.2562 5.38256L13.2517 5.40151L12.939 7H11.0153L12.6841 5.12376C12.7423 5.0657 12.8247 5.02209 12.9074 5.00619C12.9275 5.00232 12.9448 5.00053 12.9593 5ZM11.4559 5H3.8C2.3 5 1 6.3 1 7.8V16.2C1 17.7 2.3 19 3.8 19H6.7734C6.72476 18.8064 6.7218 18.5998 6.77063 18.3933L7.04323 17H3.8C3.4 17 3 16.6 3 16.2V7.8C3 7.4 3.4 7 3.8 7H9.67694L11.4559 5ZM14.2294 5.61263C14.2787 5.40399 14.2752 5.19534 14.2251 5H17.3C18.9 5 20.1 6.3 20.1 7.8V16.2C20.1 17.7 18.8 19 17.3 19H9.5494L11.3283 17H17.3C17.7 17 18.1 16.6 18.1 16.2V7.8C18.1 7.4 17.7 7 17.3 7H13.9579L14.2294 5.61263ZM8.06219 17L7.74829 18.6044L7.74381 18.6234C7.71913 18.7277 7.74834 18.851 7.8811 18.9414C7.9424 18.9625 7.98683 18.9768 8.02763 18.9876C8.06436 18.9973 8.0821 18.9995 8.08597 19C8.13768 18.9992 8.22058 18.9793 8.31502 18.8831L9.98999 17H8.06219Z" fill="white"/>
<path fill-rule="evenodd" clip-rule="evenodd" d="M12.5477 9H9.23635L6.09616 12.5304L6.05054 12.5706C6.02941 12.5892 6.01244 12.6137 6.00421 12.6624C5.99479 12.7183 5.99911 12.8047 6.03992 12.9054C6.113 13.0858 6.259 13.1574 6.35626 13.1574H8.81399L8.45349 15H11.7689L14.9038 11.4755L14.9495 11.4353C14.9706 11.4167 14.9876 11.3922 14.9958 11.3435C15.0052 11.2877 15.0009 11.2012 14.9601 11.1005C14.887 10.9202 14.741 10.8485 14.6437 10.8485H12.186L12.5477 9ZM13.5666 9L13.4006 9.84851H14.6437C14.8847 9.84851 15.1125 9.91796 15.31 10.0387V10C15.31 9.4 14.95 9 14.41 9H13.5666ZM15.31 12.5235L13.1073 15H14.41C14.95 15 15.31 14.6 15.31 14V12.5235ZM5.50001 9H7.89801L5.38938 11.8204C4.97501 12.1855 4.90595 12.7698 5.11314 13.281C5.32032 13.7923 5.80376 14.1574 6.35626 14.1574H7.59938L7.43453 15H5.50001C4.96001 15 4.60001 14.6 4.60001 14V10C4.60001 9.4 4.96001 9 5.50001 9Z" fill="white"/>
</svg>
