<svg width="24" height="24" viewBox="0 0 24 24" fill="none" xmlns="http://www.w3.org/2000/svg">
<path d="M22 9.2C21.4 9.2 21 9.6 21 10.2V13.8C21 14.4 21.4 14.8 22 14.8C22.6 14.8 23 14.4 23 13.8V10.2C23 9.6 22.6 9.2 22 9.2Z" fill="#FF5F5F"/>
<path d="M11.7586 14.1207C11.7586 14.4607 11.6268 14.7699 11.4116 15C11.2474 15.1756 11.0346 15.3051 10.7947 15.3672C10.7387 15.3818 10.6812 15.3926 10.6225 15.3995C10.5728 15.4053 10.5223 15.4083 10.471 15.4083C10.4198 15.4083 10.3692 15.4053 10.3195 15.3995C10.2608 15.3926 10.2033 15.3818 10.1473 15.3672C9.90737 15.3051 9.6946 15.1756 9.53042 15C9.31519 14.7699 9.18343 14.4607 9.18343 14.1207V9V7V6.471C9.18343 5.7599 9.7599 5.18343 10.471 5.18343C11.1821 5.18343 11.7586 5.7599 11.7586 6.47101V7V9V14.1207Z" fill="#FF5F5F"/>
<path d="M10.6225 16.5444C10.696 16.5444 10.7679 16.5514 10.8376 16.5647C11.1205 16.6189 11.3661 16.778 11.5323 17C11.6744 17.1897 11.7586 17.4252 11.7586 17.6805C11.7586 18.3079 11.2499 18.8166 10.6225 18.8166H10.3195C9.69208 18.8166 9.18343 18.3079 9.18343 17.6805C9.18343 17.4252 9.26759 17.1897 9.40968 17C9.57595 16.778 9.82156 16.6189 10.1044 16.5647C10.1741 16.5514 10.246 16.5444 10.3195 16.5444H10.6225Z" fill="#FF5F5F"/>
<path fill-rule="evenodd" clip-rule="evenodd" d="M17.3 5H12.4567C12.7616 5.41098 12.942 5.91993 12.942 6.47101V7H17.3C17.7 7 18.1 7.4 18.1 7.8V16.2C18.1 16.6 17.7 17 17.3 17H12.8406C12.9065 17.2152 12.942 17.4437 12.942 17.6805C12.942 18.1707 12.7899 18.6254 12.5304 19H17.3C18.8 19 20.1 17.7 20.1 16.2V7.8C20.1 6.3 18.9 5 17.3 5ZM8.41164 19C8.15208 18.6254 8 18.1707 8 17.6805C8 17.4437 8.03548 17.2152 8.10142 17H3.8C3.4 17 3 16.6 3 16.2V7.8C3 7.4 3.4 7 3.8 7H8V6.471C8 5.91992 8.1804 5.41098 8.48536 5H3.8C2.3 5 1 6.3 1 7.8V16.2C1 17.7 2.3 19 3.8 19H8.41164ZM9.40968 17C9.26759 17.1897 9.18343 17.4252 9.18343 17.6805C9.18343 18.3079 9.69208 18.8166 10.3195 18.8166H10.6225C11.2499 18.8166 11.7586 18.3079 11.7586 17.6805C11.7586 17.4252 11.6744 17.1897 11.5323 17H9.40968ZM11.7586 6.47101V7H9.18343V6.471C9.18343 5.7599 9.7599 5.18343 10.471 5.18343C11.1821 5.18343 11.7586 5.7599 11.7586 6.47101Z" fill="#FF5F5F"/>
<path fill-rule="evenodd" clip-rule="evenodd" d="M11.7586 9H9.18343V14.1207C9.18343 14.4607 9.31519 14.7699 9.53042 15H11.4116C11.6268 14.7699 11.7586 14.4607 11.7586 14.1207V9ZM12.942 9V14.1207C12.942 14.4304 12.885 14.7268 12.781 15H15.5C16.1 15 16.5 14.6 16.5 14V10C16.5 9.4 16.1 9 15.5 9H12.942ZM5.60001 9H8V14.1207C8 14.4304 8.05698 14.7268 8.16102 15H5.60001C5.00001 15 4.60001 14.6 4.60001 14V10C4.60001 9.4 5.00001 9 5.60001 9Z" fill="#FF5F5F"/>
</svg>
