<svg width="50" height="50" viewBox="0 0 50 50" fill="none" xmlns="http://www.w3.org/2000/svg">
<g clip-path="url(#clip0_224_43)">
<g filter="url(#filter0_ii_224_43)">
<path d="M25 34.4697C30.23 34.4697 34.4697 30.2299 34.4697 25C34.4697 19.77 30.23 15.5303 25 15.5303C19.7701 15.5303 15.5303 19.77 15.5303 25C15.5303 30.2299 19.7701 34.4697 25 34.4697Z" stroke="#5CE0B6" stroke-width="3.78788" stroke-linecap="round"/>
</g>
</g>
<defs>
<filter id="filter0_ii_224_43" x="13.6364" y="11.6364" width="22.7273" height="26.7272" filterUnits="userSpaceOnUse" color-interpolation-filters="sRGB">
<feFlood flood-opacity="0" result="BackgroundImageFix"/>
<feBlend mode="normal" in="SourceGraphic" in2="BackgroundImageFix" result="shape"/>
<feColorMatrix in="SourceAlpha" type="matrix" values="0 0 0 0 0 0 0 0 0 0 0 0 0 0 0 0 0 0 127 0" result="hardAlpha"/>
<feOffset dy="-2"/>
<feGaussianBlur stdDeviation="2"/>
<feComposite in2="hardAlpha" operator="arithmetic" k2="-1" k3="1"/>
<feColorMatrix type="matrix" values="0 0 0 0 0 0 0 0 0 0 0 0 0 0 0 0 0 0 0.25 0"/>
<feBlend mode="normal" in2="shape" result="effect1_innerShadow_224_43"/>
<feColorMatrix in="SourceAlpha" type="matrix" values="0 0 0 0 0 0 0 0 0 0 0 0 0 0 0 0 0 0 127 0" result="hardAlpha"/>
<feOffset dy="2"/>
<feGaussianBlur stdDeviation="2"/>
<feComposite in2="hardAlpha" operator="arithmetic" k2="-1" k3="1"/>
<feColorMatrix type="matrix" values="0 0 0 0 1 0 0 0 0 1 0 0 0 0 1 0 0 0 0.75 0"/>
<feBlend mode="normal" in2="effect1_innerShadow_224_43" result="effect2_innerShadow_224_43"/>
</filter>
<clipPath id="clip0_224_43">
<rect width="50" height="50" fill="white"/>
</clipPath>
</defs>
</svg>
