{
    "_id": "BD_C_0079",
    "question_name": "format_phone_numbers",
    "question_path": "test-bank/C_Programming/format_phone_numbers/",
    "topic": "C Programming",
    "disabled": false,
    "provisioned": 0,
    "attempts": 0,
    "passes": 0,
    "failures": 0,
    "estimated_time_to_complete": 96,
    "complexity": 3,
    "ksats": [
        "A0019",
        "A0018",
        "S0034",
        "S0032",
        "S0036",
        "S0033",
        "S0007",
        "S0052",
        "S0053",
        "S0048",
        "S0079",
        "S0097",
        "S0081",
        "S0108",
        "S0110",
        "S0082",
        "S0160"
    ],
    "created_on": "2022-06-01 13:23:11",
    "updated_on": "2022-06-01 13:23:11"
}