"Timestamp","Username","Total score","Which of the following is the boolean operator for and?","Which of the following is the boolean operator for and? [Score]","Which of the following is the boolean operator for and? [Feedback]","What is the output of the following expression?","What is the output of the following expression? [Score]","What is the output of the following expression? [Feedback]","What is the output of the following code?","What is the output of the following code? [Score]","What is the output of the following code? [Feedback]","Which statement would be used to point to int i?","Which statement would be used to point to int i? [Score]","Which statement would be used to point to int i? [Feedback]","Which format specifier can be used to print a double value?","Which format specifier can be used to print a double value? [Score]","Which format specifier can be used to print a double value? [Feedback]","What is the correct way to write a comment in c?","What is the correct way to write a comment in c? [Score]","What is the correct way to write a comment in c? [Feedback]","What is the result of int z?","What is the result of int z? [Score]","What is the result of int z? [Feedback]"," What will be the output of the following C code?"," What will be the output of the following C code? [Score]"," What will be the output of the following C code? [Feedback]","Consider the C program shown below. The output of this program is","Consider the C program shown below. The output of this program is [Score]","Consider the C program shown below. The output of this program is [Feedback]","What is the difference between the following 2 codes?","What is the difference between the following 2 codes? [Score]","What is the difference between the following 2 codes? [Feedback]","What will be the output of the following C code?","What will be the output of the following C code? [Score]","What will be the output of the following C code? [Feedback]","What will be the output of the following C code?","What will be the output of the following C code? [Score]","What will be the output of the following C code? [Feedback]"," What is #include <stdio.h>?"," What is #include <stdio.h>? [Score]"," What is #include <stdio.h>? [Feedback]","Which of the following is true?","Which of the following is true? [Score]","Which of the following is true? [Feedback]","What does the following fragment of C-program print?","What does the following fragment of C-program print? [Score]","What does the following fragment of C-program print? [Feedback]","What will be the output of the following C code?","What will be the output of the following C code? [Score]","What will be the output of the following C code? [Feedback]","What will be the output of the following C code?","What will be the output of the following C code? [Score]","What will be the output of the following C code? [Feedback]","What will be the output of the following C code?","What will be the output of the following C code? [Score]","What will be the output of the following C code? [Feedback]","What will be the output of the following C code?","What will be the output of the following C code? [Score]","What will be the output of the following C code? [Feedback]","Which loop is most suitable to first perform the operation and then test the condition?","Which loop is most suitable to first perform the operation and then test the condition? [Score]","Which loop is most suitable to first perform the operation and then test the condition? [Feedback]"
"2022/03/30 1:49:55 PM EST","jeremy_stokes_16@hotmail.com","54.00 / 63","&&","3.00 / 3","","False","3.00 / 3","","Compilation ERROR","0.00 / 3","","int_ptr = &i;","3.00 / 3","","%lf","3.00 / 3","","/** Comments **/","3.00 / 3","","4","3.00 / 3","","The program will cause a compile-time error due to redeclaration","3.00 / 3","","1276","3.00 / 3","","No difference as space doesn’t make any difference, values of a, b, d are same in both the case","0.00 / 3","","-1","3.00 / 3","","8","3.00 / 3","","Preprocessor directive","3.00 / 3","","“ptr = calloc(m, n)” is equivalent to following ptr = malloc(m * n);","3.00 / 3","","2011","3.00 / 3","","Undefined Behavior","0.00 / 3","","Same address is printed","4.00 / 4","","hello world","4.00 / 4","","nothing","4.00 / 4","","do-while loop","3.00 / 3",""
"2022/03/30 1:50:26 PM EST","williampeacock728@gmail.com","43.00 / 63","&&","3.00 / 3","","False","3.00 / 3","","123","3.00 / 3","","int_ptr = i","0.00 / 3","","%lf","3.00 / 3","","/** Comments **/","3.00 / 3","","4","3.00 / 3","","The program will cause a compile-time error due to redeclaration","3.00 / 3","","1276","3.00 / 3","","Space does make a difference, values of a, b, d are different","0.00 / 3","","-1","3.00 / 3","","8","3.00 / 3","","Preprocessor directive","3.00 / 3","","“ptr = calloc(m, n)” is equivalent to following ptr = malloc(m * n);","3.00 / 3","","E2011","0.00 / 3","","Segmentation fault/ runtime crash since pointer to local variable is returned","0.00 / 3","","Different address is printed","0.00 / 4","","hello world","4.00 / 4","","Infinite Hello","0.00 / 4","","do-while loop","3.00 / 3",""
"2022/03/30 1:51:00 PM EST","joshziebarth@yahoo.com","57.00 / 63","&&","3.00 / 3","","False","3.00 / 3","","Compilation ERROR","0.00 / 3","","int_ptr = &i;","3.00 / 3","","%lf","3.00 / 3","","/** Comments **/","3.00 / 3","","4","3.00 / 3","","The program will print 14","3.00 / 3","","1276","3.00 / 3","","No difference as space doesn’t make any difference, values of a, b, d are same in both the case","0.00 / 3","","-1","3.00 / 3","","8","3.00 / 3","","Preprocessor directive","3.00 / 3","","“ptr = calloc(m, n)” is equivalent to following ptr = malloc(m * n);","3.00 / 3","","2011","3.00 / 3","","10","3.00 / 3","","Same address is printed","4.00 / 4","","hello world","4.00 / 4","","nothing","4.00 / 4","","do-while loop","3.00 / 3",""
"2022/03/30 1:51:59 PM EST","zachary.ranes@outlook.com","43.00 / 63","&","0.00 / 3","","False","3.00 / 3","","123","3.00 / 3","","int *int_ptr;","0.00 / 3","","%lf","3.00 / 3","","/** Comments **/","3.00 / 3","","4","3.00 / 3","","The program will cause a compile-time error due to redeclaration","3.00 / 3","","1276","3.00 / 3","","Program 2 has syntax error, program 1 is not","3.00 / 3","","-1","3.00 / 3","","8","3.00 / 3","","Preprocessor directive","3.00 / 3","","“ptr = calloc(m, n)” is equivalent to following ptr = malloc(m * n);","3.00 / 3","","E2011","0.00 / 3","","Undefined Behavior","0.00 / 3","","Different address is printed","0.00 / 4","","hello world Texas","0.00 / 4","","nothing","4.00 / 4","","do-while loop","3.00 / 3",""
"2022/03/30 1:53:26 PM EST","Kurt.Haley@gmail.com","44.00 / 63","&&","3.00 / 3","","False","3.00 / 3","","Compilation ERROR","0.00 / 3","","int_ptr = &i;","3.00 / 3","","%d","0.00 / 3","","/** Comments **/","3.00 / 3","","4","3.00 / 3","","The program will print 12","0.00 / 3","","766","0.00 / 3","","Program 2 has syntax error, program 1 is not","3.00 / 3","","-1","3.00 / 3","","Run time error","0.00 / 3","","Preprocessor directive","3.00 / 3","","“ptr = calloc(m, n)” is equivalent to following ptr = malloc(m * n);","3.00 / 3","","2011","3.00 / 3","","10","3.00 / 3","","Different address is printed","0.00 / 4","","hello world","4.00 / 4","","nothing","4.00 / 4","","do-while loop","3.00 / 3",""
"2022/03/30 1:53:34 PM EST","averestless@gmail.com","42.00 / 63","&&","3.00 / 3","","False","3.00 / 3","","Compilation ERROR","0.00 / 3","","int_ptr = &i;","3.00 / 3","","%lf","3.00 / 3","","/** Comments **/","3.00 / 3","","4","3.00 / 3","","The program will cause a compile-time error due to redeclaration","3.00 / 3","","766","0.00 / 3","","No difference as space doesn’t make any difference, values of a, b, d are same in both the case","0.00 / 3","","-1","3.00 / 3","","Run time error","0.00 / 3","","Preprocessor directive","3.00 / 3","","“ptr = calloc(m, n)” is equivalent to following ptr = malloc(m);","0.00 / 3","","2011","3.00 / 3","","Undefined Behavior","0.00 / 3","","Same address is printed","4.00 / 4","","hello world","4.00 / 4","","nothing","4.00 / 4","","while loop","0.00 / 3",""
"2022/03/30 1:54:22 PM EST","sjordan129@gmail.com","31.00 / 63","&","0.00 / 3","","False","3.00 / 3","","Compilation ERROR","0.00 / 3","","None of the above","0.00 / 3","","%lf","3.00 / 3","","/** Comments **/","3.00 / 3","","11","0.00 / 3","","The program will print 14","3.00 / 3","","14 6 6","0.00 / 3","","No difference as space doesn’t make any difference, values of a, b, d are same in both the case","0.00 / 3","","-1","3.00 / 3","","8","3.00 / 3","","Preprocessor directive","3.00 / 3","","“ptr = calloc(m, n)” is equivalent to following ptr = malloc(m * n);","3.00 / 3","","2011","3.00 / 3","","11","0.00 / 3","","p and a are missing ""*"" and ""&"" to be able to access the address","0.00 / 4","","hello world","4.00 / 4","","Infinite Hello","0.00 / 4","","for loop","0.00 / 3",""
"2022/03/30 2:00:53 PM EST","pharez@andrews.edu","51.00 / 63","&&","3.00 / 3","","False","3.00 / 3","","Compilation ERROR","0.00 / 3","","int_ptr = &i;","3.00 / 3","","%lf","3.00 / 3","","/** Comments **/","3.00 / 3","","4","3.00 / 3","","The program will cause a compile-time error due to redeclaration","3.00 / 3","","1276","3.00 / 3","","Space does make a difference, values of a, b, d are different","0.00 / 3","","-1","3.00 / 3","","8","3.00 / 3","","file inclusion directive","0.00 / 3","","“ptr = calloc(m, n)” is equivalent to following ptr = malloc(m * n);","3.00 / 3","","E2011","0.00 / 3","","10","3.00 / 3","","Same address is printed","4.00 / 4","","hello world","4.00 / 4","","nothing","4.00 / 4","","do-while loop","3.00 / 3",""
"2022/03/30 2:02:29 PM EST","jane.maniago@gmail.com","54.00 / 63","&&","3.00 / 3","","False","3.00 / 3","","Compilation ERROR","0.00 / 3","","None of the above","0.00 / 3","","%lf","3.00 / 3","","/** Comments **/","3.00 / 3","","4","3.00 / 3","","The program will print 14","3.00 / 3","","1276","3.00 / 3","","Program 2 has syntax error, program 1 is not","3.00 / 3","","-1","3.00 / 3","","8","3.00 / 3","","Preprocessor directive","3.00 / 3","","“ptr = calloc(m, n)” is equivalent to following ptr = malloc(m * n);","3.00 / 3","","GATE2011","0.00 / 3","","10","3.00 / 3","","Same address is printed","4.00 / 4","","hello world","4.00 / 4","","nothing","4.00 / 4","","do-while loop","3.00 / 3",""
"2022/03/30 2:03:30 PM EST","jeffrey.selonke.usaf@gmail.com","47.00 / 63","&&","3.00 / 3","","False","3.00 / 3","","123","3.00 / 3","","int_ptr = &i;","3.00 / 3","","%lf","3.00 / 3","","/** Comments **/","3.00 / 3","","4","3.00 / 3","","The program will cause a compile-time error due to redeclaration","3.00 / 3","","1276","3.00 / 3","","No difference as space doesn’t make any difference, values of a, b, d are same in both the case","0.00 / 3","","-1","3.00 / 3","","8","3.00 / 3","","Preprocessor directive","3.00 / 3","","“ptr = calloc(m, n)” is equivalent to following ptr = malloc(m);","0.00 / 3","","E2011","0.00 / 3","","Undefined Behavior","0.00 / 3","","Compile time error","0.00 / 4","","hello world","4.00 / 4","","nothing","4.00 / 4","","do-while loop","3.00 / 3",""
"2022/03/30 2:03:36 PM EST","darryl.santry@newcastlede.gov","41.00 / 63","&&","3.00 / 3","","False","3.00 / 3","","Compilation ERROR","0.00 / 3","","None of the above","0.00 / 3","","%lf","3.00 / 3","","/** Comments **/","3.00 / 3","","4","3.00 / 3","","The program will cause a compile-time error due to redeclaration","3.00 / 3","","766","0.00 / 3","","No difference as space doesn’t make any difference, values of a, b, d are same in both the case","0.00 / 3","","-1","3.00 / 3","","8","3.00 / 3","","Preprocessor directive","3.00 / 3","","“ptr = calloc(m, n)” is equivalent to following ptr = malloc(m * n);","3.00 / 3","","E2011","0.00 / 3","","Segmentation fault/ runtime crash since pointer to local variable is returned","0.00 / 3","","Same address is printed","4.00 / 4","","hello world","4.00 / 4","","Infinite Hello","0.00 / 4","","do-while loop","3.00 / 3",""
"2022/03/30 2:04:03 PM EST","randy.mcnutt@gmail.com","48.00 / 63","&&","3.00 / 3","","False","3.00 / 3","","Compilation ERROR","0.00 / 3","","None of the above","0.00 / 3","","%lf","3.00 / 3","","/** Comments **/","3.00 / 3","","4","3.00 / 3","","The program will cause a compile-time error due to redeclaration","3.00 / 3","","1276","3.00 / 3","","Program 2 has syntax error, program 1 is not","3.00 / 3","","-3","0.00 / 3","","8","3.00 / 3","","Preprocessor directive","3.00 / 3","","“ptr = calloc(m, n)” is equivalent to following ptr = malloc(m * n);","3.00 / 3","","E2011","0.00 / 3","","Segmentation fault/ runtime crash since pointer to local variable is returned","0.00 / 3","","Same address is printed","4.00 / 4","","hello world","4.00 / 4","","nothing","4.00 / 4","","do-while loop","3.00 / 3",""