{
  "URL_WARD": "http://dvctt.phuongcogiang.gov.vn",
  "URL_DICH_VU_CONG_HCMC": "https://dichvucong.hochiminhcity.gov.vn",
  "URL_DICH_VU_CONG_QG": "https://dichvucong.gov.vn",
  "URL_DICH_VU_CONG_BCA": "https://dichvucong.bocongan.gov.vn"
}