[
  {
    "name": "Lê Thu Huyền",
    "position": "Bí thư",
    "phoneNumber": "090 8418 177"
  },
  {
    "name": "Huỳnh Minh thắng",
    "position": "Phó Bí thư",
    "phoneNumber": "091 3121 720"
  },
  {
    "name": "trần trọng nghĩa",
    "position": "Chủ tịch UBND",
    "phoneNumber": "0916 999 978"
  },
  {
    "name": "Huỳnh thị ngọc hân",
    "position": "Phó chủ tich UBND",
    "phoneNumber": "093 3822 768"
  },
  {
    "name": "phạm văn thêm",
    "position": "Phó chủ tich UBND",
    "phoneNumber": "090 8235 489"
  },
  {
    "name": "dương tự quốc khánh",
    "position": "CHT BCHH Quân Sự",
    "phoneNumber": "090 8254 064"
  },
  {
    "name": "huỳnh thanh nhung",
    "position": "Chủ tịch UB.MTTQVN",
    "phoneNumber": "090 7070 858"
  },
  {
    "name": "Lâm văn trí",
    "position": "Bí thư'",
    "phoneNumber": "090 3312 206"
  }
]
