<svg xmlns="http://www.w3.org/2000/svg" xmlns:xlink="http://www.w3.org/1999/xlink" width="21.031" height="22.067" viewBox="0 0 21.031 22.067">
  <defs>
    <style>
      .cls-1 {
        fill: #f0a508;
      }

      .cls-2 {
        fill: url(#linear-gradient);
      }

      .cls-3 {
        opacity: 0.8;
        fill: url(#linear-gradient-2);
      }

      .cls-4 {
        fill: url(#linear-gradient-3);
      }

      .cls-5 {
        filter: url(#路径_24495);
      }
    </style>
    <linearGradient id="linear-gradient" x1="0.111" y1="1.102" x2="0.543" y2="-0.185" gradientUnits="objectBoundingBox">
      <stop offset="0" stop-color="#ffc119"/>
      <stop offset="1" stop-color="#fde45b"/>
    </linearGradient>
    <linearGradient id="linear-gradient-2" x1="-0.009" y1="1.336" x2="0.581" y2="-0.56" gradientUnits="objectBoundingBox">
      <stop offset="0" stop-color="#e58700"/>
      <stop offset="1" stop-color="#ffce00"/>
    </linearGradient>
    <linearGradient id="linear-gradient-3" x1="-0.111" y1="1.449" x2="0.529" y2="-0.107" gradientUnits="objectBoundingBox">
      <stop offset="0" stop-color="#ffd86e"/>
      <stop offset="1" stop-color="#fddd4d"/>
    </linearGradient>
    <filter id="路径_24495" x="3.9" y="6.274" width="13.202" height="10.293" filterUnits="userSpaceOnUse">
      <feOffset dy="1" input="SourceAlpha"/>
      <feGaussianBlur stdDeviation="0.5" result="blur"/>
      <feFlood flood-color="#e08a04" flood-opacity="0.161"/>
      <feComposite operator="in" in2="blur"/>
      <feComposite in="SourceGraphic"/>
    </filter>
  </defs>
  <g id="icon_wicc" transform="translate(-159.435 -197.843)">
    <path id="路径_92919" data-name="路径 92919" class="cls-1" d="M10.531.067a10.5,10.5,0,1,1-10.5,10.5A10.5,10.5,0,0,1,10.531.067Z" transform="translate(159.435 198.843)"/>
    <ellipse id="椭圆_7123" data-name="椭圆 7123" class="cls-2" cx="10.5" cy="10.5" rx="10.5" ry="10.5" transform="translate(159.435 197.843)"/>
    <ellipse id="椭圆_7124" data-name="椭圆 7124" class="cls-3" cx="8.449" cy="8.48" rx="8.449" ry="8.48" transform="translate(161.486 199.894)"/>
    <g id="组_19221" data-name="组 19221" transform="translate(164.835 204.617)">
      <g class="cls-5" transform="matrix(1, 0, 0, 1, -5.4, -6.77)">
        <path id="路径_24495-2" data-name="路径 24495" class="cls-4" d="M-292.385,613.989h2.14l.77,4.083,1.128-4.083h2.133l1.131,4.078.772-4.078h2.129l-1.607,7.293H-286l-1.279-4.591-1.274,4.591h-2.209Z" transform="translate(297.79 -607.21)"/>
      </g>
    </g>
  </g>
</svg>
