<svg xmlns="http://www.w3.org/2000/svg" xmlns:xlink="http://www.w3.org/1999/xlink" width="347" height="406" viewBox="0 0 347 406">
  <defs>
    <style>
      .cls-1 {
        fill: #fff;
      }

      .cls-2 {
        fill: #88cbff;
        opacity: 0.51;
      }

      .cls-3 {
        fill: #c2e4ff;
      }

      .cls-4 {
        filter: url(#矩形_21562);
      }

      .cls-5 {
        filter: url(#矩形_21561);
      }

      .cls-6 {
        filter: url(#减去_3177);
      }

      .cls-7 {
        filter: url(#矩形_21550);
      }
    </style>
    <filter id="矩形_21550" x="0" y="0" width="346.999" height="181" filterUnits="userSpaceOnUse">
      <feOffset input="SourceAlpha"/>
      <feGaussianBlur stdDeviation="2" result="blur"/>
      <feFlood flood-opacity="0.161"/>
      <feComposite operator="in" in2="blur"/>
      <feComposite in="SourceGraphic"/>
    </filter>
    <filter id="减去_3177" x="0" y="179" width="346.999" height="227" filterUnits="userSpaceOnUse">
      <feOffset input="SourceAlpha"/>
      <feGaussianBlur stdDeviation="2" result="blur-2"/>
      <feFlood flood-opacity="0.161"/>
      <feComposite operator="in" in2="blur-2"/>
      <feComposite in="SourceGraphic"/>
    </filter>
    <filter id="矩形_21561" x="25" y="163.479" width="3.5" height="30" filterUnits="userSpaceOnUse">
      <feOffset dx="0.5" input="SourceAlpha"/>
      <feGaussianBlur result="blur-3"/>
      <feFlood flood-opacity="0.102"/>
      <feComposite operator="in" in2="blur-3"/>
      <feComposite in="SourceGraphic"/>
    </filter>
    <filter id="矩形_21562" x="317" y="163.479" width="3.5" height="30" filterUnits="userSpaceOnUse">
      <feOffset dx="0.5" input="SourceAlpha"/>
      <feGaussianBlur result="blur-4"/>
      <feFlood flood-opacity="0.102"/>
      <feComposite operator="in" in2="blur-4"/>
      <feComposite in="SourceGraphic"/>
    </filter>
  </defs>
  <g id="content_bg" transform="translate(-14 -170.521)">
    <g class="cls-7" transform="matrix(1, 0, 0, 1, 14, 170.52)">
      <rect id="矩形_21550-2" data-name="矩形 21550" class="cls-1" width="334.999" height="169" rx="12" transform="translate(6 6)"/>
    </g>
    <path id="减去_3200" data-name="减去 3200" class="cls-2" d="M-4953,56h-311a12,12,0,0,1-5.96-1.583,12.083,12.083,0,0,1-4.287-4.17A11.975,11.975,0,0,0-5268,52h311a12.014,12.014,0,0,0,12-12V-105a11.976,11.976,0,0,0-1.752-6.247,12.082,12.082,0,0,1,4.17,4.287A12,12,0,0,1-4941-101V44a11.92,11.92,0,0,1-3.515,8.485A11.922,11.922,0,0,1-4953,56Z" transform="translate(5296 289.521)"/>
    <g class="cls-6" transform="matrix(1, 0, 0, 1, 14, 170.52)">
      <path id="减去_3177-2" data-name="减去 3177" class="cls-1" d="M-4900-9231h-311a11.919,11.919,0,0,1-8.484-3.515A11.925,11.925,0,0,1-5223-9243v-191a12.013,12.013,0,0,1,12-12h311a11.917,11.917,0,0,1,8.483,3.515A11.923,11.923,0,0,1-4888-9434v191a11.924,11.924,0,0,1-3.515,8.486A11.916,11.916,0,0,1-4900-9231Z" transform="translate(5229 9631)"/>
    </g>
    <g id="组_24766" data-name="组 24766" transform="translate(0 17)">
      <circle id="椭圆_7612" data-name="椭圆 7612" class="cls-3" cx="3.5" cy="3.5" r="3.5" transform="translate(37 315)"/>
      <circle id="椭圆_7614" data-name="椭圆 7614" class="cls-3" cx="3.5" cy="3.5" r="3.5" transform="translate(37 342)"/>
      <g class="cls-5" transform="matrix(1, 0, 0, 1, 14, 153.52)">
        <rect id="矩形_21561-2" data-name="矩形 21561" class="cls-3" width="3" height="30" transform="translate(25 163.48)"/>
      </g>
    </g>
    <g id="组_24767" data-name="组 24767" transform="translate(0 15)">
      <circle id="椭圆_7613" data-name="椭圆 7613" class="cls-3" cx="3.5" cy="3.5" r="3.5" transform="translate(329 317)"/>
      <circle id="椭圆_7615" data-name="椭圆 7615" class="cls-3" cx="3.5" cy="3.5" r="3.5" transform="translate(329 344)"/>
      <g class="cls-4" transform="matrix(1, 0, 0, 1, 14, 155.52)">
        <rect id="矩形_21562-2" data-name="矩形 21562" class="cls-3" width="3" height="30" transform="translate(317 163.48)"/>
      </g>
    </g>
    <path id="减去_3203" data-name="减去 3203" class="cls-2" d="M329,221H18a12.032,12.032,0,0,1-11.038-7.278A11.887,11.887,0,0,0,14,216H325a12,12,0,0,0,12-12V13a11.932,11.932,0,0,0-.961-4.723,12.2,12.2,0,0,1,1.447,1.238A11.924,11.924,0,0,1,341,18V209a12,12,0,0,1-12,12Z" transform="translate(14 349.521)"/>
  </g>
</svg>
