{
    "loop" : {
        "description": "`VC` loop detection attributes, related to *vehicle* content",
        "type": "object",
        "properties": {
            "tls" : {
                "description": "TLS specific parameters (accordingly BASt standard)",
                "type": "object",
                "properties": {
                    "class" : {
                        "description" : "vehicle class (TLS 8+1)",
                        "type" : "integer",
                        "format" : "int32",
                        "enum" : [0,2,3,5,6,7,8,9,10,11],
                        "default" : 0,
                        "example" : 7
                    }
                }
            },
            "cost323" : {
                "description": "COST323 specific parameters",
                "type": "object",
                "properties": {
                    "class" : {
                        "description" : "vehicle category (TLS 8+1)",
                        "type" : "integer",
                        "format" : "int32",
                        "enum" : [0,1,2,3,4,5,6,7,8],
                        "default" : 0,
                        "example" : 1
                    }
                }
            }
        }
    }
}