{
    "status": {
        "description": "A status info returned by system component",
        "type": "object",
        "properties": {
            "time": {
                "description": "Date and time (with milliseconds) of vehicle detection (UTC)",
                "type": "string",
                "example": "2020-01-01T08:00:00.100Z"
            },
            "time-info": {
                "$ref" : "../components/time-info.json#/time-info"
            },
            "host" : {
                "$ref": "../components/host.json#/host"
            },
            "system" : {
                "$ref": "../components/system.json#/system"
            },
            "devices" : {
                "type": "object",
                "description" : "list of devices / sensors attached to terminal",
                "properties": {
                    "cpu-0" : {
                        "$ref": "../components/device.json#/device"
                    }
                }
            },
            "services" : {
                "type": "object",
                "description" : "list of services running on terminal",
                "properties": {
                    "api" : {
                        "$ref": "../components/service.json#/service"
                    }
                }
            }
        },
        "required" : [
            "id",
            "system"
        ]
    }
}