{
    "sectiontrace": {
        "description": "Information about single section match which has been registered at a specific place and given time",
        "type": "object",
        "properties": {
            "id": {
                "description": "Unique event identifier including timestamp UTC and unique section ID",
                "type": "string",
                "example": "SectionTrace-20200101-080000-100-212b3f84a169d2dbf712d2cd717256f3"
            },
            "type": {
                "description": "Dataset type",
                "type": "string",
                "enum": [
                    "SectionTrace"
                ],
                "example": "SectionTrace"
            },
            "version": {
                "description": "Version of data record format (should be 4.x)",
                "type": "string",
                "example": "4.3"
            },
            "time": {
                "description": "Date and time (with milliseconds) of section detection (time of last VehicleTrace; UTC)",
                "type": "string",
                "example": "2020-01-01T08:00:00.100Z"
            },
            "time-info": {
                "$ref": "../components/time-info.json#/time-info"
            },
            "terminal": {
                "description": "source (terminal)",
                "type": "object",
                "required": [
                    "id"
                ],
                "properties": {
                    "id": {
                        "$ref": "../terminals/terminal-ref.json#/terminal/properties/id"
                    }
                }
            },
            "section": {
                "$ref": "../traffic/section.json#/section"
            },
            "vehicle": {
                "$ref": "../vehicles/vehicle.json#/vehicle"
            },
            "resources": {
                "$ref": "../resources/resources.json#/resources"
            },
            "extensions": {
                "type": "object",
                "properties" : {
                    "ssc" : {
                        "$ref": "./extensions-ssc.json#/ssc"
                    }
                }
            }
        },
        "required": [
            "id",
            "type",
            "version",
            "time",
            "time-info",
            "location",
            "terminal",
            "section",
            "events"
        ]
    }
}
