{
    "parking": {
        "type": "object",
        "description": "Parking lot specification extension - full info with actual state",
        "properties": {
            "id" : {
                "$ref": "./parking-ref.json#/parking/properties/id"
            },                      
            "location" : {
                "$ref": "../locations/location-park.json#/location"
            },
            "name" : {
                "$ref": "./parking-ref.json#/parking/properties/name"
            },
            "description" : {
                "$ref": "./parking-ref.json#/parking/properties/description"
            },  
            "is-closed": {
                "$ref": "./parking-ref.json#/parking/properties/is-closed"
            },
            "is-paid": {
                "$ref": "./parking-ref.json#/parking/properties/is-paid"
            },
            "kind" : {
                "$ref": "./parking-ref.json#/parking/properties/kind"
            },        
            "zones" : {
                "description" : "List of all parking zones (with actual state)",
                "type": "array",
                "items" : {
                    "$ref": "./zone.json#/zone"
                }
            },
            "pictures" : {
                "$ref": "./parking-ref.json#/parking/properties/pictures"
            },
            "occupancy" : {
                "$ref": "./occupancy.json#/occupancy"
            }
        },
        "required" : [
            "id",
            "location",
            "name",
            "zones",
            "is-closed",
            "is-paid",
            "occupancy"
        ]            
    }
}