{
    "point" : {
        "allOf": [
            {
                "$ref": "entity-attributes.json#/entity-attributes"
            },
            {
                "description" : "Traffic pattern - point - definition",
                "type": "object",
                "properties": {
                    "lanes": {
                        "description" : "list of location.id-s that are included in that point",
                        "type": "array",
                        "items": {
                            "type": "string",
                            "minItems": 1,
                            "maxItems": 16,
                            "uniqueItems": false                            
                        },
                        "example" : ["pl-wrotest-l1"]
                    }
                },
                "required": [
                "lanes"
                ]
            }
        ]        
    }
}
