{
    "resources": {
        "description": "Additional (test/binary) attachments attached to the main event",
        "type": "object",
        "properties": {
            "filename.ext" : {
                "description" : "Filename (with extension) and attributes",
                "type" : "object",
                "properties": {
                    "kind" : {
                        "description" : "Resource semantics",
                        "type"        : "string",
                        "example"     : "laneview"
                    },
                    "mimetype" : {
                        "description" : "Indicate the media type of the resource (MIME type - RFC 6838)",
                        "type"        : "string",
                        "example"     : "image/jpeg"
                    },
                    "size" : {
                        "description" : "File / resource size, in bytes",
                        "type" : "integer",
                        "format" : "int64",
                        "example" : 219873
                    },
                    "resolution" : {
                        "description" : "Additional info about the resource geometry (",
                        "type" : "array",
                        "items" : {
                            "type" : "integer",
                            "format" : "int32"
                        },
                        "example" : [2048, 1536]
                    },
                    "checksum" : {
                        "description" : "Checksum - hash to verify data consistency",
                        "type" : "string",
                        "example" : "{SHA256}01992865718f1f16b69a5bf79253662c2e196a2a383566c3471e657fc45d26fe"
                    }
                },
                "required": [
                    "kind",
                    "mimetype",
                    "size"
                ]                
            }
        }
    }
}
