{
    "parking": {
        "type": "object",
        "description": "Parking lot specification extension - message format",
        "properties": {
            "type" : {
                "description": "data record type",
                "type": "string",
                "enum": ["Parking"],
                "example": "Parking"
            },  
            "version" : {
                "description": "data record version",
                "type": "string",
                "example": "4.0"
            },
            "id": {
                "description": "Unique event identifier",
                "type": "string",
                "example": "Parking-20200101-080000-100-pl-wrobaluckiego"
            },             
            "time": {
                "description": "Current date and time (UTC)",
                "type": "string",
                "example": "2022-01-01T08:00:00.100Z"
            },            
            "time-info": {
                "$ref": "../components/time-info.json#/time-info"
            },
            "parking" : {
                "$ref": "./parking.json#/parking"
            }
        },
        "required" : [
            "id",
            "type",
            "version",
            "time",
            "parking"
        ]
    }

}