{
	"info": {
		"_postman_id": "6c2b718c-ffd0-4e9a-b432-bb38801409ce",
		"name": "A3",
		"schema": "https://schema.getpostman.com/json/collection/v2.1.0/collection.json",
		"_exporter_id": "23572316"
	},
	"item": [
		{
			"name": "golang-mux",
			"item": [
				{
					"name": "GET ALL BOOKS",
					"request": {
						"method": "GET",
						"header": []
					},
					"response": []
				},
				{
					"name": "GET SINGLE BOOK",
					"request": {
						"method": "GET",
						"header": []
					},
					"response": []
				},
				{
					"name": "CREATE BOOK",
					"request": {
						"method": "POST",
						"header": [],
						"body": {
							"mode": "raw",
							"raw": "{\r\n    \"isbn\":\"0000000\",\r\n    \"title\":\"Book Two\",\r\n    \"author\":{\"firstname\":\"Alam\", \"lastname\":\"syah\"}\r\n}",
							"options": {
								"raw": {
									"language": "json"
								}
							}
						},
						"url": {
							"raw": "http://localhost:8000/api/books",
							"protocol": "http",
							"host": [
								"localhost"
							],
							"port": "8000",
							"path": [
								"api",
								"books"
							]
						}
					},
					"response": []
				},
				{
					"name": "DELETE BOOK",
					"request": {
						"method": "DELETE",
						"header": [],
						"url": {
							"raw": "http://localhost:8000/api/books/8498081",
							"protocol": "http",
							"host": [
								"localhost"
							],
							"port": "8000",
							"path": [
								"api",
								"books",
								"8498081"
							]
						}
					},
					"response": []
				},
				{
					"name": "UPDATE BOOK",
					"request": {
						"method": "PUT",
						"header": [],
						"body": {
							"mode": "raw",
							"raw": "{\r\n    \"isbn\":\"1234567890543\",\r\n    \"title\":\"Book Fourrr\",\r\n    \"author\":{\"firstname\":\"bahar\",\"lastname\":\"alamsyah\"}\r\n}",
							"options": {
								"raw": {
									"language": "json"
								}
							}
						},
						"url": {
							"raw": "http://localhost:8000/api/books/1",
							"protocol": "http",
							"host": [
								"localhost"
							],
							"port": "8000",
							"path": [
								"api",
								"books",
								"1"
							]
						}
					},
					"response": []
				}
			]
		}
	]
}