Linked: (/home/eaibot/2022_jsjds/ros_ws/devel/.private/shape_msgs/include/shape_msgs/Mesh.h, /home/eaibot/2022_jsjds/ros_ws/devel/include/shape_msgs/Mesh.h)
Linked: (/home/eaibot/2022_jsjds/ros_ws/devel/.private/shape_msgs/include/shape_msgs/MeshTriangle.h, /home/eaibot/2022_jsjds/ros_ws/devel/include/shape_msgs/MeshTriangle.h)
Linked: (/home/eaibot/2022_jsjds/ros_ws/devel/.private/shape_msgs/include/shape_msgs/Plane.h, /home/eaibot/2022_jsjds/ros_ws/devel/include/shape_msgs/Plane.h)
Linked: (/home/eaibot/2022_jsjds/ros_ws/devel/.private/shape_msgs/include/shape_msgs/SolidPrimitive.h, /home/eaibot/2022_jsjds/ros_ws/devel/include/shape_msgs/SolidPrimitive.h)
Linked: (/home/eaibot/2022_jsjds/ros_ws/devel/.private/shape_msgs/lib/pkgconfig/shape_msgs.pc, /home/eaibot/2022_jsjds/ros_ws/devel/lib/pkgconfig/shape_msgs.pc)
Linked: (/home/eaibot/2022_jsjds/ros_ws/devel/.private/shape_msgs/lib/python3.6/site-packages/shape_msgs/__init__.py, /home/eaibot/2022_jsjds/ros_ws/devel/lib/python3.6/site-packages/shape_msgs/__init__.py)
Linked: (/home/eaibot/2022_jsjds/ros_ws/devel/.private/shape_msgs/lib/python3.6/site-packages/shape_msgs/msg/__init__.py, /home/eaibot/2022_jsjds/ros_ws/devel/lib/python3.6/site-packages/shape_msgs/msg/__init__.py)
Linked: (/home/eaibot/2022_jsjds/ros_ws/devel/.private/shape_msgs/lib/python3.6/site-packages/shape_msgs/msg/_SolidPrimitive.py, /home/eaibot/2022_jsjds/ros_ws/devel/lib/python3.6/site-packages/shape_msgs/msg/_SolidPrimitive.py)
Linked: (/home/eaibot/2022_jsjds/ros_ws/devel/.private/shape_msgs/lib/python3.6/site-packages/shape_msgs/msg/_Plane.py, /home/eaibot/2022_jsjds/ros_ws/devel/lib/python3.6/site-packages/shape_msgs/msg/_Plane.py)
Linked: (/home/eaibot/2022_jsjds/ros_ws/devel/.private/shape_msgs/lib/python3.6/site-packages/shape_msgs/msg/_MeshTriangle.py, /home/eaibot/2022_jsjds/ros_ws/devel/lib/python3.6/site-packages/shape_msgs/msg/_MeshTriangle.py)
Linked: (/home/eaibot/2022_jsjds/ros_ws/devel/.private/shape_msgs/lib/python3.6/site-packages/shape_msgs/msg/_Mesh.py, /home/eaibot/2022_jsjds/ros_ws/devel/lib/python3.6/site-packages/shape_msgs/msg/_Mesh.py)
Linked: (/home/eaibot/2022_jsjds/ros_ws/devel/.private/shape_msgs/share/roseus/ros/shape_msgs/manifest.l, /home/eaibot/2022_jsjds/ros_ws/devel/share/roseus/ros/shape_msgs/manifest.l)
Linked: (/home/eaibot/2022_jsjds/ros_ws/devel/.private/shape_msgs/share/roseus/ros/shape_msgs/msg/MeshTriangle.l, /home/eaibot/2022_jsjds/ros_ws/devel/share/roseus/ros/shape_msgs/msg/MeshTriangle.l)
Linked: (/home/eaibot/2022_jsjds/ros_ws/devel/.private/shape_msgs/share/roseus/ros/shape_msgs/msg/Mesh.l, /home/eaibot/2022_jsjds/ros_ws/devel/share/roseus/ros/shape_msgs/msg/Mesh.l)
Linked: (/home/eaibot/2022_jsjds/ros_ws/devel/.private/shape_msgs/share/roseus/ros/shape_msgs/msg/SolidPrimitive.l, /home/eaibot/2022_jsjds/ros_ws/devel/share/roseus/ros/shape_msgs/msg/SolidPrimitive.l)
Linked: (/home/eaibot/2022_jsjds/ros_ws/devel/.private/shape_msgs/share/roseus/ros/shape_msgs/msg/Plane.l, /home/eaibot/2022_jsjds/ros_ws/devel/share/roseus/ros/shape_msgs/msg/Plane.l)
Linked: (/home/eaibot/2022_jsjds/ros_ws/devel/.private/shape_msgs/share/shape_msgs/cmake/shape_msgs-msg-extras.cmake, /home/eaibot/2022_jsjds/ros_ws/devel/share/shape_msgs/cmake/shape_msgs-msg-extras.cmake)
Linked: (/home/eaibot/2022_jsjds/ros_ws/devel/.private/shape_msgs/share/shape_msgs/cmake/shape_msgs-msg-paths.cmake, /home/eaibot/2022_jsjds/ros_ws/devel/share/shape_msgs/cmake/shape_msgs-msg-paths.cmake)
Linked: (/home/eaibot/2022_jsjds/ros_ws/devel/.private/shape_msgs/share/shape_msgs/cmake/shape_msgsConfig.cmake, /home/eaibot/2022_jsjds/ros_ws/devel/share/shape_msgs/cmake/shape_msgsConfig.cmake)
Linked: (/home/eaibot/2022_jsjds/ros_ws/devel/.private/shape_msgs/share/shape_msgs/cmake/shape_msgsConfig-version.cmake, /home/eaibot/2022_jsjds/ros_ws/devel/share/shape_msgs/cmake/shape_msgsConfig-version.cmake)
Linked: (/home/eaibot/2022_jsjds/ros_ws/devel/.private/shape_msgs/share/common-lisp/ros/shape_msgs/msg/_package_MeshTriangle.lisp, /home/eaibot/2022_jsjds/ros_ws/devel/share/common-lisp/ros/shape_msgs/msg/_package_MeshTriangle.lisp)
Linked: (/home/eaibot/2022_jsjds/ros_ws/devel/.private/shape_msgs/share/common-lisp/ros/shape_msgs/msg/MeshTriangle.lisp, /home/eaibot/2022_jsjds/ros_ws/devel/share/common-lisp/ros/shape_msgs/msg/MeshTriangle.lisp)
Linked: (/home/eaibot/2022_jsjds/ros_ws/devel/.private/shape_msgs/share/common-lisp/ros/shape_msgs/msg/shape_msgs-msg.asd, /home/eaibot/2022_jsjds/ros_ws/devel/share/common-lisp/ros/shape_msgs/msg/shape_msgs-msg.asd)
Linked: (/home/eaibot/2022_jsjds/ros_ws/devel/.private/shape_msgs/share/common-lisp/ros/shape_msgs/msg/Mesh.lisp, /home/eaibot/2022_jsjds/ros_ws/devel/share/common-lisp/ros/shape_msgs/msg/Mesh.lisp)
Linked: (/home/eaibot/2022_jsjds/ros_ws/devel/.private/shape_msgs/share/common-lisp/ros/shape_msgs/msg/_package_Mesh.lisp, /home/eaibot/2022_jsjds/ros_ws/devel/share/common-lisp/ros/shape_msgs/msg/_package_Mesh.lisp)
Linked: (/home/eaibot/2022_jsjds/ros_ws/devel/.private/shape_msgs/share/common-lisp/ros/shape_msgs/msg/_package_Plane.lisp, /home/eaibot/2022_jsjds/ros_ws/devel/share/common-lisp/ros/shape_msgs/msg/_package_Plane.lisp)
Linked: (/home/eaibot/2022_jsjds/ros_ws/devel/.private/shape_msgs/share/common-lisp/ros/shape_msgs/msg/_package.lisp, /home/eaibot/2022_jsjds/ros_ws/devel/share/common-lisp/ros/shape_msgs/msg/_package.lisp)
Linked: (/home/eaibot/2022_jsjds/ros_ws/devel/.private/shape_msgs/share/common-lisp/ros/shape_msgs/msg/Plane.lisp, /home/eaibot/2022_jsjds/ros_ws/devel/share/common-lisp/ros/shape_msgs/msg/Plane.lisp)
Linked: (/home/eaibot/2022_jsjds/ros_ws/devel/.private/shape_msgs/share/common-lisp/ros/shape_msgs/msg/SolidPrimitive.lisp, /home/eaibot/2022_jsjds/ros_ws/devel/share/common-lisp/ros/shape_msgs/msg/SolidPrimitive.lisp)
Linked: (/home/eaibot/2022_jsjds/ros_ws/devel/.private/shape_msgs/share/common-lisp/ros/shape_msgs/msg/_package_SolidPrimitive.lisp, /home/eaibot/2022_jsjds/ros_ws/devel/share/common-lisp/ros/shape_msgs/msg/_package_SolidPrimitive.lisp)
Linked: (/home/eaibot/2022_jsjds/ros_ws/devel/.private/shape_msgs/share/gennodejs/ros/shape_msgs/_index.js, /home/eaibot/2022_jsjds/ros_ws/devel/share/gennodejs/ros/shape_msgs/_index.js)
Linked: (/home/eaibot/2022_jsjds/ros_ws/devel/.private/shape_msgs/share/gennodejs/ros/shape_msgs/msg/_index.js, /home/eaibot/2022_jsjds/ros_ws/devel/share/gennodejs/ros/shape_msgs/msg/_index.js)
Linked: (/home/eaibot/2022_jsjds/ros_ws/devel/.private/shape_msgs/share/gennodejs/ros/shape_msgs/msg/Plane.js, /home/eaibot/2022_jsjds/ros_ws/devel/share/gennodejs/ros/shape_msgs/msg/Plane.js)
Linked: (/home/eaibot/2022_jsjds/ros_ws/devel/.private/shape_msgs/share/gennodejs/ros/shape_msgs/msg/Mesh.js, /home/eaibot/2022_jsjds/ros_ws/devel/share/gennodejs/ros/shape_msgs/msg/Mesh.js)
Linked: (/home/eaibot/2022_jsjds/ros_ws/devel/.private/shape_msgs/share/gennodejs/ros/shape_msgs/msg/MeshTriangle.js, /home/eaibot/2022_jsjds/ros_ws/devel/share/gennodejs/ros/shape_msgs/msg/MeshTriangle.js)
Linked: (/home/eaibot/2022_jsjds/ros_ws/devel/.private/shape_msgs/share/gennodejs/ros/shape_msgs/msg/SolidPrimitive.js, /home/eaibot/2022_jsjds/ros_ws/devel/share/gennodejs/ros/shape_msgs/msg/SolidPrimitive.js)
