[36mInstall the project...[0m
-- Install configuration: "Release"
-- Installing: /home/eaibot/2022_jsjds/ros_ws/install/_setup_util.py
-- Installing: /home/eaibot/2022_jsjds/ros_ws/install/env.sh
-- Installing: /home/eaibot/2022_jsjds/ros_ws/install/setup.bash
-- Installing: /home/eaibot/2022_jsjds/ros_ws/install/local_setup.bash
-- Installing: /home/eaibot/2022_jsjds/ros_ws/install/setup.sh
-- Installing: /home/eaibot/2022_jsjds/ros_ws/install/local_setup.sh
-- Installing: /home/eaibot/2022_jsjds/ros_ws/install/setup.zsh
-- Installing: /home/eaibot/2022_jsjds/ros_ws/install/local_setup.zsh
-- Installing: /home/eaibot/2022_jsjds/ros_ws/install/.rosinstall
-- Installing: /home/eaibot/2022_jsjds/ros_ws/install/share/desktop_full/package.xml
