2023-08-07 21:15:55,218 - INFO - distance of the obstacle : 0.386 - single_laser.py
2023-08-07 21:16:06,642 - INFO - distance of the obstacle : 0.491 - single_laser.py
2023-08-07 21:16:52,223 - INFO - distance of the obstacle : 0.359 - single_laser.py
2023-08-07 21:16:58,633 - INFO - distance of the obstacle : 0.337 - single_laser.py
2023-08-07 21:17:16,467 - INFO - distance of the obstacle : 0.554 - single_laser.py
2023-08-07 21:17:30,504 - INFO - distance of the obstacle : 0.648 - single_laser.py
2023-08-07 21:18:32,122 - INFO - distance of the obstacle : 0.271 - single_laser.py
2023-08-07 21:18:51,383 - INFO - distance of the obstacle : 0.296 - single_laser.py
2023-08-07 21:19:21,580 - INFO - distance of the obstacle : 0.512 - single_laser.py
2023-08-07 21:19:35,682 - INFO - distance of the obstacle : 0.675 - single_laser.py
2023-08-07 21:20:21,786 - INFO - distance of the obstacle : 0.28 - single_laser.py
2023-08-07 21:20:48,046 - INFO - distance of the obstacle : 0.22 - single_laser.py
2023-08-07 21:21:17,720 - INFO - distance of the obstacle : 0.506 - single_laser.py
2023-08-07 21:21:31,710 - INFO - distance of the obstacle : 0.667 - single_laser.py
2023-08-07 21:22:13,767 - INFO - distance of the obstacle : 0.261 - single_laser.py
2023-08-07 21:22:29,356 - INFO - distance of the obstacle : 0.252 - single_laser.py
