2023-07-24 20:33:20,119 - INFO - distance of the obstacle : 0.697 - single_laser.py
2023-07-24 20:34:26,474 - INFO - distance of the obstacle : 0.209 - single_laser.py
2023-07-24 20:34:36,883 - INFO - distance of the obstacle : 0.18 - single_laser.py
2023-07-24 20:35:08,453 - INFO - distance of the obstacle : 0.508 - single_laser.py
2023-07-24 20:35:30,851 - INFO - distance of the obstacle : 0.665 - single_laser.py
2023-07-24 20:36:37,062 - INFO - distance of the obstacle : 0.176 - single_laser.py
2023-07-24 20:37:15,065 - INFO - distance of the obstacle : 0.508 - single_laser.py
2023-07-24 20:37:37,017 - INFO - distance of the obstacle : 0.682 - single_laser.py
