// generated VGG pooling region filters & projection parameters

// PR: [pr-learn/liberty-0.035-0.250-pr.h5]#7
// PJ: [pj-learn/notredame-liberty-0.035-0.250-pr#7-0.0010-0.100-pj.h5]


// PR orig rows
static const int PRrows = 68;

// PR orig cols
static const int PRcols = 4096;

// PR indexes & len
static const unsigned int PRidx[] =
{
 0xa92,0x29,0xad2,0x29,0xb12,0x29,0xb52,0x29,0xb92,0x29,0xbd2,0x29,0xc12,0x29,0xc52,0x29,
 0xc92,0x29,0xcd2,0x29,0xd12,0x29,0xd52,0x29,0xd92,0x29,0xdd2,0x29,0xe12,0x29,0xe52,0x29,
 0xe92,0x29,0xed2,0x29,0xf12,0x29,0xf52,0x29,0xf92,0x29,0xfd2,0x29,0x1a85,0x29,0x1ac5,0x29,
 0x1b05,0x29,0x1b45,0x29,0x1b85,0x29,0x1bc5,0x29,0x1c05,0x29,0x1c45,0x29,0x1c85,0x29,0x1cc5,0x29,
 0x1d05,0x29,0x1d45,0x29,0x1d85,0x29,0x1dc5,0x29,0x1e05,0x29,0x1e45,0x29,0x1e85,0x29,0x1ec5,0x29,
 0x1f05,0x29,0x1f45,0x29,0x1f85,0x29,0x1fc5,0x29,0x29cf,0x2F,0x2a0f,0x2F,0x2a4f,0x2F,0x2a8f,0x2F,
 0x2acf,0x2F,0x2b0f,0x2F,0x2b4f,0x2F,0x2b8f,0x2F,0x2bcf,0x2F,0x2c0f,0x2F,0x2c4f,0x2F,0x2c8f,0x2F,
 0x2ccf,0x2F,0x2d0f,0x2F,0x2d4f,0x2F,0x2d8f,0x2F,0x2dcf,0x2F,0x2e0f,0x2F,0x2e4f,0x2F,0x2e8f,0x2F,
 0x2ecf,0x2F,0x2f0f,0x2F,0x2f4f,0x2F,0x2f8f,0x2F,0x2fcf,0x2F,0x39c2,0x2F,0x3a02,0x2F,0x3a42,0x2F,
 0x3a82,0x2F,0x3ac2,0x2F,0x3b02,0x2F,0x3b42,0x2F,0x3b82,0x2F,0x3bc2,0x2F,0x3c02,0x2F,0x3c42,0x2F,
 0x3c82,0x2F,0x3cc2,0x2F,0x3d02,0x2F,0x3d42,0x2F,0x3d82,0x2F,0x3dc2,0x2F,0x3e02,0x2F,0x3e42,0x2F,
 0x3e82,0x2F,0x3ec2,0x2F,0x3f02,0x2F,0x3f42,0x2F,0x3f82,0x2F,0x3fc2,0x2F,0x495d,0x23,0x499d,0x23,
 0x49dd,0x23,0x4a1d,0x23,0x4a5d,0x23,0x4a9d,0x23,0x4add,0x23,0x4b1d,0x23,0x4b5d,0x23,0x4b9d,0x23,
 0x4bdd,0x23,0x4c1d,0x23,0x4c5d,0x23,0x4c9d,0x23,0x4cdd,0x23,0x4d1d,0x23,0x4d5d,0x23,0x4d9d,0x23,
 0x4ddd,0x23,0x4e1d,0x23,0x4e5d,0x23,0x4e9d,0x23,0x4edd,0x23,0x4f1d,0x23,0x4f5d,0x23,0x4f9d,0x23,
 0x4fdd,0x23,0x5940,0x23,0x5980,0x23,0x59c0,0x23,0x5a00,0x23,0x5a40,0x23,0x5a80,0x23,0x5ac0,0x23,
 0x5b00,0x23,0x5b40,0x23,0x5b80,0x23,0x5bc0,0x23,0x5c00,0x23,0x5c40,0x23,0x5c80,0x23,0x5cc0,0x23,
 0x5d00,0x23,0x5d40,0x23,0x5d80,0x23,0x5dc0,0x23,0x5e00,0x23,0x5e40,0x23,0x5e80,0x23,0x5ec0,0x23,
 0x5f00,0x23,0x5f40,0x23,0x5f80,0x23,0x5fc0,0x23,0x68de,0x1A,0x691e,0x1A,0x695e,0x1A,0x699e,0x1A,
 0x69de,0x1A,0x6a1e,0x1A,0x6a5e,0x1A,0x6a9e,0x1A,0x6ade,0x1A,0x6b1e,0x1A,0x6b5e,0x1A,0x6b9e,0x1A,
 0x6bde,0x1A,0x6c1e,0x1A,0x6c5e,0x1A,0x6c9e,0x1A,0x6cde,0x1A,0x6d1e,0x1A,0x6d5e,0x1A,0x6d9e,0x1A,
 0x6dde,0x1A,0x6e1e,0x1A,0x6e5e,0x1A,0x6e9e,0x1A,0x6ede,0x1A,0x6f1e,0x1A,0x78c8,0x1A,0x7908,0x1A,
 0x7948,0x1A,0x7988,0x1A,0x79c8,0x1A,0x7a08,0x1A,0x7a48,0x1A,0x7a88,0x1A,0x7ac8,0x1A,0x7b08,0x1A,
 0x7b48,0x1A,0x7b88,0x1A,0x7bc8,0x1A,0x7c08,0x1A,0x7c48,0x1A,0x7c88,0x1A,0x7cc8,0x1A,0x7d08,0x1A,
 0x7d48,0x1A,0x7d88,0x1A,0x7dc8,0x1A,0x7e08,0x1A,0x7e48,0x1A,0x7e88,0x1A,0x7ec8,0x1A,0x7f08,0x1A,
 0x8861,0x1F,0x88a1,0x1F,0x88e1,0x1F,0x8921,0x1F,0x8961,0x1F,0x89a1,0x1F,0x89e1,0x1F,0x8a21,0x1F,
 0x8a61,0x1F,0x8aa1,0x1F,0x8ae1,0x1F,0x8b21,0x1F,0x8b61,0x1F,0x8ba1,0x1F,0x8be1,0x1F,0x8c21,0x1F,
 0x8c61,0x1F,0x8ca1,0x1F,0x8ce1,0x1F,0x8d21,0x1F,0x8d61,0x1F,0x8da1,0x1F,0x8de1,0x1F,0x8e21,0x1F,
 0x8e61,0x1F,0x8ea1,0x1F,0x8ee1,0x1F,0x8f21,0x1F,0x8f61,0x1F,0x8fa1,0x1F,0x8fe1,0x1F,0x9859,0x17,
 0x9899,0x17,0x98d9,0x17,0x9919,0x17,0x9959,0x17,0x9999,0x17,0x99d9,0x17,0x9a19,0x17,0x9a59,0x17,
 0x9a99,0x17,0x9ad9,0x17,0x9b19,0x17,0x9b59,0x17,0x9b99,0x17,0x9bd9,0x17,0x9c19,0x17,0x9c59,0x17,
 0x9c99,0x17,0x9cd9,0x17,0x9d19,0x17,0x9d59,0x17,0x9d99,0x17,0x9dd9,0x17,0xa855,0x16,0xa895,0x16,
 0xa8d5,0x16,0xa915,0x16,0xa955,0x16,0xa995,0x16,0xa9d5,0x16,0xaa15,0x16,0xaa55,0x16,0xaa95,0x16,
 0xaad5,0x16,0xab15,0x16,0xab55,0x16,0xab95,0x16,0xabd5,0x16,0xac15,0x16,0xac55,0x16,0xac95,0x16,
 0xacd5,0x16,0xad15,0x16,0xad55,0x16,0xad95,0x16,0xb850,0x17,0xb890,0x17,0xb8d0,0x17,0xb910,0x17,
 0xb950,0x17,0xb990,0x17,0xb9d0,0x17,0xba10,0x17,0xba50,0x17,0xba90,0x17,0xbad0,0x17,0xbb10,0x17,
 0xbb50,0x17,0xbb90,0x17,0xbbd0,0x17,0xbc10,0x17,0xbc50,0x17,0xbc90,0x17,0xbcd0,0x17,0xbd10,0x17,
 0xbd50,0x17,0xbd90,0x17,0xbdd0,0x17,0xc840,0x1F,0xc880,0x1F,0xc8c0,0x1F,0xc900,0x1F,0xc940,0x1F,
 0xc980,0x1F,0xc9c0,0x1F,0xca00,0x1F,0xca40,0x1F,0xca80,0x1F,0xcac0,0x1F,0xcb00,0x1F,0xcb40,0x1F,
 0xcb80,0x1F,0xcbc0,0x1F,0xcc00,0x1F,0xcc40,0x1F,0xcc80,0x1F,0xccc0,0x1F,0xcd00,0x1F,0xcd40,0x1F,
 0xcd80,0x1F,0xcdc0,0x1F,0xce00,0x1F,0xce40,0x1F,0xce80,0x1F,0xcec0,0x1F,0xcf00,0x1F,0xcf40,0x1F,
 0xcf80,0x1F,0xcfc0,0x1F,0xd820,0x14,0xd860,0x14,0xd8a0,0x14,0xd8e0,0x14,0xd920,0x14,0xd960,0x14,
 0xd9a0,0x14,0xd9e0,0x14,0xda20,0x14,0xda60,0x14,0xdaa0,0x14,0xdae0,0x14,0xdb20,0x14,0xdb60,0x14,
 0xdba0,0x14,0xdbe0,0x14,0xdc20,0x14,0xdc60,0x14,0xdca0,0x14,0xdce0,0x14,0xe81f,0x5,0xe85f,0x5,
 0xe89f,0x5,0xe8df,0x5,0xe91f,0x5,0xf81c,0x5,0xf85c,0x5,0xf89c,0x5,0xf8dc,0x5,0xf91c,0x5,
 0x1080c,0x14,0x1084c,0x14,0x1088c,0x14,0x108cc,0x14,0x1090c,0x14,0x1094c,0x14,0x1098c,0x14,0x109cc,0x14,
 0x10a0c,0x14,0x10a4c,0x14,0x10a8c,0x14,0x10acc,0x14,0x10b0c,0x14,0x10b4c,0x14,0x10b8c,0x14,0x10bcc,0x14,
 0x10c0c,0x14,0x10c4c,0x14,0x10c8c,0x14,0x10ccc,0x14,0x117e0,0x5,0x11820,0x5,0x11860,0x5,0x118a0,0x5,
 0x118e0,0x5,0x127db,0x5,0x1281b,0x5,0x1285b,0x5,0x1289b,0x5,0x128db,0x5,0x137a3,0x1A,0x137e3,0x1A,
 0x13823,0x1A,0x13863,0x1A,0x138a3,0x1A,0x138e3,0x1A,0x13923,0x1A,0x13963,0x1A,0x139a3,0x1A,0x139e3,0x1A,
 0x13a23,0x1A,0x13a63,0x1A,0x13aa3,0x1A,0x13ae3,0x1A,0x13b23,0x1A,0x13b63,0x1A,0x13ba3,0x1A,0x13be3,0x1A,
 0x13c23,0x1A,0x13c63,0x1A,0x13ca3,0x1A,0x13ce3,0x1A,0x13d23,0x1A,0x13d63,0x1A,0x13da3,0x1A,0x13de3,0x1A,
 0x14783,0x1A,0x147c3,0x1A,0x14803,0x1A,0x14843,0x1A,0x14883,0x1A,0x148c3,0x1A,0x14903,0x1A,0x14943,0x1A,
 0x14983,0x1A,0x149c3,0x1A,0x14a03,0x1A,0x14a43,0x1A,0x14a83,0x1A,0x14ac3,0x1A,0x14b03,0x1A,0x14b43,0x1A,
 0x14b83,0x1A,0x14bc3,0x1A,0x14c03,0x1A,0x14c43,0x1A,0x14c83,0x1A,0x14cc3,0x1A,0x14d03,0x1A,0x14d43,0x1A,
 0x14d83,0x1A,0x14dc3,0x1A,0x15765,0x1B,0x157a5,0x1B,0x157e5,0x1B,0x15825,0x1B,0x15865,0x1B,0x158a5,0x1B,
 0x158e5,0x1B,0x15925,0x1B,0x15965,0x1B,0x159a5,0x1B,0x159e5,0x1B,0x15a25,0x1B,0x15a65,0x1B,0x15aa5,0x1B,
 0x15ae5,0x1B,0x15b25,0x1B,0x15b65,0x1B,0x15ba5,0x1B,0x15be5,0x1B,0x15c25,0x1B,0x15c65,0x1B,0x15ca5,0x1B,
 0x15ce5,0x1B,0x15d25,0x1B,0x15d65,0x1B,0x15da5,0x1B,0x15de5,0x1B,0x15e25,0x1B,0x15e65,0x1B,0x15ea5,0x1B,
 0x15ee5,0x1B,0x15f25,0x1B,0x15f65,0x1B,0x15fa5,0x1B,0x15fe5,0x1B,0x16740,0x1B,0x16780,0x1B,0x167c0,0x1B,
 0x16800,0x1B,0x16840,0x1B,0x16880,0x1B,0x168c0,0x1B,0x16900,0x1B,0x16940,0x1B,0x16980,0x1B,0x169c0,0x1B,
 0x16a00,0x1B,0x16a40,0x1B,0x16a80,0x1B,0x16ac0,0x1B,0x16b00,0x1B,0x16b40,0x1B,0x16b80,0x1B,0x16bc0,0x1B,
 0x16c00,0x1B,0x16c40,0x1B,0x16c80,0x1B,0x16cc0,0x1B,0x16d00,0x1B,0x16d40,0x1B,0x16d80,0x1B,0x16dc0,0x1B,
 0x16e00,0x1B,0x16e40,0x1B,0x16e80,0x1B,0x16ec0,0x1B,0x16f00,0x1B,0x16f40,0x1B,0x16f80,0x1B,0x16fc0,0x1B,
 0x17720,0x5,0x17760,0x5,0x177a0,0x5,0x177e0,0x5,0x17820,0x5,0x1871b,0x5,0x1875b,0x5,0x1879b,0x5,
 0x187db,0x5,0x1881b,0x5,0x19718,0x10,0x19758,0x10,0x19798,0x10,0x197d8,0x10,0x19818,0x10,0x19858,0x10,
 0x19898,0x10,0x198d8,0x10,0x19918,0x10,0x19958,0x10,0x19998,0x10,0x199d8,0x10,0x19a18,0x10,0x19a58,0x10,
 0x19a98,0x10,0x19ad8,0x10,0x1a6df,0x5,0x1a71f,0x5,0x1a75f,0x5,0x1a79f,0x5,0x1a7df,0x5,0x1b6dc,0x5,
 0x1b71c,0x5,0x1b75c,0x5,0x1b79c,0x5,0x1b7dc,0x5,0x1c661,0x17,0x1c6a1,0x17,0x1c6e1,0x17,0x1c721,0x17,
 0x1c761,0x17,0x1c7a1,0x17,0x1c7e1,0x17,0x1c821,0x17,0x1c861,0x17,0x1c8a1,0x17,0x1c8e1,0x17,0x1c921,0x17,
 0x1c961,0x17,0x1c9a1,0x17,0x1c9e1,0x17,0x1ca21,0x17,0x1ca61,0x17,0x1caa1,0x17,0x1cae1,0x17,0x1cb21,0x17,
 0x1cb61,0x17,0x1cba1,0x17,0x1cbe1,0x17,0x1d648,0x17,0x1d688,0x17,0x1d6c8,0x17,0x1d708,0x17,0x1d748,0x17,
 0x1d788,0x17,0x1d7c8,0x17,0x1d808,0x17,0x1d848,0x17,0x1d888,0x17,0x1d8c8,0x17,0x1d908,0x17,0x1d948,0x17,
 0x1d988,0x17,0x1d9c8,0x17,0x1da08,0x17,0x1da48,0x17,0x1da88,0x17,0x1dac8,0x17,0x1db08,0x17,0x1db48,0x17,
 0x1db88,0x17,0x1dbc8,0x17,0x1e61c,0x10,0x1e65c,0x10,0x1e69c,0x10,0x1e6dc,0x10,0x1e71c,0x10,0x1e75c,0x10,
 0x1e79c,0x10,0x1e7dc,0x10,0x1e81c,0x10,0x1e85c,0x10,0x1e89c,0x10,0x1e8dc,0x10,0x1e91c,0x10,0x1e95c,0x10,
 0x1e99c,0x10,0x1e9dc,0x10,0x1f614,0x10,0x1f654,0x10,0x1f694,0x10,0x1f6d4,0x10,0x1f714,0x10,0x1f754,0x10,
 0x1f794,0x10,0x1f7d4,0x10,0x1f814,0x10,0x1f854,0x10,0x1f894,0x10,0x1f8d4,0x10,0x1f914,0x10,0x1f954,0x10,
 0x1f994,0x10,0x1f9d4,0x10,0x205d7,0x17,0x20617,0x17,0x20657,0x17,0x20697,0x17,0x206d7,0x17,0x20717,0x17,
 0x20757,0x17,0x20797,0x17,0x207d7,0x17,0x20817,0x17,0x20857,0x17,0x20897,0x17,0x208d7,0x17,0x20917,0x17,
 0x20957,0x17,0x20997,0x17,0x209d7,0x17,0x20a17,0x17,0x20a57,0x17,0x20a97,0x17,0x20ad7,0x17,0x20b17,0x17,
 0x20b57,0x17,0x215d2,0x17,0x21612,0x17,0x21652,0x17,0x21692,0x17,0x216d2,0x17,0x21712,0x17,0x21752,0x17,
 0x21792,0x17,0x217d2,0x17,0x21812,0x17,0x21852,0x17,0x21892,0x17,0x218d2,0x17,0x21912,0x17,0x21952,0x17,
 0x21992,0x17,0x219d2,0x17,0x21a12,0x17,0x21a52,0x17,0x21a92,0x17,0x21ad2,0x17,0x21b12,0x17,0x21b52,0x17,
 0x22561,0x16,0x225a1,0x16,0x225e1,0x16,0x22621,0x16,0x22661,0x16,0x226a1,0x16,0x226e1,0x16,0x22721,0x16,
 0x22761,0x16,0x227a1,0x16,0x227e1,0x16,0x22821,0x16,0x22861,0x16,0x228a1,0x16,0x228e1,0x16,0x22921,0x16,
 0x22961,0x16,0x229a1,0x16,0x229e1,0x16,0x22a21,0x16,0x22a61,0x16,0x22aa1,0x16,0x23549,0x16,0x23589,0x16,
 0x235c9,0x16,0x23609,0x16,0x23649,0x16,0x23689,0x16,0x236c9,0x16,0x23709,0x16,0x23749,0x16,0x23789,0x16,
 0x237c9,0x16,0x23809,0x16,0x23849,0x16,0x23889,0x16,0x238c9,0x16,0x23909,0x16,0x23949,0x16,0x23989,0x16,
 0x239c9,0x16,0x23a09,0x16,0x23a49,0x16,0x23a89,0x16,0x24518,0x10,0x24558,0x10,0x24598,0x10,0x245d8,0x10,
 0x24618,0x10,0x24658,0x10,0x24698,0x10,0x246d8,0x10,0x24718,0x10,0x24758,0x10,0x24798,0x10,0x247d8,0x10,
 0x24818,0x10,0x24858,0x10,0x24898,0x10,0x248d8,0x10,0x254aa,0x16,0x254ea,0x16,0x2552a,0x16,0x2556a,0x16,
 0x255aa,0x16,0x255ea,0x16,0x2562a,0x16,0x2566a,0x16,0x256aa,0x16,0x256ea,0x16,0x2572a,0x16,0x2576a,0x16,
 0x257aa,0x16,0x257ea,0x16,0x2582a,0x16,0x2586a,0x16,0x258aa,0x16,0x258ea,0x16,0x2592a,0x16,0x2596a,0x16,
 0x259aa,0x16,0x259ea,0x16,0x25a2a,0x16,0x25a6a,0x16,0x25aaa,0x16,0x25aea,0x16,0x25b2a,0x16,0x25b6a,0x16,
 0x25baa,0x16,0x25bea,0x16,0x25c2a,0x16,0x25c6a,0x16,0x25caa,0x16,0x25cea,0x16,0x25d2a,0x16,0x25d6a,0x16,
 0x25daa,0x16,0x25dea,0x16,0x25e2a,0x16,0x25e6a,0x16,0x25eaa,0x16,0x26497,0x17,0x264d7,0x17,0x26517,0x17,
 0x26557,0x17,0x26597,0x17,0x265d7,0x17,0x26617,0x17,0x26657,0x17,0x26697,0x17,0x266d7,0x17,0x26717,0x17,
 0x26757,0x17,0x26797,0x17,0x267d7,0x17,0x26817,0x17,0x26857,0x17,0x26897,0x17,0x268d7,0x17,0x26917,0x17,
 0x26957,0x17,0x26997,0x17,0x269d7,0x17,0x26a17,0x17,0x27492,0x17,0x274d2,0x17,0x27512,0x17,0x27552,0x17,
 0x27592,0x17,0x275d2,0x17,0x27612,0x17,0x27652,0x17,0x27692,0x17,0x276d2,0x17,0x27712,0x17,0x27752,0x17,
 0x27792,0x17,0x277d2,0x17,0x27812,0x17,0x27852,0x17,0x27892,0x17,0x278d2,0x17,0x27912,0x17,0x27952,0x17,
 0x27992,0x17,0x279d2,0x17,0x27a12,0x17,0x28480,0x16,0x284c0,0x16,0x28500,0x16,0x28540,0x16,0x28580,0x16,
 0x285c0,0x16,0x28600,0x16,0x28640,0x16,0x28680,0x16,0x286c0,0x16,0x28700,0x16,0x28740,0x16,0x28780,0x16,
 0x287c0,0x16,0x28800,0x16,0x28840,0x16,0x28880,0x16,0x288c0,0x16,0x28900,0x16,0x28940,0x16,0x28980,0x16,
 0x289c0,0x16,0x28a00,0x16,0x28a40,0x16,0x28a80,0x16,0x28ac0,0x16,0x28b00,0x16,0x28b40,0x16,0x28b80,0x16,
 0x28bc0,0x16,0x28c00,0x16,0x28c40,0x16,0x28c80,0x16,0x28cc0,0x16,0x28d00,0x16,0x28d40,0x16,0x28d80,0x16,
 0x28dc0,0x16,0x28e00,0x16,0x28e40,0x16,0x28e80,0x16,0x29421,0x17,0x29461,0x17,0x294a1,0x17,0x294e1,0x17,
 0x29521,0x17,0x29561,0x17,0x295a1,0x17,0x295e1,0x17,0x29621,0x17,0x29661,0x17,0x296a1,0x17,0x296e1,0x17,
 0x29721,0x17,0x29761,0x17,0x297a1,0x17,0x297e1,0x17,0x29821,0x17,0x29861,0x17,0x298a1,0x17,0x298e1,0x17,
 0x29921,0x17,0x29961,0x17,0x299a1,0x17,0x2a408,0x17,0x2a448,0x17,0x2a488,0x17,0x2a4c8,0x17,0x2a508,0x17,
 0x2a548,0x17,0x2a588,0x17,0x2a5c8,0x17,0x2a608,0x17,0x2a648,0x17,0x2a688,0x17,0x2a6c8,0x17,0x2a708,0x17,
 0x2a748,0x17,0x2a788,0x17,0x2a7c8,0x17,0x2a808,0x17,0x2a848,0x17,0x2a888,0x17,0x2a8c8,0x17,0x2a908,0x17,
 0x2a948,0x17,0x2a988,0x17,0x2b3e7,0x19,0x2b427,0x19,0x2b467,0x19,0x2b4a7,0x19,0x2b4e7,0x19,0x2b527,0x19,
 0x2b567,0x19,0x2b5a7,0x19,0x2b5e7,0x19,0x2b627,0x19,0x2b667,0x19,0x2b6a7,0x19,0x2b6e7,0x19,0x2b727,0x19,
 0x2b767,0x19,0x2b7a7,0x19,0x2b7e7,0x19,0x2b827,0x19,0x2b867,0x19,0x2b8a7,0x19,0x2b8e7,0x19,0x2b927,0x19,
 0x2b967,0x19,0x2b9a7,0x19,0x2b9e7,0x19,0x2ba27,0x19,0x2ba67,0x19,0x2baa7,0x19,0x2bae7,0x19,0x2bb27,0x19,
 0x2bb67,0x19,0x2bba7,0x19,0x2bbe7,0x19,0x2bc27,0x19,0x2bc67,0x19,0x2bca7,0x19,0x2bce7,0x19,0x2bd27,0x19,
 0x2bd67,0x19,0x2bda7,0x19,0x2bde7,0x19,0x2be27,0x19,0x2be67,0x19,0x2bea7,0x19,0x2bee7,0x19,0x2bf27,0x19,
 0x2bf67,0x19,0x2c3c0,0x19,0x2c400,0x19,0x2c440,0x19,0x2c480,0x19,0x2c4c0,0x19,0x2c500,0x19,0x2c540,0x19,
 0x2c580,0x19,0x2c5c0,0x19,0x2c600,0x19,0x2c640,0x19,0x2c680,0x19,0x2c6c0,0x19,0x2c700,0x19,0x2c740,0x19,
 0x2c780,0x19,0x2c7c0,0x19,0x2c800,0x19,0x2c840,0x19,0x2c880,0x19,0x2c8c0,0x19,0x2c900,0x19,0x2c940,0x19,
 0x2c980,0x19,0x2c9c0,0x19,0x2ca00,0x19,0x2ca40,0x19,0x2ca80,0x19,0x2cac0,0x19,0x2cb00,0x19,0x2cb40,0x19,
 0x2cb80,0x19,0x2cbc0,0x19,0x2cc00,0x19,0x2cc40,0x19,0x2cc80,0x19,0x2ccc0,0x19,0x2cd00,0x19,0x2cd40,0x19,
 0x2cd80,0x19,0x2cdc0,0x19,0x2ce00,0x19,0x2ce40,0x19,0x2ce80,0x19,0x2cec0,0x19,0x2cf00,0x19,0x2cf40,0x19,
 0x2d320,0x14,0x2d360,0x14,0x2d3a0,0x14,0x2d3e0,0x14,0x2d420,0x14,0x2d460,0x14,0x2d4a0,0x14,0x2d4e0,0x14,
 0x2d520,0x14,0x2d560,0x14,0x2d5a0,0x14,0x2d5e0,0x14,0x2d620,0x14,0x2d660,0x14,0x2d6a0,0x14,0x2d6e0,0x14,
 0x2d720,0x14,0x2d760,0x14,0x2d7a0,0x14,0x2d7e0,0x14,0x2e30c,0x14,0x2e34c,0x14,0x2e38c,0x14,0x2e3cc,0x14,
 0x2e40c,0x14,0x2e44c,0x14,0x2e48c,0x14,0x2e4cc,0x14,0x2e50c,0x14,0x2e54c,0x14,0x2e58c,0x14,0x2e5cc,0x14,
 0x2e60c,0x14,0x2e64c,0x14,0x2e68c,0x14,0x2e6cc,0x14,0x2e70c,0x14,0x2e74c,0x14,0x2e78c,0x14,0x2e7cc,0x14,
 0x2f255,0x16,0x2f295,0x16,0x2f2d5,0x16,0x2f315,0x16,0x2f355,0x16,0x2f395,0x16,0x2f3d5,0x16,0x2f415,0x16,
 0x2f455,0x16,0x2f495,0x16,0x2f4d5,0x16,0x2f515,0x16,0x2f555,0x16,0x2f595,0x16,0x2f5d5,0x16,0x2f615,0x16,
 0x2f655,0x16,0x2f695,0x16,0x2f6d5,0x16,0x2f715,0x16,0x2f755,0x16,0x2f795,0x16,0x30223,0x1A,0x30263,0x1A,
 0x302a3,0x1A,0x302e3,0x1A,0x30323,0x1A,0x30363,0x1A,0x303a3,0x1A,0x303e3,0x1A,0x30423,0x1A,0x30463,0x1A,
 0x304a3,0x1A,0x304e3,0x1A,0x30523,0x1A,0x30563,0x1A,0x305a3,0x1A,0x305e3,0x1A,0x30623,0x1A,0x30663,0x1A,
 0x306a3,0x1A,0x306e3,0x1A,0x30723,0x1A,0x30763,0x1A,0x307a3,0x1A,0x307e3,0x1A,0x30823,0x1A,0x30863,0x1A,
 0x31219,0x17,0x31259,0x17,0x31299,0x17,0x312d9,0x17,0x31319,0x17,0x31359,0x17,0x31399,0x17,0x313d9,0x17,
 0x31419,0x17,0x31459,0x17,0x31499,0x17,0x314d9,0x17,0x31519,0x17,0x31559,0x17,0x31599,0x17,0x315d9,0x17,
 0x31619,0x17,0x31659,0x17,0x31699,0x17,0x316d9,0x17,0x31719,0x17,0x31759,0x17,0x31799,0x17,0x32210,0x17,
 0x32250,0x17,0x32290,0x17,0x322d0,0x17,0x32310,0x17,0x32350,0x17,0x32390,0x17,0x323d0,0x17,0x32410,0x17,
 0x32450,0x17,0x32490,0x17,0x324d0,0x17,0x32510,0x17,0x32550,0x17,0x32590,0x17,0x325d0,0x17,0x32610,0x17,
 0x32650,0x17,0x32690,0x17,0x326d0,0x17,0x32710,0x17,0x32750,0x17,0x32790,0x17,0x33203,0x1A,0x33243,0x1A,
 0x33283,0x1A,0x332c3,0x1A,0x33303,0x1A,0x33343,0x1A,0x33383,0x1A,0x333c3,0x1A,0x33403,0x1A,0x33443,0x1A,
 0x33483,0x1A,0x334c3,0x1A,0x33503,0x1A,0x33543,0x1A,0x33583,0x1A,0x335c3,0x1A,0x33603,0x1A,0x33643,0x1A,
 0x33683,0x1A,0x336c3,0x1A,0x33703,0x1A,0x33743,0x1A,0x33783,0x1A,0x337c3,0x1A,0x33803,0x1A,0x33843,0x1A,
 0x3416a,0x16,0x341aa,0x16,0x341ea,0x16,0x3422a,0x16,0x3426a,0x16,0x342aa,0x16,0x342ea,0x16,0x3432a,0x16,
 0x3436a,0x16,0x343aa,0x16,0x343ea,0x16,0x3442a,0x16,0x3446a,0x16,0x344aa,0x16,0x344ea,0x16,0x3452a,0x16,
 0x3456a,0x16,0x345aa,0x16,0x345ea,0x16,0x3462a,0x16,0x3466a,0x16,0x346aa,0x16,0x346ea,0x16,0x3472a,0x16,
 0x3476a,0x16,0x347aa,0x16,0x347ea,0x16,0x3482a,0x16,0x3486a,0x16,0x348aa,0x16,0x348ea,0x16,0x3492a,0x16,
 0x3496a,0x16,0x349aa,0x16,0x349ea,0x16,0x34a2a,0x16,0x34a6a,0x16,0x34aaa,0x16,0x34aea,0x16,0x34b2a,0x16,
 0x34b6a,0x16,0x35140,0x16,0x35180,0x16,0x351c0,0x16,0x35200,0x16,0x35240,0x16,0x35280,0x16,0x352c0,0x16,
 0x35300,0x16,0x35340,0x16,0x35380,0x16,0x353c0,0x16,0x35400,0x16,0x35440,0x16,0x35480,0x16,0x354c0,0x16,
 0x35500,0x16,0x35540,0x16,0x35580,0x16,0x355c0,0x16,0x35600,0x16,0x35640,0x16,0x35680,0x16,0x356c0,0x16,
 0x35700,0x16,0x35740,0x16,0x35780,0x16,0x357c0,0x16,0x35800,0x16,0x35840,0x16,0x35880,0x16,0x358c0,0x16,
 0x35900,0x16,0x35940,0x16,0x35980,0x16,0x359c0,0x16,0x35a00,0x16,0x35a40,0x16,0x35a80,0x16,0x35ac0,0x16,
 0x35b00,0x16,0x35b40,0x16,0x360de,0x1A,0x3611e,0x1A,0x3615e,0x1A,0x3619e,0x1A,0x361de,0x1A,0x3621e,0x1A,
 0x3625e,0x1A,0x3629e,0x1A,0x362de,0x1A,0x3631e,0x1A,0x3635e,0x1A,0x3639e,0x1A,0x363de,0x1A,0x3641e,0x1A,
 0x3645e,0x1A,0x3649e,0x1A,0x364de,0x1A,0x3651e,0x1A,0x3655e,0x1A,0x3659e,0x1A,0x365de,0x1A,0x3661e,0x1A,
 0x3665e,0x1A,0x3669e,0x1A,0x366de,0x1A,0x3671e,0x1A,0x370c8,0x1A,0x37108,0x1A,0x37148,0x1A,0x37188,0x1A,
 0x371c8,0x1A,0x37208,0x1A,0x37248,0x1A,0x37288,0x1A,0x372c8,0x1A,0x37308,0x1A,0x37348,0x1A,0x37388,0x1A,
 0x373c8,0x1A,0x37408,0x1A,0x37448,0x1A,0x37488,0x1A,0x374c8,0x1A,0x37508,0x1A,0x37548,0x1A,0x37588,0x1A,
 0x375c8,0x1A,0x37608,0x1A,0x37648,0x1A,0x37688,0x1A,0x376c8,0x1A,0x37708,0x1A,0x380a7,0x19,0x380e7,0x19,
 0x38127,0x19,0x38167,0x19,0x381a7,0x19,0x381e7,0x19,0x38227,0x19,0x38267,0x19,0x382a7,0x19,0x382e7,0x19,
 0x38327,0x19,0x38367,0x19,0x383a7,0x19,0x383e7,0x19,0x38427,0x19,0x38467,0x19,0x384a7,0x19,0x384e7,0x19,
 0x38527,0x19,0x38567,0x19,0x385a7,0x19,0x385e7,0x19,0x38627,0x19,0x38667,0x19,0x386a7,0x19,0x386e7,0x19,
 0x38727,0x19,0x38767,0x19,0x387a7,0x19,0x387e7,0x19,0x38827,0x19,0x38867,0x19,0x388a7,0x19,0x388e7,0x19,
 0x38927,0x19,0x38967,0x19,0x389a7,0x19,0x389e7,0x19,0x38a27,0x19,0x38a67,0x19,0x38aa7,0x19,0x38ae7,0x19,
 0x38b27,0x19,0x38b67,0x19,0x38ba7,0x19,0x38be7,0x19,0x38c27,0x19,0x39080,0x19,0x390c0,0x19,0x39100,0x19,
 0x39140,0x19,0x39180,0x19,0x391c0,0x19,0x39200,0x19,0x39240,0x19,0x39280,0x19,0x392c0,0x19,0x39300,0x19,
 0x39340,0x19,0x39380,0x19,0x393c0,0x19,0x39400,0x19,0x39440,0x19,0x39480,0x19,0x394c0,0x19,0x39500,0x19,
 0x39540,0x19,0x39580,0x19,0x395c0,0x19,0x39600,0x19,0x39640,0x19,0x39680,0x19,0x396c0,0x19,0x39700,0x19,
 0x39740,0x19,0x39780,0x19,0x397c0,0x19,0x39800,0x19,0x39840,0x19,0x39880,0x19,0x398c0,0x19,0x39900,0x19,
 0x39940,0x19,0x39980,0x19,0x399c0,0x19,0x39a00,0x19,0x39a40,0x19,0x39a80,0x19,0x39ac0,0x19,0x39b00,0x19,
 0x39b40,0x19,0x39b80,0x19,0x39bc0,0x19,0x39c00,0x19,0x3a025,0x1B,0x3a065,0x1B,0x3a0a5,0x1B,0x3a0e5,0x1B,
 0x3a125,0x1B,0x3a165,0x1B,0x3a1a5,0x1B,0x3a1e5,0x1B,0x3a225,0x1B,0x3a265,0x1B,0x3a2a5,0x1B,0x3a2e5,0x1B,
 0x3a325,0x1B,0x3a365,0x1B,0x3a3a5,0x1B,0x3a3e5,0x1B,0x3a425,0x1B,0x3a465,0x1B,0x3a4a5,0x1B,0x3a4e5,0x1B,
 0x3a525,0x1B,0x3a565,0x1B,0x3a5a5,0x1B,0x3a5e5,0x1B,0x3a625,0x1B,0x3a665,0x1B,0x3a6a5,0x1B,0x3a6e5,0x1B,
 0x3a725,0x1B,0x3a765,0x1B,0x3a7a5,0x1B,0x3a7e5,0x1B,0x3a825,0x1B,0x3a865,0x1B,0x3a8a5,0x1B,0x3b021,0x1F,
 0x3b061,0x1F,0x3b0a1,0x1F,0x3b0e1,0x1F,0x3b121,0x1F,0x3b161,0x1F,0x3b1a1,0x1F,0x3b1e1,0x1F,0x3b221,0x1F,
 0x3b261,0x1F,0x3b2a1,0x1F,0x3b2e1,0x1F,0x3b321,0x1F,0x3b361,0x1F,0x3b3a1,0x1F,0x3b3e1,0x1F,0x3b421,0x1F,
 0x3b461,0x1F,0x3b4a1,0x1F,0x3b4e1,0x1F,0x3b521,0x1F,0x3b561,0x1F,0x3b5a1,0x1F,0x3b5e1,0x1F,0x3b621,0x1F,
 0x3b661,0x1F,0x3b6a1,0x1F,0x3b6e1,0x1F,0x3b721,0x1F,0x3b761,0x1F,0x3b7a1,0x1F,0x3c01d,0x23,0x3c05d,0x23,
 0x3c09d,0x23,0x3c0dd,0x23,0x3c11d,0x23,0x3c15d,0x23,0x3c19d,0x23,0x3c1dd,0x23,0x3c21d,0x23,0x3c25d,0x23,
 0x3c29d,0x23,0x3c2dd,0x23,0x3c31d,0x23,0x3c35d,0x23,0x3c39d,0x23,0x3c3dd,0x23,0x3c41d,0x23,0x3c45d,0x23,
 0x3c49d,0x23,0x3c4dd,0x23,0x3c51d,0x23,0x3c55d,0x23,0x3c59d,0x23,0x3c5dd,0x23,0x3c61d,0x23,0x3c65d,0x23,
 0x3c69d,0x23,0x3d012,0x29,0x3d052,0x29,0x3d092,0x29,0x3d0d2,0x29,0x3d112,0x29,0x3d152,0x29,0x3d192,0x29,
 0x3d1d2,0x29,0x3d212,0x29,0x3d252,0x29,0x3d292,0x29,0x3d2d2,0x29,0x3d312,0x29,0x3d352,0x29,0x3d392,0x29,
 0x3d3d2,0x29,0x3d412,0x29,0x3d452,0x29,0x3d492,0x29,0x3d4d2,0x29,0x3d512,0x29,0x3d552,0x29,0x3e00f,0x2F,
 0x3e04f,0x2F,0x3e08f,0x2F,0x3e0cf,0x2F,0x3e10f,0x2F,0x3e14f,0x2F,0x3e18f,0x2F,0x3e1cf,0x2F,0x3e20f,0x2F,
 0x3e24f,0x2F,0x3e28f,0x2F,0x3e2cf,0x2F,0x3e30f,0x2F,0x3e34f,0x2F,0x3e38f,0x2F,0x3e3cf,0x2F,0x3e40f,0x2F,
 0x3e44f,0x2F,0x3e48f,0x2F,0x3e4cf,0x2F,0x3e50f,0x2F,0x3e54f,0x2F,0x3e58f,0x2F,0x3e5cf,0x2F,0x3e60f,0x2F,
 0x3f005,0x29,0x3f045,0x29,0x3f085,0x29,0x3f0c5,0x29,0x3f105,0x29,0x3f145,0x29,0x3f185,0x29,0x3f1c5,0x29,
 0x3f205,0x29,0x3f245,0x29,0x3f285,0x29,0x3f2c5,0x29,0x3f305,0x29,0x3f345,0x29,0x3f385,0x29,0x3f3c5,0x29,
 0x3f405,0x29,0x3f445,0x29,0x3f485,0x29,0x3f4c5,0x29,0x3f505,0x29,0x3f545,0x29,0x40002,0x2F,0x40042,0x2F,
 0x40082,0x2F,0x400c2,0x2F,0x40102,0x2F,0x40142,0x2F,0x40182,0x2F,0x401c2,0x2F,0x40202,0x2F,0x40242,0x2F,
 0x40282,0x2F,0x402c2,0x2F,0x40302,0x2F,0x40342,0x2F,0x40382,0x2F,0x403c2,0x2F,0x40402,0x2F,0x40442,0x2F,
 0x40482,0x2F,0x404c2,0x2F,0x40502,0x2F,0x40542,0x2F,0x40582,0x2F,0x405c2,0x2F,0x40602,0x2F,0x41000,0x1B,
 0x41040,0x1B,0x41080,0x1B,0x410c0,0x1B,0x41100,0x1B,0x41140,0x1B,0x41180,0x1B,0x411c0,0x1B,0x41200,0x1B,
 0x41240,0x1B,0x41280,0x1B,0x412c0,0x1B,0x41300,0x1B,0x41340,0x1B,0x41380,0x1B,0x413c0,0x1B,0x41400,0x1B,
 0x41440,0x1B,0x41480,0x1B,0x414c0,0x1B,0x41500,0x1B,0x41540,0x1B,0x41580,0x1B,0x415c0,0x1B,0x41600,0x1B,
 0x41640,0x1B,0x41680,0x1B,0x416c0,0x1B,0x41700,0x1B,0x41740,0x1B,0x41780,0x1B,0x417c0,0x1B,0x41800,0x1B,
 0x41840,0x1B,0x41880,0x1B,0x42000,0x23,0x42040,0x23,0x42080,0x23,0x420c0,0x23,0x42100,0x23,0x42140,0x23,
 0x42180,0x23,0x421c0,0x23,0x42200,0x23,0x42240,0x23,0x42280,0x23,0x422c0,0x23,0x42300,0x23,0x42340,0x23,
 0x42380,0x23,0x423c0,0x23,0x42400,0x23,0x42440,0x23,0x42480,0x23,0x424c0,0x23,0x42500,0x23,0x42540,0x23,
 0x42580,0x23,0x425c0,0x23,0x42600,0x23,0x42640,0x23,0x42680,0x23,0x43000,0x1F,0x43040,0x1F,0x43080,0x1F,
 0x430c0,0x1F,0x43100,0x1F,0x43140,0x1F,0x43180,0x1F,0x431c0,0x1F,0x43200,0x1F,0x43240,0x1F,0x43280,0x1F,
 0x432c0,0x1F,0x43300,0x1F,0x43340,0x1F,0x43380,0x1F,0x433c0,0x1F,0x43400,0x1F,0x43440,0x1F,0x43480,0x1F,
 0x434c0,0x1F,0x43500,0x1F,0x43540,0x1F,0x43580,0x1F,0x435c0,0x1F,0x43600,0x1F,0x43640,0x1F,0x43680,0x1F,
 0x436c0,0x1F,0x43700,0x1F,0x43740,0x1F,0x43780,0x1F
};

// PR matrix
static const unsigned int PR[] =
{
 0x3529d401,0x35854878,0x35cc4f8e,0x3618ee96,0x365f978a,0x369fa060,0x36de96e3,0x37179048,
 0x37499324,0x3782e89c,0x37a60e02,0x37cdb5b6,0x37f8dfc2,0x381306bc,0x3829a727,0x383f2ec3,
 0x385267bd,0x386224e5,0x386d6000,0x387355e3,0x38739c68,0x386e2e9a,0x38636d50,0x38541400,
 0x384123a8,0x382bc707,0x38153468,0x37fd2233,0x37d1b45d,0x37a9a9b0,0x37860e5a,0x374ee38b,
 0x371be960,0x36e57e64,0x36a4f35a,0x366792ad,0x361ebfe6,0x35d49034,0x358afb14,0x35317d3f,
 0x34dd5d9a,0x358669a0,0x35d2fa24,0x3621b44d,0x36721470,0x36b0f6f3,0x36fcad3f,0x37302bd2,
 0x376fe9f0,0x379f89f4,0x37cf37f3,0x38036d13,0x3822cfc4,0x3844f978,0x3868bb4c,0x38864620,
 0x3897505d,0x38a68720,0x38b2fc0e,0x38bbdf98,0x38c09747,0x38c0cf16,0x38bc831c,0x38b3fffc,
 0x38a7da15,0x3898dccc,0x3887f496,0x386c2e0b,0x38485882,0x3825f928,0x38064823,0x37d43362,
 0x37a3bea9,0x3776cbe3,0x3735a2ba,0x37028d5e,0x36b74804,0x367b49e8,0x36283c62,0x35dbff04,
 0x358c79e0,0x352f33de,0x35cfc9d0,0x3623131e,0x3679fa83,0x36bb1d93,0x3708c8e6,0x37434e6f,
 0x37882be4,0x37b970f8,0x37f6a18b,0x38202b63,0x384b2be6,0x387bb0b9,0x38984058,0x38b3e3cc,
 0x38cf92f0,0x38e9ea83,0x3900b7b6,0x390a5899,0x39113778,0x3914dcf3,0x39150817,0x3911b5dd,
 0x390b2182,0x3901bdb6,0x38ec4f5d,0x38d22c62,0x38b68e1e,0x389adb6f,0x388049fa,0x384f960a,
 0x3824053d,0x37fd2205,0x37bec2de,0x378c652d,0x3749d210,0x370daacf,0x36c23bc7,0x368209b1,
 0x362a0bc3,0x35d92970,0x35876c3b,0x361cda67,0x36763346,0x36bcb385,0x370d3f73,0x374e8265,
 0x37936e4f,0x37cd955a,0x380bfbe9,0x383a2c9f,0x3871d070,0x38995e36,0x38bdfe50,0x38e5dc21,
 0x3907cb1c,0x391cb0fa,0x3930937f,0x39425481,0x3950ddd5,0x395b3d46,0x3960be97,0x3960ffb7,
 0x395bfc17,0x39520d28,0x3943e00d,0x3932621f,0x391ea74d,0x3909ce2b,0x38e9cb43,0x38c1aed6,
 0x389cb352,0x3877a0cf,0x383f1517,0x380ffff7,0x37d3f5d0,0x37985926,0x3755e16e,0x37129efa,
 0x36c452c3,0x36805ccf,0x3623edce,0x35cc7400,0x366744ad,0x36b58084,0x370b1cec,0x3750426a,
 0x37983dc9,0x37d96039,0x38178f08,0x384e6562,0x38894005,0x38b244be,0x38e22135,0x390c10ca,
 0x392974a5,0x3948379e,0x39670799,0x39822c99,0x398f433b,0x3999faa5,0x39a1a045,0x39a5af3c,
 0x39a5df3f,0x39a22cf2,0x399ada42,0x399066d6,0x398381a6,0x3969ec3d,0x394b2f09,0x392c5b1d,
 0x390ec919,0x38e70b0e,0x38b68dfd,0x388cde4e,0x3854512c,0x381c4281,0x37e0a04b,0x379dacee,
 0x37582e88,0x3710bb67,0x36bd42d2,0x3671b376,0x3616b9b8,0x36a68186,0x3702ad01,0x37485064,
 0x3795f0b9,0x37db37d2,0x381c80fd,0x385a3c31,0x38949945,0x38c5a1ae,0x39005909,0x3922ce6d,
 0x3949af8a,0x3974016c,0x39902672,0x39a6558c,0x39bb7158,0x39ce4a0d,0x39ddb864,0x39e8bb41,
 0x39ee934b,0x39eed86f,0x39e985d1,0x39defa63,0x39cfedf1,0x39bd5c70,0x39a86ac9,0x39924935,
 0x39782e89,0x394d9a30,0x39265809,0x39036f05,0x38cad778,0x3898dc97,0x3861011d,0x3821b94d,
 0x37e30afd,0x379ba4e6,0x375067b6,0x37084315,0x36ae0467,0x36590908,0x36ea266c,0x3737c380,
 0x378cd8b1,0x37d2dac3,0x381a236e,0x385c15a7,0x38997281,0x38d0f7c9,0x390af5d8,0x39347d6b,
 0x3964f28e,0x398dcf98,0x39ab9134,0x39cab64e,0x39e9e894,0x3a03cbda,0x3a110c3d,0x3a1be5d6,
 0x3a23a3dc,0x3a27bfc3,0x3a27f060,0x3a243249,0x3a1cc83d,0x3a123379,0x3a052527,0x39ecd674,
 0x39cdb731,0x39ae80ed,0x39909095,0x3969ec14,0x3938d456,0x390e9fac,0x38d6f676,0x389e34f8,
 0x38636cd9,0x381fa3ea,0x37dae026,0x37928918,0x373f9e8f,0x36f4b67b,0x36989a87,0x3720c95b,
 0x377c5fd0,0x37c16eee,0x3810ca38,0x3853b021,0x389720c5,0x38d2bd24,0x390f7e92,0x393ed7ce,
 0x3977e0d2,0x399d36c9,0x39c2c205,0x39eb9fc4,0x3a0b32dd,0x3a209ee4,0x3a350111,0x3a47340c,
 0x3a561ab2,0x3a60bcbc,0x3a666162,0x3a66a426,0x3a618056,0x3a5751a1,0x3a48c983,0x3a36db4a,
 0x3a22a1d0,0x3a0d42d7,0x39efa826,0x39c68a39,0x39a0a14b,0x397dd683,0x3943dfc8,0x39139c67,
 0x38d94689,0x389c2b2f,0x385b3e7d,0x38164c3e,0x37c93f1a,0x378394dc,0x37280a2f,0x36d19487,
 0x3757a739,0x37a93f44,0x3801b85d,0x384232ab,0x388df64d,0x38cab2e6,0x390d5359,0x394075d7,
 0x397ff752,0x39a63b62,0x39d2dc91,0x3a029bc3,0x3a1e039e,0x3a3ab2e0,0x3a576e44,0x3a72c516,
 0x3a8596f2,0x3a8f9520,0x3a96b693,0x3a9a7f63,0x3a9aac29,0x3a9739c0,0x3a9065a5,0x3a86a6dc,
 0x3a754123,0x3a5a20e5,0x3a3d7705,0x3a20b7f4,0x3a052510,0x39d7717d,0x39aa3a8b,0x39835b67,
 0x3945fb49,0x3911b590,0x38d175a5,0x38930785,0x384995d7,0x3806f5b8,0x37b07b75,0x376161ad,
 0x370c8c70,0x378d3d0c,0x37ddb0ef,0x3829ea87,0x387e5f94,0x38b9f392,0x3904c113,0x39391e1f,
 0x397c18ec,0x39a7a407,0x39d9bde0,0x3a0a19ac,0x3a2b1463,0x3a4efa38,0x3a748ce9,0x3a8d17bf,
 0x3a9eff82,0x3aaefc0f,0x3abc12ef,0x3ac56a07,0x3aca5f0a,0x3aca99b0,0x3ac615d9,0x3abd2410,
 0x3ab0603b,0x3aa0a014,0x3a8edc11,0x3a782c7c,0x3a528517,0x3a2e66e2,0x3a0d19db,0x39defa15,
 0x39ac0f69,0x3981aa2b,0x393edc12,0x39092e99,0x38c096c0,0x38840662,0x3830c785,0x37e72b0f,
 0x37939c20,0x37381993,0x37b4ad1a,0x380dcbf8,0x38595c87,0x38a2b364,0x38eddfd0,0x3929d2a8,
 0x396ccec3,0x39a13eb6,0x39d6735f,0x3a0b4547,0x3a30a966,0x3a5ad990,0x3a8462b9,0x3a9c6af9,
 0x3ab47d63,0x3acb650f,0x3adfd85d,0x3af096e6,0x3afc89a6,0x3b017081,0x3b019604,0x3afd6574,
 0x3af1f44b,0x3ae19ffe,0x3acd79f3,0x3ab6c000,0x3a9ebc43,0x3a86a6c5,0x3a5f1989,0x3a348016,
 0x3a0e9e7f,0x39dc1aad,0x39a5dee8,0x3974272a,0x392f7cb1,0x38f65d74,0x38a8e3d5,0x38622420,
 0x3813dbc0,0x37bcd3a0,0x376b8177,0x37e1b844,0x383125c2,0x3887c683,0x38cb4353,0x391496bf,
 0x39542923,0x3993ec2f,0x39c971bc,0x3a05f50d,0x3a2dfdd9,0x3a5cb45c,0x3a88b487,0x3aa563e0,
 0x3ac369ea,0x3ae17ca7,0x3afe1a2d,0x3b0bd357,0x3b1648ee,0x3b1dbf98,0x3b21b5a0,0x3b21e47d,
 0x3b1e48e4,0x3b17232f,0x3b0ceff2,0x3b0059f5,0x3ae44f87,0x3ac64f1e,0x3aa83889,0x3a8b5c22,
 0x3a618007,0x3a322cc5,0x3a097d1d,0x39cf3928,0x399882c8,0x395b3cae,0x3919e484,0x38d2fec7,
 0x388d427c,0x3838b869,0x37ebe6f9,0x37931bfd,0x3809b2d1,0x3858227f,0x38a5a84b,0x38f7ff72,
 0x39354a72,0x39816d48,0x39b47a59,0x39f5c762,0x3a237064,0x3a5448c8,0x3a86a394,0x3aa6cab0,
 0x3ac9ca30,0x3aee6bcc,0x3b098e73,0x3b1b0354,0x3b2a994e,0x3b375c31,0x3b40775c,0x3b454c91,
 0x3b4585be,0x3b411ee0,0x3b38667a,0x3b2bf48d,0x3b1c9975,0x3b0b476f,0x3af1f421,0x3acd3e54,
 0x3aaa07de,0x3a899082,0x3a596365,0x3a27bf6c,0x39fcd467,0x39ba1375,0x3985be66,0x393bc30b,
 0x3900b745,0x38ac5941,0x38615fd0,0x380fe904,0x37b37c56,0x382412f0,0x3880c463,0x38c56363,
 0x3913c012,0x39580422,0x399a37cc,0x39d70c2c,0x3a126da4,0x3a42beb4,0x3a7cf23f,0x3aa06dab,
 0x3ac6bd68,0x3af0710e,0x3b0e0b73,0x3b23e79a,0x3b38b477,0x3b4b46b5,0x3b5a7b59,0x3b65550a,
 0x3b6b173a,0x3b6b5b5b,0x3b661ca4,0x3b5bb8a4,0x3b4ce477,0x3b3a9863,0x3b25f50d,0x3b102639,
 0x3af48e8c,0x3aca9969,0x3aa3ea0e,0x3a818392,0x3a47e104,0x3a16a104,0x39ddb7ca,0x399f5c98,
 0x395fba0b,0x39195eec,0x38cd5c74,0x38864593,0x382b79ba,0x37d5dd82,0x383eedb7,0x3895d7cc,
 0x38e5b20e,0x392beee2,0x397b5f51,0x39b3759b,0x39fa3ec7,0x3a2a650e,0x3a629e9e,0x3a932c69,
 0x3abaafb3,0x3ae744b5,0x3b0be5d7,0x3b254b32,0x3b3ebb4a,0x3b56efb2,0x3b6c8c14,0x3b7e3dd9,
 0x3b856f16,0x3b88c8d3,0x3b88f076,0x3b85e339,0x3b7faf11,0x3b6e6d8f,0x3b5922d3,0x3b411ebe,
 0x3b27be26,0x3b0e4acd,0x3aebc26c,0x3abebe25,0x3a96b645,0x3a68980b,0x3a2f4873,0x3a0100f1,
 0x39b971ed,0x39822c26,0x3932793c,0x38eef931,0x389c3fa2,0x38478aa3,0x37f8de92,0x3858fb4f,
 0x38aa4a2b,0x390284ef,0x394364eb,0x398ed62d,0x39cbf28d,0x3a0e3238,0x3a41a55a,0x3a80c57e,
 0x3aa74188,0x3ad42919,0x3b0369bc,0x3b1efcce,0x3b3bd94c,0x3b58c200,0x3b7443ef,0x3b86699f,
 0x3b90778f,0x3b97a441,0x3b9b7308,0x3b9ba014,0x3b98283c,0x3b91495c,0x3b877b35,0x3b76c3e8,
 0x3b5b78e3,0x3b3ea1cf,0x3b21b568,0x3b05f708,0x3ad8c53f,0x3aab46ff,0x3a842a8e,0x3a473380,
 0x3a129b59,0x39d2bff6,0x3993ef63,0x394ad3bf,0x3907ca8d,0x38b191c4,0x3862c51a,0x380d6a16,
 0x3870d269,0x38bcfff4,0x3910dc16,0x3958dcd3,0x399e87c8,0x39e25b09,0x3a1dd1cf,0x3a56ec15,
 0x3a8eeb7b,0x3ab9a1fd,0x3aeb7898,0x3b11da06,0x3b3074b0,0x3b507cf9,0x3b7092cf,0x3b878d3a,
 0x3b952e47,0x3ba05705,0x3ba84d84,0x3bac8766,0x3bacb965,0x3ba8e000,0x3ba13fdf,0x3b965ded,
 0x3b88f05e,0x3b73960a,0x3b5393c4,0x3b3379d4,0x3b14af1a,0x3af09667,0x3abe1890,0x3a92b007,
 0x3a5d167d,0x3a22b6ff,0x39e9e7c8,0x39a43066,0x39611cb8,0x3916b5fd,0x38c5144f,0x387baf85,
 0x381cf3b0,0x388283ca,0x38ccdbeb,0x391d03dc,0x396b0f51,0x39abd539,0x39f55975,0x3a2b0ffc,
 0x3a68f4e5,0x3a9ae996,0x3ac935a0,0x3aff3ad3,0x3b1e171b,0x3b3f4331,0x3b61fb92,0x3b826153,
 0x3b92ed0f,0x3ba1b2e0,0x3badcb56,0x3bb66ce2,0x3bbb018c,0x3bbb37bd,0x3bb70ba9,0x3baec7b9,
 0x3ba2fc02,0x3b946e00,0x3b84034c,0x3b6554b9,0x3b428935,0x3b212907,0x3b026346,0x3ace0c13,
 0x3a9eff13,0x3a6fa3c0,0x3a305e53,0x39fd8861,0x39b1f766,0x3974006c,0x39235b75,0x38d59dd6,
 0x38886708,0x382a1f38,0x388a2851,0x38d8daed,0x392635a6,0x3978d310,0x39b5e524,0x3a01dbb9,
 0x3a35145a,0x3a76991d,0x3aa3fbda,0x3ad4fdec,0x3b071678,0x3b275904,0x3b4a7660,0x3b6f373e,
 0x3b8a03d4,0x3b9b879a,0x3bab2ae0,0x3bb7f8a8,0x3bc11b97,0x3bc5f4ec,0x3bc62e4a,0x3bc1c3aa,
 0x3bb903d3,0x3bac8748,0x3b9d1f15,0x3b8bbe48,0x3b72c296,0x3b4ded77,0x3b2a98f4,0x3b0a05e4,
 0x3ada1ce4,0x3aa84e8f,0x3a7dac26,0x3a3ab23d,0x3a063086,0x39bc6342,0x3981251b,0x392cec51,
 0x38e22020,0x389063d1,0x3834157d,0x388ed3ad,0x38e02f31,0x392bd3b9,0x39809df7,0x39bc0aed,
 0x3a063f47,0x3a3b3314,0x3a7eeeb6,0x3aa986ab,0x3adc30c3,0x3b0ba744,0x3b2d00ef,0x3b514e1d,
 0x3b774cf9,0x3b8eadf5,0x3ba0c944,0x3bb0f3d8,0x3bbe3067,0x3bc7a264,0x3bcca5ad,0x3bcce0fb,
 0x3bc85024,0x3bbf449a,0x3bb25c06,0x3ba26e85,0x3b90775c,0x3b7af6fc,0x3b54e32f,0x3b305cfd,
 0x3b0eb017,0x3ae17c0a,0x3aadfec7,0x3a831f7a,0x3a410190,0x3a0ab98d,0x39c2c138,0x3985827d,
 0x3932c47a,0x38e9c499,0x3895451a,0x383a2b9b,0x38903348,0x38e25713,0x392d7ab7,0x3981da97,
 0x39bdd9d7,0x3a0789c3,0x3a3cffeb,0x3a80b125,0x3aab27ff,0x3ade4ed0,0x3b0cff0f,0x3b2eaad2,
 0x3b53515e,0x3b79adc5,0x3b900d32,0x3ba25515,0x3bb2a775,0x3bc0049a,0x3bc98dd7,0x3bce9d77,
 0x3bced957,0x3bca3d43,0x3bc11b75,0x3bb41319,0x3ba3fe63,0x3b91db00,0x3b7d60cd,0x3b56ef42,
 0x3b320f27,0x3b100f5a,0x3ae3a720,0x3aafab1c,0x3a846245,0x3a42dcb1,0x3a0c0f0f,0x39c4a0a8,
 0x3986cb28,0x39347c8e,0x38ec0414,0x3896b491,0x383bf5e9,0x388e2e7d,0x38df2be8,0x392b0cfd,
 0x39800935,0x39bb3171,0x3a05a403,0x3a3a5a91,0x3a7dc7de,0x3aa8c299,0x3adb3217,0x3b0b05bf,
 0x3b2c38d7,0x3b505c09,0x3b762ef3,0x3b8e08f0,0x3ba00f4e,0x3bb0272f,0x3bbd546f,0x3bc6bb7f,
 0x3bcbb8fc,0x3bcbf405,0x3bc76877,0x3bbe6763,0x3bb18dbc,0x3ba1b2a9,0x3b8fd046,0x3b79d4b9,
 0x3b53ecf5,0x3b2f9103,0x3b0e0b0f,0x3ae0773f,0x3aad358a,0x3a8287d3,0x3a402256,0x3a0a191b,
 0x39c1dff8,0x3984e813,0x3931f5b7,0x38e8b63b,0x38949876,0x38395448,0x34dd5d9a,0x35317d3f,
 0x358afb14,0x35d49034,0x361ebfe6,0x366792ad,0x36a4f35a,0x36e57e64,0x371be960,0x374ee38b,
 0x37860e5a,0x37a9a9b0,0x37d1b45d,0x37fd2233,0x38153468,0x382bc707,0x384123a8,0x38541400,
 0x38636d50,0x386e2e9a,0x38739c68,0x387355e3,0x386d6000,0x386224e5,0x385267bd,0x383f2ec3,
 0x3829a727,0x381306bc,0x37f8dfc2,0x37cdb5b6,0x37a60e02,0x3782e89c,0x37499324,0x37179048,
 0x36de96e3,0x369fa060,0x365f978a,0x3618ee96,0x35cc4f8e,0x35854878,0x3529d401,0x352f33de,
 0x358c79e0,0x35dbff04,0x36283c62,0x367b49e8,0x36b74804,0x37028d5e,0x3735a2ba,0x3776cbe3,
 0x37a3bea9,0x37d43362,0x38064823,0x3825f928,0x38485882,0x386c2e0b,0x3887f496,0x3898dccc,
 0x38a7da15,0x38b3fffc,0x38bc831c,0x38c0cf16,0x38c09747,0x38bbdf98,0x38b2fc0e,0x38a68720,
 0x3897505d,0x38864620,0x3868bb4c,0x3844f978,0x3822cfc4,0x38036d13,0x37cf37f3,0x379f89f4,
 0x376fe9f0,0x37302bd2,0x36fcad3f,0x36b0f6f3,0x36721470,0x3621b44d,0x35d2fa24,0x358669a0,
 0x35876c3b,0x35d92970,0x362a0bc3,0x368209b1,0x36c23bc7,0x370daacf,0x3749d210,0x378c652d,
 0x37bec2de,0x37fd2205,0x3824053d,0x384f960a,0x388049fa,0x389adb6f,0x38b68e1e,0x38d22c62,
 0x38ec4f5d,0x3901bdb6,0x390b2182,0x3911b5dd,0x39150817,0x3914dcf3,0x39113778,0x390a5899,
 0x3900b7b6,0x38e9ea83,0x38cf92f0,0x38b3e3cc,0x38984058,0x387bb0b9,0x384b2be6,0x38202b63,
 0x37f6a18b,0x37b970f8,0x37882be4,0x37434e6f,0x3708c8e6,0x36bb1d93,0x3679fa83,0x3623131e,
 0x35cfc9d0,0x35cc7400,0x3623edce,0x36805ccf,0x36c452c3,0x37129efa,0x3755e16e,0x37985926,
 0x37d3f5d0,0x380ffff7,0x383f1517,0x3877a0cf,0x389cb352,0x38c1aed6,0x38e9cb43,0x3909ce2b,
 0x391ea74d,0x3932621f,0x3943e00d,0x39520d28,0x395bfc17,0x3960ffb7,0x3960be97,0x395b3d46,
 0x3950ddd5,0x39425481,0x3930937f,0x391cb0fa,0x3907cb1c,0x38e5dc21,0x38bdfe50,0x38995e36,
 0x3871d070,0x383a2c9f,0x380bfbe9,0x37cd955a,0x37936e4f,0x374e8265,0x370d3f73,0x36bcb385,
 0x36763346,0x361cda67,0x3616b9b8,0x3671b376,0x36bd42d2,0x3710bb67,0x37582e88,0x379dacee,
 0x37e0a04b,0x381c4281,0x3854512c,0x388cde4e,0x38b68dfd,0x38e70b0e,0x390ec919,0x392c5b1d,
 0x394b2f09,0x3969ec3d,0x398381a6,0x399066d6,0x399ada42,0x39a22cf2,0x39a5df3f,0x39a5af3c,
 0x39a1a045,0x3999faa5,0x398f433b,0x39822c99,0x39670799,0x3948379e,0x392974a5,0x390c10ca,
 0x38e22135,0x38b244be,0x38894005,0x384e6562,0x38178f08,0x37d96039,0x37983dc9,0x3750426a,
 0x370b1cec,0x36b58084,0x366744ad,0x36590908,0x36ae0467,0x37084315,0x375067b6,0x379ba4e6,
 0x37e30afd,0x3821b94d,0x3861011d,0x3898dc97,0x38cad778,0x39036f05,0x39265809,0x394d9a30,
 0x39782e89,0x39924935,0x39a86ac9,0x39bd5c70,0x39cfedf1,0x39defa63,0x39e985d1,0x39eed86f,
 0x39ee934b,0x39e8bb41,0x39ddb864,0x39ce4a0d,0x39bb7158,0x39a6558c,0x39902672,0x3974016c,
 0x3949af8a,0x3922ce6d,0x39005909,0x38c5a1ae,0x38949945,0x385a3c31,0x381c80fd,0x37db37d2,
 0x3795f0b9,0x37485064,0x3702ad01,0x36a68186,0x36989a87,0x36f4b67b,0x373f9e8f,0x37928918,
 0x37dae026,0x381fa3ea,0x38636cd9,0x389e34f8,0x38d6f676,0x390e9fac,0x3938d456,0x3969ec14,
 0x39909095,0x39ae80ed,0x39cdb731,0x39ecd674,0x3a052527,0x3a123379,0x3a1cc83d,0x3a243249,
 0x3a27f060,0x3a27bfc3,0x3a23a3dc,0x3a1be5d6,0x3a110c3d,0x3a03cbda,0x39e9e894,0x39cab64e,
 0x39ab9134,0x398dcf98,0x3964f28e,0x39347d6b,0x390af5d8,0x38d0f7c9,0x38997281,0x385c15a7,
 0x381a236e,0x37d2dac3,0x378cd8b1,0x3737c380,0x36ea266c,0x36d19487,0x37280a2f,0x378394dc,
 0x37c93f1a,0x38164c3e,0x385b3e7d,0x389c2b2f,0x38d94689,0x39139c67,0x3943dfc8,0x397dd683,
 0x39a0a14b,0x39c68a39,0x39efa826,0x3a0d42d7,0x3a22a1d0,0x3a36db4a,0x3a48c983,0x3a5751a1,
 0x3a618056,0x3a66a426,0x3a666162,0x3a60bcbc,0x3a561ab2,0x3a47340c,0x3a350111,0x3a209ee4,
 0x3a0b32dd,0x39eb9fc4,0x39c2c205,0x399d36c9,0x3977e0d2,0x393ed7ce,0x390f7e92,0x38d2bd24,
 0x389720c5,0x3853b021,0x3810ca38,0x37c16eee,0x377c5fd0,0x3720c95b,0x370c8c70,0x376161ad,
 0x37b07b75,0x3806f5b8,0x384995d7,0x38930785,0x38d175a5,0x3911b590,0x3945fb49,0x39835b67,
 0x39aa3a8b,0x39d7717d,0x3a052510,0x3a20b7f4,0x3a3d7705,0x3a5a20e5,0x3a754123,0x3a86a6dc,
 0x3a9065a5,0x3a9739c0,0x3a9aac29,0x3a9a7f63,0x3a96b693,0x3a8f9520,0x3a8596f2,0x3a72c516,
 0x3a576e44,0x3a3ab2e0,0x3a1e039e,0x3a029bc3,0x39d2dc91,0x39a63b62,0x397ff752,0x394075d7,
 0x390d5359,0x38cab2e6,0x388df64d,0x384232ab,0x3801b85d,0x37a93f44,0x3757a739,0x37381993,
 0x37939c20,0x37e72b0f,0x3830c785,0x38840662,0x38c096c0,0x39092e99,0x393edc12,0x3981aa2b,
 0x39ac0f69,0x39defa15,0x3a0d19db,0x3a2e66e2,0x3a528517,0x3a782c7c,0x3a8edc11,0x3aa0a014,
 0x3ab0603b,0x3abd2410,0x3ac615d9,0x3aca99b0,0x3aca5f0a,0x3ac56a07,0x3abc12ef,0x3aaefc0f,
 0x3a9eff82,0x3a8d17bf,0x3a748ce9,0x3a4efa38,0x3a2b1463,0x3a0a19ac,0x39d9bde0,0x39a7a407,
 0x397c18ec,0x39391e1f,0x3904c113,0x38b9f392,0x387e5f94,0x3829ea87,0x37ddb0ef,0x378d3d0c,
 0x376b8177,0x37bcd3a0,0x3813dbc0,0x38622420,0x38a8e3d5,0x38f65d74,0x392f7cb1,0x3974272a,
 0x39a5dee8,0x39dc1aad,0x3a0e9e7f,0x3a348016,0x3a5f1989,0x3a86a6c5,0x3a9ebc43,0x3ab6c000,
 0x3acd79f3,0x3ae19ffe,0x3af1f44b,0x3afd6574,0x3b019604,0x3b017081,0x3afc89a6,0x3af096e6,
 0x3adfd85d,0x3acb650f,0x3ab47d63,0x3a9c6af9,0x3a8462b9,0x3a5ad990,0x3a30a966,0x3a0b4547,
 0x39d6735f,0x39a13eb6,0x396ccec3,0x3929d2a8,0x38eddfd0,0x38a2b364,0x38595c87,0x380dcbf8,
 0x37b4ad1a,0x37931bfd,0x37ebe6f9,0x3838b869,0x388d427c,0x38d2fec7,0x3919e484,0x395b3cae,
 0x399882c8,0x39cf3928,0x3a097d1d,0x3a322cc5,0x3a618007,0x3a8b5c22,0x3aa83889,0x3ac64f1e,
 0x3ae44f87,0x3b0059f5,0x3b0ceff2,0x3b17232f,0x3b1e48e4,0x3b21e47d,0x3b21b5a0,0x3b1dbf98,
 0x3b1648ee,0x3b0bd357,0x3afe1a2d,0x3ae17ca7,0x3ac369ea,0x3aa563e0,0x3a88b487,0x3a5cb45c,
 0x3a2dfdd9,0x3a05f50d,0x39c971bc,0x3993ec2f,0x39542923,0x391496bf,0x38cb4353,0x3887c683,
 0x383125c2,0x37e1b844,0x37b37c56,0x380fe904,0x38615fd0,0x38ac5941,0x3900b745,0x393bc30b,
 0x3985be66,0x39ba1375,0x39fcd467,0x3a27bf6c,0x3a596365,0x3a899082,0x3aaa07de,0x3acd3e54,
 0x3af1f421,0x3b0b476f,0x3b1c9975,0x3b2bf48d,0x3b38667a,0x3b411ee0,0x3b4585be,0x3b454c91,
 0x3b40775c,0x3b375c31,0x3b2a994e,0x3b1b0354,0x3b098e73,0x3aee6bcc,0x3ac9ca30,0x3aa6cab0,
 0x3a86a394,0x3a5448c8,0x3a237064,0x39f5c762,0x39b47a59,0x39816d48,0x39354a72,0x38f7ff72,
 0x38a5a84b,0x3858227f,0x3809b2d1,0x37d5dd82,0x382b79ba,0x38864593,0x38cd5c74,0x39195eec,
 0x395fba0b,0x399f5c98,0x39ddb7ca,0x3a16a104,0x3a47e104,0x3a818392,0x3aa3ea0e,0x3aca9969,
 0x3af48e8c,0x3b102639,0x3b25f50d,0x3b3a9863,0x3b4ce477,0x3b5bb8a4,0x3b661ca4,0x3b6b5b5b,
 0x3b6b173a,0x3b65550a,0x3b5a7b59,0x3b4b46b5,0x3b38b477,0x3b23e79a,0x3b0e0b73,0x3af0710e,
 0x3ac6bd68,0x3aa06dab,0x3a7cf23f,0x3a42beb4,0x3a126da4,0x39d70c2c,0x399a37cc,0x39580422,
 0x3913c012,0x38c56363,0x3880c463,0x382412f0,0x37f8de92,0x38478aa3,0x389c3fa2,0x38eef931,
 0x3932793c,0x39822c26,0x39b971ed,0x3a0100f1,0x3a2f4873,0x3a68980b,0x3a96b645,0x3abebe25,
 0x3aebc26c,0x3b0e4acd,0x3b27be26,0x3b411ebe,0x3b5922d3,0x3b6e6d8f,0x3b7faf11,0x3b85e339,
 0x3b88f076,0x3b88c8d3,0x3b856f16,0x3b7e3dd9,0x3b6c8c14,0x3b56efb2,0x3b3ebb4a,0x3b254b32,
 0x3b0be5d7,0x3ae744b5,0x3abaafb3,0x3a932c69,0x3a629e9e,0x3a2a650e,0x39fa3ec7,0x39b3759b,
 0x397b5f51,0x392beee2,0x38e5b20e,0x3895d7cc,0x383eedb7,0x380d6a16,0x3862c51a,0x38b191c4,
 0x3907ca8d,0x394ad3bf,0x3993ef63,0x39d2bff6,0x3a129b59,0x3a473380,0x3a842a8e,0x3aab46ff,
 0x3ad8c53f,0x3b05f708,0x3b21b568,0x3b3ea1cf,0x3b5b78e3,0x3b76c3e8,0x3b877b35,0x3b91495c,
 0x3b98283c,0x3b9ba014,0x3b9b7308,0x3b97a441,0x3b90778f,0x3b86699f,0x3b7443ef,0x3b58c200,
 0x3b3bd94c,0x3b1efcce,0x3b0369bc,0x3ad42919,0x3aa74188,0x3a80c57e,0x3a41a55a,0x3a0e3238,
 0x39cbf28d,0x398ed62d,0x394364eb,0x390284ef,0x38aa4a2b,0x3858fb4f,0x381cf3b0,0x387baf85,
 0x38c5144f,0x3916b5fd,0x39611cb8,0x39a43066,0x39e9e7c8,0x3a22b6ff,0x3a5d167d,0x3a92b007,
 0x3abe1890,0x3af09667,0x3b14af1a,0x3b3379d4,0x3b5393c4,0x3b73960a,0x3b88f05e,0x3b965ded,
 0x3ba13fdf,0x3ba8e000,0x3bacb965,0x3bac8766,0x3ba84d84,0x3ba05705,0x3b952e47,0x3b878d3a,
 0x3b7092cf,0x3b507cf9,0x3b3074b0,0x3b11da06,0x3aeb7898,0x3ab9a1fd,0x3a8eeb7b,0x3a56ec15,
 0x3a1dd1cf,0x39e25b09,0x399e87c8,0x3958dcd3,0x3910dc16,0x38bcfff4,0x3870d269,0x382a1f38,
 0x38886708,0x38d59dd6,0x39235b75,0x3974006c,0x39b1f766,0x39fd8861,0x3a305e53,0x3a6fa3c0,
 0x3a9eff13,0x3ace0c13,0x3b026346,0x3b212907,0x3b428935,0x3b6554b9,0x3b84034c,0x3b946e00,
 0x3ba2fc02,0x3baec7b9,0x3bb70ba9,0x3bbb37bd,0x3bbb018c,0x3bb66ce2,0x3badcb56,0x3ba1b2e0,
 0x3b92ed0f,0x3b826153,0x3b61fb92,0x3b3f4331,0x3b1e171b,0x3aff3ad3,0x3ac935a0,0x3a9ae996,
 0x3a68f4e5,0x3a2b0ffc,0x39f55975,0x39abd539,0x396b0f51,0x391d03dc,0x38ccdbeb,0x388283ca,
 0x3834157d,0x389063d1,0x38e22020,0x392cec51,0x3981251b,0x39bc6342,0x3a063086,0x3a3ab23d,
 0x3a7dac26,0x3aa84e8f,0x3ada1ce4,0x3b0a05e4,0x3b2a98f4,0x3b4ded77,0x3b72c296,0x3b8bbe48,
 0x3b9d1f15,0x3bac8748,0x3bb903d3,0x3bc1c3aa,0x3bc62e4a,0x3bc5f4ec,0x3bc11b97,0x3bb7f8a8,
 0x3bab2ae0,0x3b9b879a,0x3b8a03d4,0x3b6f373e,0x3b4a7660,0x3b275904,0x3b071678,0x3ad4fdec,
 0x3aa3fbda,0x3a76991d,0x3a35145a,0x3a01dbb9,0x39b5e524,0x3978d310,0x392635a6,0x38d8daed,
 0x388a2851,0x383a2b9b,0x3895451a,0x38e9c499,0x3932c47a,0x3985827d,0x39c2c138,0x3a0ab98d,
 0x3a410190,0x3a831f7a,0x3aadfec7,0x3ae17c0a,0x3b0eb017,0x3b305cfd,0x3b54e32f,0x3b7af6fc,
 0x3b90775c,0x3ba26e85,0x3bb25c06,0x3bbf449a,0x3bc85024,0x3bcce0fb,0x3bcca5ad,0x3bc7a264,
 0x3bbe3067,0x3bb0f3d8,0x3ba0c944,0x3b8eadf5,0x3b774cf9,0x3b514e1d,0x3b2d00ef,0x3b0ba744,
 0x3adc30c3,0x3aa986ab,0x3a7eeeb6,0x3a3b3314,0x3a063f47,0x39bc0aed,0x39809df7,0x392bd3b9,
 0x38e02f31,0x388ed3ad,0x383bf5e9,0x3896b491,0x38ec0414,0x39347c8e,0x3986cb28,0x39c4a0a8,
 0x3a0c0f0f,0x3a42dcb1,0x3a846245,0x3aafab1c,0x3ae3a720,0x3b100f5a,0x3b320f27,0x3b56ef42,
 0x3b7d60cd,0x3b91db00,0x3ba3fe63,0x3bb41319,0x3bc11b75,0x3bca3d43,0x3bced957,0x3bce9d77,
 0x3bc98dd7,0x3bc0049a,0x3bb2a775,0x3ba25515,0x3b900d32,0x3b79adc5,0x3b53515e,0x3b2eaad2,
 0x3b0cff0f,0x3ade4ed0,0x3aab27ff,0x3a80b125,0x3a3cffeb,0x3a0789c3,0x39bdd9d7,0x3981da97,
 0x392d7ab7,0x38e25713,0x38903348,0x38395448,0x38949876,0x38e8b63b,0x3931f5b7,0x3984e813,
 0x39c1dff8,0x3a0a191b,0x3a402256,0x3a8287d3,0x3aad358a,0x3ae0773f,0x3b0e0b0f,0x3b2f9103,
 0x3b53ecf5,0x3b79d4b9,0x3b8fd046,0x3ba1b2a9,0x3bb18dbc,0x3bbe6763,0x3bc76877,0x3bcbf405,
 0x3bcbb8fc,0x3bc6bb7f,0x3bbd546f,0x3bb0272f,0x3ba00f4e,0x3b8e08f0,0x3b762ef3,0x3b505c09,
 0x3b2c38d7,0x3b0b05bf,0x3adb3217,0x3aa8c299,0x3a7dc7de,0x3a3a5a91,0x3a05a403,0x39bb3171,
 0x39800935,0x392b0cfd,0x38df2be8,0x388e2e7d,0x35061e74,0x35467ade,0x35904681,0x35ce0d5a,
 0x36108c37,0x36473ada,0x3686e13d,0x36b3692e,0x36ea705b,0x37167932,0x373dc1f1,0x376b14c0,
 0x378f0c98,0x37ab06ad,0x37c8df22,0x37e7c4ab,0x38035a41,0x38124324,0x381ffe9f,0x382beead,
 0x38358152,0x383c3c13,0x383fc61d,0x383fefda,0x383cb714,0x3836472a,0x382cf546,0x38213912,
 0x3813a2c9,0x3804cfc9,0x37eabdcd,0x37cbcb64,0x37adcf53,0x37919ff7,0x376fb88c,0x3741d4fd,
 0x3719f73e,0x36f049be,0x36b8332d,0x368ab73c,0x364d3e93,0x36152a2e,0x35d4fed3,0x35956403,
 0x354ddddb,0x350b58d4