Symlinking /home/eaibot/2022_jsjds/leo_ws/devel/lib/ltme01_sdk.a
Symlinking /home/eaibot/2022_jsjds/leo_ws/devel/lib/pkgconfig/ltme01_driver.pc
Symlinking /home/eaibot/2022_jsjds/leo_ws/devel/lib/ltme01_driver/ltme01_driver_node
Symlinking /home/eaibot/2022_jsjds/leo_ws/devel/share/ltme01_driver/cmake/ltme01_driverConfig.cmake
Symlinking /home/eaibot/2022_jsjds/leo_ws/devel/share/ltme01_driver/cmake/ltme01_driverConfig-version.cmake
