[35m[1mScanning dependencies of target message_filters[0m
[ 50%] [32mBuilding CXX object CMakeFiles/message_filters.dir/src/connection.cpp.o[0m
[100%] [32m[1mLinking CXX shared library /home/eaibot/2022_jsjds/ros_ws/devel/.private/message_filters/lib/libmessage_filters.so[0m
[100%] Built target message_filters
