Not searching for unused variables given on the command line.
[36m--[0m Using CATKIN_DEVEL_PREFIX: /home/eaibot/2022_jsjds/ros_ws/devel/.private/cv_bridge
[36m--[0m Using CMAKE_PREFIX_PATH: /home/eaibot/2022_jsjds/ros_ws/install;/opt/ros/kinetic
[36m--[0m This workspace overlays: /home/eaibot/2022_jsjds/ros_ws/install;/opt/ros/kinetic
[36m--[0m Found PythonInterp: /usr/bin/python3 (found suitable version "3.6.9", minimum required is "2")
[36m--[0m Using PYTHON_EXECUTABLE: /usr/bin/python3
[36m--[0m Using default Python package layout
[36m--[0m Using empy: /usr/bin/empy
[36m--[0m Using CATKIN_ENABLE_TESTING: ON
[36m--[0m Call enable_testing()
[36m--[0m Using CATKIN_TEST_RESULTS_DIR: /home/eaibot/2022_jsjds/ros_ws/build/cv_bridge/test_results
[36m--[0m Found gtest sources under '/usr/src/gmock': gtests will be built
[36m--[0m Found gmock sources under '/usr/src/gmock': gmock will be built
[36m--[0m Found PythonInterp: /usr/bin/python3 (found version "3.6.9")
[36m--[0m Using Python nosetests: /usr/bin/nosetests3
[36m--[0m catkin 0.7.29
[36m--[0m BUILD_SHARED_LIBS is on
[36m--[0m Found PythonLibs: /usr/local/python3/lib/libpython3.6m.so.1.0 (found version "3.6.9")
[36m--[0m Boost version: 1.58.0
[36m--[0m Found the following Boost libraries:
[36m--[0m   python3
[36m--[0m Found PythonLibs: /usr/local/python3/lib/libpython3.6m.so.1.0 (found suitable version "3.6.9", minimum required is "3.6")
[36m--[0m Configuring done
[36m--[0m Generating done
[36m--[0m Build files have been written to: /home/eaibot/2022_jsjds/ros_ws/build/cv_bridge
