Linked: (/home/eaibot/2022_jsjds/ros_ws/devel/.private/std_srvs/include/std_srvs/EmptyRequest.h, /home/eaibot/2022_jsjds/ros_ws/devel/include/std_srvs/EmptyRequest.h)
Linked: (/home/eaibot/2022_jsjds/ros_ws/devel/.private/std_srvs/include/std_srvs/SetBoolResponse.h, /home/eaibot/2022_jsjds/ros_ws/devel/include/std_srvs/SetBoolResponse.h)
Linked: (/home/eaibot/2022_jsjds/ros_ws/devel/.private/std_srvs/include/std_srvs/SetBoolRequest.h, /home/eaibot/2022_jsjds/ros_ws/devel/include/std_srvs/SetBoolRequest.h)
Linked: (/home/eaibot/2022_jsjds/ros_ws/devel/.private/std_srvs/include/std_srvs/EmptyResponse.h, /home/eaibot/2022_jsjds/ros_ws/devel/include/std_srvs/EmptyResponse.h)
Linked: (/home/eaibot/2022_jsjds/ros_ws/devel/.private/std_srvs/include/std_srvs/SetBool.h, /home/eaibot/2022_jsjds/ros_ws/devel/include/std_srvs/SetBool.h)
Linked: (/home/eaibot/2022_jsjds/ros_ws/devel/.private/std_srvs/include/std_srvs/Trigger.h, /home/eaibot/2022_jsjds/ros_ws/devel/include/std_srvs/Trigger.h)
Linked: (/home/eaibot/2022_jsjds/ros_ws/devel/.private/std_srvs/include/std_srvs/Empty.h, /home/eaibot/2022_jsjds/ros_ws/devel/include/std_srvs/Empty.h)
Linked: (/home/eaibot/2022_jsjds/ros_ws/devel/.private/std_srvs/include/std_srvs/TriggerResponse.h, /home/eaibot/2022_jsjds/ros_ws/devel/include/std_srvs/TriggerResponse.h)
Linked: (/home/eaibot/2022_jsjds/ros_ws/devel/.private/std_srvs/include/std_srvs/TriggerRequest.h, /home/eaibot/2022_jsjds/ros_ws/devel/include/std_srvs/TriggerRequest.h)
Linked: (/home/eaibot/2022_jsjds/ros_ws/devel/.private/std_srvs/lib/pkgconfig/std_srvs.pc, /home/eaibot/2022_jsjds/ros_ws/devel/lib/pkgconfig/std_srvs.pc)
Linked: (/home/eaibot/2022_jsjds/ros_ws/devel/.private/std_srvs/lib/python3.6/site-packages/std_srvs/__init__.py, /home/eaibot/2022_jsjds/ros_ws/devel/lib/python3.6/site-packages/std_srvs/__init__.py)
Linked: (/home/eaibot/2022_jsjds/ros_ws/devel/.private/std_srvs/lib/python3.6/site-packages/std_srvs/srv/__init__.py, /home/eaibot/2022_jsjds/ros_ws/devel/lib/python3.6/site-packages/std_srvs/srv/__init__.py)
Linked: (/home/eaibot/2022_jsjds/ros_ws/devel/.private/std_srvs/lib/python3.6/site-packages/std_srvs/srv/_SetBool.py, /home/eaibot/2022_jsjds/ros_ws/devel/lib/python3.6/site-packages/std_srvs/srv/_SetBool.py)
Linked: (/home/eaibot/2022_jsjds/ros_ws/devel/.private/std_srvs/lib/python3.6/site-packages/std_srvs/srv/_Empty.py, /home/eaibot/2022_jsjds/ros_ws/devel/lib/python3.6/site-packages/std_srvs/srv/_Empty.py)
Linked: (/home/eaibot/2022_jsjds/ros_ws/devel/.private/std_srvs/lib/python3.6/site-packages/std_srvs/srv/_Trigger.py, /home/eaibot/2022_jsjds/ros_ws/devel/lib/python3.6/site-packages/std_srvs/srv/_Trigger.py)
Linked: (/home/eaibot/2022_jsjds/ros_ws/devel/.private/std_srvs/share/roseus/ros/std_srvs/manifest.l, /home/eaibot/2022_jsjds/ros_ws/devel/share/roseus/ros/std_srvs/manifest.l)
Linked: (/home/eaibot/2022_jsjds/ros_ws/devel/.private/std_srvs/share/roseus/ros/std_srvs/srv/SetBool.l, /home/eaibot/2022_jsjds/ros_ws/devel/share/roseus/ros/std_srvs/srv/SetBool.l)
Linked: (/home/eaibot/2022_jsjds/ros_ws/devel/.private/std_srvs/share/roseus/ros/std_srvs/srv/Empty.l, /home/eaibot/2022_jsjds/ros_ws/devel/share/roseus/ros/std_srvs/srv/Empty.l)
Linked: (/home/eaibot/2022_jsjds/ros_ws/devel/.private/std_srvs/share/roseus/ros/std_srvs/srv/Trigger.l, /home/eaibot/2022_jsjds/ros_ws/devel/share/roseus/ros/std_srvs/srv/Trigger.l)
Linked: (/home/eaibot/2022_jsjds/ros_ws/devel/.private/std_srvs/share/common-lisp/ros/std_srvs/srv/Trigger.lisp, /home/eaibot/2022_jsjds/ros_ws/devel/share/common-lisp/ros/std_srvs/srv/Trigger.lisp)
Linked: (/home/eaibot/2022_jsjds/ros_ws/devel/.private/std_srvs/share/common-lisp/ros/std_srvs/srv/_package_Trigger.lisp, /home/eaibot/2022_jsjds/ros_ws/devel/share/common-lisp/ros/std_srvs/srv/_package_Trigger.lisp)
Linked: (/home/eaibot/2022_jsjds/ros_ws/devel/.private/std_srvs/share/common-lisp/ros/std_srvs/srv/_package_Empty.lisp, /home/eaibot/2022_jsjds/ros_ws/devel/share/common-lisp/ros/std_srvs/srv/_package_Empty.lisp)
Linked: (/home/eaibot/2022_jsjds/ros_ws/devel/.private/std_srvs/share/common-lisp/ros/std_srvs/srv/_package.lisp, /home/eaibot/2022_jsjds/ros_ws/devel/share/common-lisp/ros/std_srvs/srv/_package.lisp)
Linked: (/home/eaibot/2022_jsjds/ros_ws/devel/.private/std_srvs/share/common-lisp/ros/std_srvs/srv/Empty.lisp, /home/eaibot/2022_jsjds/ros_ws/devel/share/common-lisp/ros/std_srvs/srv/Empty.lisp)
Linked: (/home/eaibot/2022_jsjds/ros_ws/devel/.private/std_srvs/share/common-lisp/ros/std_srvs/srv/SetBool.lisp, /home/eaibot/2022_jsjds/ros_ws/devel/share/common-lisp/ros/std_srvs/srv/SetBool.lisp)
Linked: (/home/eaibot/2022_jsjds/ros_ws/devel/.private/std_srvs/share/common-lisp/ros/std_srvs/srv/std_srvs-srv.asd, /home/eaibot/2022_jsjds/ros_ws/devel/share/common-lisp/ros/std_srvs/srv/std_srvs-srv.asd)
Linked: (/home/eaibot/2022_jsjds/ros_ws/devel/.private/std_srvs/share/common-lisp/ros/std_srvs/srv/_package_SetBool.lisp, /home/eaibot/2022_jsjds/ros_ws/devel/share/common-lisp/ros/std_srvs/srv/_package_SetBool.lisp)
Linked: (/home/eaibot/2022_jsjds/ros_ws/devel/.private/std_srvs/share/gennodejs/ros/std_srvs/_index.js, /home/eaibot/2022_jsjds/ros_ws/devel/share/gennodejs/ros/std_srvs/_index.js)
Linked: (/home/eaibot/2022_jsjds/ros_ws/devel/.private/std_srvs/share/gennodejs/ros/std_srvs/srv/_index.js, /home/eaibot/2022_jsjds/ros_ws/devel/share/gennodejs/ros/std_srvs/srv/_index.js)
Linked: (/home/eaibot/2022_jsjds/ros_ws/devel/.private/std_srvs/share/gennodejs/ros/std_srvs/srv/SetBool.js, /home/eaibot/2022_jsjds/ros_ws/devel/share/gennodejs/ros/std_srvs/srv/SetBool.js)
Linked: (/home/eaibot/2022_jsjds/ros_ws/devel/.private/std_srvs/share/gennodejs/ros/std_srvs/srv/Trigger.js, /home/eaibot/2022_jsjds/ros_ws/devel/share/gennodejs/ros/std_srvs/srv/Trigger.js)
Linked: (/home/eaibot/2022_jsjds/ros_ws/devel/.private/std_srvs/share/gennodejs/ros/std_srvs/srv/Empty.js, /home/eaibot/2022_jsjds/ros_ws/devel/share/gennodejs/ros/std_srvs/srv/Empty.js)
Linked: (/home/eaibot/2022_jsjds/ros_ws/devel/.private/std_srvs/share/std_srvs/cmake/std_srvs-msg-paths.cmake, /home/eaibot/2022_jsjds/ros_ws/devel/share/std_srvs/cmake/std_srvs-msg-paths.cmake)
Linked: (/home/eaibot/2022_jsjds/ros_ws/devel/.private/std_srvs/share/std_srvs/cmake/std_srvsConfig.cmake, /home/eaibot/2022_jsjds/ros_ws/devel/share/std_srvs/cmake/std_srvsConfig.cmake)
Linked: (/home/eaibot/2022_jsjds/ros_ws/devel/.private/std_srvs/share/std_srvs/cmake/std_srvs-msg-extras.cmake, /home/eaibot/2022_jsjds/ros_ws/devel/share/std_srvs/cmake/std_srvs-msg-extras.cmake)
Linked: (/home/eaibot/2022_jsjds/ros_ws/devel/.private/std_srvs/share/std_srvs/cmake/std_srvsConfig-version.cmake, /home/eaibot/2022_jsjds/ros_ws/devel/share/std_srvs/cmake/std_srvsConfig-version.cmake)
