[ 50%] Built target collada_parser
[100%] Built target collada_parser_plugin
[36mInstall the project...[0m
-- Install configuration: "Release"
-- Installing: /home/eaibot/2022_jsjds/ros_ws/install/_setup_util.py
-- Installing: /home/eaibot/2022_jsjds/ros_ws/install/env.sh
-- Installing: /home/eaibot/2022_jsjds/ros_ws/install/setup.bash
-- Installing: /home/eaibot/2022_jsjds/ros_ws/install/local_setup.bash
-- Installing: /home/eaibot/2022_jsjds/ros_ws/install/setup.sh
-- Installing: /home/eaibot/2022_jsjds/ros_ws/install/local_setup.sh
-- Installing: /home/eaibot/2022_jsjds/ros_ws/install/setup.zsh
-- Installing: /home/eaibot/2022_jsjds/ros_ws/install/local_setup.zsh
-- Installing: /home/eaibot/2022_jsjds/ros_ws/install/.rosinstall
-- Up-to-date: /home/eaibot/2022_jsjds/ros_ws/install/lib/pkgconfig/collada_parser.pc
-- Up-to-date: /home/eaibot/2022_jsjds/ros_ws/install/share/collada_parser/cmake/collada_parserConfig.cmake
-- Up-to-date: /home/eaibot/2022_jsjds/ros_ws/install/share/collada_parser/cmake/collada_parserConfig-version.cmake
-- Up-to-date: /home/eaibot/2022_jsjds/ros_ws/install/share/collada_parser/package.xml
-- Up-to-date: /home/eaibot/2022_jsjds/ros_ws/install/lib/libcollada_parser.so
-- Up-to-date: /home/eaibot/2022_jsjds/ros_ws/install/lib/libcollada_parser_plugin.so
-- Up-to-date: /home/eaibot/2022_jsjds/ros_ws/install/include/collada_parser
-- Up-to-date: /home/eaibot/2022_jsjds/ros_ws/install/include/collada_parser/collada_parser.h
-- Up-to-date: /home/eaibot/2022_jsjds/ros_ws/install/include/collada_parser/collada_parser_plugin.h
-- Up-to-date: /home/eaibot/2022_jsjds/ros_ws/install/share/collada_parser/collada_parser_plugin_description.xml
