Linked: (/home/eaibot/2022_jsjds/ros_ws/devel/.private/collada_urdf/lib/libcollada_urdf.so, /home/eaibot/2022_jsjds/ros_ws/devel/lib/libcollada_urdf.so)
Linked: (/home/eaibot/2022_jsjds/ros_ws/devel/.private/collada_urdf/lib/pkgconfig/collada_urdf.pc, /home/eaibot/2022_jsjds/ros_ws/devel/lib/pkgconfig/collada_urdf.pc)
Linked: (/home/eaibot/2022_jsjds/ros_ws/devel/.private/collada_urdf/lib/collada_urdf/urdf_to_collada, /home/eaibot/2022_jsjds/ros_ws/devel/lib/collada_urdf/urdf_to_collada)
Linked: (/home/eaibot/2022_jsjds/ros_ws/devel/.private/collada_urdf/lib/collada_urdf/collada_to_urdf, /home/eaibot/2022_jsjds/ros_ws/devel/lib/collada_urdf/collada_to_urdf)
Linked: (/home/eaibot/2022_jsjds/ros_ws/devel/.private/collada_urdf/share/collada_urdf/cmake/collada_urdfConfig.cmake, /home/eaibot/2022_jsjds/ros_ws/devel/share/collada_urdf/cmake/collada_urdfConfig.cmake)
Linked: (/home/eaibot/2022_jsjds/ros_ws/devel/.private/collada_urdf/share/collada_urdf/cmake/collada_urdfConfig-version.cmake, /home/eaibot/2022_jsjds/ros_ws/devel/share/collada_urdf/cmake/collada_urdfConfig-version.cmake)
