Linked: (/home/eaibot/2022_jsjds/ros_ws/devel/.private/gennodejs/lib/pkgconfig/gennodejs.pc, /home/eaibot/2022_jsjds/ros_ws/devel/lib/pkgconfig/gennodejs.pc)
Linked: (/home/eaibot/2022_jsjds/ros_ws/devel/.private/gennodejs/lib/python3.6/site-packages/gennodejs/__init__.py, /home/eaibot/2022_jsjds/ros_ws/devel/lib/python3.6/site-packages/gennodejs/__init__.py)
Linked: (/home/eaibot/2022_jsjds/ros_ws/devel/.private/gennodejs/etc/ros/genmsg/gennodejs, /home/eaibot/2022_jsjds/ros_ws/devel/etc/ros/genmsg/gennodejs)
Linked: (/home/eaibot/2022_jsjds/ros_ws/devel/.private/gennodejs/share/gennodejs/cmake/gennodejs-extras.cmake, /home/eaibot/2022_jsjds/ros_ws/devel/share/gennodejs/cmake/gennodejs-extras.cmake)
Linked: (/home/eaibot/2022_jsjds/ros_ws/devel/.private/gennodejs/share/gennodejs/cmake/gennodejsConfig.cmake, /home/eaibot/2022_jsjds/ros_ws/devel/share/gennodejs/cmake/gennodejsConfig.cmake)
Linked: (/home/eaibot/2022_jsjds/ros_ws/devel/.private/gennodejs/share/gennodejs/cmake/gennodejsConfig-version.cmake, /home/eaibot/2022_jsjds/ros_ws/devel/share/gennodejs/cmake/gennodejsConfig-version.cmake)
