Symlinking /home/eaibot/2022_jsjds/ros_ws/devel/lib/pkgconfig/rosbuild.pc
Symlinking /home/eaibot/2022_jsjds/ros_ws/devel/etc/catkin/profile.d/10.rosbuild.sh
Symlinking /home/eaibot/2022_jsjds/ros_ws/devel/share/rosbuild/cmake/rosbuildConfig-version.cmake
Symlinking /home/eaibot/2022_jsjds/ros_ws/devel/share/rosbuild/cmake/rosbuildConfig.cmake
