Symlinking /home/eaibot/2022_jsjds/ros_ws/devel/include/std_msgs/UInt64MultiArray.h
Symlinking /home/eaibot/2022_jsjds/ros_ws/devel/include/std_msgs/MultiArrayDimension.h
Symlinking /home/eaibot/2022_jsjds/ros_ws/devel/include/std_msgs/Int64MultiArray.h
Symlinking /home/eaibot/2022_jsjds/ros_ws/devel/include/std_msgs/UInt16MultiArray.h
Symlinking /home/eaibot/2022_jsjds/ros_ws/devel/include/std_msgs/Time.h
Symlinking /home/eaibot/2022_jsjds/ros_ws/devel/include/std_msgs/UInt8MultiArray.h
Symlinking /home/eaibot/2022_jsjds/ros_ws/devel/include/std_msgs/Float32MultiArray.h
Symlinking /home/eaibot/2022_jsjds/ros_ws/devel/include/std_msgs/Int8.h
Symlinking /home/eaibot/2022_jsjds/ros_ws/devel/include/std_msgs/MultiArrayLayout.h
Symlinking /home/eaibot/2022_jsjds/ros_ws/devel/include/std_msgs/Int32.h
Symlinking /home/eaibot/2022_jsjds/ros_ws/devel/include/std_msgs/Duration.h
Symlinking /home/eaibot/2022_jsjds/ros_ws/devel/include/std_msgs/Empty.h
Symlinking /home/eaibot/2022_jsjds/ros_ws/devel/include/std_msgs/Bool.h
Symlinking /home/eaibot/2022_jsjds/ros_ws/devel/include/std_msgs/Char.h
Symlinking /home/eaibot/2022_jsjds/ros_ws/devel/include/std_msgs/Header.h
Symlinking /home/eaibot/2022_jsjds/ros_ws/devel/include/std_msgs/ColorRGBA.h
Symlinking /home/eaibot/2022_jsjds/ros_ws/devel/include/std_msgs/UInt8.h
Symlinking /home/eaibot/2022_jsjds/ros_ws/devel/include/std_msgs/UInt32MultiArray.h
Symlinking /home/eaibot/2022_jsjds/ros_ws/devel/include/std_msgs/Int16.h
Symlinking /home/eaibot/2022_jsjds/ros_ws/devel/include/std_msgs/Float64MultiArray.h
Symlinking /home/eaibot/2022_jsjds/ros_ws/devel/include/std_msgs/Byte.h
Symlinking /home/eaibot/2022_jsjds/ros_ws/devel/include/std_msgs/UInt64.h
Symlinking /home/eaibot/2022_jsjds/ros_ws/devel/include/std_msgs/ByteMultiArray.h
Symlinking /home/eaibot/2022_jsjds/ros_ws/devel/include/std_msgs/Int8MultiArray.h
Symlinking /home/eaibot/2022_jsjds/ros_ws/devel/include/std_msgs/Int16MultiArray.h
Symlinking /home/eaibot/2022_jsjds/ros_ws/devel/include/std_msgs/UInt32.h
Symlinking /home/eaibot/2022_jsjds/ros_ws/devel/include/std_msgs/Int32MultiArray.h
Symlinking /home/eaibot/2022_jsjds/ros_ws/devel/include/std_msgs/Float32.h
Symlinking /home/eaibot/2022_jsjds/ros_ws/devel/include/std_msgs/String.h
Symlinking /home/eaibot/2022_jsjds/ros_ws/devel/include/std_msgs/Float64.h
Symlinking /home/eaibot/2022_jsjds/ros_ws/devel/include/std_msgs/UInt16.h
Symlinking /home/eaibot/2022_jsjds/ros_ws/devel/include/std_msgs/Int64.h
Symlinking /home/eaibot/2022_jsjds/ros_ws/devel/lib/pkgconfig/std_msgs.pc
Symlinking /home/eaibot/2022_jsjds/ros_ws/devel/lib/python3.6/site-packages/std_msgs/__init__.py
Symlinking /home/eaibot/2022_jsjds/ros_ws/devel/lib/python3.6/site-packages/std_msgs/msg/_Char.py
Symlinking /home/eaibot/2022_jsjds/ros_ws/devel/lib/python3.6/site-packages/std_msgs/msg/_UInt16.py
Symlinking /home/eaibot/2022_jsjds/ros_ws/devel/lib/python3.6/site-packages/std_msgs/msg/__init__.py
Symlinking /home/eaibot/2022_jsjds/ros_ws/devel/lib/python3.6/site-packages/std_msgs/msg/_ColorRGBA.py
Symlinking /home/eaibot/2022_jsjds/ros_ws/devel/lib/python3.6/site-packages/std_msgs/msg/_UInt16MultiArray.py
Symlinking /home/eaibot/2022_jsjds/ros_ws/devel/lib/python3.6/site-packages/std_msgs/msg/_ByteMultiArray.py
Symlinking /home/eaibot/2022_jsjds/ros_ws/devel/lib/python3.6/site-packages/std_msgs/msg/_Int32.py
Symlinking /home/eaibot/2022_jsjds/ros_ws/devel/lib/python3.6/site-packages/std_msgs/msg/_UInt8.py
Symlinking /home/eaibot/2022_jsjds/ros_ws/devel/lib/python3.6/site-packages/std_msgs/msg/_Int8MultiArray.py
Symlinking /home/eaibot/2022_jsjds/ros_ws/devel/lib/python3.6/site-packages/std_msgs/msg/_UInt8MultiArray.py
Symlinking /home/eaibot/2022_jsjds/ros_ws/devel/lib/python3.6/site-packages/std_msgs/msg/_MultiArrayDimension.py
Symlinking /home/eaibot/2022_jsjds/ros_ws/devel/lib/python3.6/site-packages/std_msgs/msg/_Header.py
Symlinking /home/eaibot/2022_jsjds/ros_ws/devel/lib/python3.6/site-packages/std_msgs/msg/_Byte.py
Symlinking /home/eaibot/2022_jsjds/ros_ws/devel/lib/python3.6/site-packages/std_msgs/msg/_Empty.py
Symlinking /home/eaibot/2022_jsjds/ros_ws/devel/lib/python3.6/site-packages/std_msgs/msg/_Int32MultiArray.py
Symlinking /home/eaibot/2022_jsjds/ros_ws/devel/lib/python3.6/site-packages/std_msgs/msg/_UInt32.py
Symlinking /home/eaibot/2022_jsjds/ros_ws/devel/lib/python3.6/site-packages/std_msgs/msg/_String.py
Symlinking /home/eaibot/2022_jsjds/ros_ws/devel/lib/python3.6/site-packages/std_msgs/msg/_UInt64.py
Symlinking /home/eaibot/2022_jsjds/ros_ws/devel/lib/python3.6/site-packages/std_msgs/msg/_Int8.py
Symlinking /home/eaibot/2022_jsjds/ros_ws/devel/lib/python3.6/site-packages/std_msgs/msg/_Float32MultiArray.py
Symlinking /home/eaibot/2022_jsjds/ros_ws/devel/lib/python3.6/site-packages/std_msgs/msg/_UInt64MultiArray.py
Symlinking /home/eaibot/2022_jsjds/ros_ws/devel/lib/python3.6/site-packages/std_msgs/msg/_Int64MultiArray.py
Symlinking /home/eaibot/2022_jsjds/ros_ws/devel/lib/python3.6/site-packages/std_msgs/msg/_Float32.py
Symlinking /home/eaibot/2022_jsjds/ros_ws/devel/lib/python3.6/site-packages/std_msgs/msg/_Bool.py
Symlinking /home/eaibot/2022_jsjds/ros_ws/devel/lib/python3.6/site-packages/std_msgs/msg/_Float64.py
Symlinking /home/eaibot/2022_jsjds/ros_ws/devel/lib/python3.6/site-packages/std_msgs/msg/_Duration.py
Symlinking /home/eaibot/2022_jsjds/ros_ws/devel/lib/python3.6/site-packages/std_msgs/msg/_Int16MultiArray.py
Symlinking /home/eaibot/2022_jsjds/ros_ws/devel/lib/python3.6/site-packages/std_msgs/msg/_Float64MultiArray.py
Symlinking /home/eaibot/2022_jsjds/ros_ws/devel/lib/python3.6/site-packages/std_msgs/msg/_Int64.py
Symlinking /home/eaibot/2022_jsjds/ros_ws/devel/lib/python3.6/site-packages/std_msgs/msg/_MultiArrayLayout.py
Symlinking /home/eaibot/2022_jsjds/ros_ws/devel/lib/python3.6/site-packages/std_msgs/msg/_Time.py
Symlinking /home/eaibot/2022_jsjds/ros_ws/devel/lib/python3.6/site-packages/std_msgs/msg/_Int16.py
Symlinking /home/eaibot/2022_jsjds/ros_ws/devel/lib/python3.6/site-packages/std_msgs/msg/_UInt32MultiArray.py
Symlinking /home/eaibot/2022_jsjds/ros_ws/devel/share/roseus/ros/std_msgs/manifest.l
Symlinking /home/eaibot/2022_jsjds/ros_ws/devel/share/roseus/ros/std_msgs/msg/Int8MultiArray.l
Symlinking /home/eaibot/2022_jsjds/ros_ws/devel/share/roseus/ros/std_msgs/msg/Float64.l
Symlinking /home/eaibot/2022_jsjds/ros_ws/devel/share/roseus/ros/std_msgs/msg/Header.l
Symlinking /home/eaibot/2022_jsjds/ros_ws/devel/share/roseus/ros/std_msgs/msg/Char.l
Symlinking /home/eaibot/2022_jsjds/ros_ws/devel/share/roseus/ros/std_msgs/msg/Int8.l
Symlinking /home/eaibot/2022_jsjds/ros_ws/devel/share/roseus/ros/std_msgs/msg/MultiArrayLayout.l
Symlinking /home/eaibot/2022_jsjds/ros_ws/devel/share/roseus/ros/std_msgs/msg/Float32.l
Symlinking /home/eaibot/2022_jsjds/ros_ws/devel/share/roseus/ros/std_msgs/msg/ColorRGBA.l
Symlinking /home/eaibot/2022_jsjds/ros_ws/devel/share/roseus/ros/std_msgs/msg/UInt32.l
Symlinking /home/eaibot/2022_jsjds/ros_ws/devel/share/roseus/ros/std_msgs/msg/UInt16MultiArray.l
Symlinking /home/eaibot/2022_jsjds/ros_ws/devel/share/roseus/ros/std_msgs/msg/UInt64MultiArray.l
Symlinking /home/eaibot/2022_jsjds/ros_ws/devel/share/roseus/ros/std_msgs/msg/Time.l
Symlinking /home/eaibot/2022_jsjds/ros_ws/devel/share/roseus/ros/std_msgs/msg/Float64MultiArray.l
Symlinking /home/eaibot/2022_jsjds/ros_ws/devel/share/roseus/ros/std_msgs/msg/Bool.l
Symlinking /home/eaibot/2022_jsjds/ros_ws/devel/share/roseus/ros/std_msgs/msg/Int16.l
Symlinking /home/eaibot/2022_jsjds/ros_ws/devel/share/roseus/ros/std_msgs/msg/Int16MultiArray.l
Symlinking /home/eaibot/2022_jsjds/ros_ws/devel/share/roseus/ros/std_msgs/msg/ByteMultiArray.l
Symlinking /home/eaibot/2022_jsjds/ros_ws/devel/share/roseus/ros/std_msgs/msg/Int32MultiArray.l
Symlinking /home/eaibot/2022_jsjds/ros_ws/devel/share/roseus/ros/std_msgs/msg/Empty.l
Symlinking /home/eaibot/2022_jsjds/ros_ws/devel/share/roseus/ros/std_msgs/msg/Int32.l
Symlinking /home/eaibot/2022_jsjds/ros_ws/devel/share/roseus/ros/std_msgs/msg/Byte.l
Symlinking /home/eaibot/2022_jsjds/ros_ws/devel/share/roseus/ros/std_msgs/msg/Float32MultiArray.l
Symlinking /home/eaibot/2022_jsjds/ros_ws/devel/share/roseus/ros/std_msgs/msg/MultiArrayDimension.l
Symlinking /home/eaibot/2022_jsjds/ros_ws/devel/share/roseus/ros/std_msgs/msg/Duration.l
Symlinking /home/eaibot/2022_jsjds/ros_ws/devel/share/roseus/ros/std_msgs/msg/UInt8.l
Symlinking /home/eaibot/2022_jsjds/ros_ws/devel/share/roseus/ros/std_msgs/msg/String.l
Symlinking /home/eaibot/2022_jsjds/ros_ws/devel/share/roseus/ros/std_msgs/msg/UInt16.l
Symlinking /home/eaibot/2022_jsjds/ros_ws/devel/share/roseus/ros/std_msgs/msg/UInt8MultiArray.l
Symlinking /home/eaibot/2022_jsjds/ros_ws/devel/share/roseus/ros/std_msgs/msg/UInt64.l
Symlinking /home/eaibot/2022_jsjds/ros_ws/devel/share/roseus/ros/std_msgs/msg/UInt32MultiArray.l
Symlinking /home/eaibot/2022_jsjds/ros_ws/devel/share/roseus/ros/std_msgs/msg/Int64MultiArray.l
Symlinking /home/eaibot/2022_jsjds/ros_ws/devel/share/roseus/ros/std_msgs/msg/Int64.l
Symlinking /home/eaibot/2022_jsjds/ros_ws/devel/share/common-lisp/ros/std_msgs/msg/Float32.lisp
Symlinking /home/eaibot/2022_jsjds/ros_ws/devel/share/common-lisp/ros/std_msgs/msg/Bool.lisp
Symlinking /home/eaibot/2022_jsjds/ros_ws/devel/share/common-lisp/ros/std_msgs/msg/Int64MultiArray.lisp
Symlinking /home/eaibot/2022_jsjds/ros_ws/devel/share/common-lisp/ros/std_msgs/msg/_package_UInt64.lisp
Symlinking /home/eaibot/2022_jsjds/ros_ws/devel/share/common-lisp/ros/std_msgs/msg/_package_Int8.lisp
Symlinking /home/eaibot/2022_jsjds/ros_ws/devel/share/common-lisp/ros/std_msgs/msg/_package_ByteMultiArray.lisp
Symlinking /home/eaibot/2022_jsjds/ros_ws/devel/share/common-lisp/ros/std_msgs/msg/_package_Empty.lisp
Symlinking /home/eaibot/2022_jsjds/ros_ws/devel/share/common-lisp/ros/std_msgs/msg/Duration.lisp
Symlinking /home/eaibot/2022_jsjds/ros_ws/devel/share/common-lisp/ros/std_msgs/msg/_package_Duration.lisp
Symlinking /home/eaibot/2022_jsjds/ros_ws/devel/share/common-lisp/ros/std_msgs/msg/_package_UInt8MultiArray.lisp
Symlinking /home/eaibot/2022_jsjds/ros_ws/devel/share/common-lisp/ros/std_msgs/msg/UInt64.lisp
Symlinking /home/eaibot/2022_jsjds/ros_ws/devel/share/common-lisp/ros/std_msgs/msg/UInt8MultiArray.lisp
Symlinking /home/eaibot/2022_jsjds/ros_ws/devel/share/common-lisp/ros/std_msgs/msg/Int32MultiArray.lisp
Symlinking /home/eaibot/2022_jsjds/ros_ws/devel/share/common-lisp/ros/std_msgs/msg/Int16MultiArray.lisp
Symlinking /home/eaibot/2022_jsjds/ros_ws/devel/share/common-lisp/ros/std_msgs/msg/UInt32.lisp
Symlinking /home/eaibot/2022_jsjds/ros_ws/devel/share/common-lisp/ros/std_msgs/msg/UInt16.lisp
Symlinking /home/eaibot/2022_jsjds/ros_ws/devel/share/common-lisp/ros/std_msgs/msg/Time.lisp
Symlinking /home/eaibot/2022_jsjds/ros_ws/devel/share/common-lisp/ros/std_msgs/msg/_package_Header.lisp
Symlinking /home/eaibot/2022_jsjds/ros_ws/devel/share/common-lisp/ros/std_msgs/msg/Float64MultiArray.lisp
Symlinking /home/eaibot/2022_jsjds/ros_ws/devel/share/common-lisp/ros/std_msgs/msg/UInt8.lisp
Symlinking /home/eaibot/2022_jsjds/ros_ws/devel/share/common-lisp/ros/std_msgs/msg/_package_Int8MultiArray.lisp
Symlinking /home/eaibot/2022_jsjds/ros_ws/devel/share/common-lisp/ros/std_msgs/msg/Int8.lisp
Symlinking /home/eaibot/2022_jsjds/ros_ws/devel/share/common-lisp/ros/std_msgs/msg/MultiArrayDimension.lisp
Symlinking /home/eaibot/2022_jsjds/ros_ws/devel/share/common-lisp/ros/std_msgs/msg/_package_UInt32MultiArray.lisp
Symlinking /home/eaibot/2022_jsjds/ros_ws/devel/share/common-lisp/ros/std_msgs/msg/_package_Int64.lisp
Symlinking /home/eaibot/2022_jsjds/ros_ws/devel/share/common-lisp/ros/std_msgs/msg/_package_Bool.lisp
Symlinking /home/eaibot/2022_jsjds/ros_ws/devel/share/common-lisp/ros/std_msgs/msg/_package_Int16.lisp
Symlinking /home/eaibot/2022_jsjds/ros_ws/devel/share/common-lisp/ros/std_msgs/msg/_package.lisp
Symlinking /home/eaibot/2022_jsjds/ros_ws/devel/share/common-lisp/ros/std_msgs/msg/UInt32MultiArray.lisp
Symlinking /home/eaibot/2022_jsjds/ros_ws/devel/share/common-lisp/ros/std_msgs/msg/ColorRGBA.lisp
Symlinking /home/eaibot/2022_jsjds/ros_ws/devel/share/common-lisp/ros/std_msgs/msg/_package_Int16MultiArray.lisp
Symlinking /home/eaibot/2022_jsjds/ros_ws/devel/share/common-lisp/ros/std_msgs/msg/UInt64MultiArray.lisp
Symlinking /home/eaibot/2022_jsjds/ros_ws/devel/share/common-lisp/ros/std_msgs/msg/ByteMultiArray.lisp
Symlinking /home/eaibot/2022_jsjds/ros_ws/devel/share/common-lisp/ros/std_msgs/msg/Int64.lisp
Symlinking /home/eaibot/2022_jsjds/ros_ws/devel/share/common-lisp/ros/std_msgs/msg/_package_Float32MultiArray.lisp
Symlinking /home/eaibot/2022_jsjds/ros_ws/devel/share/common-lisp/ros/std_msgs/msg/_package_Char.lisp
Symlinking /home/eaibot/2022_jsjds/ros_ws/devel/share/common-lisp/ros/std_msgs/msg/_package_Int64MultiArray.lisp
Symlinking /home/eaibot/2022_jsjds/ros_ws/devel/share/common-lisp/ros/std_msgs/msg/Int8MultiArray.lisp
Symlinking /home/eaibot/2022_jsjds/ros_ws/devel/share/common-lisp/ros/std_msgs/msg/_package_UInt16.lisp
Symlinking /home/eaibot/2022_jsjds/ros_ws/devel/share/common-lisp/ros/std_msgs/msg/_package_Time.lisp
Symlinking /home/eaibot/2022_jsjds/ros_ws/devel/share/common-lisp/ros/std_msgs/msg/String.lisp
Symlinking /home/eaibot/2022_jsjds/ros_ws/devel/share/common-lisp/ros/std_msgs/msg/_package_UInt8.lisp
Symlinking /home/eaibot/2022_jsjds/ros_ws/devel/share/common-lisp/ros/std_msgs/msg/_package_Int32.lisp
Symlinking /home/eaibot/2022_jsjds/ros_ws/devel/share/common-lisp/ros/std_msgs/msg/_package_Byte.lisp
Symlinking /home/eaibot/2022_jsjds/ros_ws/devel/share/common-lisp/ros/std_msgs/msg/_package_Int32MultiArray.lisp
Symlinking /home/eaibot/2022_jsjds/ros_ws/devel/share/common-lisp/ros/std_msgs/msg/_package_Float32.lisp
Symlinking /home/eaibot/2022_jsjds/ros_ws/devel/share/common-lisp/ros/std_msgs/msg/Empty.lisp
Symlinking /home/eaibot/2022_jsjds/ros_ws/devel/share/common-lisp/ros/std_msgs/msg/Header.lisp
Symlinking /home/eaibot/2022_jsjds/ros_ws/devel/share/common-lisp/ros/std_msgs/msg/_package_String.lisp
Symlinking /home/eaibot/2022_jsjds/ros_ws/devel/share/common-lisp/ros/std_msgs/msg/_package_UInt64MultiArray.lisp
Symlinking /home/eaibot/2022_jsjds/ros_ws/devel/share/common-lisp/ros/std_msgs/msg/std_msgs-msg.asd
Symlinking /home/eaibot/2022_jsjds/ros_ws/devel/share/common-lisp/ros/std_msgs/msg/_package_Float64MultiArray.lisp
Symlinking /home/eaibot/2022_jsjds/ros_ws/devel/share/common-lisp/ros/std_msgs/msg/MultiArrayLayout.lisp
Symlinking /home/eaibot/2022_jsjds/ros_ws/devel/share/common-lisp/ros/std_msgs/msg/UInt16MultiArray.lisp
Symlinking /home/eaibot/2022_jsjds/ros_ws/devel/share/common-lisp/ros/std_msgs/msg/Int32.lisp
Symlinking /home/eaibot/2022_jsjds/ros_ws/devel/share/common-lisp/ros/std_msgs/msg/_package_MultiArrayDimension.lisp
Symlinking /home/eaibot/2022_jsjds/ros_ws/devel/share/common-lisp/ros/std_msgs/msg/Byte.lisp
Symlinking /home/eaibot/2022_jsjds/ros_ws/devel/share/common-lisp/ros/std_msgs/msg/_package_MultiArrayLayout.lisp
Symlinking /home/eaibot/2022_jsjds/ros_ws/devel/share/common-lisp/ros/std_msgs/msg/Int16.lisp
Symlinking /home/eaibot/2022_jsjds/ros_ws/devel/share/common-lisp/ros/std_msgs/msg/Float64.lisp
Symlinking /home/eaibot/2022_jsjds/ros_ws/devel/share/common-lisp/ros/std_msgs/msg/_package_UInt16MultiArray.lisp
Symlinking /home/eaibot/2022_jsjds/ros_ws/devel/share/common-lisp/ros/std_msgs/msg/Float32MultiArray.lisp
Symlinking /home/eaibot/2022_jsjds/ros_ws/devel/share/common-lisp/ros/std_msgs/msg/_package_ColorRGBA.lisp
Symlinking /home/eaibot/2022_jsjds/ros_ws/devel/share/common-lisp/ros/std_msgs/msg/Char.lisp
Symlinking /home/eaibot/2022_jsjds/ros_ws/devel/share/common-lisp/ros/std_msgs/msg/_package_Float64.lisp
Symlinking /home/eaibot/2022_jsjds/ros_ws/devel/share/common-lisp/ros/std_msgs/msg/_package_UInt32.lisp
Symlinking /home/eaibot/2022_jsjds/ros_ws/devel/share/gennodejs/ros/std_msgs/_index.js
Symlinking /home/eaibot/2022_jsjds/ros_ws/devel/share/gennodejs/ros/std_msgs/msg/Int64MultiArray.js
Symlinking /home/eaibot/2022_jsjds/ros_ws/devel/share/gennodejs/ros/std_msgs/msg/_index.js
Symlinking /home/eaibot/2022_jsjds/ros_ws/devel/share/gennodejs/ros/std_msgs/msg/UInt64.js
Symlinking /home/eaibot/2022_jsjds/ros_ws/devel/share/gennodejs/ros/std_msgs/msg/UInt64MultiArray.js
Symlinking /home/eaibot/2022_jsjds/ros_ws/devel/share/gennodejs/ros/std_msgs/msg/Float32.js
Symlinking /home/eaibot/2022_jsjds/ros_ws/devel/share/gennodejs/ros/std_msgs/msg/Int32.js
Symlinking /home/eaibot/2022_jsjds/ros_ws/devel/share/gennodejs/ros/std_msgs/msg/Float64.js
Symlinking /home/eaibot/2022_jsjds/ros_ws/devel/share/gennodejs/ros/std_msgs/msg/Int8MultiArray.js
Symlinking /home/eaibot/2022_jsjds/ros_ws/devel/share/gennodejs/ros/std_msgs/msg/Time.js
Symlinking /home/eaibot/2022_jsjds/ros_ws/devel/share/gennodejs/ros/std_msgs/msg/String.js
Symlinking /home/eaibot/2022_jsjds/ros_ws/devel/share/gennodejs/ros/std_msgs/msg/UInt8.js
Symlinking /home/eaibot/2022_jsjds/ros_ws/devel/share/gennodejs/ros/std_msgs/msg/Header.js
Symlinking /home/eaibot/2022_jsjds/ros_ws/devel/share/gennodejs/ros/std_msgs/msg/UInt8MultiArray.js
Symlinking /home/eaibot/2022_jsjds/ros_ws/devel/share/gennodejs/ros/std_msgs/msg/ByteMultiArray.js
Symlinking /home/eaibot/2022_jsjds/ros_ws/devel/share/gennodejs/ros/std_msgs/msg/Int64.js
Symlinking /home/eaibot/2022_jsjds/ros_ws/devel/share/gennodejs/ros/std_msgs/msg/ColorRGBA.js
Symlinking /home/eaibot/2022_jsjds/ros_ws/devel/share/gennodejs/ros/std_msgs/msg/Bool.js
Symlinking /home/eaibot/2022_jsjds/ros_ws/devel/share/gennodejs/ros/std_msgs/msg/Int8.js
Symlinking /home/eaibot/2022_jsjds/ros_ws/devel/share/gennodejs/ros/std_msgs/msg/UInt16MultiArray.js
Symlinking /home/eaibot/2022_jsjds/ros_ws/devel/share/gennodejs/ros/std_msgs/msg/UInt32.js
Symlinking /home/eaibot/2022_jsjds/ros_ws/devel/share/gennodejs/ros/std_msgs/msg/Empty.js
Symlinking /home/eaibot/2022_jsjds/ros_ws/devel/share/gennodejs/ros/std_msgs/msg/Int16MultiArray.js
Symlinking /home/eaibot/2022_jsjds/ros_ws/devel/share/gennodejs/ros/std_msgs/msg/MultiArrayLayout.js
Symlinking /home/eaibot/2022_jsjds/ros_ws/devel/share/gennodejs/ros/std_msgs/msg/Float32MultiArray.js
Symlinking /home/eaibot/2022_jsjds/ros_ws/devel/share/gennodejs/ros/std_msgs/msg/MultiArrayDimension.js
Symlinking /home/eaibot/2022_jsjds/ros_ws/devel/share/gennodejs/ros/std_msgs/msg/Byte.js
Symlinking /home/eaibot/2022_jsjds/ros_ws/devel/share/gennodejs/ros/std_msgs/msg/UInt32MultiArray.js
Symlinking /home/eaibot/2022_jsjds/ros_ws/devel/share/gennodejs/ros/std_msgs/msg/Char.js
Symlinking /home/eaibot/2022_jsjds/ros_ws/devel/share/gennodejs/ros/std_msgs/msg/Int32MultiArray.js
Symlinking /home/eaibot/2022_jsjds/ros_ws/devel/share/gennodejs/ros/std_msgs/msg/Int16.js
Symlinking /home/eaibot/2022_jsjds/ros_ws/devel/share/gennodejs/ros/std_msgs/msg/UInt16.js
Symlinking /home/eaibot/2022_jsjds/ros_ws/devel/share/gennodejs/ros/std_msgs/msg/Float64MultiArray.js
Symlinking /home/eaibot/2022_jsjds/ros_ws/devel/share/gennodejs/ros/std_msgs/msg/Duration.js
Symlinking /home/eaibot/2022_jsjds/ros_ws/devel/share/std_msgs/cmake/std_msgs-msg-paths.cmake
Symlinking /home/eaibot/2022_jsjds/ros_ws/devel/share/std_msgs/cmake/std_msgs-msg-extras.cmake
Symlinking /home/eaibot/2022_jsjds/ros_ws/devel/share/std_msgs/cmake/std_msgsConfig-version.cmake
Symlinking /home/eaibot/2022_jsjds/ros_ws/devel/share/std_msgs/cmake/std_msgsConfig.cmake
