2023-07-24 21:15:31,646 - INFO - distance of the obstacle : 0.515 - single_laser.py
2023-07-24 21:15:46,453 - INFO - distance of the obstacle : 0.689 - single_laser.py
2023-07-24 21:16:43,383 - INFO - distance of the obstacle : 0.191 - single_laser.py
2023-07-24 21:16:57,272 - INFO - distance of the obstacle : 0.24 - single_laser.py
2023-07-24 21:17:33,011 - INFO - distance of the obstacle : 0.501 - single_laser.py
2023-07-24 21:17:56,822 - INFO - distance of the obstacle : 0.671 - single_laser.py
2023-07-24 21:18:48,576 - INFO - distance of the obstacle : 0.205 - single_laser.py
2023-07-24 21:19:10,486 - INFO - distance of the obstacle : 0.171 - single_laser.py
2023-07-24 21:19:40,831 - INFO - distance of the obstacle : 0.51 - single_laser.py
2023-07-24 21:19:55,655 - INFO - distance of the obstacle : 0.678 - single_laser.py
2023-07-24 21:21:08,518 - INFO - distance of the obstacle : 0.436 - single_laser.py
