Symlinking /home/eaibot/2022_jsjds/ros_ws/devel/include/stereo_image_proc/DisparityConfig.h
Symlinking /home/eaibot/2022_jsjds/ros_ws/devel/lib/libstereo_image_proc.so
Symlinking /home/eaibot/2022_jsjds/ros_ws/devel/lib/stereo_image_proc/stereo_image_proc
Symlinking /home/eaibot/2022_jsjds/ros_ws/devel/lib/pkgconfig/stereo_image_proc.pc
Symlinking /home/eaibot/2022_jsjds/ros_ws/devel/lib/python3.6/site-packages/stereo_image_proc/__init__.py
Symlinking /home/eaibot/2022_jsjds/ros_ws/devel/lib/python3.6/site-packages/stereo_image_proc/cfg/__init__.py
Symlinking /home/eaibot/2022_jsjds/ros_ws/devel/lib/python3.6/site-packages/stereo_image_proc/cfg/DisparityConfig.py
Symlinking /home/eaibot/2022_jsjds/ros_ws/devel/share/stereo_image_proc/docs/DisparityConfig-usage.dox
Symlinking /home/eaibot/2022_jsjds/ros_ws/devel/share/stereo_image_proc/docs/DisparityConfig.wikidoc
Symlinking /home/eaibot/2022_jsjds/ros_ws/devel/share/stereo_image_proc/docs/DisparityConfig.dox
Symlinking /home/eaibot/2022_jsjds/ros_ws/devel/share/stereo_image_proc/cmake/stereo_image_procConfig.cmake
Symlinking /home/eaibot/2022_jsjds/ros_ws/devel/share/stereo_image_proc/cmake/stereo_image_procConfig-version.cmake
