[  0%] Built target _sensor_msgs_generate_messages_check_deps_TimeReference
[  0%] Built target _sensor_msgs_generate_messages_check_deps_FluidPressure
[  0%] Built target _sensor_msgs_generate_messages_check_deps_ChannelFloat32
[  0%] Built target _sensor_msgs_generate_messages_check_deps_MagneticField
[  0%] Built target _sensor_msgs_generate_messages_check_deps_PointField
[  0%] Built target _sensor_msgs_generate_messages_check_deps_BatteryState
[  0%] Built target _sensor_msgs_generate_messages_check_deps_Illuminance
[  0%] Built target _sensor_msgs_generate_messages_check_deps_PointCloud2
[  0%] Built target _sensor_msgs_generate_messages_check_deps_CompressedImage
[  0%] Built target _sensor_msgs_generate_messages_check_deps_Imu
[  0%] Built target _sensor_msgs_generate_messages_check_deps_LaserScan
[  0%] Built target _sensor_msgs_generate_messages_check_deps_NavSatFix
[  0%] Built target std_msgs_generate_messages_cpp
[  0%] Built target geometry_msgs_generate_messages_cpp
[  0%] Built target _sensor_msgs_generate_messages_check_deps_CameraInfo
[  0%] Built target _sensor_msgs_generate_messages_check_deps_Image
[  0%] Built target _sensor_msgs_generate_messages_check_deps_Joy
[  0%] Built target _sensor_msgs_generate_messages_check_deps_JoyFeedbackArray
[  0%] Built target _sensor_msgs_generate_messages_check_deps_JoyFeedback
[  0%] Built target _sensor_msgs_generate_messages_check_deps_LaserEcho
[  0%] Built target _sensor_msgs_generate_messages_check_deps_SetCameraInfo
[  0%] Built target _sensor_msgs_generate_messages_check_deps_MultiDOFJointState
[  0%] Built target _sensor_msgs_generate_messages_check_deps_MultiEchoLaserScan
[  0%] Built target _sensor_msgs_generate_messages_check_deps_JointState
[  0%] Built target _sensor_msgs_generate_messages_check_deps_NavSatStatus
[  0%] Built target _sensor_msgs_generate_messages_check_deps_Range
[  0%] Built target _sensor_msgs_generate_messages_check_deps_RegionOfInterest
[  0%] Built target _sensor_msgs_generate_messages_check_deps_RelativeHumidity
[  0%] Built target _sensor_msgs_generate_messages_check_deps_Temperature
[  0%] Built target _sensor_msgs_generate_messages_check_deps_PointCloud
[ 19%] Built target sensor_msgs_generate_messages_cpp
[ 19%] Built target geometry_msgs_generate_messages_nodejs
[ 19%] Built target std_msgs_generate_messages_nodejs
[ 39%] Built target sensor_msgs_generate_messages_nodejs
[ 39%] Built target std_msgs_generate_messages_lisp
[ 39%] Built target geometry_msgs_generate_messages_lisp
[ 58%] Built target sensor_msgs_generate_messages_lisp
[ 58%] Built target std_msgs_generate_messages_eus
[ 58%] Built target geometry_msgs_generate_messages_eus
[ 79%] Built target sensor_msgs_generate_messages_eus
[ 79%] Built target std_msgs_generate_messages_py
[ 79%] Built target geometry_msgs_generate_messages_py
[100%] Built target sensor_msgs_generate_messages_py
[100%] Built target sensor_msgs_generate_messages
[36mInstall the project...[0m
-- Install configuration: "Release"
-- Up-to-date: /home/eaibot/2022_jsjds/ros_ws/install/_setup_util.py
-- Installing: /home/eaibot/2022_jsjds/ros_ws/install/env.sh
-- Installing: /home/eaibot/2022_jsjds/ros_ws/install/setup.bash
-- Installing: /home/eaibot/2022_jsjds/ros_ws/install/local_setup.bash
-- Installing: /home/eaibot/2022_jsjds/ros_ws/install/setup.sh
-- Installing: /home/eaibot/2022_jsjds/ros_ws/install/local_setup.sh
-- Installing: /home/eaibot/2022_jsjds/ros_ws/install/setup.zsh
-- Installing: /home/eaibot/2022_jsjds/ros_ws/install/local_setup.zsh
-- Installing: /home/eaibot/2022_jsjds/ros_ws/install/.rosinstall
+ cd /home/eaibot/2022_jsjds/ros_ws/src/common_msgs/sensor_msgs
+ mkdir -p /home/eaibot/2022_jsjds/ros_ws/install/lib/python3.6/site-packages
+ /usr/bin/env PYTHONPATH=/home/eaibot/2022_jsjds/ros_ws/install/lib/python3.6/site-packages:/home/eaibot/2022_jsjds/ros_ws/build/sensor_msgs/lib/python3.6/site-packages:/home/eaibot/2022_jsjds/ros_ws/install/lib/python3.6/site-packages:/opt/ros/kinetic/lib/python2.7/dist-packages:/home/eaibot/2022_jsjds/ros_ws/devel/lib/python3.6/site-packages:/home/eaibot/2022_jsjds/ros_ws/devel/lib/python3.6/site-packages:/home/eaibot/2022_jsjds/ros_ws/devel/lib/python3.6/site-packages CATKIN_BINARY_DIR=/home/eaibot/2022_jsjds/ros_ws/build/sensor_msgs /usr/bin/python3 /home/eaibot/2022_jsjds/ros_ws/src/common_msgs/sensor_msgs/setup.py build --build-base /home/eaibot/2022_jsjds/ros_ws/build/sensor_msgs install --root=/ --prefix=/home/eaibot/2022_jsjds/ros_ws/install --install-scripts=/home/eaibot/2022_jsjds/ros_ws/install/bin
running build
running build_py
running install
running install_lib
running install_egg_info
Removing /home/eaibot/2022_jsjds/ros_ws/install/lib/python3.6/site-packages/sensor_msgs-1.12.7-py3.6.egg-info
Writing /home/eaibot/2022_jsjds/ros_ws/install/lib/python3.6/site-packages/sensor_msgs-1.12.7-py3.6.egg-info
-- Up-to-date: /home/eaibot/2022_jsjds/ros_ws/install/share/sensor_msgs/msg/BatteryState.msg
-- Up-to-date: /home/eaibot/2022_jsjds/ros_ws/install/share/sensor_msgs/msg/CameraInfo.msg
-- Up-to-date: /home/eaibot/2022_jsjds/ros_ws/install/share/sensor_msgs/msg/ChannelFloat32.msg
-- Up-to-date: /home/eaibot/2022_jsjds/ros_ws/install/share/sensor_msgs/msg/CompressedImage.msg
-- Up-to-date: /home/eaibot/2022_jsjds/ros_ws/install/share/sensor_msgs/msg/FluidPressure.msg
-- Up-to-date: /home/eaibot/2022_jsjds/ros_ws/install/share/sensor_msgs/msg/Illuminance.msg
-- Up-to-date: /home/eaibot/2022_jsjds/ros_ws/install/share/sensor_msgs/msg/Image.msg
-- Up-to-date: /home/eaibot/2022_jsjds/ros_ws/install/share/sensor_msgs/msg/Imu.msg
-- Up-to-date: /home/eaibot/2022_jsjds/ros_ws/install/share/sensor_msgs/msg/JointState.msg
-- Up-to-date: /home/eaibot/2022_jsjds/ros_ws/install/share/sensor_msgs/msg/Joy.msg
-- Up-to-date: /home/eaibot/2022_jsjds/ros_ws/install/share/sensor_msgs/msg/JoyFeedback.msg
-- Up-to-date: /home/eaibot/2022_jsjds/ros_ws/install/share/sensor_msgs/msg/JoyFeedbackArray.msg
-- Up-to-date: /home/eaibot/2022_jsjds/ros_ws/install/share/sensor_msgs/msg/LaserEcho.msg
-- Up-to-date: /home/eaibot/2022_jsjds/ros_ws/install/share/sensor_msgs/msg/LaserScan.msg
-- Up-to-date: /home/eaibot/2022_jsjds/ros_ws/install/share/sensor_msgs/msg/MagneticField.msg
-- Up-to-date: /home/eaibot/2022_jsjds/ros_ws/install/share/sensor_msgs/msg/MultiDOFJointState.msg
-- Up-to-date: /home/eaibot/2022_jsjds/ros_ws/install/share/sensor_msgs/msg/MultiEchoLaserScan.msg
-- Up-to-date: /home/eaibot/2022_jsjds/ros_ws/install/share/sensor_msgs/msg/NavSatFix.msg
-- Up-to-date: /home/eaibot/2022_jsjds/ros_ws/install/share/sensor_msgs/msg/NavSatStatus.msg
-- Up-to-date: /home/eaibot/2022_jsjds/ros_ws/install/share/sensor_msgs/msg/PointCloud.msg
-- Up-to-date: /home/eaibot/2022_jsjds/ros_ws/install/share/sensor_msgs/msg/PointCloud2.msg
-- Up-to-date: /home/eaibot/2022_jsjds/ros_ws/install/share/sensor_msgs/msg/PointField.msg
-- Up-to-date: /home/eaibot/2022_jsjds/ros_ws/install/share/sensor_msgs/msg/Range.msg
-- Up-to-date: /home/eaibot/2022_jsjds/ros_ws/install/share/sensor_msgs/msg/RegionOfInterest.msg
-- Up-to-date: /home/eaibot/2022_jsjds/ros_ws/install/share/sensor_msgs/msg/RelativeHumidity.msg
-- Up-to-date: /home/eaibot/2022_jsjds/ros_ws/install/share/sensor_msgs/msg/Temperature.msg
-- Up-to-date: /home/eaibot/2022_jsjds/ros_ws/install/share/sensor_msgs/msg/TimeReference.msg
-- Up-to-date: /home/eaibot/2022_jsjds/ros_ws/install/share/sensor_msgs/srv/SetCameraInfo.srv
-- Up-to-date: /home/eaibot/2022_jsjds/ros_ws/install/share/sensor_msgs/cmake/sensor_msgs-msg-paths.cmake
-- Up-to-date: /home/eaibot/2022_jsjds/ros_ws/install/include/sensor_msgs
-- Installing: /home/eaibot/2022_jsjds/ros_ws/install/include/sensor_msgs/Range.h
-- Installing: /home/eaibot/2022_jsjds/ros_ws/install/include/sensor_msgs/JoyFeedback.h
-- Installing: /home/eaibot/2022_jsjds/ros_ws/install/include/sensor_msgs/SetCameraInfo.h
-- Installing: /home/eaibot/2022_jsjds/ros_ws/install/include/sensor_msgs/Temperature.h
-- Installing: /home/eaibot/2022_jsjds/ros_ws/install/include/sensor_msgs/NavSatFix.h
-- Installing: /home/eaibot/2022_jsjds/ros_ws/install/include/sensor_msgs/PointField.h
-- Installing: /home/eaibot/2022_jsjds/ros_ws/install/include/sensor_msgs/ChannelFloat32.h
-- Installing: /home/eaibot/2022_jsjds/ros_ws/install/include/sensor_msgs/Joy.h
-- Installing: /home/eaibot/2022_jsjds/ros_ws/install/include/sensor_msgs/FluidPressure.h
-- Installing: /home/eaibot/2022_jsjds/ros_ws/install/include/sensor_msgs/Illuminance.h
-- Installing: /home/eaibot/2022_jsjds/ros_ws/install/include/sensor_msgs/RegionOfInterest.h
-- Installing: /home/eaibot/2022_jsjds/ros_ws/install/include/sensor_msgs/PointCloud.h
-- Installing: /home/eaibot/2022_jsjds/ros_ws/install/include/sensor_msgs/MultiEchoLaserScan.h
-- Installing: /home/eaibot/2022_jsjds/ros_ws/install/include/sensor_msgs/SetCameraInfoResponse.h
-- Installing: /home/eaibot/2022_jsjds/ros_ws/install/include/sensor_msgs/TimeReference.h
-- Installing: /home/eaibot/2022_jsjds/ros_ws/install/include/sensor_msgs/LaserScan.h
-- Installing: /home/eaibot/2022_jsjds/ros_ws/install/include/sensor_msgs/Image.h
-- Installing: /home/eaibot/2022_jsjds/ros_ws/install/include/sensor_msgs/JoyFeedbackArray.h
-- Installing: /home/eaibot/2022_jsjds/ros_ws/install/include/sensor_msgs/PointCloud2.h
-- Installing: /home/eaibot/2022_jsjds/ros_ws/install/include/sensor_msgs/SetCameraInfoRequest.h
-- Installing: /home/eaibot/2022_jsjds/ros_ws/install/include/sensor_msgs/JointState.h
-- Installing: /home/eaibot/2022_jsjds/ros_ws/install/include/sensor_msgs/NavSatStatus.h
-- Installing: /home/eaibot/2022_jsjds/ros_ws/install/include/sensor_msgs/MagneticField.h
-- Installing: /home/eaibot/2022_jsjds/ros_ws/install/include/sensor_msgs/Imu.h
-- Installing: /home/eaibot/2022_jsjds/ros_ws/install/include/sensor_msgs/CompressedImage.h
-- Installing: /home/eaibot/2022_jsjds/ros_ws/install/include/sensor_msgs/MultiDOFJointState.h
-- Installing: /home/eaibot/2022_jsjds/ros_ws/install/include/sensor_msgs/CameraInfo.h
-- Installing: /home/eaibot/2022_jsjds/ros_ws/install/include/sensor_msgs/RelativeHumidity.h
-- Installing: /home/eaibot/2022_jsjds/ros_ws/install/include/sensor_msgs/BatteryState.h
-- Installing: /home/eaibot/2022_jsjds/ros_ws/install/include/sensor_msgs/LaserEcho.h
-- Up-to-date: /home/eaibot/2022_jsjds/ros_ws/install/share/roseus/ros/sensor_msgs
-- Up-to-date: /home/eaibot/2022_jsjds/ros_ws/install/share/roseus/ros/sensor_msgs/srv
-- Installing: /home/eaibot/2022_jsjds/ros_ws/install/share/roseus/ros/sensor_msgs/srv/SetCameraInfo.l
-- Installing: /home/eaibot/2022_jsjds/ros_ws/install/share/roseus/ros/sensor_msgs/manifest.l
-- Up-to-date: /home/eaibot/2022_jsjds/ros_ws/install/share/roseus/ros/sensor_msgs/msg
-- Installing: /home/eaibot/2022_jsjds/ros_ws/install/share/roseus/ros/sensor_msgs/msg/NavSatFix.l
-- Installing: /home/eaibot/2022_jsjds/ros_ws/install/share/roseus/ros/sensor_msgs/msg/LaserScan.l
-- Installing: /home/eaibot/2022_jsjds/ros_ws/install/share/roseus/ros/sensor_msgs/msg/JointState.l
-- Installing: /home/eaibot/2022_jsjds/ros_ws/install/share/roseus/ros/sensor_msgs/msg/ChannelFloat32.l
-- Installing: /home/eaibot/2022_jsjds/ros_ws/install/share/roseus/ros/sensor_msgs/msg/MultiEchoLaserScan.l
-- Installing: /home/eaibot/2022_jsjds/ros_ws/install/share/roseus/ros/sensor_msgs/msg/Illuminance.l
-- Installing: /home/eaibot/2022_jsjds/ros_ws/install/share/roseus/ros/sensor_msgs/msg/Temperature.l
-- Installing: /home/eaibot/2022_jsjds/ros_ws/install/share/roseus/ros/sensor_msgs/msg/NavSatStatus.l
-- Installing: /home/eaibot/2022_jsjds/ros_ws/install/share/roseus/ros/sensor_msgs/msg/PointCloud2.l
-- Installing: /home/eaibot/2022_jsjds/ros_ws/install/share/roseus/ros/sensor_msgs/msg/Range.l
-- Installing: /home/eaibot/2022_jsjds/ros_ws/install/share/roseus/ros/sensor_msgs/msg/RelativeHumidity.l
-- Installing: /home/eaibot/2022_jsjds/ros_ws/install/share/roseus/ros/sensor_msgs/msg/JoyFeedback.l
-- Installing: /home/eaibot/2022_jsjds/ros_ws/install/share/roseus/ros/sensor_msgs/msg/CompressedImage.l
-- Installing: /home/eaibot/2022_jsjds/ros_ws/install/share/roseus/ros/sensor_msgs/msg/FluidPressure.l
-- Installing: /home/eaibot/2022_jsjds/ros_ws/install/share/roseus/ros/sensor_msgs/msg/TimeReference.l
-- Installing: /home/eaibot/2022_jsjds/ros_ws/install/share/roseus/ros/sensor_msgs/msg/BatteryState.l
-- Installing: /home/eaibot/2022_jsjds/ros_ws/install/share/roseus/ros/sensor_msgs/msg/Imu.l
-- Installing: /home/eaibot/2022_jsjds/ros_ws/install/share/roseus/ros/sensor_msgs/msg/JoyFeedbackArray.l
-- Installing: /home/eaibot/2022_jsjds/ros_ws/install/share/roseus/ros/sensor_msgs/msg/MagneticField.l
-- Installing: /home/eaibot/2022_jsjds/ros_ws/install/share/roseus/ros/sensor_msgs/msg/CameraInfo.l
-- Installing: /home/eaibot/2022_jsjds/ros_ws/install/share/roseus/ros/sensor_msgs/msg/PointCloud.l
-- Installing: /home/eaibot/2022_jsjds/ros_ws/install/share/roseus/ros/sensor_msgs/msg/LaserEcho.l
-- Installing: /home/eaibot/2022_jsjds/ros_ws/install/share/roseus/ros/sensor_msgs/msg/MultiDOFJointState.l
-- Installing: /home/eaibot/2022_jsjds/ros_ws/install/share/roseus/ros/sensor_msgs/msg/Image.l
-- Installing: /home/eaibot/2022_jsjds/ros_ws/install/share/roseus/ros/sensor_msgs/msg/PointField.l
-- Installing: /home/eaibot/2022_jsjds/ros_ws/install/share/roseus/ros/sensor_msgs/msg/RegionOfInterest.l
-- Installing: /home/eaibot/2022_jsjds/ros_ws/install/share/roseus/ros/sensor_msgs/msg/Joy.l
-- Up-to-date: /home/eaibot/2022_jsjds/ros_ws/install/share/common-lisp/ros/sensor_msgs
-- Up-to-date: /home/eaibot/2022_jsjds/ros_ws/install/share/common-lisp/ros/sensor_msgs/srv
-- Installing: /home/eaibot/2022_jsjds/ros_ws/install/share/common-lisp/ros/sensor_msgs/srv/_package.lisp
-- Installing: /home/eaibot/2022_jsjds/ros_ws/install/share/common-lisp/ros/sensor_msgs/srv/SetCameraInfo.lisp
-- Installing: /home/eaibot/2022_jsjds/ros_ws/install/share/common-lisp/ros/sensor_msgs/srv/_package_SetCameraInfo.lisp
-- Installing: /home/eaibot/2022_jsjds/ros_ws/install/share/common-lisp/ros/sensor_msgs/srv/sensor_msgs-srv.asd
-- Up-to-date: /home/eaibot/2022_jsjds/ros_ws/install/share/common-lisp/ros/sensor_msgs/msg
-- Installing: /home/eaibot/2022_jsjds/ros_ws/install/share/common-lisp/ros/sensor_msgs/msg/_package_FluidPressure.lisp
-- Installing: /home/eaibot/2022_jsjds/ros_ws/install/share/common-lisp/ros/sensor_msgs/msg/_package_NavSatStatus.lisp
-- Installing: /home/eaibot/2022_jsjds/ros_ws/install/share/common-lisp/ros/sensor_msgs/msg/MagneticField.lisp
-- Installing: /home/eaibot/2022_jsjds/ros_ws/install/share/common-lisp/ros/sensor_msgs/msg/_package_LaserEcho.lisp
-- Installing: /home/eaibot/2022_jsjds/ros_ws/install/share/common-lisp/ros/sensor_msgs/msg/_package_JoyFeedback.lisp
-- Installing: /home/eaibot/2022_jsjds/ros_ws/install/share/common-lisp/ros/sensor_msgs/msg/_package_CameraInfo.lisp
-- Installing: /home/eaibot/2022_jsjds/ros_ws/install/share/common-lisp/ros/sensor_msgs/msg/FluidPressure.lisp
-- Installing: /home/eaibot/2022_jsjds/ros_ws/install/share/common-lisp/ros/sensor_msgs/msg/JointState.lisp
-- Installing: /home/eaibot/2022_jsjds/ros_ws/install/share/common-lisp/ros/sensor_msgs/msg/_package_Range.lisp
-- Installing: /home/eaibot/2022_jsjds/ros_ws/install/share/common-lisp/ros/sensor_msgs/msg/Image.lisp
-- Installing: /home/eaibot/2022_jsjds/ros_ws/install/share/common-lisp/ros/sensor_msgs/msg/JoyFeedbackArray.lisp
-- Installing: /home/eaibot/2022_jsjds/ros_ws/install/share/common-lisp/ros/sensor_msgs/msg/_package_Joy.lisp
-- Installing: /home/eaibot/2022_jsjds/ros_ws/install/share/common-lisp/ros/sensor_msgs/msg/Temperature.lisp
-- Installing: /home/eaibot/2022_jsjds/ros_ws/install/share/common-lisp/ros/sensor_msgs/msg/PointField.lisp
-- Installing: /home/eaibot/2022_jsjds/ros_ws/install/share/common-lisp/ros/sensor_msgs/msg/TimeReference.lisp
-- Installing: /home/eaibot/2022_jsjds/ros_ws/install/share/common-lisp/ros/sensor_msgs/msg/_package_Illuminance.lisp
-- Installing: /home/eaibot/2022_jsjds/ros_ws/install/share/common-lisp/ros/sensor_msgs/msg/JoyFeedback.lisp
-- Installing: /home/eaibot/2022_jsjds/ros_ws/install/share/common-lisp/ros/sensor_msgs/msg/_package_JointState.lisp
-- Installing: /home/eaibot/2022_jsjds/ros_ws/install/share/common-lisp/ros/sensor_msgs/msg/Illuminance.lisp
-- Installing: /home/eaibot/2022_jsjds/ros_ws/install/share/common-lisp/ros/sensor_msgs/msg/_package_JoyFeedbackArray.lisp
-- Installing: /home/eaibot/2022_jsjds/ros_ws/install/share/common-lisp/ros/sensor_msgs/msg/_package_TimeReference.lisp
-- Installing: /home/eaibot/2022_jsjds/ros_ws/install/share/common-lisp/ros/sensor_msgs/msg/RegionOfInterest.lisp
-- Installing: /home/eaibot/2022_jsjds/ros_ws/install/share/common-lisp/ros/sensor_msgs/msg/Imu.lisp
-- Installing: /home/eaibot/2022_jsjds/ros_ws/install/share/common-lisp/ros/sensor_msgs/msg/_package_MagneticField.lisp
-- Installing: /home/eaibot/2022_jsjds/ros_ws/install/share/common-lisp/ros/sensor_msgs/msg/_package.lisp
-- Installing: /home/eaibot/2022_jsjds/ros_ws/install/share/common-lisp/ros/sensor_msgs/msg/sensor_msgs-msg.asd
-- Installing: /home/eaibot/2022_jsjds/ros_ws/install/share/common-lisp/ros/sensor_msgs/msg/NavSatFix.lisp
-- Installing: /home/eaibot/2022_jsjds/ros_ws/install/share/common-lisp/ros/sensor_msgs/msg/_package_LaserScan.lisp
-- Installing: /home/eaibot/2022_jsjds/ros_ws/install/share/common-lisp/ros/sensor_msgs/msg/LaserScan.lisp
-- Installing: /home/eaibot/2022_jsjds/ros_ws/install/share/common-lisp/ros/sensor_msgs/msg/MultiDOFJointState.lisp
-- Installing: /home/eaibot/2022_jsjds/ros_ws/install/share/common-lisp/ros/sensor_msgs/msg/RelativeHumidity.lisp
-- Installing: /home/eaibot/2022_jsjds/ros_ws/install/share/common-lisp/ros/sensor_msgs/msg/CameraInfo.lisp
-- Installing: /home/eaibot/2022_jsjds/ros_ws/install/share/common-lisp/ros/sensor_msgs/msg/Joy.lisp
-- Installing: /home/eaibot/2022_jsjds/ros_ws/install/share/common-lisp/ros/sensor_msgs/msg/PointCloud.lisp
-- Installing: /home/eaibot/2022_jsjds/ros_ws/install/share/common-lisp/ros/sensor_msgs/msg/_package_Imu.lisp
-- Installing: /home/eaibot/2022_jsjds/ros_ws/install/share/common-lisp/ros/sensor_msgs/msg/_package_MultiEchoLaserScan.lisp
-- Installing: /home/eaibot/2022_jsjds/ros_ws/install/share/common-lisp/ros/sensor_msgs/msg/_package_PointCloud2.lisp
-- Installing: /home/eaibot/2022_jsjds/ros_ws/install/share/common-lisp/ros/sensor_msgs/msg/_package_PointField.lisp
-- Installing: /home/eaibot/2022_jsjds/ros_ws/install/share/common-lisp/ros/sensor_msgs/msg/_package_Temperature.lisp
-- Installing: /home/eaibot/2022_jsjds/ros_ws/install/share/common-lisp/ros/sensor_msgs/msg/NavSatStatus.lisp
-- Installing: /home/eaibot/2022_jsjds/ros_ws/install/share/common-lisp/ros/sensor_msgs/msg/_package_BatteryState.lisp
-- Installing: /home/eaibot/2022_jsjds/ros_ws/install/share/common-lisp/ros/sensor_msgs/msg/_package_RelativeHumidity.lisp
-- Installing: /home/eaibot/2022_jsjds/ros_ws/install/share/common-lisp/ros/sensor_msgs/msg/BatteryState.lisp
-- Installing: /home/eaibot/2022_jsjds/ros_ws/install/share/common-lisp/ros/sensor_msgs/msg/Range.lisp
-- Installing: /home/eaibot/2022_jsjds/ros_ws/install/share/common-lisp/ros/sensor_msgs/msg/LaserEcho.lisp
-- Installing: /home/eaibot/2022_jsjds/ros_ws/install/share/common-lisp/ros/sensor_msgs/msg/_package_RegionOfInterest.lisp
-- Installing: /home/eaibot/2022_jsjds/ros_ws/install/share/common-lisp/ros/sensor_msgs/msg/_package_CompressedImage.lisp
-- Installing: /home/eaibot/2022_jsjds/ros_ws/install/share/common-lisp/ros/sensor_msgs/msg/_package_PointCloud.lisp
-- Installing: /home/eaibot/2022_jsjds/ros_ws/install/share/common-lisp/ros/sensor_msgs/msg/ChannelFloat32.lisp
-- Installing: /home/eaibot/2022_jsjds/ros_ws/install/share/common-lisp/ros/sensor_msgs/msg/MultiEchoLaserScan.lisp
-- Installing: /home/eaibot/2022_jsjds/ros_ws/install/share/common-lisp/ros/sensor_msgs/msg/PointCloud2.lisp
-- Installing: /home/eaibot/2022_jsjds/ros_ws/install/share/common-lisp/ros/sensor_msgs/msg/_package_NavSatFix.lisp
-- Installing: /home/eaibot/2022_jsjds/ros_ws/install/share/common-lisp/ros/sensor_msgs/msg/_package_MultiDOFJointState.lisp
-- Installing: /home/eaibot/2022_jsjds/ros_ws/install/share/common-lisp/ros/sensor_msgs/msg/_package_Image.lisp
-- Installing: /home/eaibot/2022_jsjds/ros_ws/install/share/common-lisp/ros/sensor_msgs/msg/_package_ChannelFloat32.lisp
-- Installing: /home/eaibot/2022_jsjds/ros_ws/install/share/common-lisp/ros/sensor_msgs/msg/CompressedImage.lisp
-- Up-to-date: /home/eaibot/2022_jsjds/ros_ws/install/share/gennodejs/ros/sensor_msgs
-- Installing: /home/eaibot/2022_jsjds/ros_ws/install/share/gennodejs/ros/sensor_msgs/_index.js
-- Up-to-date: /home/eaibot/2022_jsjds/ros_ws/install/share/gennodejs/ros/sensor_msgs/srv
-- Installing: /home/eaibot/2022_jsjds/ros_ws/install/share/gennodejs/ros/sensor_msgs/srv/_index.js
-- Installing: /home/eaibot/2022_jsjds/ros_ws/install/share/gennodejs/ros/sensor_msgs/srv/SetCameraInfo.js
-- Up-to-date: /home/eaibot/2022_jsjds/ros_ws/install/share/gennodejs/ros/sensor_msgs/msg
-- Installing: /home/eaibot/2022_jsjds/ros_ws/install/share/gennodejs/ros/sensor_msgs/msg/NavSatStatus.js
-- Installing: /home/eaibot/2022_jsjds/ros_ws/install/share/gennodejs/ros/sensor_msgs/msg/_index.js
-- Installing: /home/eaibot/2022_jsjds/ros_ws/install/share/gennodejs/ros/sensor_msgs/msg/CameraInfo.js
-- Installing: /home/eaibot/2022_jsjds/ros_ws/install/share/gennodejs/ros/sensor_msgs/msg/LaserEcho.js
-- Installing: /home/eaibot/2022_jsjds/ros_ws/install/share/gennodejs/ros/sensor_msgs/msg/Illuminance.js
-- Installing: /home/eaibot/2022_jsjds/ros_ws/install/share/gennodejs/ros/sensor_msgs/msg/MultiEchoLaserScan.js
-- Installing: /home/eaibot/2022_jsjds/ros_ws/install/share/gennodejs/ros/sensor_msgs/msg/ChannelFloat32.js
-- Installing: /home/eaibot/2022_jsjds/ros_ws/install/share/gennodejs/ros/sensor_msgs/msg/CompressedImage.js
-- Installing: /home/eaibot/2022_jsjds/ros_ws/install/share/gennodejs/ros/sensor_msgs/msg/Image.js
-- Installing: /home/eaibot/2022_jsjds/ros_ws/install/share/gennodejs/ros/sensor_msgs/msg/PointCloud.js
-- Installing: /home/eaibot/2022_jsjds/ros_ws/install/share/gennodejs/ros/sensor_msgs/msg/RelativeHumidity.js
-- Installing: /home/eaibot/2022_jsjds/ros_ws/install/share/gennodejs/ros/sensor_msgs/msg/MultiDOFJointState.js
-- Installing: /home/eaibot/2022_jsjds/ros_ws/install/share/gennodejs/ros/sensor_msgs/msg/JoyFeedbackArray.js
-- Installing: /home/eaibot/2022_jsjds/ros_ws/install/share/gennodejs/ros/sensor_msgs/msg/JoyFeedback.js
-- Installing: /home/eaibot/2022_jsjds/ros_ws/install/share/gennodejs/ros/sensor_msgs/msg/JointState.js
-- Installing: /home/eaibot/2022_jsjds/ros_ws/install/share/gennodejs/ros/sensor_msgs/msg/PointField.js
-- Installing: /home/eaibot/2022_jsjds/ros_ws/install/share/gennodejs/ros/sensor_msgs/msg/MagneticField.js
-- Installing: /home/eaibot/2022_jsjds/ros_ws/install/share/gennodejs/ros/sensor_msgs/msg/BatteryState.js
-- Installing: /home/eaibot/2022_jsjds/ros_ws/install/share/gennodejs/ros/sensor_msgs/msg/FluidPressure.js
-- Installing: /home/eaibot/2022_jsjds/ros_ws/install/share/gennodejs/ros/sensor_msgs/msg/PointCloud2.js
-- Installing: /home/eaibot/2022_jsjds/ros_ws/install/share/gennodejs/ros/sensor_msgs/msg/NavSatFix.js
-- Installing: /home/eaibot/2022_jsjds/ros_ws/install/share/gennodejs/ros/sensor_msgs/msg/Range.js
-- Installing: /home/eaibot/2022_jsjds/ros_ws/install/share/gennodejs/ros/sensor_msgs/msg/RegionOfInterest.js
-- Installing: /home/eaibot/2022_jsjds/ros_ws/install/share/gennodejs/ros/sensor_msgs/msg/TimeReference.js
-- Installing: /home/eaibot/2022_jsjds/ros_ws/install/share/gennodejs/ros/sensor_msgs/msg/Imu.js
-- Installing: /home/eaibot/2022_jsjds/ros_ws/install/share/gennodejs/ros/sensor_msgs/msg/Temperature.js
-- Installing: /home/eaibot/2022_jsjds/ros_ws/install/share/gennodejs/ros/sensor_msgs/msg/LaserScan.js
-- Installing: /home/eaibot/2022_jsjds/ros_ws/install/share/gennodejs/ros/sensor_msgs/msg/Joy.js
Listing '/home/eaibot/2022_jsjds/ros_ws/devel/.private/sensor_msgs/lib/python3.6/site-packages/sensor_msgs'...
Listing '/home/eaibot/2022_jsjds/ros_ws/devel/.private/sensor_msgs/lib/python3.6/site-packages/sensor_msgs/msg'...
Compiling '/home/eaibot/2022_jsjds/ros_ws/devel/.private/sensor_msgs/lib/python3.6/site-packages/sensor_msgs/msg/_BatteryState.py'...
Compiling '/home/eaibot/2022_jsjds/ros_ws/devel/.private/sensor_msgs/lib/python3.6/site-packages/sensor_msgs/msg/_CameraInfo.py'...
Compiling '/home/eaibot/2022_jsjds/ros_ws/devel/.private/sensor_msgs/lib/python3.6/site-packages/sensor_msgs/msg/_ChannelFloat32.py'...
Compiling '/home/eaibot/2022_jsjds/ros_ws/devel/.private/sensor_msgs/lib/python3.6/site-packages/sensor_msgs/msg/_CompressedImage.py'...
Compiling '/home/eaibot/2022_jsjds/ros_ws/devel/.private/sensor_msgs/lib/python3.6/site-packages/sensor_msgs/msg/_FluidPressure.py'...
Compiling '/home/eaibot/2022_jsjds/ros_ws/devel/.private/sensor_msgs/lib/python3.6/site-packages/sensor_msgs/msg/_Illuminance.py'...
Compiling '/home/eaibot/2022_jsjds/ros_ws/devel/.private/sensor_msgs/lib/python3.6/site-packages/sensor_msgs/msg/_Image.py'...
Compiling '/home/eaibot/2022_jsjds/ros_ws/devel/.private/sensor_msgs/lib/python3.6/site-packages/sensor_msgs/msg/_Imu.py'...
Compiling '/home/eaibot/2022_jsjds/ros_ws/devel/.private/sensor_msgs/lib/python3.6/site-packages/sensor_msgs/msg/_JointState.py'...
Compiling '/home/eaibot/2022_jsjds/ros_ws/devel/.private/sensor_msgs/lib/python3.6/site-packages/sensor_msgs/msg/_Joy.py'...
Compiling '/home/eaibot/2022_jsjds/ros_ws/devel/.private/sensor_msgs/lib/python3.6/site-packages/sensor_msgs/msg/_JoyFeedback.py'...
Compiling '/home/eaibot/2022_jsjds/ros_ws/devel/.private/sensor_msgs/lib/python3.6/site-packages/sensor_msgs/msg/_JoyFeedbackArray.py'...
Compiling '/home/eaibot/2022_jsjds/ros_ws/devel/.private/sensor_msgs/lib/python3.6/site-packages/sensor_msgs/msg/_LaserEcho.py'...
Compiling '/home/eaibot/2022_jsjds/ros_ws/devel/.private/sensor_msgs/lib/python3.6/site-packages/sensor_msgs/msg/_LaserScan.py'...
Compiling '/home/eaibot/2022_jsjds/ros_ws/devel/.private/sensor_msgs/lib/python3.6/site-packages/sensor_msgs/msg/_MagneticField.py'...
Compiling '/home/eaibot/2022_jsjds/ros_ws/devel/.private/sensor_msgs/lib/python3.6/site-packages/sensor_msgs/msg/_MultiDOFJointState.py'...
Compiling '/home/eaibot/2022_jsjds/ros_ws/devel/.private/sensor_msgs/lib/python3.6/site-packages/sensor_msgs/msg/_MultiEchoLaserScan.py'...
Compiling '/home/eaibot/2022_jsjds/ros_ws/devel/.private/sensor_msgs/lib/python3.6/site-packages/sensor_msgs/msg/_NavSatFix.py'...
Compiling '/home/eaibot/2022_jsjds/ros_ws/devel/.private/sensor_msgs/lib/python3.6/site-packages/sensor_msgs/msg/_NavSatStatus.py'...
Compiling '/home/eaibot/2022_jsjds/ros_ws/devel/.private/sensor_msgs/lib/python3.6/site-packages/sensor_msgs/msg/_PointCloud.py'...
Compiling '/home/eaibot/2022_jsjds/ros_ws/devel/.private/sensor_msgs/lib/python3.6/site-packages/sensor_msgs/msg/_PointCloud2.py'...
Compiling '/home/eaibot/2022_jsjds/ros_ws/devel/.private/sensor_msgs/lib/python3.6/site-packages/sensor_msgs/msg/_PointField.py'...
Compiling '/home/eaibot/2022_jsjds/ros_ws/devel/.private/sensor_msgs/lib/python3.6/site-packages/sensor_msgs/msg/_Range.py'...
Compiling '/home/eaibot/2022_jsjds/ros_ws/devel/.private/sensor_msgs/lib/python3.6/site-packages/sensor_msgs/msg/_RegionOfInterest.py'...
Compiling '/home/eaibot/2022_jsjds/ros_ws/devel/.private/sensor_msgs/lib/python3.6/site-packages/sensor_msgs/msg/_RelativeHumidity.py'...
Compiling '/home/eaibot/2022_jsjds/ros_ws/devel/.private/sensor_msgs/lib/python3.6/site-packages/sensor_msgs/msg/_Temperature.py'...
Compiling '/home/eaibot/2022_jsjds/ros_ws/devel/.private/sensor_msgs/lib/python3.6/site-packages/sensor_msgs/msg/_TimeReference.py'...
Compiling '/home/eaibot/2022_jsjds/ros_ws/devel/.private/sensor_msgs/lib/python3.6/site-packages/sensor_msgs/msg/__init__.py'...
Listing '/home/eaibot/2022_jsjds/ros_ws/devel/.private/sensor_msgs/lib/python3.6/site-packages/sensor_msgs/srv'...
Compiling '/home/eaibot/2022_jsjds/ros_ws/devel/.private/sensor_msgs/lib/python3.6/site-packages/sensor_msgs/srv/_SetCameraInfo.py'...
Compiling '/home/eaibot/2022_jsjds/ros_ws/devel/.private/sensor_msgs/lib/python3.6/site-packages/sensor_msgs/srv/__init__.py'...
-- Up-to-date: /home/eaibot/2022_jsjds/ros_ws/install/lib/python3.6/site-packages/sensor_msgs
-- Up-to-date: /home/eaibot/2022_jsjds/ros_ws/install/lib/python3.6/site-packages/sensor_msgs/srv
-- Installing: /home/eaibot/2022_jsjds/ros_ws/install/lib/python3.6/site-packages/sensor_msgs/srv/_SetCameraInfo.py
-- Up-to-date: /home/eaibot/2022_jsjds/ros_ws/install/lib/python3.6/site-packages/sensor_msgs/srv/__pycache__
-- Installing: /home/eaibot/2022_jsjds/ros_ws/install/lib/python3.6/site-packages/sensor_msgs/srv/__pycache__/__init__.cpython-36.pyc
-- Installing: /home/eaibot/2022_jsjds/ros_ws/install/lib/python3.6/site-packages/sensor_msgs/srv/__pycache__/_SetCameraInfo.cpython-36.pyc
-- Up-to-date: /home/eaibot/2022_jsjds/ros_ws/install/lib/python3.6/site-packages/sensor_msgs/__pycache__
-- Up-to-date: /home/eaibot/2022_jsjds/ros_ws/install/lib/python3.6/site-packages/sensor_msgs/__pycache__/__init__.cpython-36.pyc
-- Up-to-date: /home/eaibot/2022_jsjds/ros_ws/install/lib/python3.6/site-packages/sensor_msgs/msg
-- Installing: /home/eaibot/2022_jsjds/ros_ws/install/lib/python3.6/site-packages/sensor_msgs/msg/_LaserScan.py
-- Installing: /home/eaibot/2022_jsjds/ros_ws/install/lib/python3.6/site-packages/sensor_msgs/msg/_LaserEcho.py
-- Installing: /home/eaibot/2022_jsjds/ros_ws/install/lib/python3.6/site-packages/sensor_msgs/msg/_Range.py
-- Installing: /home/eaibot/2022_jsjds/ros_ws/install/lib/python3.6/site-packages/sensor_msgs/msg/_BatteryState.py
-- Installing: /home/eaibot/2022_jsjds/ros_ws/install/lib/python3.6/site-packages/sensor_msgs/msg/_FluidPressure.py
-- Installing: /home/eaibot/2022_jsjds/ros_ws/install/lib/python3.6/site-packages/sensor_msgs/msg/_Imu.py
-- Installing: /home/eaibot/2022_jsjds/ros_ws/install/lib/python3.6/site-packages/sensor_msgs/msg/_PointCloud2.py
-- Installing: /home/eaibot/2022_jsjds/ros_ws/install/lib/python3.6/site-packages/sensor_msgs/msg/_PointField.py
-- Installing: /home/eaibot/2022_jsjds/ros_ws/install/lib/python3.6/site-packages/sensor_msgs/msg/_MultiEchoLaserScan.py
-- Installing: /home/eaibot/2022_jsjds/ros_ws/install/lib/python3.6/site-packages/sensor_msgs/msg/_RelativeHumidity.py
-- Installing: /home/eaibot/2022_jsjds/ros_ws/install/lib/python3.6/site-packages/sensor_msgs/msg/_PointCloud.py
-- Installing: /home/eaibot/2022_jsjds/ros_ws/install/lib/python3.6/site-packages/sensor_msgs/msg/_CompressedImage.py
-- Installing: /home/eaibot/2022_jsjds/ros_ws/install/lib/python3.6/site-packages/sensor_msgs/msg/_JoyFeedback.py
-- Installing: /home/eaibot/2022_jsjds/ros_ws/install/lib/python3.6/site-packages/sensor_msgs/msg/_Illuminance.py
-- Installing: /home/eaibot/2022_jsjds/ros_ws/install/lib/python3.6/site-packages/sensor_msgs/msg/_TimeReference.py
-- Installing: /home/eaibot/2022_jsjds/ros_ws/install/lib/python3.6/site-packages/sensor_msgs/msg/_NavSatFix.py
-- Installing: /home/eaibot/2022_jsjds/ros_ws/install/lib/python3.6/site-packages/sensor_msgs/msg/_JointState.py
-- Installing: /home/eaibot/2022_jsjds/ros_ws/install/lib/python3.6/site-packages/sensor_msgs/msg/_MagneticField.py
-- Installing: /home/eaibot/2022_jsjds/ros_ws/install/lib/python3.6/site-packages/sensor_msgs/msg/_Temperature.py
-- Installing: /home/eaibot/2022_jsjds/ros_ws/install/lib/python3.6/site-packages/sensor_msgs/msg/_CameraInfo.py
-- Installing: /home/eaibot/2022_jsjds/ros_ws/install/lib/python3.6/site-packages/sensor_msgs/msg/_MultiDOFJointState.py
-- Installing: /home/eaibot/2022_jsjds/ros_ws/install/lib/python3.6/site-packages/sensor_msgs/msg/_Image.py
-- Installing: /home/eaibot/2022_jsjds/ros_ws/install/lib/python3.6/site-packages/sensor_msgs/msg/_ChannelFloat32.py
-- Up-to-date: /home/eaibot/2022_jsjds/ros_ws/install/lib/python3.6/site-packages/sensor_msgs/msg/__pycache__
-- Installing: /home/eaibot/2022_jsjds/ros_ws/install/lib/python3.6/site-packages/sensor_msgs/msg/__pycache__/_NavSatStatus.cpython-36.pyc
-- Installing: /home/eaibot/2022_jsjds/ros_ws/install/lib/python3.6/site-packages/sensor_msgs/msg/__pycache__/_MultiEchoLaserScan.cpython-36.pyc
-- Installing: /home/eaibot/2022_jsjds/ros_ws/install/lib/python3.6/site-packages/sensor_msgs/msg/__pycache__/_CameraInfo.cpython-36.pyc
-- Installing: /home/eaibot/2022_jsjds/ros_ws/install/lib/python3.6/site-packages/sensor_msgs/msg/__pycache__/_JointState.cpython-36.pyc
-- Installing: /home/eaibot/2022_jsjds/ros_ws/install/lib/python3.6/site-packages/sensor_msgs/msg/__pycache__/_NavSatFix.cpython-36.pyc
-- Installing: /home/eaibot/2022_jsjds/ros_ws/install/lib/python3.6/site-packages/sensor_msgs/msg/__pycache__/_Illuminance.cpython-36.pyc
-- Installing: /home/eaibot/2022_jsjds/ros_ws/install/lib/python3.6/site-packages/sensor_msgs/msg/__pycache__/_Imu.cpython-36.pyc
-- Installing: /home/eaibot/2022_jsjds/ros_ws/install/lib/python3.6/site-packages/sensor_msgs/msg/__pycache__/_TimeReference.cpython-36.pyc
-- Installing: /home/eaibot/2022_jsjds/ros_ws/install/lib/python3.6/site-packages/sensor_msgs/msg/__pycache__/__init__.cpython-36.pyc
-- Installing: /home/eaibot/2022_jsjds/ros_ws/install/lib/python3.6/site-packages/sensor_msgs/msg/__pycache__/_FluidPressure.cpython-36.pyc
-- Installing: /home/eaibot/2022_jsjds/ros_ws/install/lib/python3.6/site-packages/sensor_msgs/msg/__pycache__/_Image.cpython-36.pyc
-- Installing: /home/eaibot/2022_jsjds/ros_ws/install/lib/python3.6/site-packages/sensor_msgs/msg/__pycache__/_JoyFeedback.cpython-36.pyc
-- Installing: /home/eaibot/2022_jsjds/ros_ws/install/lib/python3.6/site-packages/sensor_msgs/msg/__pycache__/_MagneticField.cpython-36.pyc
-- Installing: /home/eaibot/2022_jsjds/ros_ws/install/lib/python3.6/site-packages/sensor_msgs/msg/__pycache__/_CompressedImage.cpython-36.pyc
-- Installing: /home/eaibot/2022_jsjds/ros_ws/install/lib/python3.6/site-packages/sensor_msgs/msg/__pycache__/_ChannelFloat32.cpython-36.pyc
-- Installing: /home/eaibot/2022_jsjds/ros_ws/install/lib/python3.6/site-packages/sensor_msgs/msg/__pycache__/_LaserEcho.cpython-36.pyc
-- Installing: /home/eaibot/2022_jsjds/ros_ws/install/lib/python3.6/site-packages/sensor_msgs/msg/__pycache__/_Range.cpython-36.pyc
-- Installing: /home/eaibot/2022_jsjds/ros_ws/install/lib/python3.6/site-packages/sensor_msgs/msg/__pycache__/_BatteryState.cpython-36.pyc
-- Installing: /home/eaibot/2022_jsjds/ros_ws/install/lib/python3.6/site-packages/sensor_msgs/msg/__pycache__/_LaserScan.cpython-36.pyc
-- Installing: /home/eaibot/2022_jsjds/ros_ws/install/lib/python3.6/site-packages/sensor_msgs/msg/__pycache__/_PointField.cpython-36.pyc
-- Installing: /home/eaibot/2022_jsjds/ros_ws/install/lib/python3.6/site-packages/sensor_msgs/msg/__pycache__/_MultiDOFJointState.cpython-36.pyc
-- Installing: /home/eaibot/2022_jsjds/ros_ws/install/lib/python3.6/site-packages/sensor_msgs/msg/__pycache__/_JoyFeedbackArray.cpython-36.pyc
-- Installing: /home/eaibot/2022_jsjds/ros_ws/install/lib/python3.6/site-packages/sensor_msgs/msg/__pycache__/_Joy.cpython-36.pyc
-- Installing: /home/eaibot/2022_jsjds/ros_ws/install/lib/python3.6/site-packages/sensor_msgs/msg/__pycache__/_Temperature.cpython-36.pyc
-- Installing: /home/eaibot/2022_jsjds/ros_ws/install/lib/python3.6/site-packages/sensor_msgs/msg/__pycache__/_RelativeHumidity.cpython-36.pyc
-- Installing: /home/eaibot/2022_jsjds/ros_ws/install/lib/python3.6/site-packages/sensor_msgs/msg/__pycache__/_PointCloud2.cpython-36.pyc
-- Installing: /home/eaibot/2022_jsjds/ros_ws/install/lib/python3.6/site-packages/sensor_msgs/msg/__pycache__/_PointCloud.cpython-36.pyc
-- Installing: /home/eaibot/2022_jsjds/ros_ws/install/lib/python3.6/site-packages/sensor_msgs/msg/__pycache__/_RegionOfInterest.cpython-36.pyc
-- Installing: /home/eaibot/2022_jsjds/ros_ws/install/lib/python3.6/site-packages/sensor_msgs/msg/_NavSatStatus.py
-- Installing: /home/eaibot/2022_jsjds/ros_ws/install/lib/python3.6/site-packages/sensor_msgs/msg/_RegionOfInterest.py
-- Installing: /home/eaibot/2022_jsjds/ros_ws/install/lib/python3.6/site-packages/sensor_msgs/msg/_JoyFeedbackArray.py
-- Installing: /home/eaibot/2022_jsjds/ros_ws/install/lib/python3.6/site-packages/sensor_msgs/msg/_Joy.py
-- Up-to-date: /home/eaibot/2022_jsjds/ros_ws/install/lib/python3.6/site-packages/sensor_msgs
-- Up-to-date: /home/eaibot/2022_jsjds/ros_ws/install/lib/python3.6/site-packages/sensor_msgs/srv
-- Installing: /home/eaibot/2022_jsjds/ros_ws/install/lib/python3.6/site-packages/sensor_msgs/srv/__init__.py
-- Up-to-date: /home/eaibot/2022_jsjds/ros_ws/install/lib/python3.6/site-packages/sensor_msgs/srv/__pycache__
-- Up-to-date: /home/eaibot/2022_jsjds/ros_ws/install/lib/python3.6/site-packages/sensor_msgs/__pycache__
-- Up-to-date: /home/eaibot/2022_jsjds/ros_ws/install/lib/python3.6/site-packages/sensor_msgs/msg
-- Installing: /home/eaibot/2022_jsjds/ros_ws/install/lib/python3.6/site-packages/sensor_msgs/msg/__init__.py
-- Up-to-date: /home/eaibot/2022_jsjds/ros_ws/install/lib/python3.6/site-packages/sensor_msgs/msg/__pycache__
-- Installing: /home/eaibot/2022_jsjds/ros_ws/install/lib/pkgconfig/sensor_msgs.pc
-- Up-to-date: /home/eaibot/2022_jsjds/ros_ws/install/share/sensor_msgs/cmake/sensor_msgs-msg-extras.cmake
-- Up-to-date: /home/eaibot/2022_jsjds/ros_ws/install/share/sensor_msgs/cmake/sensor_msgsConfig.cmake
-- Up-to-date: /home/eaibot/2022_jsjds/ros_ws/install/share/sensor_msgs/cmake/sensor_msgsConfig-version.cmake
-- Up-to-date: /home/eaibot/2022_jsjds/ros_ws/install/share/sensor_msgs/package.xml
-- Up-to-date: /home/eaibot/2022_jsjds/ros_ws/install/include/sensor_msgs
-- Up-to-date: /home/eaibot/2022_jsjds/ros_ws/install/include/sensor_msgs/image_encodings.h
-- Up-to-date: /home/eaibot/2022_jsjds/ros_ws/install/include/sensor_msgs/point_cloud_conversion.h
-- Up-to-date: /home/eaibot/2022_jsjds/ros_ws/install/include/sensor_msgs/distortion_models.h
-- Up-to-date: /home/eaibot/2022_jsjds/ros_ws/install/include/sensor_msgs/point_field_conversion.h
-- Up-to-date: /home/eaibot/2022_jsjds/ros_ws/install/include/sensor_msgs/impl
-- Up-to-date: /home/eaibot/2022_jsjds/ros_ws/install/include/sensor_msgs/impl/point_cloud2_iterator.h
-- Up-to-date: /home/eaibot/2022_jsjds/ros_ws/install/include/sensor_msgs/fill_image.h
-- Up-to-date: /home/eaibot/2022_jsjds/ros_ws/install/include/sensor_msgs/point_cloud2_iterator.h
-- Up-to-date: /home/eaibot/2022_jsjds/ros_ws/install/share/sensor_msgs/migration_rules
-- Up-to-date: /home/eaibot/2022_jsjds/ros_ws/install/share/sensor_msgs/migration_rules/sensor_msgs.bmr
