[100%] Built target roslib
[36mInstall the project...[0m
-- Install configuration: "Release"
-- Installing: /home/eaibot/2022_jsjds/ros_ws/install/_setup_util.py
-- Installing: /home/eaibot/2022_jsjds/ros_ws/install/env.sh
-- Installing: /home/eaibot/2022_jsjds/ros_ws/install/setup.bash
-- Installing: /home/eaibot/2022_jsjds/ros_ws/install/local_setup.bash
-- Installing: /home/eaibot/2022_jsjds/ros_ws/install/setup.sh
-- Installing: /home/eaibot/2022_jsjds/ros_ws/install/local_setup.sh
-- Installing: /home/eaibot/2022_jsjds/ros_ws/install/setup.zsh
-- Installing: /home/eaibot/2022_jsjds/ros_ws/install/local_setup.zsh
-- Installing: /home/eaibot/2022_jsjds/ros_ws/install/.rosinstall
-- Up-to-date: /home/eaibot/2022_jsjds/ros_ws/install/lib/pkgconfig/roslib.pc
-- Up-to-date: /home/eaibot/2022_jsjds/ros_ws/install/share/roslib/cmake/roslib-extras.cmake
-- Up-to-date: /home/eaibot/2022_jsjds/ros_ws/install/share/roslib/cmake/roslibConfig.cmake
-- Up-to-date: /home/eaibot/2022_jsjds/ros_ws/install/share/roslib/cmake/roslibConfig-version.cmake
-- Up-to-date: /home/eaibot/2022_jsjds/ros_ws/install/share/roslib/package.xml
+ cd /home/eaibot/2022_jsjds/ros_ws/src/ros/roslib
+ mkdir -p /home/eaibot/2022_jsjds/ros_ws/install/lib/python3.6/site-packages
+ /usr/bin/env PYTHONPATH=/home/eaibot/2022_jsjds/ros_ws/install/lib/python3.6/site-packages:/home/eaibot/2022_jsjds/ros_ws/build/roslib/lib/python3.6/site-packages:/home/eaibot/2022_jsjds/ros_ws/install/lib/python3.6/site-packages:/opt/ros/kinetic/lib/python2.7/dist-packages:/home/eaibot/2022_jsjds/ros_ws/devel/lib/python3.6/site-packages:/home/eaibot/2022_jsjds/ros_ws/devel/lib/python3.6/site-packages:/home/eaibot/2022_jsjds/ros_ws/devel/lib/python3.6/site-packages CATKIN_BINARY_DIR=/home/eaibot/2022_jsjds/ros_ws/build/roslib /usr/bin/python3 /home/eaibot/2022_jsjds/ros_ws/src/ros/roslib/setup.py build --build-base /home/eaibot/2022_jsjds/ros_ws/build/roslib install --root=/ --prefix=/home/eaibot/2022_jsjds/ros_ws/install --install-scripts=/home/eaibot/2022_jsjds/ros_ws/install/bin
running build
running build_py
running install
running install_lib
running install_egg_info
Removing /home/eaibot/2022_jsjds/ros_ws/install/lib/python3.6/site-packages/roslib-1.14.6-py3.6.egg-info
Writing /home/eaibot/2022_jsjds/ros_ws/install/lib/python3.6/site-packages/roslib-1.14.6-py3.6.egg-info
-- Up-to-date: /home/eaibot/2022_jsjds/ros_ws/install/lib/libroslib.so
-- Up-to-date: /home/eaibot/2022_jsjds/ros_ws/install/include
-- Up-to-date: /home/eaibot/2022_jsjds/ros_ws/install/include/ros
-- Up-to-date: /home/eaibot/2022_jsjds/ros_ws/install/include/ros/package.h
-- Up-to-date: /home/eaibot/2022_jsjds/ros_ws/install/lib/roslib/gendeps
