[  0%] Built target _nodelet_generate_messages_check_deps_NodeletUnload
[  0%] Built target _nodelet_generate_messages_check_deps_NodeletList
[  0%] Built target std_msgs_generate_messages_nodejs
[  0%] Built target _nodelet_generate_messages_check_deps_NodeletLoad
[  0%] Built target std_msgs_generate_messages_cpp
[  0%] Built target std_msgs_generate_messages_lisp
[  0%] Built target std_msgs_generate_messages_py
[  0%] Built target std_msgs_generate_messages_eus
[ 12%] Built target nodelet_generate_messages_nodejs
[ 25%] Built target nodelet_generate_messages_cpp
[ 37%] Built target nodelet_generate_messages_lisp
[ 54%] Built target nodelet_generate_messages_py
[ 70%] Built target nodelet_generate_messages_eus
[ 91%] Built target nodeletlib
[ 91%] Built target nodelet_generate_messages
[100%] Built target nodelet
