<svg xmlns="https://www.w3.org/2000/svg" xmlns:xlink="https://www.w3.org/1999/xlink" width="150" height="43.904" viewBox="0 0 150 43.904">
  <defs>
    <clipPath id="clip-path">
      <rect id="Rectangle_21565" data-name="Rectangle 21565" width="150" height="43.904" fill="none"/>
    </clipPath>
  </defs>
  <g id="Group_72782" data-name="Group 72782" transform="translate(0 0)">
    <g id="Group_71713" data-name="Group 71713" transform="translate(0 0)" clip-path="url(#clip-path)">
      <path id="Path_57247" data-name="Path 57247" d="M55.464,22.39a2.329,2.329,0,0,0-2.6-2.352H49.209v4.5h4a2.23,2.23,0,0,0,2.257-2.15m-6.255-8.725v4.088l3.355,0a2.073,2.073,0,0,0,2.351-2.069c0-1.243-.911-2.014-2.337-2.014Zm6.519,5.069a3.7,3.7,0,0,1,2.765,3.712c0,2.8-2.266,4.555-5,4.555H46.231V11.2h6.677c3.187,0,5,1.818,5,4.107a3.745,3.745,0,0,1-2.182,3.422Z" transform="translate(-16.767 -4.063)" fill="#14145d"/>
      <path id="Path_57248" data-name="Path 57248" d="M82.875,11.2v9.654c0,3.706-2.275,6.367-6.449,6.367-4.194,0-6.426-2.661-6.426-6.367V11.2h2.979v9.654a3.279,3.279,0,0,0,3.469,3.607c2.306,0,3.447-1.307,3.447-3.607V11.2Z" transform="translate(-25.387 -4.063)" fill="#14145d"/>
      <path id="Path_57249" data-name="Path 57249" d="M99.165,18.344h3.13a2.245,2.245,0,0,0,2.428-2.045,2.3,2.3,0,0,0,.006-.3,2.21,2.21,0,0,0-2.106-2.31,2.171,2.171,0,0,0-.328.009h-3.13Zm.9,2.3h-.9V27H96.186V11.2h6.109c3.165.064,5.481,1.934,5.481,4.716a4.688,4.688,0,0,1-4.3,4.63L108.432,27,104.8,27Z" transform="translate(-34.885 -4.064)" fill="#14145d"/>
      <path id="Path_57250" data-name="Path 57250" d="M118.777,25.279l2.039-2a7.581,7.581,0,0,0,3.8,1.034c2.014,0,2.9-.683,2.9-1.785,0-3.284-7.982-1.507-7.982-7.109,0-3,2.307-4.634,5.736-4.634a9.01,9.01,0,0,1,5.03,1.444l-2.026,1.985a7.463,7.463,0,0,0-3.064-.674c-1.816,0-2.655.756-2.654,1.737,0,3.015,8,1.614,8,7.074,0,2.974-2.252,4.721-6.223,4.721a9.179,9.179,0,0,1-5.561-1.794" transform="translate(-43.078 -3.911)" fill="#14145d"/>
      <path id="Path_57251" data-name="Path 57251" d="M145.313,21.164h4.708l-2.358-6.425Zm5.642,2.5h-6.573L143.113,27h-3.077l6.047-15.8h3.174L155.3,27h-3.077Z" transform="translate(-50.788 -4.063)" fill="#14145d"/>
      <path id="Path_57252" data-name="Path 57252" d="M16.913,43.758v15.8H13.934V48.263L8.448,54.8l-.7-.856L2.981,48.3V59.554H0v-15.8H2.844l5.608,6.673,5.568-6.673Z" transform="translate(0 -15.87)" fill="#14145d"/>
      <path id="Path_57253" data-name="Path 57253" d="M35.372,53.717H40.08l-2.361-6.425Zm5.642,2.5H34.441l-1.27,3.342H30.094l6.047-15.8h3.174l6.046,15.8H42.285Z" transform="translate(-10.914 -15.869)" fill="#14145d"/>
      <path id="Path_57254" data-name="Path 57254" d="M67.683,57.059v2.5H57.606v-15.8h2.979v13.3Z" transform="translate(-20.892 -15.87)" fill="#14145d"/>
      <path id="Path_57255" data-name="Path 57255" d="M80.387,53.716h4.708L82.736,47.29Zm5.642,2.5H79.454l-1.27,3.342H75.107l6.044-15.8h3.174l6.046,15.8H87.294Z" transform="translate(-27.24 -15.869)" fill="#14145d"/>
      <path id="Path_57256" data-name="Path 57256" d="M105.221,53.064v6.493h-2.979v-6.38l-5.557-9.418h3.476l3.54,6.5,3.539-6.5h3.476Z" transform="translate(-35.066 -15.87)" fill="#14145d"/>
      <rect id="Rectangle_21564" data-name="Rectangle 21564" width="2.979" height="15.797" transform="translate(91.483 27.887)" fill="#14145d"/>
      <path id="Path_57257" data-name="Path 57257" d="M157.81,53.717h4.708l-2.358-6.425Zm5.642,2.5h-6.575l-1.27,3.342H152.53l6.046-15.8h3.174l6.046,15.8H164.72Z" transform="translate(-55.319 -15.869)" fill="#14145d"/>
      <path id="Path_57258" data-name="Path 57258" d="M119.576,57.826l2.039-2a7.581,7.581,0,0,0,3.8,1.034c2.014,0,2.9-.683,2.9-1.785,0-3.284-7.983-1.507-7.982-7.109,0-3,2.307-4.634,5.736-4.634a9.015,9.015,0,0,1,5.03,1.444l-2.031,1.99a7.476,7.476,0,0,0-3.064-.674c-1.816,0-2.655.756-2.654,1.737,0,3.015,8,1.614,8,7.074,0,2.974-2.252,4.721-6.223,4.721a9.174,9.174,0,0,1-5.561-1.794" transform="translate(-43.366 -15.715)" fill="#14145d"/>
      <path id="Path_57259" data-name="Path 57259" d="M215.279,11.21h-10.1l-8.652,8.648h10.1Z" transform="translate(-71.276 -4.066)" fill="#c52a1c"/>
      <path id="Path_57260" data-name="Path 57260" d="M182.507,35.979l-4.951,4.951,10.112-.01,4.942-4.942Z" transform="translate(-64.396 -13.049)" fill="#c52a1c"/>
      <path id="Path_57261" data-name="Path 57261" d="M193.762,7.142H165.049L172.179,0H200.9Z" transform="translate(-59.86 0)" fill="#e93347"/>
      <path id="Path_57262" data-name="Path 57262" d="M210.1,7.145,217.239.007A6.4,6.4,0,0,1,220.2,7.149Z" transform="translate(-76.199 -0.003)" fill="#871924"/>
      <path id="Path_57263" data-name="Path 57263" d="M217.483,35.99h-10.1L186.64,56.732l10.112-.01,20.73-20.73Z" transform="translate(-67.69 -13.053)" fill="#1436f3"/>
      <path id="Path_57264" data-name="Path 57264" d="M181.369,24.78l-7.132,7.143c.382,0,3.16,0,7.067,0l7.138-7.138Z" transform="translate(-63.192 -8.987)" fill="#497bea"/>
      <path id="Path_57265" data-name="Path 57265" d="M201.178,31.925l7.138-7.138h11.478l-7.139,7.138Z" transform="translate(-72.963 -8.99)" fill="#497bea"/>
      <path id="Path_57266" data-name="Path 57266" d="M192.465,24.78l-7.138,7.138h10.1l7.138-7.138Z" transform="translate(-67.214 -8.987)" fill="#14145d"/>
      <path id="Path_57267" data-name="Path 57267" d="M219.185,31.925l7.138-7.138a6.406,6.406,0,0,1,2.964,7.138Z" transform="translate(-79.494 -8.99)" fill="#14145d"/>
    </g>
  </g>
</svg>
