<svg xmlns="https://www.w3.org/2000/svg" width="375.923" height="253.577" viewBox="0 0 375.923 253.577">
  <g id="Group_70306" data-name="Group 70306" transform="translate(13492.627 11136.118)">
    <path id="Path_56396" data-name="Path 56396" d="M-13116.7-11136.118l-157.123,155.052h157.123Z" fill="#141461"/>
    <path id="Path_56397" data-name="Path 56397" d="M-13492.627-10981.066h218.84l-97.521,98.525h-121.319Z" fill="#0038ff"/>
  </g>
</svg>
