<svg id="BGD_Tier" data-name="BGD Tier" xmlns="https://www.w3.org/2000/svg" xmlns:xlink="https://www.w3.org/1999/xlink" width="60" height="60" viewBox="0 0 60 60">
  <defs>
    <clipPath id="clip-path">
      <rect id="Rectangle_23294" data-name="Rectangle 23294" width="60" height="60" transform="translate(0 0.004)" fill="none"/>
    </clipPath>
  </defs>
  <g id="Mask_Group_70974" data-name="Mask Group 70974" transform="translate(0 -0.004)" clip-path="url(#clip-path)">
    <path id="Path_59203" data-name="Path 59203" d="M60,30A30,30,0,1,1,30,0,30,30,0,0,1,60,30" transform="translate(0 0)" fill="#f3d26d"/>
    <path id="Path_59269" data-name="Path 59269" d="M30.055,60.062a30,30,0,1,1,30-30,30,30,0,0,1-30,30m0-57.373A27.373,27.373,0,1,0,57.428,30.062v0A27.4,27.4,0,0,0,30.055,2.686" transform="translate(-0.061 -0.076)" fill="#e9b341"/>
    <g id="Group_77377" data-name="Group 77377" transform="translate(5.045 3.875)">
      <g id="Group_77360" data-name="Group 77360">
        <path id="Path_59224" data-name="Path 59224" d="M668.793,355.2a.36.36,0,0,0,.515-.063,2.324,2.324,0,0,1,2.254-.6,12.813,12.813,0,0,1,1.485.55,2.828,2.828,0,0,1,3.033-2.46c.51-1.726,1.828-2.129,3.435-2.025a2.892,2.892,0,0,1,1.5-3.67c-.329-1.749.629-2.705,2.094-3.359-.078-.095-.144-.172-.208-.251a2.791,2.791,0,0,1-.242-3.572.306.306,0,0,0-.038-.273,2.532,2.532,0,0,1-.276-2.705,11.537,11.537,0,0,1,.659-1.115,3.519,3.519,0,0,1-1.711-1.228,2.489,2.489,0,0,1-.393-2.08,2.562,2.562,0,0,1-1.531-1.5,3.576,3.576,0,0,1-.06-2.149c-1.664.2-2.948-.362-3.485-1.934a.656.656,0,0,0-.134-.011A2.658,2.658,0,0,1,673,324.93c-.072-.218-.163-.43-.219-.572a11.235,11.235,0,0,1-1.6.6,2.4,2.4,0,0,1-2.263-.69.271.271,0,0,0-.253-.035,2.421,2.421,0,0,1-2.005.31v.324a1.045,1.045,0,0,1,.718.3,2.046,2.046,0,0,0,1.208.707,2.411,2.411,0,0,0,1.141-.294,1.5,1.5,0,0,1,1.207-.2,9.98,9.98,0,0,1-1.043.717,11.525,11.525,0,0,1-1.264.5.247.247,0,0,1-.184,0,6.171,6.171,0,0,1-1.783-1.474v.457a6.153,6.153,0,0,0,1.407,1.092,1.054,1.054,0,0,0,1.056.046,3.734,3.734,0,0,0,1.769-.99c.44-.566,1.153-.554,1.655-.988.232.442.441.828.637,1.219a.592.592,0,0,1,.04.273,3.6,3.6,0,0,0,.649,2.108,1.639,1.639,0,0,1,.1.2,1.113,1.113,0,0,0,.944.639,4.464,4.464,0,0,0,2.537-.2.248.248,0,0,1,.108-.032c.452.042.9.088,1.349.132a12.632,12.632,0,0,1-.031,1.313,3.239,3.239,0,0,1-.294.778,5.121,5.121,0,0,0-.139,2.349.314.314,0,0,0,.119.211,14.9,14.9,0,0,0,1.488,1,4.9,4.9,0,0,0,1.1.3.927.927,0,0,1,.267.073c.371.233.735.479,1.093.715-.208.393-.419.8-.642,1.2-.037.066-.128.1-.193.15a3.554,3.554,0,0,0-1.246,1.522,2.136,2.136,0,0,1-.2.437,1.066,1.066,0,0,0,.1,1.282,11.734,11.734,0,0,0,.8,1.2c.247.3.6.522.846.828a8.367,8.367,0,0,1,.608,1.017c-.343.241-.685.518-1.063.731a1.988,1.988,0,0,1-.7.168,3.933,3.933,0,0,0-1.615.8,1.381,1.381,0,0,0-.71,1.326,3.809,3.809,0,0,0,.307,1.857,4,4,0,0,1,.285,1.618c.018.107.02.217.027.3-.425.053-.826.11-1.231.15a.743.743,0,0,1-.357-.044,4.5,4.5,0,0,0-2.288-.165c-.7.062-.97.49-1.262,1.016a3.9,3.9,0,0,0-.521,2.1.4.4,0,0,1-.045.186c-.189.389-.385.776-.572,1.151a12.279,12.279,0,0,1-1.25-.474c-.214-.107-.356-.351-.541-.52a5.047,5.047,0,0,0-2.267-1.007c-.09-.023-.219.06-.316.117a3.917,3.917,0,0,0-1.784,1.557c-.009.021-.019.041-.029.06v.717a2.43,2.43,0,0,1,2.136.1m.875-29.868c-.286.095-.572.193-.865.262a.544.544,0,0,1-.349-.049c-.3-.159-.6-.343-.893-.517.006-.034.01-.069.014-.1l.691-.185c.054-.015.126-.008.162-.041.251-.231.44-.057.651.076.234.148.486.269.765.42-.081.065-.123.119-.176.137m4.729,1.546c.159.036.3.06.435.1a3.368,3.368,0,0,1,1.225.841c.077.1.136.214.209.331a1.589,1.589,0,0,1-1.869-1.272m5.125,4.885c.115.092.21.17.308.246.236.181.556.316.686.555a2.252,2.252,0,0,1,.077.867c.006.11.01.218.016.331a1.6,1.6,0,0,1-1.087-2m2.416,8.8c-.03.069-.072.132-.121.218a1.713,1.713,0,0,1-.017-2.29c.039.084.074.155.107.227.107.229.211.46.323.687a.414.414,0,0,1,.023.437,7.755,7.755,0,0,0-.314.72m-1.211,4.93a3.326,3.326,0,0,0-.057.644.9.9,0,0,1-.52,1,2.736,2.736,0,0,0-.486.438,1.685,1.685,0,0,1,1.063-2.078m-4.254,5.724q-.3.513-.612,1.025a.147.147,0,0,1-.084.062c-.344.074-.689.146-1.035.213a.361.361,0,0,1-.13-.025,1.6,1.6,0,0,1,1.861-1.275m-7.554,2.7a2.016,2.016,0,0,1,1.178.346c-.356.227-.666.426-.978.62a.232.232,0,0,1-.156.043c-.365-.108-.727-.225-1.089-.339-.017-.033-.034-.066-.052-.1a3.824,3.824,0,0,1,1.1-.571" transform="translate(-642.021 -313.654)" fill="#e9b341"/>
        <path id="Path_59225" data-name="Path 59225" d="M693.3,112.578a2.768,2.768,0,0,0-1.084-1.216c-.2-.106-.442-.149-.655-.242a.564.564,0,0,1-.3-.218,6.2,6.2,0,0,0-2.884-3.223c.185-.377.384-.747.555-1.128a6.471,6.471,0,0,0,.426-3.1.427.427,0,0,1,.1-.313,2.467,2.467,0,0,0,.83-2.373c0-.013.019-.029.029-.043l-.021-.053c-.038-.027-.076-.053-.112-.083a2.449,2.449,0,0,0-2.259-.625.667.667,0,0,1-.629-.165,9.579,9.579,0,0,0-1.063-.682,5.282,5.282,0,0,0-2.818-.687c-.017-.045-.039-.073-.035-.1a6.053,6.053,0,0,0-1.073-4.144.376.376,0,0,1-.038-.3,2.5,2.5,0,0,0-.2-2.244.606.606,0,0,0-.466-.388,2.588,2.588,0,0,0-2.227.578.538.538,0,0,1-.36.132c-.371-.028-.739-.123-1.11-.14a5.558,5.558,0,0,0-3.191.7c-.132-.266-.253-.531-.393-.786a6.286,6.286,0,0,0-2.5-2.421.458.458,0,0,1-.215-.288,2.54,2.54,0,0,0-1.442-2.012.491.491,0,0,0-.345,0,2.454,2.454,0,0,0-1.762,1.622.374.374,0,0,1-.222.219,5.467,5.467,0,0,0-1.112.386v.355a6.156,6.156,0,0,1,2.163-.625c-.026.215.025.371-.273.417A6,6,0,0,0,666.72,90v.377a4.117,4.117,0,0,1,1.129-.494c.159-.04.216.014.275.148a1.8,1.8,0,0,0,2.43.933,4,4,0,0,0,.686-.584c.069-.056.2-.124.259-.095a6.275,6.275,0,0,1,1.827,1.65c-.47.012-.708.171-.8.485a.644.644,0,0,0,.331.777,1.649,1.649,0,0,1-1.428.41.26.26,0,0,1-.1-.151,3.86,3.86,0,0,0-1.678-1.96.234.234,0,0,0-.175-.039,3.678,3.678,0,0,0-1.907,1.225c-.35.476-.38.516-.856.355v.3l.073.016a16.261,16.261,0,0,1,1.707.435,4.368,4.368,0,0,1,.759.417,3.863,3.863,0,0,1,1.923-.308,7,7,0,0,0,1.142-.054,1.506,1.506,0,0,0,1.078-.927c.132-.245-.062-.426-.365-.386,0,.014-.01.03,0,.04.049.09.1.178.152.267-.062.021-.156.079-.182.057-.083-.07-.207-.181-.194-.254a.492.492,0,0,1,.216-.345.539.539,0,0,1,.454.05.853.853,0,0,1,.12,1.1,2.3,2.3,0,0,1-2.158.936c-.36-.012-.719-.069-1.08-.105,0,.014-.008.027-.014.041a3.56,3.56,0,0,1,.675.261,2.1,2.1,0,0,1,.872,1.845,3.26,3.26,0,0,1-.062.722.41.41,0,0,1-.484.375,9.546,9.546,0,0,0,.093-1.284,1.46,1.46,0,0,0-2.09-1.436.3.3,0,0,1-.366-.048,1.441,1.441,0,0,0-2.069.355,2.329,2.329,0,0,0-.2.323l0,1.907a2,2,0,0,0,.3.012.582.582,0,0,0,.621-.413c.023-.067.1-.115.153-.172.062.089.18.181.176.268-.014.294-.292.455-.591.567a2.453,2.453,0,0,1-.292.074c0,.024.008.047.014.071.1-.018.2-.033.294-.054a2.821,2.821,0,0,0,1.325-.577c.159-.143.243-.115.364.056a2.982,2.982,0,0,0,1.444.935,4.809,4.809,0,0,1-.62-.531.6.6,0,0,1-.055-.44c.012-.063.18-.1.216-.115.116.239.16.491.31.6a1.415,1.415,0,0,0,1.163.165A2.923,2.923,0,0,0,673.016,97a9.243,9.243,0,0,0,.32,1.023,1.961,1.961,0,0,0,1.129,1.14.512.512,0,0,0,.632-.142.273.273,0,0,1,.177-.066.376.376,0,0,1,.089.235c-.055.262-.283.314-.5.323a4.764,4.764,0,0,0-.653,0c.207.052.412.116.622.155a4.065,4.065,0,0,0,.667.08c.229,0,.459-.035.716-.058a3.3,3.3,0,0,0,.885,1.805,5.027,5.027,0,0,1-.293-.8.822.822,0,0,1,.137-.454c.019-.035.165,0,.251,0a.55.55,0,0,1-.01.205.529.529,0,0,0,.112.64,2.208,2.208,0,0,0,1.931.616c.2-.014.4-.056.542-.077a9.95,9.95,0,0,0-.123,1.456,2.5,2.5,0,0,0,.331.964c.176.339.38.376.916.281.113.275-.027.466-.355.418a1.871,1.871,0,0,1-.556-.243,1.049,1.049,0,0,0-.268-.153,1.1,1.1,0,0,0,.144.184,3.241,3.241,0,0,0,1.375.846c.172.036.148.147.1.283a2.948,2.948,0,0,0,.057,1.74,3.664,3.664,0,0,1,.039-.718.7.7,0,0,1,.3-.375c.066-.041.222.06.3.086-.137.237-.322.419-.344.619a1.3,1.3,0,0,0,.463.979,3,3,0,0,0,1.374.789c.059.019.115.046.122.049a9.9,9.9,0,0,0-.787,1.248,2.518,2.518,0,0,0-.151,1.041c.006.39.158.492.669.606,0,.29-.146.413-.388.277a1.515,1.515,0,0,1-.422-.421,1.537,1.537,0,0,1-.151-.373l-.1.04a6.987,6.987,0,0,0,.342.861,3.8,3.8,0,0,0,.53.714c.14.154.051.234-.045.327a2.786,2.786,0,0,0-.738,1.565,5.627,5.627,0,0,1,.285-.53.774.774,0,0,1,.267-.233c.256-.14.406-.05.447.251-.576.117-.8.582-.646,1.226a3.093,3.093,0,0,0,.966,1.559c-.466.29-.963.549-1.4.885a1.244,1.244,0,0,0-.523,1.043,1.15,1.15,0,0,0,.2.419c.04.075.089.145.135.216-.127.017-.288.091-.375.04a.655.655,0,0,1-.274-.657c.006-.125.018-.25.03-.434-.06.072-.1.1-.1.123a3.2,3.2,0,0,0,.046,1.656c.067.152.07.253-.119.331a4.648,4.648,0,0,0-.812.4,7.373,7.373,0,0,0-.69.581l.054.064a2.152,2.152,0,0,1,.435-.326,1.319,1.319,0,0,1,.561-.085.207.207,0,0,1,.2.277c-.057.209-.164.093-.278.059a.532.532,0,0,0-.592.22,2.063,2.063,0,0,0-.413,1.587c.039.323.132.641.2.941-.384-.008-.8-.032-1.213-.02a1.716,1.716,0,0,0-1.056.4c-.415.338-.456.474-.254,1.057-.112.011-.242.065-.305.021a.376.376,0,0,1-.161-.29c.056-.3.158-.592.25-.914-.082.11-.172.213-.242.329a2.794,2.794,0,0,0-.558,1.276c-.009.157-.1.2-.255.158a3.8,3.8,0,0,0-1.626.148.262.262,0,0,0-.1.052c-.01.007-.009.031-.016.062a4.57,4.57,0,0,1,.594-.058c.239.006.478.058.541.345a.246.246,0,0,1-.062.19.17.17,0,0,1-.162-.005c-.425-.3-.644-.3-1.081.049a2.87,2.87,0,0,0-.974,1.935,10.8,10.8,0,0,0-1.026-.581,1.834,1.834,0,0,0-1.578-.018.5.5,0,0,0-.294.442.926.926,0,0,1-.091.23c-.09-.088-.247-.169-.255-.263a.694.694,0,0,1,.4-.621,1.537,1.537,0,0,0,.281-.215,2.947,2.947,0,0,0-1.563,1.151,3.236,3.236,0,0,0-1.869-.7,4.462,4.462,0,0,1,.556.228.866.866,0,0,1,.315.3c.125.222.045.343-.244.409a1.442,1.442,0,0,0-.118-.35.649.649,0,0,0-.629-.237,2.051,2.051,0,0,0-.515.081v.306l.061-.012a2.332,2.332,0,0,0,.6,2.021,1.494,1.494,0,0,0,1.622.382,3.157,3.157,0,0,0,.483-.337c.986.647,2.215-.173,2.269-1.494a7.374,7.374,0,0,0-.139-1.2c.364,0,.469.061.536.511a2.736,2.736,0,0,1-.348,2,1.553,1.553,0,0,1-1.1.679l.023.075c.331-.04.662-.095.995-.117a2.4,2.4,0,0,1,2.09.715.922.922,0,0,1,.1,1.231.37.37,0,0,1-.494.135.6.6,0,0,1-.244-.4c-.02-.213.149-.277.405-.215-.05.124-.1.239-.163.407.113-.043.259-.055.3-.125a.445.445,0,0,0,.031-.362,1.689,1.689,0,0,0-1.649-.931c-.629.019-1.26-.025-1.889-.041a.066.066,0,0,1-.028,0c-.437-.247-.8-.06-1.2.141a6.173,6.173,0,0,1-1.375.439,4.262,4.262,0,0,0-.879.273v.312a1.931,1.931,0,0,1,.845-.257c.052,0,.116.083.152.142a3.609,3.609,0,0,0,1.741,1.358.748.748,0,0,0,.883-.117,3.609,3.609,0,0,0,1.317-1.743.279.279,0,0,1,.308-.217,1.615,1.615,0,0,1,1.284.408.608.608,0,0,0-.354.771c.056.272.347.463.8.5a6.317,6.317,0,0,1-1.8,1.683.246.246,0,0,1-.218-.083,1.761,1.761,0,0,0-2.09-.639,1.479,1.479,0,0,0-1.027.925c-.114.277-.182.342-.473.2-.463-.22-.914-.461-1.362-.706v.41a6.652,6.652,0,0,0,2.551.872c.016.095.035.2.064.369a6.1,6.1,0,0,1-2.615-.83v.377a6.769,6.769,0,0,0,.935.395c.51.174.924.35,1.069.9.009.033.047.057.067.088a2.755,2.755,0,0,0,1.715,1.071l.106-.041c.234-.18.482-.345.7-.544a2.17,2.17,0,0,0,.7-1.431.507.507,0,0,1,.271-.423,5.986,5.986,0,0,0,2.716-3.065c.02-.052.049-.1.078-.158a6.031,6.031,0,0,0,4.146.52.647.647,0,0,1,.622.159,2.524,2.524,0,0,0,2.28.44.383.383,0,0,0,.207-.172,2.515,2.515,0,0,0,.3-2.408.572.572,0,0,1,.076-.428,6.271,6.271,0,0,0,.975-3.853c-.009-.09-.028-.18-.041-.264.4-.056.782-.111,1.165-.163a5.584,5.584,0,0,0,2.232-.948c.227-.144.421-.336.646-.48a.5.5,0,0,1,.351-.08,2.552,2.552,0,0,0,2.258-.561.69.69,0,0,0,.23-.443,2.361,2.361,0,0,0-.822-2.128.492.492,0,0,1-.173-.47,5.968,5.968,0,0,0-.99-3.942,1.362,1.362,0,0,1-.086-.174,6.006,6.006,0,0,0,2.8-3.175.582.582,0,0,1,.432-.354,2.477,2.477,0,0,0,1.625-1.476.57.57,0,0,0-.01-.563m-23.81-18.772a.351.351,0,0,1-.427-.037c-.187-.119-.387-.219-.657-.369l.937-.755a1.7,1.7,0,0,1,.76.983,2.6,2.6,0,0,0-.613.178m.328,39.625a.189.189,0,0,1-.178,0c-.286-.2-.566-.4-.826-.593a1.2,1.2,0,0,1,1.662-.266,2.02,2.02,0,0,1-.658.861m13.5-32.845c.019-.088.048-.172.076-.273a.626.626,0,0,0,.758.154c.354-.22.434-.468.284-1.014.43.158.834.275,1.209.455a9.731,9.731,0,0,1,.955.588c.141.09.177.187.06.339a1.586,1.586,0,0,0-.012,1.873,1.516,1.516,0,0,0,1.45.881c.134-.007.275.013.288.194a6.381,6.381,0,0,1-.342,2.408c-.291-.369-.571-.474-.883-.364-.292.1-.447.368-.417.808-.235-.137-.435-.242-.622-.367a1.387,1.387,0,0,1-.253-.255c-.35-.407-.358-.415-.052-.853a3.82,3.82,0,0,0,.507-2.262.258.258,0,0,0-.111-.178,4.214,4.214,0,0,0-1.724-.793,3.946,3.946,0,0,0-.694-.027.255.255,0,0,1-.288-.2,1.964,1.964,0,0,1-.189-1.12m1.871,2.92a1.583,1.583,0,0,1-.342,1.005c-.209-.163-.417-.317-.613-.485a.331.331,0,0,1-.1-.2c-.029-.248-.041-.5-.06-.765a1.7,1.7,0,0,1,1.068.311.165.165,0,0,1,.047.135m-11.614-5.727-.1-.017c-.075-.469-.148-.938-.216-1.361l-1.047.884-.089-.057a3.134,3.134,0,0,0-.516-2.554,2.468,2.468,0,0,0,2.325-1.159l.067.062c0,.264-.005.529-.008.832.2-.236.378-.443.556-.65l.075-.014a2.428,2.428,0,0,0,1.018,2.408,3.1,3.1,0,0,0-2.067,1.627m5.244-.541c-.286-.047-.578-.085-.865-.15-.056-.013-.089-.13-.132-.2-.12-.187-.242-.373-.417-.645.379-.057.714-.114,1.052-.152a.231.231,0,0,1,.186.1,1.5,1.5,0,0,1,.176,1.043m-.1-2.261a3.253,3.253,0,0,0-2.044.453.31.31,0,0,1-.283,0,1.692,1.692,0,0,1-.785-1.17,1.43,1.43,0,0,0,.506-.083.92.92,0,0,0,.292-.4.675.675,0,0,0-.292-.8c.141-.031.247-.059.354-.076a6.082,6.082,0,0,1,1.981-.039c.183.03.289.084.262.306a1.692,1.692,0,0,0,1.057,1.743,1.5,1.5,0,0,0,1.579-.028.236.236,0,0,1,.224.046,2.458,2.458,0,0,1,.309.5,7.709,7.709,0,0,1,.337.874c.091.292.146.6.226.934a.717.717,0,0,0-1,.168.5.5,0,0,0,.036.741.892.892,0,0,1-.745.054,2.668,2.668,0,0,1-.373-.122c-.45-.194-.45-.2-.39-.688a3.718,3.718,0,0,0-.4-1.9c-.186-.45-.473-.489-.857-.517m3.839,7.087a3.168,3.168,0,0,0-2.609.476l-.076-.085c.159-.455.319-.909.452-1.292l-1.337.325-.028-.077c.2-.4.429-.78.6-1.189a1.927,1.927,0,0,0,.1-1.281,6.458,6.458,0,0,0,1.3.314,6.152,6.152,0,0,0,1.295-.219l-.331.7.734-.283.068.029a2.44,2.44,0,0,0-.16,2.584m.754,7.615,1.031-1-1.353-.35c0-.029-.006-.058-.009-.088a3.14,3.14,0,0,0,1.822-1.816,3.427,3.427,0,0,0,2.241,1.274l-.636.454.836.1a2.564,2.564,0,0,0-1.337,2.135,8.838,8.838,0,0,0-1.222-.539,9.123,9.123,0,0,0-1.373-.169m3.471,2.425c.411.126.6.478.836.764a.111.111,0,0,1-.005.1,2.008,2.008,0,0,1-.794.776c-.105-.213-.2-.408-.3-.6a.352.352,0,0,1,.005-.412,3.042,3.042,0,0,0,.257-.628m-11.659,18.868a6.561,6.561,0,0,0-.264,1.281l-.528-.568c0,.273,0,.541.005.808l-.056.05a2.486,2.486,0,0,0-2.355-1.093,3.079,3.079,0,0,0,.487-2.587l.077-.053,1.072.892c.058-.424.122-.9.187-1.374l.082-.027a3.15,3.15,0,0,0,2.027,1.568,6.77,6.77,0,0,0-.734,1.1m7.287-1.039c-.1.3-.259.583-.38.878-.1.248-.224.314-.5.183a1.622,1.622,0,0,0-1.8.286,1.539,1.539,0,0,0-.671,1.512c.045.278-.1.331-.275.347a12.372,12.372,0,0,1-1.278.05c-.329-.005-.659-.062-1.022-.1.326-.392.391-.68.242-.933-.2-.334-.354-.4-.788-.321a1.44,1.44,0,0,1,.456-.961c.319-.344.447-.388.833-.148a3.327,3.327,0,0,0,1.913.291.749.749,0,0,0,.741-.528,3.316,3.316,0,0,0,.345-2.066.357.357,0,0,1,.21-.45,1.554,1.554,0,0,1,1.29-.2c-.228.357-.214.559.049.832a.7.7,0,0,0,.968.054c-.119.461-.206.877-.338,1.279m.5-3.458-.8-.318.419.76-.039.059a2.547,2.547,0,0,0-2.581.1,3.043,3.043,0,0,0-.786-2.493l.038-.08,1.423.292c-.164-.426-.335-.87-.506-1.314.016-.024.032-.049.047-.073a3.137,3.137,0,0,0,2.6.453,2.5,2.5,0,0,0,.236,2.554l-.053.056m.174-8.884,1.345-.389-1.014-.913c.01-.037.019-.074.03-.111a3.076,3.076,0,0,0,2.5-.826,2.44,2.44,0,0,0,1.408,2.172c-.008.023-.015.047-.021.071l-.82.1.69.484a2.648,2.648,0,0,0-2.233,1.342,3.222,3.222,0,0,0-1.889-1.843c0-.029.006-.058.009-.088m2.283,4.845a.139.139,0,0,1-.065.108c-.334.127-.67.246-1.044.382.013-.364.016-.623.035-.88a.293.293,0,0,1,.1-.176c.2-.169.4-.329.622-.509a2.07,2.07,0,0,1,.355,1.076m3.184-.948a1.226,1.226,0,0,1,0,.194c.008.493,0,.471-.486.554a1.774,1.774,0,0,0-1.389,1.254,1.564,1.564,0,0,0,.178,1.5c.127.19.087.3-.064.393-.456.271-.918.533-1.388.779a7.385,7.385,0,0,1-.73.286.723.723,0,0,0-.264-.994.556.556,0,0,0-.745.11,1.118,1.118,0,0,1-.091-.93,1.218,1.218,0,0,1,.121-.4c.066-.1.207-.222.308-.216a3.814,3.814,0,0,0,2.378-.856.361.361,0,0,0,.121-.261,3.934,3.934,0,0,0-.345-1.853c-.1-.206-.249-.392-.364-.594a.279.279,0,0,1-.039-.22,1.658,1.658,0,0,1,1.113-.948c-.005.4.111.6.41.712.344.13.574.046.953-.4.117.675.224,1.285.327,1.9m1.716-6.772a5.623,5.623,0,0,1-1.391,1.973c-.15-.476-.386-.7-.727-.694a.526.526,0,0,0-.589.457,1.127,1.127,0,0,1-.482-.616,1.8,1.8,0,0,1-.1-.408c-.075-.34-.04-.441.377-.655a3.7,3.7,0,0,0,1.388-1.525.608.608,0,0,0-.028-.725,3.46,3.46,0,0,0-1.616-1.575.286.286,0,0,1-.161-.189,1.808,1.808,0,0,1,.386-1.259c.034-.045.109-.059.165-.087.18.331.39.458.666.412.384-.065.54-.231.655-.76.339.4.666.749.948,1.13a6.043,6.043,0,0,1,.46.831c.07.137.043.222-.116.31a1.692,1.692,0,0,0-.8,2.043,1.455,1.455,0,0,0,.875,1.1.259.259,0,0,1,.094.234" transform="translate(-642.076 -86.98)" fill="#e9b341"/>
        <path id="Path_59226" data-name="Path 59226" d="M664.173,411.717a2.985,2.985,0,0,1-1.014,1.086,3.093,3.093,0,0,1-.754.347v.158a3.155,3.155,0,0,0,1.752-1.2c.017-.024.038-.045.061-.071a3.2,3.2,0,0,0,2.062.815.343.343,0,0,1,.3.163,1.339,1.339,0,0,0,1.113.528.206.206,0,0,0,.13-.062,1.334,1.334,0,0,0,.472-1.2.3.3,0,0,1,.1-.209,3.329,3.329,0,0,0,1.011-1.852c.007-.047.009-.1.014-.141l.62.071a2.97,2.97,0,0,0,1.273-.192c.136-.044.261-.117.4-.161a.264.264,0,0,1,.191.005,1.356,1.356,0,0,0,1.235.01.365.365,0,0,0,.176-.2,1.252,1.252,0,0,0-.141-1.2.262.262,0,0,1-.026-.264,3.16,3.16,0,0,0,.012-2.156.645.645,0,0,1-.021-.1,3.189,3.189,0,0,0,1.861-1.261.308.308,0,0,1,.268-.125,1.317,1.317,0,0,0,1.031-.544.3.3,0,0,0,.069-.29,1.467,1.467,0,0,0-.4-.769c-.091-.082-.207-.135-.3-.211-.051-.04-.115-.1-.124-.152a3.292,3.292,0,0,0-1.057-2.038c.146-.169.3-.332.434-.507a3.422,3.422,0,0,0,.629-1.537.227.227,0,0,1,.091-.148,1.31,1.31,0,0,0,.74-1.11c0-.007.014-.013.021-.019l0-.03c-.016-.019-.032-.037-.047-.057a1.3,1.3,0,0,0-1.078-.62.353.353,0,0,1-.3-.168,5.049,5.049,0,0,0-.456-.491,2.8,2.8,0,0,0-1.357-.725c0-.025-.01-.043-.005-.054a3.208,3.208,0,0,0,0-2.272.2.2,0,0,1,.02-.161,1.327,1.327,0,0,0,.193-1.18.32.32,0,0,0-.188-.261,1.373,1.373,0,0,0-1.221,0,.285.285,0,0,1-.2.02c-.187-.064-.364-.161-.552-.219a2.955,2.955,0,0,0-1.733-.06c-.033-.154-.06-.306-.1-.456a3.339,3.339,0,0,0-.964-1.574.243.243,0,0,1-.073-.177,1.349,1.349,0,0,0-.475-1.225.26.26,0,0,0-.176-.047,1.3,1.3,0,0,0-1.12.6.2.2,0,0,1-.143.083,3.074,3.074,0,0,0-1.412.314,8.7,8.7,0,0,0-.774.471c.01.006,0,0-.006,0a3.167,3.167,0,0,0-1.8-1.258l-.018-.006v.168a2.982,2.982,0,0,1,1.8,1.442,3.022,3.022,0,0,1,2.733-.929c-.041.107-.036.194-.2.178a2.991,2.991,0,0,0-2.25.671c-.114.093-.21.209-.316.315a2.877,2.877,0,0,0-1.771-1.464v.163l.056.02a3.605,3.605,0,0,1,.986.573.913.913,0,0,0-.24.156.471.471,0,0,0-.085.259c-.007.165.092.266.27.312a.871.871,0,0,1-.69.389.146.146,0,0,1-.087-.066,1.46,1.46,0,0,0-.212-.279v.259a.93.93,0,0,1,.07.129l-.071.019v.163c.022-.006.045-.01.068-.015a4.842,4.842,0,0,0,.662-.17.818.818,0,0,0,.5-.658c.029-.117-.106-.186-.225-.137l.108.15-.041.054c-.062-.024-.173-.045-.175-.073a.352.352,0,0,1,.06-.251.271.271,0,0,1,.24-.031.45.45,0,0,1,.2.526,1.061,1.061,0,0,1-.731.7,3.327,3.327,0,0,1-.509.1l-.152.03c-.051.011-.1.023-.15.036a1.1,1.1,0,0,1,.15.011,1.054,1.054,0,0,1,.861.859,3.146,3.146,0,0,1,.058.452c.023.174-.113.189-.243.26a1.361,1.361,0,0,0-.1-.824.9.9,0,0,0-.578-.511v.162a1.6,1.6,0,0,1,.152.077,1.812,1.812,0,0,1-.132.3l-.02.028v.276a1.6,1.6,0,0,0,.283-.5,1.056,1.056,0,0,1,.249.927c0,.03-.082.076-.12.071-.059-.008-.161-.055-.161-.084,0-.173-.111-.222-.238-.22h-.014v.148c.082-.026.078.062.093.115a.306.306,0,0,0,.34.2,1.41,1.41,0,0,0,1.1-.688c.038.078.071.15.109.22a1.256,1.256,0,0,0,.826.719.31.31,0,0,0,.375-.13c.021-.032.067-.046.1-.069.02.054.067.117.055.161-.045.15-.21.2-.378.214a1.316,1.316,0,0,1-.16,0c0,.013,0,.025,0,.038.053,0,.106.01.159.011a1.494,1.494,0,0,0,.757-.121c.1-.053.14-.027.18.076a1.576,1.576,0,0,0,.618.671,2.6,2.6,0,0,1-.248-.355.323.323,0,0,1,.03-.234c.014-.03.105-.026.126-.03.029.138.018.273.08.351a.752.752,0,0,0,.576.238,1.547,1.547,0,0,0,.865-.209,5.181,5.181,0,0,0,.029.568,1.043,1.043,0,0,0,.43.735.273.273,0,0,0,.344.011.146.146,0,0,1,.1-.011.2.2,0,0,1,.015.133c-.063.128-.187.125-.3.1a2.5,2.5,0,0,0-.335-.086c.1.054.2.114.3.161a2.077,2.077,0,0,0,.332.13c.117.032.24.043.375.065a1.762,1.762,0,0,0,.216,1.045,2.7,2.7,0,0,1-.045-.448.436.436,0,0,1,.131-.215c.014-.016.085.019.13.03a.283.283,0,0,1-.032.1.282.282,0,0,0-.026.344,1.173,1.173,0,0,0,.911.572c.1.019.213.024.289.032a5.284,5.284,0,0,0-.256.732,1.327,1.327,0,0,0,.043.539c.045.2.145.244.434.266.021.156-.076.235-.238.168a.983.983,0,0,1-.254-.2c-.038-.034-.062-.085-.117-.113a.558.558,0,0,0,.049.113,1.727,1.727,0,0,0,.595.616c.084.041.056.1.014.159a1.567,1.567,0,0,0-.2.9,1.932,1.932,0,0,1,.115-.364.374.374,0,0,1,.2-.153c.039-.012.106.06.144.084-.1.1-.22.172-.259.272a.687.687,0,0,0,.109.565,1.6,1.6,0,0,0,.6.588.6.6,0,0,1,.056.041,5.165,5.165,0,0,0-.569.537,1.339,1.339,0,0,0-.215.515c-.049.2.016.274.263.4-.038.15-.129.193-.235.091a.785.785,0,0,1-.161-.272.813.813,0,0,1-.029-.212l-.057.007a3.915,3.915,0,0,0,.061.488,2.043,2.043,0,0,0,.179.436c.051.1-.005.128-.066.163a1.48,1.48,0,0,0-.587.707,3.078,3.078,0,0,1,.217-.234.41.41,0,0,1,.168-.085c.15-.038.215.028.2.189-.311-.016-.49.193-.494.544a1.645,1.645,0,0,0,.29.929,8.64,8.64,0,0,0-.837.27.66.66,0,0,0-.406.467.61.61,0,0,0,.049.242c.01.044.027.086.041.129-.067-.008-.16.009-.2-.029a.348.348,0,0,1-.054-.374c.019-.064.041-.126.073-.219-.04.029-.062.036-.067.05a1.706,1.706,0,0,0-.2.857c.014.087,0,.14-.105.154a2.459,2.459,0,0,0-.471.1,4.047,4.047,0,0,0-.432.207l.02.04a1.117,1.117,0,0,1,.266-.11.691.691,0,0,1,.3.03.11.11,0,0,1,.066.168c-.058.1-.1.026-.151-.006a.283.283,0,0,0-.333.035,1.1,1.1,0,0,0-.422.761c-.023.172-.017.347-.023.509-.2-.054-.406-.122-.62-.17a.915.915,0,0,0-.6.066c-.258.119-.3.183-.27.509-.059-.008-.133,0-.16-.029a.2.2,0,0,1-.043-.17c.068-.147.159-.283.249-.436-.056.045-.117.087-.168.137a1.484,1.484,0,0,0-.455.582c-.025.08-.077.088-.152.047a2.015,2.015,0,0,0-.856-.139.139.139,0,0,0-.057.014c-.007,0-.008.015-.016.03a2.436,2.436,0,0,1,.313.049c.122.035.237.093.233.249a.133.133,0,0,1-.058.089c-.016.011-.066,0-.082-.024-.178-.213-.292-.237-.563-.118a1.525,1.525,0,0,0-.756.865,5.7,5.7,0,0,0-.45-.434.971.971,0,0,0-.809-.218.264.264,0,0,0-.209.189.256.256,0,0,1-.05.073v.177h.023a.186.186,0,0,0,.2-.2c.005-.112.121-.112.2-.1.036.005.08.077.087.124a.933.933,0,0,1-.252.856,2.182,2.182,0,0,0-.255-.442v.285a1.35,1.35,0,0,1,.084.176l.037.092c-.039.024-.078.058-.121.079v.168a.978.978,0,0,0,.6-.661,3.882,3.882,0,0,0,.087-.633c.186.05.233.093.207.333a1.447,1.447,0,0,1-.443.982.783.783,0,0,1-.456.2,1.087,1.087,0,0,1-.2,0c0,.014,0,.028,0,.041.066.009.132.016.2.024.11.014.22.027.329.047a1.273,1.273,0,0,1,.979.644.489.489,0,0,1-.11.646.2.2,0,0,1-.271,0,.321.321,0,0,1-.073-.239c.018-.112.113-.122.237-.057l-.137.187c.064-.007.14.006.169-.025a.238.238,0,0,0,.063-.182.9.9,0,0,0-.725-.7c-.155-.035-.308-.077-.461-.123v.189l.031.01a.549.549,0,0,1-.031.081v.268a1.6,1.6,0,0,0,.17-.224.148.148,0,0,1,.187-.071.855.855,0,0,1,.606.38.323.323,0,0,0-.284.35c-.006.147.117.284.342.364a3.557,3.557,0,0,1-1.02.588v.169a2.914,2.914,0,0,0,1.751-1.467,2.284,2.284,0,0,0,.962.747,2.823,2.823,0,0,0,1.295.272,2.077,2.077,0,0,1,.342,0c.058.009.108.077.182.133a2.917,2.917,0,0,1-2.762-.9m.444-20.575a4.428,4.428,0,0,0-.337.623,1.58,1.58,0,0,1-.29-.695l-.446.619-.049-.017a1.69,1.69,0,0,0-.583-1.264,1.3,1.3,0,0,0,1.048-.862l.042,0c.032.138.064.276.1.436l.213-.4.038-.012a1.292,1.292,0,0,0,.76,1.086,4.225,4.225,0,0,0-.5.483m2.374-1.426a.125.125,0,0,0-.085-.043,1.952,1.952,0,0,0-1.142.377c-.266.217-.266.216-.555.024a.6.6,0,0,1-.275-.384.31.31,0,0,0,.338-.269.384.384,0,0,0-.244-.447,3.344,3.344,0,0,1,1.249-.326c.087,0,.11.036.122.113a.956.956,0,0,0,1.126.8,2.107,2.107,0,0,0,.43-.209c.043-.019.12-.037.145-.014a3.336,3.336,0,0,1,.721,1.089c-.243-.056-.386-.005-.473.145a.342.342,0,0,0,.067.443.876.876,0,0,1-.788.023.142.142,0,0,1-.033-.091,2.044,2.044,0,0,0-.6-1.229m1.185,3.744-.049-.023c.024-.25.047-.5.069-.728l-.655.316-.038-.041a1.661,1.661,0,0,0,.073-1.38,1.312,1.312,0,0,0,1.348-.288c.008.014.017.027.026.04-.037.135-.073.271-.115.426l.373-.261.04,0a1.29,1.29,0,0,0,.2,1.372,1.643,1.643,0,0,0-1.277.563m6.335,7.814c.121.25.243.472.338.706a3.176,3.176,0,0,1,.126.488c.018.08-.007.12-.1.144a.9.9,0,0,0-.682.944.771.771,0,0,0,.3.682.14.14,0,0,1,.017.133,2.994,2.994,0,0,1-.975.83c-.014-.264-.106-.409-.281-.453a.279.279,0,0,0-.363.158.6.6,0,0,1-.167-.38.991.991,0,0,1,0-.223c.007-.185.038-.232.28-.287a1.967,1.967,0,0,0,.916-.6.322.322,0,0,0,.081-.376,1.839,1.839,0,0,0-.622-1.023.151.151,0,0,1-.058-.118.966.966,0,0,1,.365-.6c.023-.019.064-.016.1-.023.049.194.141.287.288.3.206.017.309-.047.438-.3m-1.255-5.034c.211-.067.284-.183.28-.483.2.138.392.251.561.393a4.972,4.972,0,0,1,.413.428c.061.065.067.119-.014.182a.842.842,0,0,0-.254.961.8.8,0,0,0,.629.645c.069.015.139.043.122.137a3.384,3.384,0,0,1-.494,1.193c-.1-.228-.23-.319-.405-.3s-.278.13-.321.36c-.1-.1-.192-.181-.271-.271a.739.739,0,0,1-.1-.164c-.126-.255-.129-.261.086-.445a2.028,2.028,0,0,0,.559-1.1.134.134,0,0,0-.033-.106,2.244,2.244,0,0,0-.781-.636,2.173,2.173,0,0,0-.354-.105.134.134,0,0,1-.121-.139,1.032,1.032,0,0,1,.051-.6c.02-.043.047-.082.075-.13a.334.334,0,0,0,.37.18m-3.322-3.615a.9.9,0,0,1-.25-.706.75.75,0,0,0,.272.025.486.486,0,0,0,.2-.167.359.359,0,0,0-.045-.448c.077,0,.134,0,.192.008a3.218,3.218,0,0,1,1.023.242c.091.039.137.081.095.192a.9.9,0,0,0,.313,1.036.793.793,0,0,0,.815.194.125.125,0,0,1,.109.053,1.324,1.324,0,0,1,.094.3,4.09,4.09,0,0,1,.057.494c.008.162,0,.325-.007.509a.38.38,0,0,0-.535-.045.263.263,0,0,0-.08.386.473.473,0,0,1-.39-.071,1.451,1.451,0,0,1-.176-.111c-.206-.159-.2-.161-.109-.406a1.979,1.979,0,0,0,.047-1.027c-.036-.256-.179-.314-.373-.379a1.728,1.728,0,0,0-1.11-.038.164.164,0,0,1-.145-.037m.888,4.124-.028-.054.4-.6-.73-.01,0-.043c.156-.176.323-.344.465-.531a1.025,1.025,0,0,0,.219-.646,3.407,3.407,0,0,0,.625.333,3.263,3.263,0,0,0,.694.058l-.262.315.415-.048.031.023a1.3,1.3,0,0,0-.424,1.307,1.681,1.681,0,0,0-1.4-.1m1.447,3.737-.649-.358c0-.016,0-.031.007-.047a1.667,1.667,0,0,0,1.177-.692,3.477,3.477,0,0,0,.4.571,3.52,3.52,0,0,0,.585.38l-.386.15.417.16a1.361,1.361,0,0,0-.969.92,4.757,4.757,0,0,0-.557-.439,4.837,4.837,0,0,0-.683-.268l.662-.377m-1.826,4.412.742-.023-.4-.6.03-.053a1.634,1.634,0,0,0,1.391-.1,1.3,1.3,0,0,0,.437,1.3l-.021.034-.434-.057.291.34a1.4,1.4,0,0,0-1.325.395,1.708,1.708,0,0,0-.727-1.2l.017-.044m-.682,3.683a.632.632,0,0,1,.115-.191.247.247,0,0,1,.187-.07,2.027,2.027,0,0,0,1.335-.126.192.192,0,0,0,.1-.118,2.086,2.086,0,0,0,.067-1c-.027-.12-.076-.235-.108-.353a.147.147,0,0,1,.008-.118.88.88,0,0,1,.7-.34c-.056.205-.022.322.117.42.159.112.289.1.543-.08-.029.362-.054.69-.082,1.017a.7.7,0,0,1-.027.1c-.062.254-.06.242-.323.22a.94.94,0,0,0-.88.461.83.83,0,0,0-.106.793c.04.114,0,.167-.086.193-.27.079-.542.153-.816.217a3.823,3.823,0,0,1-.414.051.383.383,0,0,0,0-.545.3.3,0,0,0-.4-.042.594.594,0,0,1,.077-.49m-2.249-.647.693.339c-.028-.24-.057-.492-.087-.743l.035-.031a1.663,1.663,0,0,0,1.276.576,1.327,1.327,0,0,0-.216,1.344l-.034.022-.368-.268.115.446-.029.025a1.351,1.351,0,0,0-1.34-.289,1.615,1.615,0,0,0-.074-1.384l.029-.036m-2.927,2.789a3.4,3.4,0,0,0-.3.624l-.2-.362-.1.416-.036.018a1.318,1.318,0,0,0-1.065-.873,1.634,1.634,0,0,0,.592-1.265l.047-.017.433.6c.086-.21.182-.446.278-.681l.045,0a1.675,1.675,0,0,0,.834,1.074,3.616,3.616,0,0,0-.523.47m2.33.767a.818.818,0,0,0-.544.688c-.014.149-.1.158-.187.142a6.578,6.578,0,0,1-.664-.143c-.169-.047-.331-.119-.512-.187.22-.159.291-.3.248-.448-.058-.2-.129-.253-.362-.27a.759.759,0,0,1,.361-.433c.209-.135.281-.141.448.034a1.76,1.76,0,0,0,.944.4.4.4,0,0,0,.451-.173,1.766,1.766,0,0,0,.45-1.016.19.19,0,0,1,.167-.2.828.828,0,0,1,.69.066c-.165.154-.184.259-.086.434s.247.227.491.156c-.122.221-.222.423-.343.612-.091.142-.211.265-.312.4-.086.114-.156.132-.278.029a.863.863,0,0,0-.963-.091" transform="translate(-637.77 -374.055)" fill="#e9b341"/>
        <path id="Path_59227" data-name="Path 59227" d="M519.646,532.927a.178.178,0,0,1,.119.086.279.279,0,0,1,.016.032.674.674,0,0,0,.08.133.558.558,0,0,0,.506.246.7.7,0,0,0,.377-.563.158.158,0,0,1,.073-.1,1.7,1.7,0,0,0,.749-.909,1.835,1.835,0,0,0,.986.15c.1,0,.223-.076.319-.015a.594.594,0,0,0,.745.062.658.658,0,0,0,.062-.633.137.137,0,0,1,.016-.139,1.759,1.759,0,0,0,.248-1.16,1.673,1.673,0,0,0,1.1-.439.16.16,0,0,1,.152-.034c.237.045.606-.046.659-.305a.75.75,0,0,0-.117-.432.036.036,0,0,0-.006-.008.655.655,0,0,0-.109-.124l-.019-.017a3.04,3.04,0,0,0-.294-1.169.7.7,0,0,0-.043-.058l-.024-.029a2.453,2.453,0,0,0,.838-1,.739.739,0,0,0,.517-.494l0-.016c-.006-.011-.012-.023-.018-.034a.78.78,0,0,0-.082-.168v0c-.155-.231-.369-.194-.52-.368h0l-.017-.021a2.475,2.475,0,0,0-.183-.306c-.008-.013-.018-.025-.027-.037a1.431,1.431,0,0,0-.552-.47l-.032-.015a2.391,2.391,0,0,0,.284-1.275.618.618,0,0,0,.183-.711.261.261,0,0,0-.019-.029c-.222-.191-.472-.141-.733-.147a1.721,1.721,0,0,0-1.119-.4h-.024a1.786,1.786,0,0,0-.318-1.161.127.127,0,0,1-.018-.1.7.7,0,0,0-.088-.653l-.019-.029a.631.631,0,0,0-.728.139,2.585,2.585,0,0,0-1.286.182l-.007,0a1.552,1.552,0,0,0-.172-.315,1.778,1.778,0,0,0-.613-.535.479.479,0,0,1-.042-.047c-.1-.124-.087-.253-.176-.384l0,0A.682.682,0,0,0,520,518.9a.6.6,0,0,0-.569.412.176.176,0,0,1-.131.123,1.924,1.924,0,0,0-.946.688,2.159,2.159,0,0,0-1.2-.422l-.007-.009a.688.688,0,0,0-.495-.293c-.336-.068-.474.416-.429.686a2.167,2.167,0,0,0-.564,1.14,1.947,1.947,0,0,0-1.158.176.169.169,0,0,1-.169.006.6.6,0,0,0-.7.1c-.165.4.091.512.1.806a1.9,1.9,0,0,0,.027,1.182,1.7,1.7,0,0,0-.957.689c-.019.025-.052.057-.078.057a.672.672,0,0,0-.5.218c-.176.133-.125.351,0,.522l.008.012a.7.7,0,0,0,.244.208.138.138,0,0,1,.069.064.237.237,0,0,1,.021.064,1.645,1.645,0,0,0,.307.715c.008.012.017.025.027.037a3.047,3.047,0,0,0,.238.283l0,0a1.71,1.71,0,0,0-.523,1.06.1.1,0,0,1-.058.09.668.668,0,0,0-.345.46.275.275,0,0,0,.06.257.69.69,0,0,0,.438.228.286.286,0,0,1,.261.116,1.774,1.774,0,0,0,.954.6l-.008.021a1.7,1.7,0,0,0,.033,1.159.112.112,0,0,1-.009.121.691.691,0,0,0-.065.65.217.217,0,0,0,.019.022.627.627,0,0,0,.727.05,2.539,2.539,0,0,0,1.305.113.341.341,0,0,0,0,.037,1.052,1.052,0,0,0,.217.574l.027.038.008.012c.077.1.158.19.224.281a.617.617,0,0,1,.139.329.585.585,0,0,0,.133.36l0,.005a1.209,1.209,0,0,0,.159.167.724.724,0,0,0,.626-.314.143.143,0,0,1,.121-.071,1.722,1.722,0,0,0,1.1-.452c.007.01.014.021.022.03a.379.379,0,0,0,.024.032,1.708,1.708,0,0,0,.922.587m.5-.6c-.653.2-.052.654-1.035.044.231-.082.243-.327.021-.381.084-.141.364-.318.46-.115a.923.923,0,0,0,.44.312c.283.1.513-.279.6-.509.064-.168.353-.079.456.025-.207.1-.083.384.142.348-.758.9-.362.2-1.079.276m1.412-.807-.019.008-.159-.18c0,.085.006.163.009.242l-.017.01a.711.711,0,0,0-.656-.3.848.848,0,0,0,.117-.719l.019-.016.318.252c.012-.126.025-.259.039-.391l.021-.012a.875.875,0,0,0,.591.439.7.7,0,0,0-.262.666m1.795-.4a.512.512,0,0,0-.646.533c.007.185-.579.09-.727.09.18-.124.07-.421-.141-.347-.01-.146.124-.368.279-.343a1.065,1.065,0,0,0,.7.085.86.86,0,0,0,.193-.748c.04-.149.27-.189.414-.156-.11.207.075.368.3.248-.094.176-.11.773-.372.638m1.874-2.46a.5.5,0,0,0-.376.793c0,.188-.437.331-.6.387.056-.216-.152-.385-.3-.224-.08-.139-.075-.471.159-.445a1.028,1.028,0,0,0,.537-.205c.2-.2.024-.581-.121-.779-.056-.141.156-.331.29-.333,0,.229.244.27.373.078.024.185.224.637.037.728m-1.393-1.64.008-.023a.876.876,0,0,0,.682-.224,1.054,1.054,0,0,0,.4.6l-.215.033.2.129a.714.714,0,0,0-.6.364,1.435,1.435,0,0,0-.557-.5l.382-.119-.293-.257m1.473-2.03c.822.869.144.379.143,1.088.083.655.671.162-.089,1.043-.026-.129-.082-.19-.174-.2s-.157.036-.2.149c-.091-.145-.285-.4-.046-.484.452-.328.543-.605.075-.972-.063-.066-.226-.068-.216-.179a.5.5,0,0,1,.146-.361c.089.222.342.156.367-.084m-1.548-2.4a.2.2,0,0,0,.286-.255c1.141.337.261.342.668.94.4.453.6-.168.375.914-.1-.18-.423-.113-.354.106-.156,0-.439-.229-.281-.377.332-.573.053-.923-.576-.9-.148-.047-.165-.3-.119-.425m-.062,2.2c.192-.143.439-.27.483-.528a1.014,1.014,0,0,0,.634.349l-.17.132.218.022.014.016a.681.681,0,0,0-.364.623.882.882,0,0,0-.709-.209c0-.01-.006-.02-.008-.03l.275-.265-.374-.087c0-.008,0-.015,0-.023m.067,5.065-.014.015-.216-.078.111.207a.737.737,0,0,0-.725.055.9.9,0,0,0-.24-.7l.014-.021.384.072c-.041-.108-.09-.231-.138-.355l.021-.024a.856.856,0,0,0,.725.107.683.683,0,0,0,.078.718m-.187-7.518a.676.676,0,0,0-.048.727.862.862,0,0,0-.719.146l-.023-.017.117-.366-.372.089-.015-.025a.871.871,0,0,0,.192-.7.69.69,0,0,0,.725,0c0,.008.006.016.009.023l-.107.206.22-.092.02.006m-1.881-1.783c.2-.012.641-.152.728.044a.5.5,0,0,0,.488.537c.1.012.224-.095.32-.051a1.746,1.746,0,0,1,.248.64c-.2-.115-.387.072-.274.257-.1.043-.424.014-.414-.128a.954.954,0,0,0-.211-.73,1.032,1.032,0,0,0-.629.066c-.2.161-.375-.1-.386-.278.211.054.3-.241.129-.357m-.613.175.021.007c0,.074,0,.148,0,.235l.154-.182.021,0a.68.68,0,0,0,.269.643,1.335,1.335,0,0,0-.552.474.827.827,0,0,1-.071-.39l-.3.268-.023-.014a.886.886,0,0,0-.158-.714.685.685,0,0,0,.635-.325m-1.627-.936a.524.524,0,0,0,.778.173c.088-.076.1-.207.228-.1a1.882,1.882,0,0,1,.441.4c-.191.012-.321.27-.11.367-.077.089-.362.209-.435.079-.273-.647-.716-.689-1.106-.106-.124.089-.359-.036-.417-.166.209-.031.187-.324-.047-.366.121-.078.586-.469.668-.285m-1.131.719.025,0,.111.2.052-.213a.908.908,0,0,0,.569.443.917.917,0,0,0-.276.658l-.022.011-.234-.31c-.042.113-.089.24-.14.378a1.546,1.546,0,0,0-.462-.591.651.651,0,0,0,.377-.572m-1.88-.074a.518.518,0,0,0,.738-.133c.067-.073.023-.259.141-.263a1.579,1.579,0,0,1,.631.16c-.19.126-.139.4.1.357-.073.145-.249.393-.417.248a.831.831,0,0,0-.682-.2.98.98,0,0,0-.294.639c-.036.163-.331.14-.446.068.169-.144-.01-.391-.221-.3.07-.117.317-.678.453-.576m-.655,1.169.018-.01.19.121c-.02-.08-.038-.149-.054-.218l.016-.014a.694.694,0,0,0,.706.128.85.85,0,0,0,.057.73l-.021.021-.363-.171a.949.949,0,0,1,.045.409.867.867,0,0,0-.686-.279.7.7,0,0,0,.094-.716m.549,2.334c.48-.3.113-.926.292-1.37.147.071.325.005.478.113.275.155.764.282.959-.035.266-.25.253-.638.54-.877.378.22.57.7,1.021.8.439-.071.688-.457,1.092-.6.008.01.015.02.022.03l0,0c.217.316.156.713.395,1.025a.107.107,0,0,0,.011.014c.178.224.574.194.822.119.181-.086.357.006.536-.039l.006.034c.054.374-.186.658-.126,1.029a.452.452,0,0,0,.1.29c.226.285.8.273,1.065.527l0,.008c-.031.059-.059.119-.089.178a1.77,1.77,0,0,1-.162.21,1.56,1.56,0,0,0-.244.288.871.871,0,0,0-.149.3c-.008.022-.016.044-.023.067a.329.329,0,0,0,.006.035.294.294,0,0,0,0,.032l.026.052a1.127,1.127,0,0,0,.11.206c.025.043.051.084.078.124.011.018.022.036.032.054l.01.009.024.022a.91.91,0,0,0,.154.145,1.523,1.523,0,0,1,.183.211.016.016,0,0,1,0,0c.035.064.066.13.106.188l-.214.152c-.154.075-.325.112-.48.185a.619.619,0,0,0-.4.356,1.172,1.172,0,0,0,.076.713,2.987,2.987,0,0,1,.081.505c-.355.12-.7-.093-1.054,0-.581.1-.419.873-.663,1.259-.38-.076-.589-.4-.958-.5-.573-.149-.734.6-1.156.808a.907.907,0,0,1-.139-.145l-.008-.011c-.14-.185-.221-.41-.354-.6l-.005-.006a.881.881,0,0,0-.253-.246,1.086,1.086,0,0,0-.733.154c-.154.123-.342.089-.513.162l-.01,0c-.137-.382.014-.768-.152-1.144-.008-.014-.016-.028-.024-.041a.061.061,0,0,0-.008-.011c-.26-.386-.858-.2-1.251-.36l-.024-.01c.029-.448.608-.912.32-1.345a.5.5,0,0,0-.033-.045c-.229-.284-.588-.367-.821-.644a.225.225,0,0,1-.024-.028c.215-.338.619-.415.833-.756.275-.464-.31-.884-.38-1.327.347-.193.738-.09,1.086-.277m-2.146,5.016a.746.746,0,0,0,.2-.706.877.877,0,0,0,.738.035l.014.023-.2.326.386,0,.012.019a.931.931,0,0,0-.362.642.744.744,0,0,0-.7-.193l.15-.18-.229.032m-.687-2.673-.012-.021a.691.691,0,0,0,.512-.509.867.867,0,0,0,.635.363.787.787,0,0,1-.339.22l.354.185,0,.025a.865.865,0,0,0-.618.4.686.686,0,0,0-.539-.483c0-.007,0-.014.007-.021l.215-.089-.215-.073m.629-2.7a.747.747,0,0,0,.689-.231.877.877,0,0,0,.39.62c0,.008,0,.016-.007.023l-.382.027.213.31-.017.02a.859.859,0,0,0-.727.078.749.749,0,0,0-.231-.693l.229.023-.157-.177m-.04-1.174a.52.52,0,0,0,.541-.728,1.574,1.574,0,0,1,.686-.188c-.143.169.049.438.242.283,0,.157-.036.39-.2.421a1.011,1.011,0,0,0-.713.088.867.867,0,0,0,0,.752c.029.162-.234.266-.377.27.1-.207-.128-.335-.32-.192,0-.163-.072-.7.142-.705m-.966,3.546c-.061-.115-.371-.644-.222-.693a.515.515,0,0,0,.148-.9,1.576,1.576,0,0,1,.52-.485c-.007.229.217.325.354.151.1.141.176.454-.072.472a.991.991,0,0,0-.506.391,1.025,1.025,0,0,0,.343.649c.119.126-.07.356-.2.417,0-.218-.3-.246-.368,0m.587,2.872-.019.016c-.117-.128-.616-.34-.486-.53a.364.364,0,0,0,.135-.288c-.034-.843-.8-.139-.193-1.241.072.215.345.214.371-.023.137.054.324.286.212.406-.174.15-.394.5-.273.71.3.418.867.174.589.792a.188.188,0,0,0-.338.157m2.069,1.985c-.2-.093-.355.132-.208.314-.159-.018-.707-.031-.7-.219a.5.5,0,0,0-.651-.619,1.7,1.7,0,0,1-.11-.722c.144.163.426,0,.323-.192.148-.01.382.08.382.234a.81.81,0,0,0,.053.771,1.013,1.013,0,0,0,.7.042c.151-.023.231.277.207.392m.406.275c.016-.074.033-.149.051-.229l-.189.142-.019-.01a.691.691,0,0,0-.135-.708.863.863,0,0,0,.664-.3l.023.007c-.013.132-.026.262-.038.391l.357-.188.019.017a.886.886,0,0,0-.021.728.716.716,0,0,0-.692.165l-.019-.011m2.085,1.2c-1.075.492-.41-.1-1.143-.275-.631-.022-.277.522-.867-.432.214.072.376-.177.2-.312.077-.1.338-.07.42-.025a1.223,1.223,0,0,0,.284.611c.216.218.593-.024.781-.187.143-.089.342.144.372.247-.215,0-.26.264-.05.373m.472-.537-.1.2-.021.005a.692.692,0,0,0-.449-.567.861.861,0,0,0,.446-.583l.026,0,.155.357.219-.318.024,0a.876.876,0,0,0,.308.645,1.063,1.063,0,0,0-.548.469l-.06-.207" transform="translate(-494.354 -499.672)" fill="#e9b341"/>
        <path id="Path_59228" data-name="Path 59228" d="M186.6,806.646a1.549,1.549,0,0,0-1.562-.016,1.522,1.522,0,0,0-.546.539,1.475,1.475,0,0,0,1.268,2.235,1.347,1.347,0,0,0,.515-.1,1.3,1.3,0,0,0,.385-.243,2.214,2.214,0,0,1-.092.373,1.243,1.243,0,0,1-.332.536.684.684,0,0,1-.472.174.862.862,0,0,1-.787-.525l-.076-.182-.463.421.045.093a1.375,1.375,0,0,0,.518.584,1.411,1.411,0,0,0,.763.215,1.291,1.291,0,0,0,.835-.294,1.837,1.837,0,0,0,.544-.852,4.276,4.276,0,0,0,.187-1.382,2.212,2.212,0,0,0-.19-.95,1.479,1.479,0,0,0-.542-.627m-1.677,1.28a.858.858,0,0,1,.119-.448.936.936,0,0,1,.322-.326.843.843,0,0,1,.867,0,.9.9,0,0,1,.319.327.9.9,0,0,1,0,.894.919.919,0,0,1-.317.327.843.843,0,0,1-.867,0,.921.921,0,0,1-.323-.327.872.872,0,0,1-.119-.446" transform="translate(-181.131 -774.4)" fill="#e9b341"/>
        <path id="Path_59229" data-name="Path 59229" d="M258.387,806.646a1.549,1.549,0,0,0-1.562-.016,1.522,1.522,0,0,0-.546.539,1.52,1.52,0,0,0-.006,1.5,1.47,1.47,0,0,0,.532.532,1.452,1.452,0,0,0,.742.2,1.347,1.347,0,0,0,.515-.1,1.3,1.3,0,0,0,.385-.243,2.216,2.216,0,0,1-.092.373,1.243,1.243,0,0,1-.332.536.684.684,0,0,1-.472.174.862.862,0,0,1-.788-.525l-.076-.182-.463.421.044.093a1.375,1.375,0,0,0,.518.584,1.411,1.411,0,0,0,.763.215,1.291,1.291,0,0,0,.835-.294,1.836,1.836,0,0,0,.544-.852,4.275,4.275,0,0,0,.187-1.382,2.211,2.211,0,0,0-.19-.95,1.478,1.478,0,0,0-.542-.627m-1.677,1.28a.857.857,0,0,1,.119-.448.936.936,0,0,1,.322-.326.819.819,0,0,1,.434-.12.828.828,0,0,1,.432.12.9.9,0,0,1,.319.327.9.9,0,0,1,0,.894.919.919,0,0,1-.317.327.843.843,0,0,1-.867,0,.921.921,0,0,1-.323-.327.873.873,0,0,1-.119-.446" transform="translate(-249.723 -774.4)" fill="#e9b341"/>
        <path id="Path_59230" data-name="Path 59230" d="M330.174,806.646a1.55,1.55,0,0,0-1.562-.016,1.521,1.521,0,0,0-.546.539,1.52,1.52,0,0,0-.006,1.5,1.47,1.47,0,0,0,.532.532,1.452,1.452,0,0,0,.742.2,1.347,1.347,0,0,0,.515-.1,1.3,1.3,0,0,0,.385-.243,2.216,2.216,0,0,1-.092.373,1.243,1.243,0,0,1-.332.536.684.684,0,0,1-.472.174.862.862,0,0,1-.787-.525l-.076-.182-.463.421.045.093a1.375,1.375,0,0,0,.518.584,1.411,1.411,0,0,0,.763.215,1.292,1.292,0,0,0,.835-.294,1.837,1.837,0,0,0,.544-.852,4.277,4.277,0,0,0,.187-1.382,2.211,2.211,0,0,0-.19-.95,1.479,1.479,0,0,0-.542-.627m-1.677,1.28a.857.857,0,0,1,.119-.448.936.936,0,0,1,.322-.326.819.819,0,0,1,.434-.12.828.828,0,0,1,.432.12.9.9,0,0,1,.319.327.9.9,0,0,1,0,.894.919.919,0,0,1-.317.327.843.843,0,0,1-.867,0,.922.922,0,0,1-.323-.327.873.873,0,0,1-.119-.446" transform="translate(-318.314 -774.4)" fill="#e9b341"/>
        <rect id="Rectangle_23295" data-name="Rectangle 23295" width="0.599" height="0.812" transform="translate(12.902 34.699)" fill="#e9b341"/>
        <path id="Path_59231" data-name="Path 59231" d="M425.108,806.646a1.549,1.549,0,0,0-1.562-.016,1.521,1.521,0,0,0-.546.539,1.52,1.52,0,0,0-.006,1.5,1.469,1.469,0,0,0,.532.532,1.452,1.452,0,0,0,.742.2,1.347,1.347,0,0,0,.515-.1,1.3,1.3,0,0,0,.385-.243,2.217,2.217,0,0,1-.092.373,1.243,1.243,0,0,1-.332.536.684.684,0,0,1-.472.174.862.862,0,0,1-.787-.525l-.076-.182-.463.421.045.093a1.375,1.375,0,0,0,.518.584,1.411,1.411,0,0,0,.763.215,1.292,1.292,0,0,0,.835-.294,1.837,1.837,0,0,0,.544-.852,4.275,4.275,0,0,0,.187-1.382,2.211,2.211,0,0,0-.19-.95,1.479,1.479,0,0,0-.542-.627m-1.677,1.28a.857.857,0,0,1,.119-.448.936.936,0,0,1,.322-.326.843.843,0,0,1,.867,0,.9.9,0,0,1,.319.327.9.9,0,0,1,0,.894.918.918,0,0,1-.317.327.843.843,0,0,1-.867,0,.922.922,0,0,1-.323-.327.873.873,0,0,1-.119-.446" transform="translate(-409.021 -774.4)" fill="#e9b341"/>
        <path id="Path_59232" data-name="Path 59232" d="M160.134,659.551h.649v-1.036h.479V657.9h-.479v-2.5h-.462l-2.089,2.593v.521h1.9Zm.033-3.037V657.9h-1.109Z" transform="translate(-156.232 -630.098)" fill="#e9b341"/>
        <rect id="Rectangle_23296" data-name="Rectangle 23296" width="0.599" height="0.812" transform="translate(5.314 28.641)" fill="#e9b341"/>
        <path id="Path_59233" data-name="Path 59233" d="M256.283,658.354h-2.2c.006-.048.014-.1.023-.142a.756.756,0,0,1,.113-.255,1.123,1.123,0,0,1,.275-.268,3.035,3.035,0,0,1,.533-.3l.211-.1.174-.083a2.388,2.388,0,0,0,.4-.244,1.186,1.186,0,0,0,.328-.374,1.117,1.117,0,0,0,.13-.553,1.294,1.294,0,0,0-.15-.613,1.157,1.157,0,0,0-.454-.459,1.466,1.466,0,0,0-.74-.173,1.788,1.788,0,0,0-.6.093,1.88,1.88,0,0,0-.738.47l0,.005c-.066.072-.11.12-.134.148l-.082.1.447.436.1-.12a2.01,2.01,0,0,1,.216-.223,1.183,1.183,0,0,1,.322-.2,1.112,1.112,0,0,1,.44-.081.8.8,0,0,1,.4.088.529.529,0,0,1,.221.223.664.664,0,0,1,.075.315.568.568,0,0,1-.091.333.864.864,0,0,1-.266.24,3.216,3.216,0,0,1-.4.2c-.155.066-.3.139-.44.213a2.213,2.213,0,0,0-.418.28,1.591,1.591,0,0,0-.326.383,1.7,1.7,0,0,0-.2.5,2.713,2.713,0,0,0-.057.634l0,.137h2.888Z" transform="translate(-247.143 -629.518)" fill="#e9b341"/>
        <path id="Path_59234" data-name="Path 59234" d="M325.79,656.023V655.4h-2.124l-.493,2.443h.593l.041-.061a.82.82,0,0,1,.317-.276.923.923,0,0,1,.419-.1.8.8,0,0,1,.4.1.772.772,0,0,1,.282.271.732.732,0,0,1,.105.395.757.757,0,0,1-.4.689.859.859,0,0,1-.421.1.956.956,0,0,1-.511-.143,1.023,1.023,0,0,1-.365-.38l-.077-.139-.474.349.053.1a1.471,1.471,0,0,0,.55.6,1.527,1.527,0,0,0,.818.225,1.566,1.566,0,0,0,.743-.176,1.364,1.364,0,0,0,.737-1.236,1.309,1.309,0,0,0-.691-1.19,1.457,1.457,0,0,0-.707-.174,1.33,1.33,0,0,0-.5.095q-.049.02-.095.043l.181-.917Z" transform="translate(-313.748 -630.098)" fill="#e9b341"/>
        <path id="Path_59235" data-name="Path 59235" d="M425.689,678.225a1.85,1.85,0,0,0-.239-.192,1.25,1.25,0,0,0-.713-.206,1.355,1.355,0,0,0-.6.131,1.439,1.439,0,0,0-.461.359,1.664,1.664,0,0,0-.3.515,1.811,1.811,0,0,0-.1.611,1.688,1.688,0,0,0,.408,1.1,1.465,1.465,0,0,0,.467.358,1.345,1.345,0,0,0,.6.134,1.33,1.33,0,0,0,.662-.179,1.409,1.409,0,0,0,.241-.17v.182a.673.673,0,0,1-.426.668,1.155,1.155,0,0,1-.455.088,1.254,1.254,0,0,1-.538-.118.907.907,0,0,1-.392-.347l-.082-.13-.449.353.069.106a1.583,1.583,0,0,0,.537.514,1.692,1.692,0,0,0,.855.193,1.9,1.9,0,0,0,.75-.147,1.3,1.3,0,0,0,.566-.453,1.263,1.263,0,0,0,.213-.741V677.87h-.61Zm-.31,2.027a1.015,1.015,0,0,1-.253.141.751.751,0,0,1-.274.051.86.86,0,0,1-.646-.29,1.114,1.114,0,0,1-.2-.323,1.032,1.032,0,0,1-.072-.382,1.195,1.195,0,0,1,.241-.7.853.853,0,0,1,.271-.23.751.751,0,0,1,.363-.084.8.8,0,0,1,.342.077.977.977,0,0,1,.3.221,1.008,1.008,0,0,1,.2.3v.837a.515.515,0,0,1-.085.19.89.89,0,0,1-.188.2" transform="translate(-409.48 -651.525)" fill="#e9b341"/>
        <path id="Path_59236" data-name="Path 59236" d="M113.465,528.874v.7h2.127v-.7H114.9v-3.452h-.62l-.029.088a.746.746,0,0,1-.077.093,2.245,2.245,0,0,1-.216.2,2,2,0,0,1-.265.19.41.41,0,0,1-.2.069h-.139v.725h.139a.774.774,0,0,0,.295-.065,2.137,2.137,0,0,0,.282-.145,1.751,1.751,0,0,0,.174-.12v2.412Z" transform="translate(-113.35 -505.904)" fill="#e9b341"/>
        <path id="Path_59237" data-name="Path 59237" d="M204.8,529.314a1.775,1.775,0,0,0,.7-.733,2.346,2.346,0,0,0,.242-1.089,2.4,2.4,0,0,0-.221-1.033,1.782,1.782,0,0,0-.671-.756,2.041,2.041,0,0,0-1.1-.281h-1.452v4.15h1.452a2.089,2.089,0,0,0,1.055-.258m-1.055-3.275a1.351,1.351,0,0,1,.728.183,1.173,1.173,0,0,1,.448.506,1.923,1.923,0,0,1,0,1.52,1.221,1.221,0,0,1-.445.517,1.328,1.328,0,0,1-.732.19h-.793v-2.917Z" transform="translate(-198.334 -505.904)" fill="#e9b341"/>
        <rect id="Rectangle_23297" data-name="Rectangle 23297" width="0.649" height="3.119" transform="translate(7.781 20.549)" fill="#e9b341"/>
        <rect id="Rectangle_23298" data-name="Rectangle 23298" width="0.649" height="0.823" transform="translate(7.781 19.408)" fill="#e9b341"/>
        <path id="Path_59238" data-name="Path 59238" d="M315.512,549.151a.957.957,0,0,1,.2-.343,1.082,1.082,0,0,1,.331-.254.827.827,0,0,1,.369-.091.373.373,0,0,1,.347.166,1.276,1.276,0,0,1,.125.654V551h.648v-1.793a2.8,2.8,0,0,0-.045-.528,1.283,1.283,0,0,0-.16-.431.807.807,0,0,0-.315-.3.981.981,0,0,0-.463-.1,1.529,1.529,0,0,0-.534.1,1.572,1.572,0,0,0-.461.265q-.037.031-.071.064v-.38h-.616V551h.649Z" transform="translate(-305.893 -527.332)" fill="#e9b341"/>
        <path id="Path_59239" data-name="Path 59239" d="M383.333,550.875a.409.409,0,0,0,.3.133.267.267,0,0,0,.044,0,.4.4,0,0,0,.053,0l.1-.01.126-.012v-.549l-.128-.01h-.008s0-.007,0-.012v-1.306a1.233,1.233,0,0,0-.348-.923,1.274,1.274,0,0,0-.925-.338,1.766,1.766,0,0,0-.593.1,2.551,2.551,0,0,0-.576.3l-.1.071.273.507.128-.087a2.167,2.167,0,0,1,.433-.234,1.12,1.12,0,0,1,.4-.075.658.658,0,0,1,.491.171.627.627,0,0,1,.171.471v.05c-.075-.019-.154-.035-.238-.047a3.107,3.107,0,0,0-.451-.034,1.852,1.852,0,0,0-.676.115,1.124,1.124,0,0,0-.481.341.852.852,0,0,0-.182.544.955.955,0,0,0,.144.51,1.018,1.018,0,0,0,.4.364,1.186,1.186,0,0,0,.558.132,1.679,1.679,0,0,0,.677-.146,1.45,1.45,0,0,0,.326-.194.465.465,0,0,0,.092.162m-1.008-.384a.6.6,0,0,1-.3-.071.5.5,0,0,1-.188-.178.419.419,0,0,1-.062-.223.346.346,0,0,1,.181-.309,1.051,1.051,0,0,1,.568-.135,2.033,2.033,0,0,1,.375.035,2.216,2.216,0,0,1,.271.069v.312a.158.158,0,0,1-.02.067.63.63,0,0,1-.075.118.762.762,0,0,1-.3.223,1.072,1.072,0,0,1-.443.091" transform="translate(-369.219 -527.332)" fill="#e9b341"/>
        <path id="Path_59240" data-name="Path 59240" d="M454.619,548.222a.558.558,0,0,0-.091-.007c-.03,0-.064,0-.107.005a1.113,1.113,0,0,0-.589.236,1.4,1.4,0,0,0-.166.15v-.364h-.627v3.108h.649v-1.883a.884.884,0,0,1,.336-.449,1.029,1.029,0,0,1,.576-.182l.135,0v-.591Z" transform="translate(-437.918 -527.684)" fill="#e9b341"/>
      </g>
    </g>
  </g>
</svg>
