<svg xmlns="https://www.w3.org/2000/svg" xmlns:xlink="https://www.w3.org/1999/xlink" width="20" height="20" viewBox="0 0 20 20">
  <defs>
    <clipPath id="clip-path">
      <rect id="Rectangle_23253" data-name="Rectangle 23253" width="20" height="18.397" fill="none"/>
    </clipPath>
  </defs>
  <g id="Group_77301" data-name="Group 77301" transform="translate(-301 -230)">
    <g id="Rectangle_21419" data-name="Rectangle 21419" transform="translate(301 230)" fill="#fff" stroke="#707070" stroke-width="1" opacity="0">
      <rect width="20" height="20" stroke="none"/>
      <rect x="0.5" y="0.5" width="19" height="19" fill="none"/>
    </g>
    <g id="Group_77306" data-name="Group 77306" transform="translate(301 230.801)">
      <g id="Group_77306-2" data-name="Group 77306" clip-path="url(#clip-path)">
        <path id="Path_59080" data-name="Path 59080" d="M16.367,8.868s-3.253,8-10.864,9.442c0,0-6.975,1.318-5.22-6.313l2.75-1.536S.888,15.347,4.621,16.167c0,0,5.926,1.321,11.746-7.3M3.635,9.529v0l0,0ZM14.5.087C7.2,1.537,3.7,9.373,3.636,9.526,9.452.91,15.307,2.043,15.307,2.043,19.436,3.08,16.97,7.936,16.97,7.936L19.716,6.4C21.473-1.232,14.5.087,14.5.087m-.049,3.239,0,.017a2.8,2.8,0,0,1,.71.3,2.318,2.318,0,0,1,1.117,1.721c.221,1.567-.747,3.691-2.59,5.68A14.923,14.923,0,0,1,8.9,14.563a6.321,6.321,0,0,1-1.019.364,5.445,5.445,0,0,1-1.463.219h0a3.269,3.269,0,0,1-1.666-.417A2.206,2.206,0,0,1,3.7,13.037c-.241-1.766.893-4.281,2.821-6.257.292-.3.594-.583.9-.85h0c2.268-1.958,4.9-2.981,6.735-2.651q.147.019.293.048m-.634.478h.041c.05-.134.094-.262.129-.376q-.084-.011-.17-.018Zm-.232,1.708a4.311,4.311,0,0,1-.992,1.341h.5l.523-1.341ZM7.672,11.65h.147c0-.027-.006-.055-.011-.084,0,0,0-.023-.009-.066Zm2.839-4.258-1.1,1.062h.815l.308-.222V7.39ZM9.182,8.671v.238l.671-.273H9.219ZM9,13.808V13.43H7.524l.134.086A2.57,2.57,0,0,0,9,13.808m-1.4-1.69a.409.409,0,0,0,.206-.287H7.6Zm0,.974v.155H9V11.831H8.463a.415.415,0,0,1-.13.557ZM9,10.052V9.431c-.071.091-.167.22-.265.375a.846.846,0,0,1,.055.247ZM9,8.844l-.389.375s-.189.052-.111.2A1.328,1.328,0,0,1,9,8.974Zm-.7,2.064c0,.033,0,.066,0,.1l.123.644H9V10.232H8.779a.638.638,0,0,1-.093.217ZM6.672,12.835s-.088,0-.216-.012l.161.082.805-.646v-.311Zm3.961.6H9.182v.37a4.458,4.458,0,0,0,1.451-.37m-.1-1.6H9.183v1.417h1.347Zm0-1.6H9.183V11.65h1.347Zm0-1.467-.109.044a11.6,11.6,0,0,1-1.237.462v.782h1.347Zm1.527,1.287V8.636h-1.2l-.143.057v1.36Zm-1.345.18V11.65h1.345V10.232Zm1.345-1.777V7.512l-.864.943Zm-.091-1.42h-.138l-.385.209-.731.117V8.1L11.2,7.75l.373-.395a.8.8,0,0,1,.393-.321m.272-3.5V3.8h1.4V3.4a5.372,5.372,0,0,0-1.4.133m0,.454V5.331h.957c.127-.267.291-.62.442-.975V3.984Zm0,1.528V6.55a1.3,1.3,0,0,0,.733-.758s.054-.107.137-.28ZM11.294,3.8h.763V3.572c-.25.062-.5.14-.763.231m-.583.231v1.3h1.344V3.984H10.874V3.965c-.054.023-.108.045-.163.07m0,1.478V6.853h.283l.041-.018a7,7,0,0,1,1-.222l.017,0v-1.1ZM9.183,5.331H10.53V4.114a11.592,11.592,0,0,0-1.347.732Zm0,1.523h1.347V5.512H9.183Zm0,.181v.9l.024-.023.56-.522a1.307,1.307,0,0,1,.539-.358ZM9,4.962q-.269.175-.534.368H9ZM7.6,6.013v.841H9V5.512H8.223q-.313.239-.62.5m0,1.022v1.42h1.02L9,8.1V7.035Zm0,1.6v1.417h.426a.882.882,0,0,0-.09-.645s-.148-.311.3-.6l.187-.173Zm0,1.6v.607l.151-.166a1.7,1.7,0,0,0,.13-.22,2.309,2.309,0,0,1,.076-.222ZM6.7,6.853h.721V6.169q-.368.325-.721.684ZM6.02,7.6v.851h1.4V7.035h-.9q-.264.278-.506.568m0,1.032v1.417h1.4V8.636Zm0,1.6V11.65h.636l.167-.119h.148l.45-.492v-.806Zm0,1.6V12.1l.382-.273Zm-.181,0H4.492v.47a2.7,2.7,0,0,1,1.047.146l.3-.214Zm0-1.6H4.492V11.65H5.839ZM5.373,8.455h.465V7.825c-.164.208-.32.417-.465.629m-.881,1.6H5.839V8.636H5.251a10.348,10.348,0,0,0-.759,1.351Zm-.554,1.6h.372V10.407a6.957,6.957,0,0,0-.372,1.243m-.091.911a.973.973,0,0,1,.463-.232v-.5H3.906a4.086,4.086,0,0,0-.058.73m8.209-.73H10.711v1.416h.2q.569-.4,1.15-.888Zm.589,0h-.409V12.2q.2-.179.409-.371m.99-1.6h-1.4V11.65h.6q.359-.347.717-.733l.084-.092Zm0-1.6h-1.4v1.417h1.4Zm0-1.6h-.354l-.1.247-.94.162V8.455h1.4Zm0-.181V6.2l-.277.653Zm.511,3.379h-.331v.391q.171-.2.331-.391m1.1-1.6H13.817v1.417h.475a11.29,11.29,0,0,0,.957-1.417m.023-1.6H13.817v1.42h1.454Zm0-1.523h-.653l-.8.278V6.853h1.454Zm0-.181V4.872l-.32.459Zm.668,1.7h-.487V8.256a7,7,0,0,0,.487-1.221m.171-1.523h-.658V6.853h.536a3.993,3.993,0,0,0,.122-1.342m-.024-.181a2.128,2.128,0,0,0-.429-1.013l-.206.3v.718ZM14.238,3.984c-.105.3-.247.669-.421,1.051v.3h.405l.366-.1.682-1.069V3.984Zm.157-.472c-.024.077-.056.176-.095.291h.778L15.065,3.8a2.929,2.929,0,0,0-.669-.283" transform="translate(0 0)" fill="#fff"/>
      </g>
    </g>
  </g>
</svg>
