<svg xmlns="https://www.w3.org/2000/svg" width="30" height="30" viewBox="0 0 30 30">
  <g id="Group_53183" data-name="Group 53183" transform="translate(-854 -758)">
    <circle id="Ellipse_407" data-name="Ellipse 407" cx="15" cy="15" r="15" transform="translate(854 758)" fill="#fff"/>
    <g id="Group_53182" data-name="Group 53182" transform="translate(878 764.323) rotate(90)">
      <rect id="Rectangle_7166" data-name="Rectangle 7166" width="18" height="18" transform="translate(-0.323)" fill="none"/>
      <path id="XMLID_225_" d="M17.37,75.208a.874.874,0,0,0-1.132,0L8.8,81.8,1.366,75.208a.874.874,0,0,0-1.132,0,.654.654,0,0,0,0,1l8,7.094a.874.874,0,0,0,1.132,0l8-7.094A.654.654,0,0,0,17.37,75.208Z" transform="translate(0 -70.058)" fill="rgba(0,0,0,0.6)"/>
    </g>
  </g>
</svg>
