<svg xmlns="https://www.w3.org/2000/svg" width="21" height="21.351" viewBox="0 0 21 21.351">
  <g id="language-svgrepo-com" transform="translate(-1.5 -1.324)">
    <circle id="Ellipse_177" data-name="Ellipse 177" cx="10" cy="10" r="10" transform="translate(2 2)" fill="none" stroke="#000" stroke-linecap="square" stroke-width="1"/>
    <path id="Path_41138" data-name="Path 41138" d="M12,22q4-3.636,4-10T12,2Q8,5.636,8,12T12,22Z" fill="none" stroke="#000" stroke-linecap="round" stroke-width="1"/>
    <path id="Path_41139" data-name="Path 41139" d="M2.5,9h19m-19,6h19" fill="none" stroke="#000" stroke-linecap="round" stroke-width="1"/>
  </g>
</svg>
