<svg xmlns="https://www.w3.org/2000/svg" xmlns:xlink="https://www.w3.org/1999/xlink" width="20" height="20" viewBox="0 0 20 20">
  <defs>
    <clipPath id="clip-path">
      <rect id="Rectangle_21779" data-name="Rectangle 21779" width="20" height="20" transform="translate(442 637)" fill="#fff"/>
    </clipPath>
  </defs>
  <g id="Mask_Group_68808" data-name="Mask Group 68808" transform="translate(-442 -637)" clip-path="url(#clip-path)">
    <path id="bolt_FILL0_wght500_GRAD0_opsz48" d="M13.57,21.292l6.757-8.133H15.953l.86-6.9-6.143,8.87H14.43ZM11.58,23.65l.983-6.88H7.55L16.617,3.65h2.162L17.8,11.513h6.02L13.717,23.65ZM15.486,13.8Z" transform="translate(436.317 633.35)" fill="#0038ff"/>
  </g>
</svg>
