{
  "type": "service_account",
  "project_id": "bursa-gold-dinar-uat",
  "private_key_id": "cb7b46bd2b094296b2b602118bf9a706c0803e89",
  "private_key": "-----BEGIN PRIVATE KEY-----\nMIIEvQIBADANBgkqhkiG9w0BAQEFAASCBKcwggSjAgEAAoIBAQDFbHrDBGu5sEup\nQNGpTnqYjM67K7S5v/eZhMTIKF6siu3fHDI7Wz40RDkpWnGbEF358/iyhm6XTctC\nKFKNTJRHHIki7bz1DXCezsNFQrq/Gn7rDYqr1YjVun73C9sDpkaR1ya2Rfq7gvJC\nQKRTfojHcffQhD0yO1HGAjfVOq1lgOpzKCaxhBq9WATg/OUYw3vTMveQ21Nubcwk\nncfaIB0r80MlhaREE5UoiSjwcwW3dcSX9meluO9VQeEoAlFwlLrxAt65fAnJvSOH\n4reBb9fRaIiO4WyFk3Az+u1jMcu8TwZzmONv8hcvCWtlFrySJaA7shIne86jzzpJ\n8ulKt1rDAgMBAAECggEAAes9Ajo/xc1F3v5HS2r83BC6Ta1uE0QfZvmYZA2oZerv\nxvRiNJt9bkqfd5xucEBneW96olmWJ5hU+m6j5sWwx0QqvREsfgFEb/a4hSrR39ul\nEinOiD8KFnG6nDIcTdvG4dICiVECz+HE8wnnzvvy3mVoMDmo0p0q/U62NjdcyhjD\nSTHNk5KT4PR/WV4LOGGG4Aj/CMvzKRnx26RSjapk2aPH24JFybZjVaKLQN5Yuj3s\nnf8QJuIwMtjn9TLncn5TSIti2Rd3XA4guqo8PASDJnbmZC91e6p2FZIsDy1Yjylt\niltHpXLnF7VAKJZpWTdprPxU6H9ph6LaKbszT3NPEQKBgQD6ptcJdztbXomAL2EP\ntf8JJ3BQJyELLZs1OSAmKMu4o19Cush4UQ0yloNehI+Rm77s0gCrMX2e3csjz3aD\n3vPT6UW5ic8dpndadH8A68X6a1CiMJln5NJXXEST0dhxftWuGGetFDf3MQwtnq6o\n1tMl+GSgH/01Jh8b4AtZeKpyiQKBgQDJouMXDGhQo2Cui0WYIPXG1zcsHi4KvpHn\nD5Z4Ta8C3LhfjAsEkhmoFkqOxt//ujJHIIMjwnZbtIISGehg5oR1WXQ/Hd3FWO3c\nDCt9alyiu6yno94N0jVXhgbgDvnPYtq4fjp0W4GkxS+HyWR8Xvwdq2Mwlz17u2yu\n233ZgWy/6wKBgQCe+AO4GCvINjwk1WfMzBO1XZMI8tgtO76NUe7G5ObX8p2vN8F/\nNYCWTgmBf7eClPHRRxtveBMBGBAHZUP4PQYNp4w2MWXvmy1lbC9EiURmH3vjcclJ\nsEGLcJR54ARTbyrcoNPYXNNl7nCX2mVR5fXCxjgjqkYwWD4wsrbgBvyraQKBgFn+\nKyCkVwJ2iLYeTsdhHpDKiUNVjPMarv/TgzLaaRv76wYp+NjnZDATEt+6f0shjUMV\njbIuHqk7XTo6+e4VtFSzwiBRciOcVzz46YgmKoYvARYpGvhMM6aGmRbzWCdpVXk2\nTVyVYr1pjJcsGX8w3ZFYZwLO3ZAVzKIWMIsdKq5VAoGAYYA164aoGOrnhZ+FBfbn\nGGor/ul4RtuYX5PWvPIlbHiL4WpwBYLPkseVnrYT0z8lw6bpso+P6+3VeRB/3QN2\nDfD90kOSSs6Etro2sSAvm4tl3pLlqWueSNMVDoo0q3pB5QfX/tyv184uWJUqw+fp\nI4m3rlYVL7BSVt2WUUvDwuM=\n-----END PRIVATE KEY-----\n",
  "client_email": "firebase-adminsdk-h76ks@bursa-gold-dinar-uat.iam.gserviceaccount.com",
  "client_id": "110917717668665321905",
  "auth_uri": "https://accounts.google.com/o/oauth2/auth",
  "token_uri": "https://oauth2.googleapis.com/token",
  "auth_provider_x509_cert_url": "https://www.googleapis.com/oauth2/v1/certs",
  "client_x509_cert_url": "https://www.googleapis.com/robot/v1/metadata/x509/firebase-adminsdk-h76ks%40bursa-gold-dinar-uat.iam.gserviceaccount.com",
  "universe_domain": "googleapis.com"
}
