<svg xmlns="https://www.w3.org/2000/svg" width="25.714" height="24" viewBox="0 0 25.714 24">
  <g id="support-technology-svgrepo-com" transform="translate(-157 62)">
    <g id="Group_51202" data-name="Group 51202" transform="translate(157 -62)">
      <g id="Group_51201" data-name="Group 51201">
        <path id="Path_41126" data-name="Path 41126" d="M22.041,21.079a9.184,9.184,0,0,0-18.367-.023v.023A3.868,3.868,0,0,0,0,24.906v.453a3.873,3.873,0,0,0,3.9,3.849H4.11l1.63,2.558A6.161,6.161,0,0,0,11,34.642h.321a1.811,1.811,0,1,0,0-.906H11A5.255,5.255,0,0,1,6.52,31.268l-1.332-2.06H5.51a.915.915,0,0,0,.918-.906v-6.34a.915.915,0,0,0-.918-.906H4.592a8.266,8.266,0,0,1,16.531,0H20.2a.915.915,0,0,0-.918.906V28.3a.915.915,0,0,0,.918.906h1.607a3.873,3.873,0,0,0,3.9-3.849v-.453A3.868,3.868,0,0,0,22.041,21.079Zm-8.954,12.2a.906.906,0,1,1-.918.906A.915.915,0,0,1,13.087,33.283ZM5.51,21.962V28.3H3.9A2.958,2.958,0,0,1,.918,25.358v-.453A2.958,2.958,0,0,1,3.9,21.962Zm19.286,3.4A2.958,2.958,0,0,1,21.811,28.3H20.2v-6.34h1.607A2.958,2.958,0,0,1,24.8,24.906Z" transform="translate(0 -12)" fill="#333"/>
        <path id="Path_41127" data-name="Path 41127" d="M273.207,67.473a2.149,2.149,0,0,1-.186-.116,2.148,2.148,0,0,0-.186-.116.437.437,0,0,0-.628.163.456.456,0,0,0,.163.628,2.151,2.151,0,0,1,.186.116.942.942,0,0,0,.209.116.449.449,0,0,0,.232.07.431.431,0,0,0,.4-.232A.469.469,0,0,0,273.207,67.473Z" transform="translate(-256.536 -63.963)" fill="#333"/>
        <path id="Path_41128" data-name="Path 41128" d="M139.35,52a6.731,6.731,0,0,0-5.113,2.347.472.472,0,0,0,.046.651.49.49,0,0,0,.3.116.418.418,0,0,0,.349-.163,5.863,5.863,0,0,1,4.416-2.022,5.77,5.77,0,0,1,1.255.139.493.493,0,0,0,.558-.349.485.485,0,0,0-.349-.558A6.286,6.286,0,0,0,139.35,52Z" transform="translate(-126.464 -49.676)" fill="#333"/>
      </g>
    </g>
  </g>
</svg>
