<svg id="Group_71229" data-name="Group 71229" xmlns="https://www.w3.org/2000/svg" xmlns:xlink="https://www.w3.org/1999/xlink" width="20" height="20" viewBox="0 0 20 20">
  <defs>
    <clipPath id="clip-path">
      <rect id="Rectangle_21418" data-name="Rectangle 21418" width="20" height="20" fill="#0038ff"/>
    </clipPath>
  </defs>
  <g id="Group_71228" data-name="Group 71228">
    <g id="Group_71227" data-name="Group 71227">
      <g id="Group_71226" data-name="Group 71226" clip-path="url(#clip-path)">
        <path id="Path_56930" data-name="Path 56930" d="M10,20A10,10,0,1,1,20,10,10.011,10.011,0,0,1,10,20M10,2a8,8,0,1,0,8,8,8.009,8.009,0,0,0-8-8" transform="translate(0 0)" fill="#0038ff"/>
      </g>
    </g>
    <path id="attach_money_FILL0_wght400_GRAD0_opsz20" d="M9.25,17V15.333a3.712,3.712,0,0,1-1.823-.958,3.994,3.994,0,0,1-1.073-1.813L7.9,11.938a2.493,2.493,0,0,0,.844,1.343,2.117,2.117,0,0,0,1.406.594,2.067,2.067,0,0,0,1.333-.417A1.321,1.321,0,0,0,12,12.375a1.337,1.337,0,0,0-.469-1.042A5.222,5.222,0,0,0,9.875,10.5,6.991,6.991,0,0,1,7.5,9.219a2.35,2.35,0,0,1-.75-1.8,2.583,2.583,0,0,1,.677-1.792A3.225,3.225,0,0,1,9.25,4.646V3h1.5V4.646a2.646,2.646,0,0,1,2.01,1.146q.511.9.532.937l-1.459.6a1.686,1.686,0,0,0-.666-.895,1.866,1.866,0,0,0-1.1-.355,1.9,1.9,0,0,0-1.208.375A1.1,1.1,0,0,0,8.9,8.3a7.747,7.747,0,0,0,1.937.865,4.677,4.677,0,0,1,2.125,1.25,2.885,2.885,0,0,1,.667,1.958,2.8,2.8,0,0,1-.771,2,3.553,3.553,0,0,1-2.1,1.021V17Z" transform="translate(0.011)" fill="#0038ff"/>
  </g>
</svg>
