<svg id="Group_71389" data-name="Group 71389" xmlns="https://www.w3.org/2000/svg" width="36" height="36" viewBox="0 0 36 36">
  <rect id="Rectangle" width="36" height="36" rx="10" fill="#f3f6fd"/>
  <g id="Group_74032" data-name="Group 74032" transform="translate(8 8)">
    <g id="Rectangle_22701" data-name="Rectangle 22701" fill="#fff" stroke="#707070" stroke-width="1" opacity="0.004">
      <rect width="20" height="20" stroke="none"/>
      <rect x="0.5" y="0.5" width="19" height="19" fill="none"/>
    </g>
    <path id="password_FILL1_wght500_GRAD0_opsz20" d="M43.6,344.527v-1.9H61.4v1.9Zm1.043-5.46-1.494-.867.646-1.116H42.5v-1.733h1.293l-.646-1.116,1.494-.867.646,1.121.646-1.121,1.488.867-.646,1.116h1.293v1.733H46.775l.646,1.116-1.488.867-.646-1.121Zm7.213,0L50.36,338.2l.646-1.116H49.713v-1.733h1.293l-.646-1.116,1.494-.867.646,1.121.646-1.121,1.494.867-.646,1.116h1.293v1.733H53.994l.646,1.116-1.494.867-.646-1.121Zm7.213,0-1.488-.867.646-1.116H56.932v-1.733h1.293l-.646-1.116,1.488-.867.646,1.121.646-1.121,1.494.867-.646,1.116H62.5v1.733H61.207l.646,1.116-1.494.867-.646-1.121-.646,1.121Z" transform="translate(-42.5 -328.949)" fill="#0038ff"/>
  </g>
</svg>
