<svg xmlns="https://www.w3.org/2000/svg" xmlns:xlink="https://www.w3.org/1999/xlink" width="190" height="190" viewBox="0 0 190 190">
  <defs>
    <clipPath id="clip-path">
      <rect id="Rectangle_23284" data-name="Rectangle 23284" width="165.22" height="156.604" fill="none"/>
    </clipPath>
    <clipPath id="clip-path-2">
      <rect id="Rectangle_23277" data-name="Rectangle 23277" width="165.213" height="108.344" fill="none"/>
    </clipPath>
    <clipPath id="clip-path-4">
      <rect id="Rectangle_23278" data-name="Rectangle 23278" width="80.644" height="101.086" fill="none"/>
    </clipPath>
  </defs>
  <g id="BGD_Transfer_Icon" data-name="BGD Transfer Icon" transform="translate(-95 -120)">
    <g id="Rectangle_19192" data-name="Rectangle 19192" transform="translate(95 120)" fill="#fff" stroke="#707070" stroke-width="1" opacity="0">
      <rect width="190" height="190" stroke="none"/>
      <rect x="0.5" y="0.5" width="189" height="189" fill="none"/>
    </g>
    <g id="Paper" transform="translate(106.891 136.698)">
      <g id="Group_77352" data-name="Group 77352" clip-path="url(#clip-path)">
        <path id="Path_59160" data-name="Path 59160" d="M29,61.862l.917,81.68L154.454,35.2Z" transform="translate(10.761 13.062)" fill="#14145d"/>
        <g id="Group_77346" data-name="Group 77346" transform="translate(0 48.259)">
          <g id="Group_77345" data-name="Group 77345" clip-path="url(#clip-path-2)">
            <path id="Path_59161" data-name="Path 59161" d="M40.326,87.828C40.959,87.51,165.219,35.2,165.219,35.2L0,57.242Z" transform="translate(0 -35.197)" fill="#1437f4"/>
            <path id="Path_59162" data-name="Path 59162" d="M43.01,82.082,29.67,127.366,86.88,78.774Z" transform="translate(11.011 -19.025)" fill="#ff873b"/>
          </g>
        </g>
        <g id="Group_77351" data-name="Group 77351" transform="translate(0 0)">
          <g id="Group_77350" data-name="Group 77350" clip-path="url(#clip-path)">
            <path id="Path_59163" data-name="Path 59163" d="M121.13,53.013c0,29.22-19.962,52.906-44.587,52.906S31.954,82.232,31.954,53.013,51.917.107,76.542.107,121.13,23.793,121.13,53.013" transform="translate(11.858 0.04)" fill="#f5b95a"/>
            <path id="Path_59164" data-name="Path 59164" d="M121.077,52.98c0,29.259-19.172,52.98-42.821,52.98S35.435,82.239,35.435,52.98,54.606,0,78.255,0s42.821,23.72,42.822,52.98" transform="translate(13.15 0)" fill="#f3d26d"/>
            <g id="Group_77349" data-name="Group 77349" transform="translate(52.052 2.405)" opacity="0.8">
              <g id="Group_77348" data-name="Group 77348">
                <g id="Group_77347" data-name="Group 77347" clip-path="url(#clip-path-4)">
                  <path id="Path_59165" data-name="Path 59165" d="M78.286,102.84c-22.234,0-40.322-22.674-40.322-50.543S56.052,1.754,78.286,1.754,118.607,24.428,118.607,52.3,100.519,102.84,78.286,102.84m0-99.451C56.771,3.39,39.268,25.33,39.268,52.3S56.771,101.2,78.286,101.2,117.3,79.266,117.3,52.3,99.8,3.39,78.286,3.39" transform="translate(-37.963 -1.754)" fill="#dea442"/>
                </g>
              </g>
            </g>
            <path id="Path_59166" data-name="Path 59166" d="M70.039,71.978c.317.2.458.175.692-.108a2.712,2.712,0,0,1,3.037-1.021,15.181,15.181,0,0,1,2,.934c.66-3.265,2.409-4.364,4.086-4.176.687-2.931,2.463-3.616,4.629-3.439-.514-2.493-.118-4.974,2.02-6.232a5.056,5.056,0,0,1,2.822-5.7c-.106-.16-.195-.292-.28-.426a5.7,5.7,0,0,1-.328-6.066.63.63,0,0,0-.051-.463,5.234,5.234,0,0,1-.372-4.595c.237-.658.584-1.253.888-1.892a4.937,4.937,0,0,1-2.3-2.085,5.128,5.128,0,0,1-.529-3.532,3.984,3.984,0,0,1-2.064-2.539,7.578,7.578,0,0,1-.081-3.649c-2.242.34-3.971-.614-4.695-3.284a.671.671,0,0,0-.181-.018c-1.622.24-3.143-1.274-3.629-3.111-.1-.369-.219-.729-.295-.971a13.279,13.279,0,0,1-2.161,1.019A2.835,2.835,0,0,1,70.2,19.449a.3.3,0,0,0-.341-.059,2.7,2.7,0,0,1-2.7.527v.55a1.286,1.286,0,0,1,.968.513,2.7,2.7,0,0,0,1.628,1.2,2.742,2.742,0,0,0,1.537-.5c.494-.28.943-.625,1.626-.346a13.977,13.977,0,0,1-1.405,1.219,13.828,13.828,0,0,1-1.7.842.269.269,0,0,1-.248,0,9.1,9.1,0,0,1-2.4-2.5v.776a8.922,8.922,0,0,0,1.9,1.854,1.173,1.173,0,0,0,1.423.078,4.879,4.879,0,0,0,2.383-1.681c.594-.961,1.553-.942,2.231-1.677.313.75.6,1.4.858,2.069a1.228,1.228,0,0,1,.053.463,7.289,7.289,0,0,0,.875,3.579,3.126,3.126,0,0,1,.14.341,1.545,1.545,0,0,0,1.271,1.085,4.846,4.846,0,0,0,3.418-.335.286.286,0,0,1,.145-.055c.61.073,1.218.149,1.818.223-.01.747.029,1.5-.041,2.229a6.414,6.414,0,0,1-.4,1.322,10.894,10.894,0,0,0-.186,3.989.569.569,0,0,0,.159.359,20.732,20.732,0,0,0,2,1.695,5.642,5.642,0,0,0,1.489.5,1.071,1.071,0,0,1,.361.123c.5.4.99.814,1.473,1.215-.28.666-.564,1.357-.865,2.036-.049.112-.173.173-.261.256a5.956,5.956,0,0,0-1.68,2.585,4.077,4.077,0,0,1-.269.743,2.186,2.186,0,0,0,.129,2.176,21.059,21.059,0,0,0,1.085,2.042c.333.517.812.886,1.141,1.407a15.421,15.421,0,0,1,.819,1.726,17.939,17.939,0,0,1-1.431,1.242,2.25,2.25,0,0,1-.943.284,4.985,4.985,0,0,0-2.176,1.367,2.537,2.537,0,0,0-.957,2.251,8,8,0,0,0,.414,3.152,8.378,8.378,0,0,1,.384,2.748c.025.182.026.369.036.513-.572.089-1.113.186-1.659.255a.815.815,0,0,1-.48-.075,4.878,4.878,0,0,0-3.082-.28c-.939.106-1.307.832-1.7,1.725a8.026,8.026,0,0,0-.7,3.565.854.854,0,0,1-.06.315c-.255.661-.518,1.318-.771,1.955a14.779,14.779,0,0,1-1.684-.806c-.288-.181-.479-.6-.728-.883a6.215,6.215,0,0,0-3.055-1.71c-.121-.04-.295.1-.425.2a5.881,5.881,0,0,0-2.4,2.643c-.012.036-.026.07-.04.1V71.8a2.677,2.677,0,0,1,2.878.178m1.179-50.715a11.705,11.705,0,0,1-1.167.444.6.6,0,0,1-.469-.084c-.411-.27-.8-.583-1.2-.879.007-.058.012-.117.019-.173.31-.107.621-.211.931-.314.073-.026.169-.014.218-.07.337-.392.592-.1.876.129.315.252.655.457,1.031.713-.11.11-.166.2-.237.233m6.37,2.624c.215.062.4.1.587.17a4.673,4.673,0,0,1,1.649,1.427c.1.171.184.363.282.562-1.142.308-2.249-.629-2.519-2.159m6.9,8.294c.155.156.282.289.414.417.318.309.75.537.924.942a4.758,4.758,0,0,1,.1,1.473c.008.185.014.37.022.561-1.076-.271-1.7-1.7-1.464-3.392m3.255,14.946c-.041.117-.1.222-.163.37a3.492,3.492,0,0,1-.023-3.888c.053.143.1.263.144.385.144.389.284.782.435,1.167a.866.866,0,0,1,.032.743c-.174.385-.282.816-.424,1.223M86.115,55.5a7.144,7.144,0,0,0-.077,1.093,1.641,1.641,0,0,1-.7,1.692,4.123,4.123,0,0,0-.654.743c-.221-1.784.2-2.827,1.431-3.528m-5.731,9.72q-.411.872-.825,1.741a.212.212,0,0,1-.114.106c-.462.125-.928.247-1.394.361-.052.014-.115-.026-.174-.043.373-1.6,1.393-2.472,2.508-2.165M70.206,69.8a2.33,2.33,0,0,1,1.586.588c-.48.385-.9.723-1.318,1.052-.06.047-.151.1-.21.074-.492-.184-.979-.383-1.468-.576-.023-.056-.047-.112-.071-.169.491-.34.96-.867,1.481-.969" transform="translate(24.921 7.184)" fill="#dea442"/>
            <path id="Path_59167" data-name="Path 59167" d="M102.979,49.743a4.516,4.516,0,0,0-1.462-2.065c-.276-.181-.6-.254-.882-.411a.806.806,0,0,1-.4-.37,10.083,10.083,0,0,0-3.886-5.472c.25-.64.518-1.268.747-1.917a13.619,13.619,0,0,0,.575-5.266.867.867,0,0,1,.129-.532,4.848,4.848,0,0,0,1.117-4.03c0-.022.026-.049.04-.074l-.029-.09c-.051-.045-.1-.089-.151-.14a2.857,2.857,0,0,0-3.044-1.061c-.376.122-.583-.044-.847-.281a12.973,12.973,0,0,0-1.431-1.159,5.987,5.987,0,0,0-3.8-1.167.529.529,0,0,1-.048-.165,12.364,12.364,0,0,0-1.445-7.037.784.784,0,0,1-.052-.513,5.238,5.238,0,0,0-.27-3.81c-.13-.319-.292-.6-.628-.658a2.991,2.991,0,0,0-3,.982.642.642,0,0,1-.485.223c-.5-.048-1-.208-1.5-.237a6.261,6.261,0,0,0-4.3,1.2c-.178-.451-.34-.9-.529-1.334a9.766,9.766,0,0,0-3.365-4.109.786.786,0,0,1-.291-.489,4.383,4.383,0,0,0-1.941-3.418.54.54,0,0,0-.465-.005,3.737,3.737,0,0,0-2.373,2.755.585.585,0,0,1-.3.372,6.464,6.464,0,0,0-1.5.654v.6a7.064,7.064,0,0,1,2.915-1.06c-.036.363.033.629-.367.709a6.971,6.971,0,0,0-2.548,1.049v.64a5.037,5.037,0,0,1,1.521-.838c.215-.069.292.023.372.252.551,1.6,2.017,2.338,3.274,1.584a5.975,5.975,0,0,0,.926-.991c.093-.1.274-.211.348-.16a9.536,9.536,0,0,1,2.461,2.8A.977.977,0,0,0,75,15.526a1.219,1.219,0,0,0,.444,1.319,1.922,1.922,0,0,1-1.924.7.45.45,0,0,1-.138-.256,6.359,6.359,0,0,0-2.261-3.328.263.263,0,0,0-.236-.066,5,5,0,0,0-2.569,2.08c-.472.808-.513.876-1.153.6v.5c.032.01.064.018.1.026a18.4,18.4,0,0,1,2.3.739,5.611,5.611,0,0,1,1.021.707,4.264,4.264,0,0,1,2.591-.522,7.5,7.5,0,0,0,1.538-.093c.732-.128,1.135-.831,1.452-1.573.178-.417-.082-.724-.491-.657,0,.023-.014.052-.007.069.066.154.136.3.2.454-.084.036-.21.134-.245.1-.111-.118-.278-.307-.261-.431.032-.219.149-.521.292-.587a.6.6,0,0,1,.61.085,1.732,1.732,0,0,1,.162,1.862,2.866,2.866,0,0,1-2.907,1.589c-.485-.021-.969-.117-1.455-.178-.005.023-.011.045-.018.069a4.291,4.291,0,0,1,.909.443,3.972,3.972,0,0,1,1.175,3.132,6.92,6.92,0,0,1-.084,1.226c-.071.491-.3.662-.651.638a20.835,20.835,0,0,0,.125-2.18c-.067-1.478-.957-2.628-2.024-2.683a1.855,1.855,0,0,0-.792.245c-.191.088-.313.121-.494-.081-.788-.878-2.1-.579-2.787.6a4.223,4.223,0,0,0-.267.548l0,3.239a2.088,2.088,0,0,0,.407.022.813.813,0,0,0,.836-.7,1.007,1.007,0,0,1,.207-.292c.084.152.241.309.236.455a1.144,1.144,0,0,1-.8.963,2.718,2.718,0,0,1-.392.126c0,.041.011.08.018.121.132-.03.266-.056.4-.092a3.469,3.469,0,0,0,1.785-.98c.215-.243.328-.2.491.095a4.068,4.068,0,0,0,1.946,1.588,7.253,7.253,0,0,1-.836-.9,1.254,1.254,0,0,1-.074-.746c.016-.107.243-.166.292-.2a3.29,3.29,0,0,0,.417,1.023,1.579,1.579,0,0,0,1.567.28,3.761,3.761,0,0,0,2-1.335c.14.579.239,1.182.431,1.737a3.088,3.088,0,0,0,1.521,1.936.6.6,0,0,0,.851-.241c.051-.075.226-.134.239-.112a.746.746,0,0,1,.121.4.619.619,0,0,1-.673.548,5.221,5.221,0,0,0-.879,0c.278.089.555.2.838.263a4.364,4.364,0,0,0,.9.136,7.847,7.847,0,0,0,.964-.1,6.282,6.282,0,0,0,1.191,3.066,10.1,10.1,0,0,1-.394-1.356,1.64,1.64,0,0,1,.185-.769c.025-.06.221-.008.339-.008a1.162,1.162,0,0,1-.014.348,1.071,1.071,0,0,0,.151,1.087,2.612,2.612,0,0,0,2.6,1.046,7.273,7.273,0,0,0,.731-.132,21.408,21.408,0,0,0-.166,2.472,5.048,5.048,0,0,0,.446,1.637c.237.574.511.638,1.234.476.152.468-.037.791-.479.71a2.3,2.3,0,0,1-.75-.413c-.115-.077-.206-.215-.361-.261a1.887,1.887,0,0,0,.193.313,4.346,4.346,0,0,0,1.852,1.437c.232.06.2.25.136.481a6.263,6.263,0,0,0,.077,2.955,7.8,7.8,0,0,1,.053-1.22,1.17,1.17,0,0,1,.406-.636c.089-.071.3.1.409.145a3.72,3.72,0,0,0-.463,1.05,2.464,2.464,0,0,0,.624,1.663,3.937,3.937,0,0,0,1.851,1.34,1.309,1.309,0,0,1,.165.084,17.868,17.868,0,0,0-1.061,2.118,5.313,5.313,0,0,0-.2,1.767c.007.662.213.835.9,1.028,0,.494-.2.7-.524.47a2.37,2.37,0,0,1-.568-.714,3.007,3.007,0,0,1-.2-.633l-.134.067a13.753,13.753,0,0,0,.461,1.462,6.517,6.517,0,0,0,.713,1.212c.189.261.069.4-.06.554a5.333,5.333,0,0,0-.994,2.659c.126-.3.234-.618.385-.9a1.153,1.153,0,0,1,.359-.4c.344-.237.547-.085.6.428-.776.2-1.083.987-.869,2.08a5.591,5.591,0,0,0,1.3,2.648,22.256,22.256,0,0,0-1.887,1.5,2.333,2.333,0,0,0-.7,1.771,2.181,2.181,0,0,0,.276.712c.053.129.121.245.181.369-.17.027-.387.155-.5.067a1.252,1.252,0,0,1-.37-1.116c.01-.211.025-.424.041-.736-.081.123-.13.163-.133.208a6.818,6.818,0,0,0,.062,2.812c.09.258.095.431-.16.561a5.846,5.846,0,0,0-1.094.687,10.834,10.834,0,0,0-.93.987l.071.108a3.068,3.068,0,0,1,.587-.553,1.438,1.438,0,0,1,.755-.144c.16.011.336.166.269.47-.077.355-.221.158-.374.1-.329-.121-.594.052-.8.374a4.2,4.2,0,0,0-.557,2.694c.053.548.178,1.089.266,1.6-.517-.012-1.076-.055-1.634-.034a2.066,2.066,0,0,0-1.422.68c-.559.574-.614.8-.343,1.795-.151.018-.325.11-.411.036a.7.7,0,0,1-.217-.492c.075-.511.214-1.006.337-1.552-.111.186-.232.362-.325.558a5.445,5.445,0,0,0-.753,2.166c-.012.266-.13.335-.344.269a4.109,4.109,0,0,0-2.191.252.356.356,0,0,0-.132.089c-.014.012-.012.052-.021.1a4.911,4.911,0,0,1,.8-.1.655.655,0,0,1,.729.585.491.491,0,0,1-.084.324c-.033.045-.165.038-.218-.01-.573-.517-.868-.5-1.456.082a5.407,5.407,0,0,0-1.314,3.285,14.075,14.075,0,0,0-1.382-.987,2.018,2.018,0,0,0-2.127-.03.879.879,0,0,0-.4.75,1.789,1.789,0,0,1-.122.391c-.122-.148-.333-.287-.343-.446a1.222,1.222,0,0,1,.544-1.054,2.267,2.267,0,0,0,.38-.365,4.174,4.174,0,0,0-2.106,1.954,3.873,3.873,0,0,0-2.517-1.182,5.232,5.232,0,0,1,.749.388,1.339,1.339,0,0,1,.425.513c.167.377.06.583-.329.7a2.921,2.921,0,0,0-.159-.594.79.79,0,0,0-.847-.4,2.229,2.229,0,0,0-.694.137v.52L67.244,78a4.68,4.68,0,0,0,.81,3.433,1.736,1.736,0,0,0,2.184.649,4.422,4.422,0,0,0,.651-.572c1.327,1.1,2.984-.293,3.056-2.537a15.591,15.591,0,0,0-.188-2.032c.491.005.632.1.723.868a5.694,5.694,0,0,1-.469,3.395,2.091,2.091,0,0,1-1.485,1.152c.011.044.022.085.032.128.446-.069.891-.162,1.34-.2A2.869,2.869,0,0,1,76.714,83.5a1.87,1.87,0,0,1,.138,2.091c-.185.284-.436.41-.665.228a1.079,1.079,0,0,1-.328-.683c-.027-.362.2-.47.546-.365-.067.211-.13.406-.221.691.154-.074.35-.095.4-.213a.937.937,0,0,0,.043-.614,2.238,2.238,0,0,0-2.223-1.581c-.849.032-1.7-.044-2.546-.071-.012,0-.027,0-.037,0-.59-.42-1.075-.1-1.621.24a7.2,7.2,0,0,1-1.851.745,4.919,4.919,0,0,0-1.185.463v.529a2.229,2.229,0,0,1,1.138-.437c.071,0,.156.141.206.241a5.215,5.215,0,0,0,2.346,2.306.854.854,0,0,0,1.189-.2,6.183,6.183,0,0,0,1.774-2.959c.067-.266.18-.361.415-.369a1.908,1.908,0,0,1,1.729.694,1.126,1.126,0,0,0-.476,1.309,1.093,1.093,0,0,0,1.071.854,9.714,9.714,0,0,1-2.421,2.859c-.06.043-.245-.048-.295-.141a2.116,2.116,0,0,0-2.815-1.085,2.233,2.233,0,0,0-1.385,1.57c-.154.47-.244.58-.638.344-.624-.373-1.231-.783-1.836-1.2v.7a7.831,7.831,0,0,0,3.437,1.479c.022.16.048.343.086.628a7.1,7.1,0,0,1-3.524-1.411v.642a8.158,8.158,0,0,0,1.26.669,2,2,0,0,1,1.441,1.536c.012.056.063.1.09.149a3.717,3.717,0,0,0,2.31,1.819l.144-.07c.314-.306.649-.585.939-.924a4.111,4.111,0,0,0,.938-2.43.9.9,0,0,1,.366-.717,9.765,9.765,0,0,0,3.658-5.2c.027-.088.066-.17.106-.269a6.65,6.65,0,0,0,5.586.884.751.751,0,0,1,.838.269,2.866,2.866,0,0,0,3.073.747.564.564,0,0,0,.278-.292,5.214,5.214,0,0,0,.4-4.09,1.191,1.191,0,0,1,.1-.725,12.868,12.868,0,0,0,1.315-6.543c-.012-.154-.038-.3-.056-.45.536-.095,1.053-.188,1.57-.276a6.818,6.818,0,0,0,3.007-1.61c.306-.244.568-.57.871-.816a.572.572,0,0,1,.473-.136,2.947,2.947,0,0,0,3.042-.953,1.3,1.3,0,0,0,.31-.753,4.6,4.6,0,0,0-1.108-3.613.961.961,0,0,1-.233-.8,12.232,12.232,0,0,0-1.334-6.692,2.75,2.75,0,0,1-.117-.295,9.8,9.8,0,0,0,3.779-5.391.854.854,0,0,1,.583-.6,3.758,3.758,0,0,0,2.19-2.506,1.192,1.192,0,0,0-.012-.956M70.9,17.869c-.241.174-.385.09-.576-.063-.252-.2-.521-.372-.886-.625.441-.45.851-.864,1.263-1.282a2.9,2.9,0,0,1,1.024,1.669,2.937,2.937,0,0,0-.825.3m.441,67.283a.211.211,0,0,1-.24,0c-.387-.333-.764-.686-1.113-1.006.7-.969,1.43-1.043,2.239-.452a3.465,3.465,0,0,1-.886,1.463M89.534,29.381c.025-.148.064-.291.1-.462.351.4.734.485,1.02.262.477-.374.584-.8.383-1.722a16.656,16.656,0,0,1,1.63.773,13.126,13.126,0,0,1,1.286,1,.378.378,0,0,1,.08.574,3.277,3.277,0,0,0-.016,3.181c.413.934,1.034,1.551,1.954,1.5.181-.011.372.022.388.329A13.482,13.482,0,0,1,95.9,38.9c-.392-.627-.769-.8-1.189-.617-.394.174-.6.625-.564,1.372-.317-.233-.585-.411-.836-.624a2.128,2.128,0,0,1-.341-.432c-.472-.691-.483-.7-.071-1.448a7.9,7.9,0,0,0,.684-3.84.462.462,0,0,0-.149-.3,5.244,5.244,0,0,0-2.323-1.348,4.358,4.358,0,0,0-.935-.045c-.219.011-.311-.089-.388-.335a4.107,4.107,0,0,1-.254-1.9m2.52,4.958a3.161,3.161,0,0,1-.459,1.707c-.282-.277-.564-.537-.827-.823a.619.619,0,0,1-.136-.343c-.038-.42-.055-.843-.081-1.3a1.966,1.966,0,0,1,1.44.528.326.326,0,0,1,.063.229M76.406,24.615l-.133-.029c-.1-.8-.2-1.593-.291-2.312-.441.47-.927.984-1.411,1.5l-.119-.1a6.457,6.457,0,0,0-.7-4.335,3.173,3.173,0,0,0,3.133-1.968l.09.1c0,.45-.007.9-.011,1.412.271-.4.51-.753.75-1.1l.1-.023a4.656,4.656,0,0,0,1.371,4.089c-1.37.3-2.116,1.471-2.785,2.761m7.065-.919c-.384-.08-.779-.144-1.164-.254-.077-.022-.119-.222-.178-.337-.162-.317-.326-.633-.562-1.1.511-.1.963-.193,1.418-.258a.3.3,0,0,1,.251.174,3.106,3.106,0,0,1,.236,1.77m-.132-3.838a3.669,3.669,0,0,0-2.755.769.347.347,0,0,1-.381,0,2.991,2.991,0,0,1-1.058-1.987c.244-.043.5-.005.683-.141a1.592,1.592,0,0,0,.392-.677,1.311,1.311,0,0,0-.392-1.352c.189-.052.332-.1.476-.129a6.537,6.537,0,0,1,2.67-.067c.247.051.389.143.352.52a3.012,3.012,0,0,0,1.425,2.96,1.668,1.668,0,0,0,2.127-.047.269.269,0,0,1,.3.078,4.506,4.506,0,0,1,.415.843c.173.483.329.978.455,1.484s.2,1.011.3,1.585a.848.848,0,0,0-1.344.285.993.993,0,0,0,.048,1.259.982.982,0,0,1-1,.093,3.134,3.134,0,0,1-.5-.207c-.606-.329-.606-.333-.524-1.17a7.74,7.74,0,0,0-.536-3.221,1.084,1.084,0,0,0-1.154-.878m5.172,12.033A3.572,3.572,0,0,0,85,32.7c-.034-.048-.069-.1-.1-.144.215-.772.429-1.544.609-2.194l-1.8.553c-.012-.044-.026-.088-.038-.132.273-.67.579-1.324.808-2.02a4.066,4.066,0,0,0,.129-2.175,7.219,7.219,0,0,0,1.747.533,6.76,6.76,0,0,0,1.744-.372c-.125.332-.276.735-.446,1.185l.989-.48.092.049a5.064,5.064,0,0,0-.215,4.388m1.015,12.931,1.39-1.695c-.573-.186-1.2-.391-1.824-.594l-.012-.149A4.915,4.915,0,0,0,91.534,39.3a9.86,9.86,0,0,0,1.34,1.452,7.771,7.771,0,0,0,1.68.712l-.857.772,1.127.163a4.591,4.591,0,0,0-1.8,3.625,10.859,10.859,0,0,0-1.647-.915,9.809,9.809,0,0,0-1.85-.288M94.2,48.94c.554.214.8.81,1.127,1.3a.228.228,0,0,1-.008.177,3.117,3.117,0,0,1-1.069,1.318c-.141-.361-.273-.692-.4-1.026a.727.727,0,0,1,.007-.7A5.957,5.957,0,0,0,94.2,48.94M78.494,80.977a13.718,13.718,0,0,0-.355,2.175c-.207-.28-.451-.613-.71-.965,0,.465,0,.919.007,1.372l-.077.084a3.147,3.147,0,0,0-3.173-1.855,6.357,6.357,0,0,0,.657-4.393c.034-.03.07-.059.1-.09.5.528,1,1.053,1.444,1.515.078-.72.165-1.527.251-2.334.037-.014.074-.03.111-.045.723,1.231,1.452,2.447,2.731,2.663a12.034,12.034,0,0,0-.99,1.874m9.819-1.765c-.133.511-.35.99-.511,1.49-.138.421-.3.532-.668.311a1.854,1.854,0,0,0-2.424.485,2.927,2.927,0,0,0-.9,2.567c.06.473-.136.562-.37.59a13.391,13.391,0,0,1-1.722.085,13.181,13.181,0,0,1-1.377-.171,1.578,1.578,0,0,0,.326-1.585c-.266-.566-.477-.679-1.063-.544a2.739,2.739,0,0,1,.614-1.63c.431-.585.6-.66,1.123-.252a3.675,3.675,0,0,0,2.578.494c.539-.018.808-.335,1-.9a6.91,6.91,0,0,0,.465-3.509.662.662,0,0,1,.284-.765,1.738,1.738,0,0,1,1.737-.346,1.121,1.121,0,0,0,.066,1.412c.344.452.749.5,1.3.092-.16.783-.278,1.489-.457,2.172m.668-5.871c-.351-.176-.7-.354-1.075-.539.2.452.38.871.564,1.29-.018.033-.034.067-.053.1-1.16-.85-2.291-.57-3.477.175a6.084,6.084,0,0,0-1.059-4.233c.018-.045.034-.09.051-.136l1.917.5c-.221-.723-.451-1.477-.68-2.232l.063-.123a3.527,3.527,0,0,0,3.5.769,5.172,5.172,0,0,0,.318,4.335c-.025.032-.048.064-.073.1m.234-15.085,1.813-.661L89.66,56.046c.012-.063.026-.126.04-.188a3.644,3.644,0,0,0,3.362-1.4,4.307,4.307,0,0,0,1.9,3.688c-.01.04-.021.08-.029.119l-1.105.171c.335.3.633.558.931.821a3.552,3.552,0,0,0-3.01,2.279A5,5,0,0,0,89.2,58.406c0-.049.01-.1.012-.149m3.077,8.227a.248.248,0,0,1-.088.182c-.45.217-.9.418-1.407.649.018-.618.022-1.057.048-1.495a.538.538,0,0,1,.129-.3c.265-.288.539-.558.839-.865a4.167,4.167,0,0,1,.479,1.826m4.289-1.61a2.421,2.421,0,0,1,0,.33c.011.836.007.8-.654.941a2.682,2.682,0,0,0-1.872,2.129,3.241,3.241,0,0,0,.24,2.539c.171.324.117.517-.086.669-.614.459-1.238.9-1.87,1.322a8.911,8.911,0,0,1-.984.487A1.41,1.41,0,0,0,91,71.6c-.351-.285-.7-.192-1.005.186a2.338,2.338,0,0,1-.122-1.58,2.423,2.423,0,0,1,.163-.68c.089-.17.278-.377.414-.369a4.545,4.545,0,0,0,3.2-1.452.683.683,0,0,0,.162-.443,8.216,8.216,0,0,0-.465-3.147c-.141-.35-.336-.666-.489-1.008a.577.577,0,0,1-.053-.373,2.466,2.466,0,0,1,1.5-1.61c-.007.679.149,1.016.553,1.208.463.221.775.078,1.285-.683.158,1.146.3,2.181.44,3.218m2.312-11.5a9.864,9.864,0,0,1-1.874,3.35c-.2-.808-.52-1.182-.979-1.178s-.66.2-.793.775a1.907,1.907,0,0,1-.649-1.045,3.837,3.837,0,0,1-.138-.694c-.1-.576-.053-.747.507-1.111a6.008,6.008,0,0,0,1.87-2.59,1.25,1.25,0,0,0-.037-1.23,5.386,5.386,0,0,0-2.177-2.675.472.472,0,0,1-.217-.321,3.638,3.638,0,0,1,.52-2.138c.045-.077.147-.1.222-.148.241.562.525.777.9.7.518-.11.728-.391.882-1.29.457.679.9,1.271,1.278,1.92a11.024,11.024,0,0,1,.62,1.411.374.374,0,0,1-.156.527c-1.123.782-1.311,2.027-1.08,3.469a2.444,2.444,0,0,0,1.179,1.872.5.5,0,0,1,.126.4" transform="translate(24.922 2.332)" fill="#dea442"/>
            <path id="Path_59168" data-name="Path 59168" d="M69.613,64.084a4.786,4.786,0,0,1-1.366,1.844,3.849,3.849,0,0,1-1.017.591v.269a4.374,4.374,0,0,0,2.361-2.04c.023-.04.052-.075.082-.119a3.88,3.88,0,0,0,2.779,1.383.452.452,0,0,1,.4.278,1.693,1.693,0,0,0,1.5.9.261.261,0,0,0,.174-.1,2.59,2.59,0,0,0,.636-2.035.577.577,0,0,1,.129-.356,6.186,6.186,0,0,0,1.362-3.144c.01-.08.012-.163.019-.24.285.041.559.08.834.121a3.248,3.248,0,0,0,1.715-.328c.182-.074.352-.2.533-.273a.284.284,0,0,1,.258.008,1.5,1.5,0,0,0,1.663.018.6.6,0,0,0,.237-.336,2.6,2.6,0,0,0-.191-2.042.543.543,0,0,1-.036-.448,6.688,6.688,0,0,0,.016-3.662,1.317,1.317,0,0,1-.027-.171,4.408,4.408,0,0,0,2.506-2.14.389.389,0,0,1,.362-.213,1.7,1.7,0,0,0,1.389-.923.618.618,0,0,0,.093-.494A2.768,2.768,0,0,0,85.5,49.12c-.123-.138-.28-.229-.411-.358a.512.512,0,0,1-.166-.256,6.185,6.185,0,0,0-1.423-3.461c.2-.287.4-.565.584-.861a6.7,6.7,0,0,0,.849-2.609.407.407,0,0,1,.122-.252,2.3,2.3,0,0,0,1-1.884c0-.012.019-.022.029-.032s0-.034-.005-.052c-.022-.033-.044-.063-.063-.1a1.719,1.719,0,0,0-1.453-1.052c-.206,0-.295-.121-.406-.287a8.127,8.127,0,0,0-.614-.834A3.622,3.622,0,0,0,81.7,35.854a.306.306,0,0,1-.007-.093,6.788,6.788,0,0,0-.005-3.857.417.417,0,0,1,.027-.273,2.754,2.754,0,0,0,.261-2,.552.552,0,0,0-.254-.441,1.513,1.513,0,0,0-1.645,0,.313.313,0,0,1-.273.034c-.252-.108-.489-.273-.743-.373a3.206,3.206,0,0,0-2.335-.1c-.045-.262-.081-.52-.133-.775A6.056,6.056,0,0,0,75.3,25.3a.472.472,0,0,1-.1-.3,2.625,2.625,0,0,0-.64-2.08.3.3,0,0,0-.237-.08,1.694,1.694,0,0,0-1.508,1.02.268.268,0,0,1-.193.141,3.451,3.451,0,0,0-1.9.533,11.549,11.549,0,0,0-1.043.8c.014.011,0,.005-.008-.008a4.424,4.424,0,0,0-2.42-2.136l-.025-.01v.287a4.335,4.335,0,0,1,2.425,2.447,3.614,3.614,0,0,1,3.683-1.577c-.056.182-.049.329-.265.3a3.484,3.484,0,0,0-3.03,1.139,6.747,6.747,0,0,0-.426.535,4.226,4.226,0,0,0-2.387-2.486v.277c.022.01.048.021.075.034a4.737,4.737,0,0,1,1.329.972,1.249,1.249,0,0,0-.324.266.952.952,0,0,0-.115.439.493.493,0,0,0,.363.531,1.147,1.147,0,0,1-.93.66A.2.2,0,0,1,67.5,26.9a2.459,2.459,0,0,0-.285-.474v.44a1.739,1.739,0,0,1,.095.218l-.1.033v.277c.03-.01.062-.018.092-.026a5.292,5.292,0,0,0,.893-.289,1.393,1.393,0,0,0,.669-1.116.206.206,0,0,0-.3-.233l.145.254c-.018.03-.036.062-.055.092-.082-.04-.233-.075-.236-.123a.726.726,0,0,1,.081-.426.3.3,0,0,1,.324-.052.859.859,0,0,1,.267.891,1.638,1.638,0,0,1-.984,1.191,3.7,3.7,0,0,1-.687.171c-.069.016-.137.033-.2.051s-.136.038-.2.062a1.2,1.2,0,0,1,.2.019c.692.117,1.005.784,1.159,1.457a6.677,6.677,0,0,1,.08.768c.03.295-.152.322-.328.441a2.869,2.869,0,0,0-.132-1.4,1.35,1.35,0,0,0-.779-.867v.274a2.066,2.066,0,0,1,.2.13,3.689,3.689,0,0,1-.178.51.544.544,0,0,1-.027.048v.469a2.984,2.984,0,0,0,.383-.846,2.134,2.134,0,0,1,.335,1.574.192.192,0,0,1-.162.121c-.08-.015-.217-.095-.217-.144,0-.293-.149-.377-.321-.373h-.018v.252c.11-.044.106.1.125.195a.416.416,0,0,0,.459.335c.664-.026,1.1-.517,1.482-1.168.052.133.1.255.147.374a1.885,1.885,0,0,0,1.112,1.222.382.382,0,0,0,.506-.219c.027-.055.089-.078.136-.118.027.093.09.2.073.273-.06.255-.282.333-.509.363a1.41,1.41,0,0,1-.215,0l0,.064c.071.007.143.016.214.019a1.647,1.647,0,0,0,1.02-.207c.136-.089.189-.045.243.13a2.543,2.543,0,0,0,.832,1.141,4.771,4.771,0,0,1-.335-.6.677.677,0,0,1,.041-.4c.019-.052.141-.044.17-.052a1.962,1.962,0,0,0,.107.6.925.925,0,0,0,.776.406,1.749,1.749,0,0,0,1.167-.355c.011.322,0,.649.038.965a1.9,1.9,0,0,0,.579,1.248.311.311,0,0,0,.465.019.16.16,0,0,1,.133-.019.439.439,0,0,1,.021.226c-.085.217-.252.211-.4.169a2.85,2.85,0,0,0-.451-.145c.134.092.265.193.4.274a2.5,2.5,0,0,0,.447.219,4.192,4.192,0,0,0,.506.11,3.662,3.662,0,0,0,.291,1.774,5.791,5.791,0,0,1-.06-.761.8.8,0,0,1,.176-.366c.019-.026.115.033.175.052a.6.6,0,0,1-.044.177A.578.578,0,0,0,77,36.8a1.588,1.588,0,0,0,1.227.971c.141.033.288.041.389.056a10.672,10.672,0,0,0-.344,1.242,2.8,2.8,0,0,0,.058.915c.06.335.195.413.584.451.029.265-.1.4-.321.285a1.456,1.456,0,0,1-.343-.339c-.051-.058-.082-.144-.158-.192a1.057,1.057,0,0,0,.067.192,2.752,2.752,0,0,0,.8,1.048c.112.069.077.16.019.269a3.245,3.245,0,0,0-.27,1.532,4,4,0,0,1,.155-.618.533.533,0,0,1,.276-.259c.053-.021.143.1.195.143-.137.176-.3.293-.348.462a1.412,1.412,0,0,0,.147.958,2.473,2.473,0,0,0,.81,1,.761.761,0,0,1,.075.07,7.938,7.938,0,0,0-.766.912,2.61,2.61,0,0,0-.289.875c-.066.341.021.463.354.679-.051.254-.174.328-.317.154a1.433,1.433,0,0,1-.218-.461,1.783,1.783,0,0,1-.038-.361.689.689,0,0,1-.077.012,8.208,8.208,0,0,0,.084.83,4,4,0,0,0,.241.74c.069.166-.008.217-.089.276a2.467,2.467,0,0,0-.791,1.2c.1-.133.185-.277.292-.4a.537.537,0,0,1,.228-.144c.2-.064.289.048.265.321-.42-.027-.661.326-.666.924a3.315,3.315,0,0,0,.391,1.577,10.163,10.163,0,0,0-1.127.458,1.076,1.076,0,0,0-.547.794,1.313,1.313,0,0,0,.066.411c.015.075.037.147.055.219-.09-.014-.215.015-.266-.049a.711.711,0,0,1-.073-.635c.026-.107.055-.213.1-.372-.053.049-.084.062-.09.085a3.531,3.531,0,0,0-.263,1.455c.019.147,0,.237-.141.262a2.707,2.707,0,0,0-.633.17,4.953,4.953,0,0,0-.583.352c.01.023.018.047.027.069a1.356,1.356,0,0,1,.358-.186.763.763,0,0,1,.4.052.2.2,0,0,1,.089.287c-.078.169-.13.044-.2-.011a.321.321,0,0,0-.448.059,2.021,2.021,0,0,0-.569,1.292c-.03.292-.022.59-.032.865-.263-.092-.546-.207-.835-.289a1.007,1.007,0,0,0-.8.112c-.347.2-.4.311-.363.865-.08-.015-.18,0-.215-.049a.407.407,0,0,1-.059-.291c.092-.25.215-.48.335-.74-.075.078-.156.148-.226.233a2.531,2.531,0,0,0-.613.987c-.033.136-.1.151-.2.081a2.222,2.222,0,0,0-1.153-.236.168.168,0,0,0-.077.025c-.008,0-.011.025-.022.051a2.673,2.673,0,0,1,.422.082.4.4,0,0,1,.313.422.233.233,0,0,1-.077.152c-.022.019-.089-.008-.111-.041-.24-.361-.394-.4-.758-.2a2.5,2.5,0,0,0-1.019,1.47,8.783,8.783,0,0,0-.606-.736,1.126,1.126,0,0,0-1.09-.372.4.4,0,0,0-.282.321.432.432,0,0,1-.067.123v.3a.123.123,0,0,0,.032,0c.147-.018.255-.093.263-.33.008-.189.165-.189.271-.171.048.01.108.132.118.211a1.867,1.867,0,0,1-.34,1.453,4.057,4.057,0,0,0-.344-.751v.484a2.839,2.839,0,0,1,.112.3c.01.032.019.062.049.156a1.91,1.91,0,0,1-.162.134v.285a1.569,1.569,0,0,0,.814-1.123,7.932,7.932,0,0,0,.117-1.075c.251.085.314.158.28.566a2.77,2.77,0,0,1-.6,1.667.969.969,0,0,1-.614.343,1.172,1.172,0,0,1-.269,0c0,.025,0,.047,0,.07.089.016.178.027.267.041.148.023.3.047.443.081a1.748,1.748,0,0,1,1.32,1.093.979.979,0,0,1-.149,1.1c-.125.115-.266.138-.365.007a.65.65,0,0,1-.1-.406c.025-.191.152-.207.318-.1l-.185.318c.086-.012.189.01.228-.043a.466.466,0,0,0,.086-.308,1.383,1.383,0,0,0-.976-1.183c-.208-.06-.415-.132-.622-.208V62.9c.014.005.029.011.042.018a.884.884,0,0,1-.042.137v.455a2.685,2.685,0,0,0,.23-.38c.062-.125.129-.155.251-.121a1.164,1.164,0,0,1,.816.644c-.265.082-.37.25-.381.6a.676.676,0,0,0,.461.617,4.686,4.686,0,0,1-1.375,1v.287a4.306,4.306,0,0,0,2.36-2.49,3.288,3.288,0,0,0,1.3,1.268,3.157,3.157,0,0,0,1.744.461,2.254,2.254,0,0,1,.461-.007c.078.015.145.13.245.226a3.45,3.45,0,0,1-3.723-1.522m.6-34.936a8.56,8.56,0,0,0-.455,1.058,3.113,3.113,0,0,1-.391-1.179c-.2.346-.4.7-.6,1.05-.023-.008-.045-.018-.066-.027a3.231,3.231,0,0,0-.786-2.146,1.921,1.921,0,0,0,1.412-1.464l.056.007c.044.234.086.469.137.739.1-.247.195-.463.285-.68l.052-.021a2.235,2.235,0,0,0,1.024,1.843,6.726,6.726,0,0,0-.669.82m3.2-2.42a.155.155,0,0,0-.115-.074,2.286,2.286,0,0,0-1.538.64c-.358.369-.359.367-.749.041a1.054,1.054,0,0,1-.37-.653c.252.01.4-.159.455-.458a.7.7,0,0,0-.329-.758,3.79,3.79,0,0,1,1.684-.554c.117,0,.148.06.163.192.117.915.792,1.537,1.518,1.359a2.7,2.7,0,0,0,.58-.355c.058-.033.162-.063.195-.025a5.934,5.934,0,0,1,.971,1.85c-.326-.095-.52-.008-.636.245a.689.689,0,0,0,.09.751.968.968,0,0,1-1.063.038.28.28,0,0,1-.044-.155,3.874,3.874,0,0,0-.812-2.085m1.6,6.356-.064-.038c.032-.425.063-.85.092-1.235-.276.169-.579.352-.883.536-.016-.023-.033-.047-.051-.07a3.487,3.487,0,0,0,.1-2.343,1.509,1.509,0,0,0,1.815-.489c.012.023.025.045.036.069-.049.23-.1.459-.154.724l.5-.443.053.005a2.648,2.648,0,0,0,.276,2.33,2.044,2.044,0,0,0-1.721.956m8.537,13.268c.163.424.328.8.455,1.2a6.764,6.764,0,0,1,.17.828c.025.136-.01.2-.136.244-.66.215-.886.824-.919,1.6a1.464,1.464,0,0,0,.41,1.157.291.291,0,0,1,.022.226,4.447,4.447,0,0,1-1.314,1.41c-.019-.45-.144-.7-.378-.769s-.361-.008-.489.267a1.155,1.155,0,0,1-.225-.646,2.2,2.2,0,0,1,0-.38c.01-.313.051-.394.378-.487a2.689,2.689,0,0,0,1.233-1.019.65.65,0,0,0,.11-.639,3.334,3.334,0,0,0-.838-1.737.287.287,0,0,1-.08-.2,1.752,1.752,0,0,1,.492-1.013c.032-.032.086-.027.129-.04.067.33.189.488.388.51.278.03.415-.081.59-.516m-1.691-8.547c.284-.114.383-.311.377-.821.269.234.528.426.755.668a8.085,8.085,0,0,1,.557.728.2.2,0,0,1-.019.309,1.682,1.682,0,0,0-.341,1.632,1.263,1.263,0,0,0,.847,1.094.189.189,0,0,1,.165.233,6.644,6.644,0,0,1-.666,2.027c-.136-.387-.31-.543-.546-.516-.221.023-.376.221-.433.612-.138-.173-.258-.308-.365-.461a1.3,1.3,0,0,1-.13-.278c-.17-.433-.174-.442.115-.755a3.82,3.82,0,0,0,.754-1.861.278.278,0,0,0-.044-.18,3.312,3.312,0,0,0-1.053-1.08,2.572,2.572,0,0,0-.477-.178c-.112-.03-.149-.1-.163-.236a2.183,2.183,0,0,1,.07-1.019c.026-.073.062-.14.1-.222.138.265.326.373.5.306m-4.475-6.138a1.779,1.779,0,0,1-.336-1.2c.13.021.259.082.366.043a.723.723,0,0,0,.273-.282.735.735,0,0,0-.06-.761c.1.005.181,0,.258.014a3.609,3.609,0,0,1,1.378.41.231.231,0,0,1,.128.326,1.767,1.767,0,0,0,.422,1.758.921.921,0,0,0,1.1.33c.038-.016.129.041.147.09a2.786,2.786,0,0,1,.126.5c.037.277.066.558.077.838s0,.551-.008.865c-.241-.265-.488-.315-.721-.077a.514.514,0,0,0-.107.654.531.531,0,0,1-.527-.119,2.036,2.036,0,0,1-.236-.189c-.277-.271-.276-.273-.147-.69a4.215,4.215,0,0,0,.063-1.744.669.669,0,0,0-.5-.643,1.876,1.876,0,0,0-1.5-.064.189.189,0,0,1-.2-.063m1.2,7-.037-.092c.191-.361.383-.723.544-1.026l-.984-.016-.005-.074c.211-.3.436-.584.627-.9a2.055,2.055,0,0,0,.295-1.1,4.434,4.434,0,0,0,.842.565,3.483,3.483,0,0,0,.935.1c-.1.151-.219.332-.354.536L81,36.581l.041.04a2.562,2.562,0,0,0-.57,2.22,1.853,1.853,0,0,0-1.892-.17m1.95,6.344-.875-.607.008-.08a2.223,2.223,0,0,0,1.586-1.175,6.11,6.11,0,0,0,.536.969,4.812,4.812,0,0,0,.787.644c-.151.074-.335.165-.52.254l.561.273A2.1,2.1,0,0,0,81.3,46.855a6.987,6.987,0,0,0-.751-.745,5.794,5.794,0,0,0-.919-.454c.322-.233.618-.446.891-.642m-2.461,7.493,1-.038-.539-1.024c.012-.029.027-.059.04-.089a1.8,1.8,0,0,0,1.874-.162,2.551,2.551,0,0,0,.59,2.212L81,53.463c-.186-.032-.374-.063-.584-.1.14.207.266.392.392.577a1.654,1.654,0,0,0-1.787.67,3.088,3.088,0,0,0-.979-2.033c.007-.025.014-.049.022-.074m-.919,6.252a1.144,1.144,0,0,1,.156-.324c.063-.071.182-.147.252-.118a2.219,2.219,0,0,0,1.8-.214.326.326,0,0,0,.129-.2,4.4,4.4,0,0,0,.09-1.695c-.036-.2-.1-.4-.145-.6a.312.312,0,0,1,.011-.2,1.121,1.121,0,0,1,.939-.577.652.652,0,0,0,.158.713c.215.191.389.17.732-.137-.04.616-.074,1.171-.111,1.728,0,.056-.026.112-.036.169-.084.432-.082.413-.436.374a1.22,1.22,0,0,0-1.185.783,1.715,1.715,0,0,0-.143,1.346c.053.193.005.284-.115.328-.365.134-.731.259-1.1.369a4.055,4.055,0,0,1-.557.085.775.775,0,0,0-.007-.925.343.343,0,0,0-.536-.071,1.233,1.233,0,0,1,.1-.832m-3.03-1.1.935.576c-.038-.409-.077-.835-.118-1.261.016-.018.032-.036.048-.052A2.08,2.08,0,0,0,76.7,57.9a2.73,2.73,0,0,0-.292,2.282c-.015.014-.03.025-.047.037l-.5-.455c.055.265.1.51.155.757l-.038.044a1.553,1.553,0,0,0-1.806-.491,3.4,3.4,0,0,0-.1-2.351l.038-.062M70.169,62.4a6.571,6.571,0,0,0-.41,1.058c-.077-.18-.167-.391-.265-.616-.048.24-.095.473-.14.706l-.048.032A1.936,1.936,0,0,0,67.871,62.1a3.118,3.118,0,0,0,.8-2.149l.062-.03.584,1.02c.115-.356.244-.758.374-1.157.021,0,.041,0,.062,0A2.836,2.836,0,0,0,70.874,61.6a5.54,5.54,0,0,0-.7.8m3.14,1.3a1.369,1.369,0,0,0-.734,1.168c-.018.254-.129.267-.251.241a7.644,7.644,0,0,1-.9-.241c-.228-.08-.444-.2-.69-.318a.77.77,0,0,0,.335-.76c-.078-.336-.174-.429-.488-.458a1.25,1.25,0,0,1,.485-.735c.282-.229.38-.239.6.056a2.161,2.161,0,0,0,1.272.684c.28.081.451-.037.609-.293a3.415,3.415,0,0,0,.606-1.726c.005-.189.07-.306.226-.347a.917.917,0,0,1,.93.112.586.586,0,0,0-.115.736.457.457,0,0,0,.661.266c-.165.374-.3.718-.462,1.039-.122.241-.284.45-.42.68-.115.193-.211.223-.376.049a.975.975,0,0,0-1.3-.155" transform="translate(24.849 8.478)" fill="#dea442"/>
            <path id="Path_59169" data-name="Path 59169" d="M70.556,53.91a.252.252,0,0,1,.16.144.508.508,0,0,1,.021.055,1.258,1.258,0,0,0,.108.225.71.71,0,0,0,.681.418,1.225,1.225,0,0,0,.507-.956.28.28,0,0,1,.1-.165,2.829,2.829,0,0,0,1.009-1.542,2.015,2.015,0,0,0,1.329.254c.138-.005.3-.129.429-.025.267.278.739.429,1,.106a1.367,1.367,0,0,0,.084-1.075.283.283,0,0,1,.022-.236,3.643,3.643,0,0,0,.335-1.97,2.027,2.027,0,0,0,1.477-.746.185.185,0,0,1,.2-.058.722.722,0,0,0,.887-.518,1.515,1.515,0,0,0-.156-.732l-.008-.015a1.076,1.076,0,0,0-.147-.211c-.008-.01-.018-.018-.026-.029a6.244,6.244,0,0,0-.4-1.984.806.806,0,0,0-.058-.1c-.01-.016-.021-.033-.032-.049a4.077,4.077,0,0,0,1.128-1.692c.377-.1.551-.441.7-.839l0-.027c-.008-.019-.016-.038-.023-.059a1.477,1.477,0,0,0-.111-.284v0c-.208-.392-.5-.329-.7-.625h0a.3.3,0,0,1-.023-.034,4.641,4.641,0,0,0-.247-.52c-.011-.022-.025-.042-.037-.063a2.124,2.124,0,0,0-.743-.8.354.354,0,0,0-.044-.025,4.944,4.944,0,0,0,.383-2.165,1.234,1.234,0,0,0,.247-1.207c-.008-.016-.016-.034-.026-.049-.3-.325-.636-.24-.987-.25a2.056,2.056,0,0,0-1.508-.68l-.032,0a3.646,3.646,0,0,0-.428-1.972.259.259,0,0,1-.025-.169,1.44,1.44,0,0,0-.118-1.109l-.025-.048a.728.728,0,0,0-.98.236,2.844,2.844,0,0,0-1.733.307l-.01.007a2.913,2.913,0,0,0-.232-.535,2.665,2.665,0,0,0-.825-.909.707.707,0,0,1-.056-.08c-.13-.211-.118-.431-.239-.653l0,0a.994.994,0,0,0-.361-.361c-.337-.032-.651.3-.766.7a.273.273,0,0,1-.177.21,2.714,2.714,0,0,0-1.275,1.168,2.556,2.556,0,0,0-1.619-.717l-.01-.015a.915.915,0,0,0-.666-.5c-.452-.115-.639.706-.577,1.164a4.121,4.121,0,0,0-.761,1.936,2.15,2.15,0,0,0-1.56.3.19.19,0,0,1-.228.01.688.688,0,0,0-.938.165c-.222.675.122.869.133,1.368a4.031,4.031,0,0,0,.036,2.007,2.4,2.4,0,0,0-1.289,1.17c-.025.043-.07.1-.1.1a.832.832,0,0,0-.68.369.721.721,0,0,0,0,.887l.011.021a1.055,1.055,0,0,0,.329.352.207.207,0,0,1,.093.108.427.427,0,0,1,.029.108,3.193,3.193,0,0,0,.414,1.213c.011.021.022.041.036.063a5.316,5.316,0,0,0,.321.48l0,.005a3.232,3.232,0,0,0-.7,1.8.176.176,0,0,1-.078.152,1.144,1.144,0,0,0-.465.782.563.563,0,0,0,.081.436.879.879,0,0,0,.59.387.361.361,0,0,1,.351.2,2.407,2.407,0,0,0,1.286,1.024l-.011.036a3.607,3.607,0,0,0,.044,1.968.227.227,0,0,1-.012.206,1.438,1.438,0,0,0-.086,1.1.237.237,0,0,0,.026.038.71.71,0,0,0,.979.084c.566.13,1.152.45,1.758.193,0,.021,0,.041,0,.063a2.067,2.067,0,0,0,.293.973c.012.021.025.043.036.063l.012.021c.1.17.213.322.3.476a1.2,1.2,0,0,1,.188.558,1.153,1.153,0,0,0,.18.613l0,.008a1.932,1.932,0,0,0,.214.282.928.928,0,0,0,.845-.532.187.187,0,0,1,.162-.121,2.1,2.1,0,0,0,1.482-.769c.01.018.019.036.03.052a.438.438,0,0,0,.032.055,2.321,2.321,0,0,0,1.242,1M71.23,52.9c-.88.346-.07,1.111-1.394.074a.343.343,0,0,0,.027-.647c.114-.24.491-.539.621-.195a1.289,1.289,0,0,0,.592.531c.381.163.691-.473.8-.865.086-.285.476-.134.614.043-.278.174-.111.653.192.591-1.023,1.533-.488.335-1.455.469m1.9-1.37-.026.014c-.07-.1-.14-.2-.215-.306.005.145.008.278.012.411l-.023.016A.894.894,0,0,0,72,51.155a1.767,1.767,0,0,0,.158-1.222l.025-.026.429.428c.016-.215.034-.44.052-.664l.029-.022a1.245,1.245,0,0,0,.8.746,1.351,1.351,0,0,0-.354,1.13m2.419-.683c-.431-.181-.945.335-.871.9.01.314-.78.154-.979.154.243-.211.095-.714-.189-.59-.014-.247.167-.625.376-.581a1.174,1.174,0,0,0,.942.144,1.739,1.739,0,0,0,.259-1.271.439.439,0,0,1,.558-.266c-.148.352.1.625.4.422-.126.3-.148,1.312-.5,1.083m2.526-4.175c-.518,0-.824.853-.507,1.345,0,.319-.588.561-.809.657.077-.366-.2-.654-.4-.38-.108-.234-.1-.8.214-.754a1.241,1.241,0,0,0,.724-.35c.269-.335.032-.986-.165-1.322a.521.521,0,0,1,.391-.566c.007.389.329.458.5.133.033.315.3,1.082.051,1.237M76.2,43.883l.011-.038a1.037,1.037,0,0,0,.919-.381,1.877,1.877,0,0,0,.536,1.017c-.084.015-.186.036-.289.056.085.071.176.145.265.218a.964.964,0,0,0-.81.618,2.171,2.171,0,0,0-.75-.851q.278-.111.514-.2l-.395-.437m1.985-3.447c1.106,1.475.193.644.192,1.848.111,1.111.9.274-.121,1.77-.036-.219-.111-.322-.236-.343s-.211.062-.276.254c-.123-.247-.384-.673-.062-.821.61-.557.732-1.027.1-1.649-.084-.112-.3-.115-.291-.3a.968.968,0,0,1,.2-.613c.121.376.462.265.5-.143M76.1,36.36c.229.193.527-.081.385-.432,1.538.572.352.58.9,1.595.546.771.813-.284.506,1.552a.255.255,0,1,0-.477.18c-.21.005-.591-.388-.378-.64.448-.973.073-1.567-.775-1.532-.2-.08-.223-.5-.16-.723M76.016,40.1c.259-.243.592-.458.651-.9a1.32,1.32,0,0,0,.854.592c-.066.063-.143.14-.229.225.1.014.2.026.293.037l.018.027a1.228,1.228,0,0,0-.491,1.059,1.032,1.032,0,0,0-.956-.355l-.011-.051.37-.451-.5-.147,0-.038m.09,8.6-.019.026c-.093-.044-.186-.085-.291-.133.053.128.1.239.149.351a.821.821,0,0,0-.976.093,1.787,1.787,0,0,0-.322-1.182l.018-.036.517.122c-.056-.182-.122-.392-.186-.6l.029-.041a.959.959,0,0,0,.976.182,1.415,1.415,0,0,0,.106,1.219m-.251-12.765a1.4,1.4,0,0,0-.064,1.234.979.979,0,0,0-.968.248l-.032-.029.159-.621-.5.149-.021-.043a1.753,1.753,0,0,0,.259-1.189.771.771,0,0,0,.976.005c0,.012.008.026.012.038-.047.112-.092.223-.144.351.108-.056.2-.106.3-.156l.027.011m-2.534-3.027c.265-.021.864-.258.98.074a.8.8,0,0,0,.658.913c.134.019.3-.16.431-.086a3.411,3.411,0,0,1,.335,1.086c-.274-.2-.521.122-.369.436-.132.074-.572.023-.558-.217a1.926,1.926,0,0,0-.284-1.241,1.132,1.132,0,0,0-.846.112c-.263.273-.5-.169-.521-.472.285.092.41-.41.174-.606m-.827.3.029.012c0,.126,0,.252.005.4.074-.112.141-.21.207-.31l.027,0a1.307,1.307,0,0,0,.363,1.091,1.989,1.989,0,0,0-.745.806,1.742,1.742,0,0,1-.1-.662l-.4.455-.032-.023a1.824,1.824,0,0,0-.213-1.213.882.882,0,0,0,.854-.553M70.3,31.613a.633.633,0,0,0,1.048.295c.118-.129.141-.351.309-.17a2.862,2.862,0,0,1,.594.687c-.256.021-.433.459-.147.622-.1.152-.488.355-.587.134-.367-1.1-.964-1.17-1.49-.18-.166.149-.484-.062-.562-.282.282-.052.252-.55-.063-.621.163-.133.791-.8.9-.485m-1.523,1.222.033-.005c.048.108.1.218.151.34.025-.132.049-.256.069-.362a2.992,2.992,0,0,0,.322.477,2.221,2.221,0,0,0,.446.274,1.781,1.781,0,0,0-.373,1.117L69.4,34.7c-.111-.184-.219-.367-.315-.528-.058.192-.119.407-.189.642a2.63,2.63,0,0,0-.622-1,1.144,1.144,0,0,0,.509-.971m-2.534-.126c.281.355.846.128,1-.226.089-.123.032-.439.189-.446a1.8,1.8,0,0,1,.851.273c-.256.214-.188.676.128.606-.1.245-.335.668-.561.421a.968.968,0,0,0-.919-.34,1.878,1.878,0,0,0-.4,1.086c-.048.276-.446.237-.6.115.228-.244-.012-.665-.3-.51.095-.2.426-1.153.61-.979m-.882,1.984.023-.018.256.206-.074-.372.022-.023a.791.791,0,0,0,.95.218,1.788,1.788,0,0,0,.077,1.239l-.029.036-.49-.291a1.973,1.973,0,0,1,.06.694c-.274-.278-.536-.543-.923-.474a1.451,1.451,0,0,0,.126-1.215m.739,3.963c.647-.509.152-1.573.394-2.325.2.121.439.01.644.192.37.263,1.03.479,1.292-.059.358-.424.34-1.083.727-1.489.51.373.768,1.2,1.377,1.367.592-.122.928-.776,1.471-1.023.011.016.021.034.03.052l0,0c.292.537.21,1.211.532,1.74a.119.119,0,0,0,.015.025c.24.38.772.329,1.106.2.244-.145.48.011.723-.066l.008.058c.073.635-.251,1.117-.171,1.747a.916.916,0,0,0,.13.494c.3.483,1.075.463,1.436.9l-.005.012c-.04.1-.078.2-.119.3a3.029,3.029,0,0,1-.219.356,2.636,2.636,0,0,0-.329.489,1.681,1.681,0,0,0-.2.5c-.011.037-.022.075-.032.114a.47.47,0,0,0,.008.059.373.373,0,0,0-.005.055c.012.03.025.059.036.088a2.053,2.053,0,0,0,.147.35c.034.073.069.144.107.211l.042.09.012.016c.011.011.022.025.033.037a1.372,1.372,0,0,0,.207.245,2.468,2.468,0,0,1,.247.358l0,.007c.047.108.089.222.143.319l-.289.258c-.208.128-.437.189-.647.315a.943.943,0,0,0-.542.6,2.479,2.479,0,0,0,.1,1.211,6.336,6.336,0,0,1,.108.858c-.479.2-.939-.158-1.42,0-.783.162-.565,1.482-.893,2.138-.513-.13-.794-.679-1.292-.849-.772-.254-.989,1.015-1.556,1.371a1.436,1.436,0,0,1-.188-.245l-.011-.018c-.188-.315-.3-.7-.477-1.019l-.007-.011a1.391,1.391,0,0,0-.341-.417,1.229,1.229,0,0,0-.987.261c-.208.21-.461.151-.691.276l-.014.008c-.184-.649.019-1.3-.206-1.943-.01-.025-.021-.048-.032-.07l-.011-.019c-.35-.655-1.156-.343-1.685-.612-.011,0-.022-.011-.033-.016.04-.761.82-1.549.431-2.284a.713.713,0,0,0-.044-.075c-.31-.483-.792-.624-1.106-1.093a.372.372,0,0,1-.033-.048c.289-.574.835-.7,1.123-1.283.37-.788-.418-1.5-.511-2.254.466-.328.993-.154,1.462-.472m-2.89,8.517a1.5,1.5,0,0,0,.267-1.2.964.964,0,0,0,.994.059l.018.04-.276.554.52,0,.015.032a1.719,1.719,0,0,0-.487,1.09.868.868,0,0,0-.946-.328l.2-.306-.308.055m-.926-4.538-.018-.037a1.075,1.075,0,0,0,.691-.864,1.143,1.143,0,0,0,.854.616,1.072,1.072,0,0,1-.457.374l.477.314,0,.043a1.186,1.186,0,0,0-.834.687c-.143-.428-.343-.751-.727-.821l.01-.036.289-.151c-.1-.045-.2-.085-.289-.125m.847-4.58a.891.891,0,0,0,.928-.392,1.571,1.571,0,0,0,.525,1.053.392.392,0,0,1-.01.038l-.514.047c.089.163.188.346.288.527l-.023.034a.95.95,0,0,0-.979.132,1.479,1.479,0,0,0-.313-1.176c.1.014.2.026.309.038l-.211-.3m-.053-1.992c.553.095.935-.6.728-1.237a1.793,1.793,0,0,1,.926-.318c-.193.285.066.743.325.48,0,.267-.048.662-.276.714a1.116,1.116,0,0,0-.961.149,1.826,1.826,0,0,0,.005,1.277c.038.274-.315.451-.507.457.132-.351-.173-.569-.431-.325,0-.277-.1-1.194.191-1.2m-1.3,6.021c-.082-.195-.5-1.094-.3-1.176.565-.182.613-1.175.2-1.526a2.417,2.417,0,0,1,.7-.824c-.008.389.292.551.477.256.14.24.237.771-.1.8a1.426,1.426,0,0,0-.683.664,1.931,1.931,0,0,0,.462,1.1c.16.214-.095.6-.267.707-.005-.37-.4-.418-.495-.007m.79,4.876-.026.026c-.158-.217-.83-.577-.654-.9a.69.69,0,0,0,.182-.488c-.045-1.433-1.082-.237-.259-2.107.1.365.465.363.5-.038.185.092.436.485.285.69-.234.256-.531.85-.367,1.207.406.71,1.167.3.794,1.345-.149-.328-.548-.073-.455.266m2.787,3.372c-.266-.159-.479.223-.281.533-.214-.032-.952-.053-.941-.372.188-.7-.4-1.3-.878-1.052a3.548,3.548,0,0,1-.148-1.226c.195.276.574,0,.435-.326.2-.016.516.136.516.4a1.693,1.693,0,0,0,.071,1.309,1.112,1.112,0,0,0,.947.071c.2-.04.31.47.278.665m.547.468c.021-.128.044-.254.067-.389l-.254.24-.026-.016a1.407,1.407,0,0,0-.182-1.2c.387.044.642-.233.894-.516.011.005.022.008.032.012-.016.223-.034.446-.051.664l.481-.319.025.029a1.871,1.871,0,0,0-.027,1.237.827.827,0,0,0-.932.28L65.9,50.8m2.808,2.031c-1.448.835-.551-.173-1.538-.469-.85-.037-.374.887-1.168-.732.289.122.506-.3.273-.529.1-.173.455-.119.565-.042a2.36,2.36,0,0,0,.383,1.037c.291.372.8-.04,1.053-.318.192-.149.461.245.5.42-.289,0-.35.45-.067.635m.636-.912c-.045.115-.09.229-.134.343l-.027.008a1.162,1.162,0,0,0-.606-.963,1.467,1.467,0,0,0,.6-.991l.036-.005.208.6.295-.54.033.005a1.668,1.668,0,0,0,.414,1.1,1.579,1.579,0,0,0-.738.8c-.023-.1-.051-.223-.081-.352" transform="translate(22.412 11.167)" fill="#dea442"/>
            <path id="Path_59170" data-name="Path 59170" d="M48.341,47.352a1.872,1.872,0,0,0-2.286-.03,2.59,2.59,0,0,0-.8.994,3.454,3.454,0,0,0-.008,2.774,2.517,2.517,0,0,0,.779.982,1.8,1.8,0,0,0,1.085.365,1.624,1.624,0,0,0,.754-.181,1.923,1.923,0,0,0,.564-.448,5.105,5.105,0,0,1-.134.688,2.458,2.458,0,0,1-.485.987.892.892,0,0,1-.69.321,1.041,1.041,0,0,1-.694-.269,1.516,1.516,0,0,1-.459-.7l-.11-.336-.677.775.064.171A2.425,2.425,0,0,0,46,54.522a1.76,1.76,0,0,0,1.117.4,1.662,1.662,0,0,0,1.222-.542,3.566,3.566,0,0,0,.8-1.57,9.776,9.776,0,0,0,.274-2.548,5.013,5.013,0,0,0-.277-1.751,2.644,2.644,0,0,0-.793-1.156m-2.454,2.36a1.9,1.9,0,0,1,.174-.825,1.6,1.6,0,0,1,.47-.6,1.023,1.023,0,0,1,.635-.222,1.033,1.033,0,0,1,.633.222,1.542,1.542,0,0,1,.466.6,2.037,2.037,0,0,1,0,1.648,1.588,1.588,0,0,1-.463.6,1.019,1.019,0,0,1-1.268,0,1.577,1.577,0,0,1-.473-.6,1.949,1.949,0,0,1-.174-.823" transform="translate(16.685 17.423)" fill="#dea442"/>
            <path id="Path_59171" data-name="Path 59171" d="M51.75,47.352a1.872,1.872,0,0,0-2.286-.03,2.59,2.59,0,0,0-.8.994,3.454,3.454,0,0,0-.008,2.774,2.517,2.517,0,0,0,.779.982,1.8,1.8,0,0,0,1.085.365,1.624,1.624,0,0,0,.754-.181,1.923,1.923,0,0,0,.564-.448,5.105,5.105,0,0,1-.134.688,2.458,2.458,0,0,1-.485.987.892.892,0,0,1-.69.321,1.035,1.035,0,0,1-.692-.269,1.508,1.508,0,0,1-.461-.7l-.11-.336-.677.775.064.171a2.425,2.425,0,0,0,.758,1.076,1.76,1.76,0,0,0,1.117.4,1.662,1.662,0,0,0,1.222-.542,3.566,3.566,0,0,0,.8-1.57,9.776,9.776,0,0,0,.274-2.548,5.013,5.013,0,0,0-.277-1.751,2.644,2.644,0,0,0-.793-1.156M49.3,49.712a1.9,1.9,0,0,1,.174-.825,1.6,1.6,0,0,1,.47-.6,1.023,1.023,0,0,1,.635-.222,1.033,1.033,0,0,1,.633.222,1.558,1.558,0,0,1,.468.6,2.044,2.044,0,0,1,0,1.648,1.587,1.587,0,0,1-.463.6,1.019,1.019,0,0,1-1.268,0,1.59,1.59,0,0,1-.473-.6,1.949,1.949,0,0,1-.174-.823" transform="translate(17.951 17.423)" fill="#dea442"/>
            <path id="Path_59172" data-name="Path 59172" d="M55.159,47.352a1.872,1.872,0,0,0-2.286-.03,2.6,2.6,0,0,0-.8.994,3.454,3.454,0,0,0-.008,2.774,2.517,2.517,0,0,0,.779.982,1.8,1.8,0,0,0,1.085.365,1.624,1.624,0,0,0,.754-.181,1.923,1.923,0,0,0,.564-.448,5.105,5.105,0,0,1-.134.688,2.458,2.458,0,0,1-.485.987.892.892,0,0,1-.69.321,1.041,1.041,0,0,1-.694-.269,1.516,1.516,0,0,1-.459-.7l-.11-.336L52,53.274l.064.171a2.425,2.425,0,0,0,.758,1.076,1.76,1.76,0,0,0,1.117.4,1.662,1.662,0,0,0,1.222-.542,3.566,3.566,0,0,0,.8-1.57,9.776,9.776,0,0,0,.274-2.548,5.013,5.013,0,0,0-.277-1.751,2.645,2.645,0,0,0-.793-1.156M52.7,49.712a1.9,1.9,0,0,1,.174-.825,1.6,1.6,0,0,1,.47-.6,1.023,1.023,0,0,1,.635-.222,1.033,1.033,0,0,1,.633.222,1.558,1.558,0,0,1,.468.6,2.044,2.044,0,0,1,0,1.648,1.587,1.587,0,0,1-.463.6,1.019,1.019,0,0,1-1.268,0,1.59,1.59,0,0,1-.473-.6,1.949,1.949,0,0,1-.174-.823" transform="translate(19.216 17.423)" fill="#dea442"/>
            <rect id="Rectangle_23279" data-name="Rectangle 23279" width="0.876" height="1.497" transform="translate(75.899 69.296)" fill="#dea442"/>
            <path id="Path_59173" data-name="Path 59173" d="M59.668,47.352a1.872,1.872,0,0,0-2.286-.03,2.59,2.59,0,0,0-.8.994,3.454,3.454,0,0,0-.008,2.774,2.5,2.5,0,0,0,.779.982,1.8,1.8,0,0,0,1.085.365,1.624,1.624,0,0,0,.754-.181,1.923,1.923,0,0,0,.564-.448,5.064,5.064,0,0,1-.134.688,2.458,2.458,0,0,1-.485.987.9.9,0,0,1-.691.321,1.04,1.04,0,0,1-.692-.269,1.505,1.505,0,0,1-.459-.7l-.11-.336-.677.775.063.171a2.427,2.427,0,0,0,.76,1.076,1.759,1.759,0,0,0,1.116.4,1.663,1.663,0,0,0,1.223-.542,3.566,3.566,0,0,0,.8-1.57,9.776,9.776,0,0,0,.274-2.548,5.014,5.014,0,0,0-.277-1.751,2.644,2.644,0,0,0-.793-1.156m-2.454,2.36a1.9,1.9,0,0,1,.174-.825,1.6,1.6,0,0,1,.47-.6,1.023,1.023,0,0,1,.635-.222,1.033,1.033,0,0,1,.633.222,1.555,1.555,0,0,1,.466.6,2.037,2.037,0,0,1,0,1.648,1.6,1.6,0,0,1-.463.6,1.019,1.019,0,0,1-1.268,0,1.577,1.577,0,0,1-.473-.6,1.949,1.949,0,0,1-.174-.823" transform="translate(20.889 17.423)" fill="#dea442"/>
            <path id="Path_59174" data-name="Path 59174" d="M46.506,45.56h.95V43.65h.7V42.515h-.7V37.909H46.78L43.724,42.69v.96h2.782Zm.048-5.6v2.553H44.932Z" transform="translate(16.226 14.068)" fill="#dea442"/>
            <rect id="Rectangle_23280" data-name="Rectangle 23280" width="0.876" height="1.497" transform="translate(64.799 58.131)" fill="#dea442"/>
            <path id="Path_59175" data-name="Path 59175" d="M52.494,44.438H49.28c.01-.088.021-.175.036-.261a1.584,1.584,0,0,1,.165-.47,1.921,1.921,0,0,1,.4-.495,4.367,4.367,0,0,1,.78-.546q.15-.088.309-.185l.255-.155a3.442,3.442,0,0,0,.592-.45,2.117,2.117,0,0,0,.479-.688,2.5,2.5,0,0,0,.191-1.02,2.9,2.9,0,0,0-.219-1.13,2,2,0,0,0-.665-.846,1.8,1.8,0,0,0-1.082-.319,2.118,2.118,0,0,0-.878.171,2.549,2.549,0,0,0-.647.409,3.066,3.066,0,0,0-.433.458l-.007.01c-.1.133-.16.221-.195.273l-.119.181.653.8.141-.221a3.658,3.658,0,0,1,.315-.411,1.73,1.73,0,0,1,.47-.367,1.329,1.329,0,0,1,.643-.149.978.978,0,0,1,.584.16.9.9,0,0,1,.324.411,1.477,1.477,0,0,1,.11.58,1.255,1.255,0,0,1-.133.614,1.409,1.409,0,0,1-.389.443,4.276,4.276,0,0,1-.584.37,6.974,6.974,0,0,0-.643.394,3.281,3.281,0,0,0-.612.517,2.892,2.892,0,0,0-.477.7,3.668,3.668,0,0,0-.293.928,6.363,6.363,0,0,0-.084,1.168l0,.252h4.224Z" transform="translate(17.903 14.055)" fill="#dea442"/>
            <path id="Path_59176" data-name="Path 59176" d="M55.509,39.056V37.91H52.4l-.72,4.5h.868l.06-.111a1.323,1.323,0,0,1,.463-.509,1.123,1.123,0,0,1,.613-.185.983.983,0,0,1,.585.182,1.281,1.281,0,0,1,.413.5,1.614,1.614,0,0,1,.154.727,1.7,1.7,0,0,1-.158.758,1.3,1.3,0,0,1-.426.513,1.063,1.063,0,0,1-.616.186,1.19,1.19,0,0,1-.747-.263,1.788,1.788,0,0,1-.535-.7l-.111-.256-.694.644.077.192a2.578,2.578,0,0,0,.806,1.1,1.956,1.956,0,0,0,2.283.092,2.309,2.309,0,0,0,.784-.92,3.066,3.066,0,0,0,.293-1.359,2.972,2.972,0,0,0-.273-1.307,2.257,2.257,0,0,0-.738-.886,1.8,1.8,0,0,0-1.034-.321,1.607,1.607,0,0,0-.735.174,1.513,1.513,0,0,0-.138.08l.265-1.691Z" transform="translate(19.131 14.069)" fill="#dea442"/>
            <path id="Path_59177" data-name="Path 59177" d="M59.836,39.986a2.942,2.942,0,0,0-.35-.354,1.566,1.566,0,0,0-1.042-.381,1.652,1.652,0,0,0-.872.243,2.244,2.244,0,0,0-.675.662,3.346,3.346,0,0,0-.436.949,4.158,4.158,0,0,0-.152,1.127,3.78,3.78,0,0,0,.158,1.085,3.32,3.32,0,0,0,.439.938,2.315,2.315,0,0,0,.683.661,1.623,1.623,0,0,0,1.84-.082,2.247,2.247,0,0,0,.352-.314v.336a1.57,1.57,0,0,1-.169.772,1.13,1.13,0,0,1-.455.459,1.4,1.4,0,0,1-.665.162,1.531,1.531,0,0,1-.787-.218,1.488,1.488,0,0,1-.573-.639l-.121-.239-.657.651.1.2a2.677,2.677,0,0,0,.786.947,2.075,2.075,0,0,0,1.252.355,2.3,2.3,0,0,0,1.1-.27,2.062,2.062,0,0,0,.828-.836,2.774,2.774,0,0,0,.311-1.366v-5.5h-.893Zm-.454,3.736a1.44,1.44,0,0,1-.37.261.9.9,0,0,1-.4.093,1.054,1.054,0,0,1-.52-.138,1.331,1.331,0,0,1-.426-.395,2.219,2.219,0,0,1-.293-.6,2.342,2.342,0,0,1-.106-.7,2.554,2.554,0,0,1,.095-.683,2.307,2.307,0,0,1,.259-.614,1.4,1.4,0,0,1,.4-.424.923.923,0,0,1,.532-.155.981.981,0,0,1,.5.143,1.52,1.52,0,0,1,.444.406,1.992,1.992,0,0,1,.288.553v1.544a1.092,1.092,0,0,1-.125.351,1.561,1.561,0,0,1-.274.359" transform="translate(20.897 14.566)" fill="#dea442"/>
            <path id="Path_59178" data-name="Path 59178" d="M41.759,36.493v1.287h3.112V36.493H43.857V30.13h-.908l-.043.163a1.476,1.476,0,0,1-.114.171,3.8,3.8,0,0,1-.315.377,3.125,3.125,0,0,1-.388.35.512.512,0,0,1-.295.128h-.2v1.337h.2a.935.935,0,0,0,.431-.119,2.9,2.9,0,0,0,.413-.267,3.069,3.069,0,0,0,.255-.221v4.445Z" transform="translate(15.435 11.182)" fill="#dea442"/>
            <path id="Path_59179" data-name="Path 59179" d="M49.483,37.3A3.065,3.065,0,0,0,50.5,35.953a5.253,5.253,0,0,0,.355-2.007,5.421,5.421,0,0,0-.324-1.9,3.157,3.157,0,0,0-.982-1.394,2.524,2.524,0,0,0-1.611-.517H45.815v7.649H47.94a2.566,2.566,0,0,0,1.542-.476M47.94,31.267A1.667,1.667,0,0,1,49,31.605a2.068,2.068,0,0,1,.655.932,4.4,4.4,0,0,1,0,2.8,2.2,2.2,0,0,1-.651.954,1.651,1.651,0,0,1-1.071.35H46.78V31.267Z" transform="translate(17.002 11.182)" fill="#dea442"/>
            <rect id="Rectangle_23281" data-name="Rectangle 23281" width="0.95" height="5.749" transform="translate(68.409 43.212)" fill="#dea442"/>
            <rect id="Rectangle_23282" data-name="Rectangle 23282" width="0.95" height="1.518" transform="translate(68.409 41.111)" fill="#dea442"/>
            <path id="Path_59180" data-name="Path 59180" d="M52.111,33.877a1.923,1.923,0,0,1,.288-.632,1.705,1.705,0,0,1,.484-.469,1.021,1.021,0,0,1,.539-.169.519.519,0,0,1,.509.307,2.894,2.894,0,0,1,.182,1.205v3.162h.947v-3.3A6.491,6.491,0,0,0,54.995,33a2.743,2.743,0,0,0-.234-.8,1.339,1.339,0,0,0-.461-.547,1.2,1.2,0,0,0-.676-.191,1.837,1.837,0,0,0-.782.177,2.228,2.228,0,0,0-.675.488c-.036.037-.07.077-.1.117v-.7h-.9v5.728h.95Z" transform="translate(18.986 11.68)" fill="#dea442"/>
            <path id="Path_59181" data-name="Path 59181" d="M57.517,37.055a.561.561,0,0,0,.432.245.32.32,0,0,0,.064.007.516.516,0,0,0,.078-.007l.148-.019.184-.023V36.247l-.186-.019h-.011V33.8a2.624,2.624,0,0,0-.509-1.7,1.658,1.658,0,0,0-1.352-.622,2.108,2.108,0,0,0-.868.189,3.554,3.554,0,0,0-.843.559l-.151.13.4.935.186-.16a3.052,3.052,0,0,1,.633-.431,1.346,1.346,0,0,1,.584-.138.855.855,0,0,1,.718.315,1.343,1.343,0,0,1,.251.868v.093a2.831,2.831,0,0,0-.35-.088,3.682,3.682,0,0,0-.658-.063,2.211,2.211,0,0,0-.989.213,1.71,1.71,0,0,0-.7.629,1.84,1.84,0,0,0-.267,1,2.108,2.108,0,0,0,.211.939,1.679,1.679,0,0,0,.58.672,1.454,1.454,0,0,0,.816.244,2.047,2.047,0,0,0,.991-.267,2.164,2.164,0,0,0,.476-.358.95.95,0,0,0,.134.3m-1.474-.707a.733.733,0,0,1-.443-.132.826.826,0,0,1-.276-.328.939.939,0,0,1-.09-.41.683.683,0,0,1,.265-.57,1.3,1.3,0,0,1,.831-.248,2.418,2.418,0,0,1,.55.064,2.9,2.9,0,0,1,.4.128v.576a.359.359,0,0,1-.03.123,1.2,1.2,0,0,1-.11.218,1.185,1.185,0,0,1-.444.411,1.3,1.3,0,0,1-.649.167" transform="translate(20.155 11.68)" fill="#dea442"/>
            <path id="Path_59182" data-name="Path 59182" d="M60.034,31.507A.665.665,0,0,0,59.9,31.5a1.405,1.405,0,0,0-1.017.444,2.162,2.162,0,0,0-.244.277v-.672h-.916v5.73h.949V33.8a1.655,1.655,0,0,1,.491-.827,1.3,1.3,0,0,1,.843-.336l.2-.007v-1.09Z" transform="translate(21.422 11.688)" fill="#dea442"/>
            <path id="Path_59183" data-name="Path 59183" d="M39.4,98.254l40.572,30.589L150.6,35.2Z" transform="translate(14.622 13.062)" fill="#1437f4"/>
          </g>
        </g>
      </g>
    </g>
  </g>
</svg>
