<svg id="Group_71223" data-name="Group 71223" xmlns="https://www.w3.org/2000/svg" width="24" height="24" viewBox="0 0 24 24">
  <g id="Path_56928" data-name="Path 56928" fill="#fff" opacity="0">
    <path d="M 23.5 23.5 L 0.5 23.5 L 0.5 0.5 L 23.5 0.5 L 23.5 23.5 Z" stroke="none"/>
    <path d="M 1 1 L 1 23 L 23 23 L 23 1 L 1 1 M 0 0 L 24 0 L 24 24 L 0 24 L 0 0 Z" stroke="none" fill="#707070"/>
  </g>
  <g id="Group_71223-2" data-name="Group 71223" transform="translate(0 2.424)">
    <path id="Path_56925" data-name="Path 56925" d="M17.7,12.5H4.5V8.792L7.125,4.3h7.948L17.7,8.792ZM6.9,10.1h8.4V9.442L13.7,6.7H8.5L6.9,9.442Z" transform="translate(0.9 2.86)" fill="#fff"/>
    <path id="Path_56926" data-name="Path 56926" d="M2.4,14.27,4,11.532H9.2l1.6,2.738v.655H2.4Zm.226-5.138L0,13.619v3.707H13.2V13.619L10.572,9.132Z" transform="translate(0 3.826)" fill="#fff"/>
    <path id="Path_56927" data-name="Path 56927" d="M11.4,14.27,13,11.532h5.2l1.6,2.738v.655H11.4Zm.226-5.138L9,13.619v3.707H22.2V13.619L19.571,9.132Z" transform="translate(1.8 3.826)" fill="#fff"/>
    <rect id="Rectangle_21414" data-name="Rectangle 21414" width="2.401" height="3.473" transform="translate(10.799 -1)" fill="#fff"/>
    <rect id="Rectangle_21415" data-name="Rectangle 21415" width="3.471" height="2.401" transform="matrix(0.843, -0.538, 0.538, 0.843, 18.953, 5.086)" fill="#fff"/>
    <rect id="Rectangle_21416" data-name="Rectangle 21416" width="2.399" height="3.473" transform="translate(0.789 5.31) rotate(-59.315)" fill="#fff"/>
  </g>
</svg>
