{
  "type": "service_account",
  "project_id": "bursa-gold-dinar-60900",
  "private_key_id": "6a51d4fbf173c3fdef82aa34ac9404bf5e862c9f",
  "private_key": "-----BEGIN PRIVATE KEY-----\nMIIEvQIBADANBgkqhkiG9w0BAQEFAASCBKcwggSjAgEAAoIBAQDaUhztq5RaUcsZ\nRhVG8Ohe2v3UWSjZQNr1CVtmOr5Ni4oOXYJBm/Sv/dqpW9C/BTe24ffeD/Q9hZOo\n77ZCHOQWHKyAjNCblvWg9X8a1EDGYt1G8l9VA9rtAqdFseXogfTh2zVhX/yx+nMx\niWAZD48vhG+OiEhLCZjuJezBkvS4BbVfQui+1IMmLWhbDYN5FzywvWgFpaXkT6KS\n/yYyKVAqnUni47zoE03/eGLI31MgAmPkLzxG/vzCE5cjshJ9gz9h5scVHlTVS+/s\n0bc33HqHxklpdJkvCnd4TmEU+q0S33+Y0Lf8fhm69uaPFJx9PhF0NbQW0eia2UYd\n7AVGKijpAgMBAAECgf9/aJ95R6iypqLgUDlNxuNu3l529MSu0cQporK0XMcY4Il9\n2K34aNgwQ1vyRwlYcRl5B5nS/klYBGkn+rz8Pqzdbd5xJu/KQ7V7oC/zq4SIQl1G\n1vhlPnRR3QdbC3btoB0WGD4OyPWvtRMeb0ClxdUwf3/OSCC1Q34vfSWuOK6YTttf\n6LlcnTpK10t5g8dT628GjZIp89AKfm9KlqdekwZyCOK+fA0JrEgfnYy1AzaTO70O\nNT19YKk1wg0BWzt+WVz0bgDUuBn6+Ltm8UTKRKkFCr5qSTkGiT24y/I4lQgdslyt\nHy/ZOipqE4E9hnsq+/SCYI5uKjpun2eSWJwwKT0CgYEA+ffU6E4pLWAjeIm5EvWT\nIv7aA/c1K60XevA8irlQZtZEyWnFrCbN37K3uPIG70GUUAbCt9HcXe26L3DUv9Q9\n95HMMzWUpm7QMqB0A0lBv/vAmOWzh0eBYEIa/k92Mdv+2HZtCNNe3xS58/yolnpi\nODUsG8dY4T8Qj0/n79E9hGsCgYEA35bH9rkV7x9d69mJz16toi9XOxMGnz00mRic\nUYUi8dz7Z333WTLWMJ5+DbLtFsgTEPiW2UfeKf0ZNxj6Y15ACvntEeJplTZhKJwW\npEiAQRQ+TFjdcwqP1KC3jZRKeVUofK9wmUdBeaK9QeExNoPyQZxeeRyLbzPxbti5\nZ9GA/PsCgYEAlg10rEMHKur0QA6En+H1AmP0Ib9LFr3gQ3dlEG1v21uyjSnGdLIS\nkb9p1EbNbOB0FJoKV2hOHcBwLLxRqhnRXQUTjIYUhtgseMei/LoEEyggFGiHHaUJ\n/+uO4qx2qjWCxRRKHass30NE4TcBSNuMjGs24DIJo6VE3pK8C1US1aMCgYEApBjC\nq8ZNXdGUmftvlD11i/nYuKePDaHbD52rZH0lF4PLE7q0pceUwdwgwacXMMgojiUU\neWWwnPp/3hs78WAD+spQ/vY/7V4a0rY0O+BmGN1ll50E8mDHDRPjg0pZmlEwxMny\nBtzwJfiVlFtVRiBy1UqRX6vefgAOav8unA57768CgYEAzmLnR+oDMn3umFX/suFQ\ntO8szjB0hfh0kVa2WHh6WcK3u5MK/D9Wo5npad0SMIhqlPG1T4sBaQgaR4PgEqf0\nmO7qlwHwBISfb2OAFnSDU67r8sZ1eNYTKW3Jmvj+pD99Zk+5APyroH2LnGjotbi0\nHD8N0lYqDaVYDI2UiO8stug=\n-----END PRIVATE KEY-----\n",
  "client_email": "firebase-adminsdk-3w5p3@bursa-gold-dinar-60900.iam.gserviceaccount.com",
  "client_id": "103489760371916358225",
  "auth_uri": "https://accounts.google.com/o/oauth2/auth",
  "token_uri": "https://oauth2.googleapis.com/token",
  "auth_provider_x509_cert_url": "https://www.googleapis.com/oauth2/v1/certs",
  "client_x509_cert_url": "https://www.googleapis.com/robot/v1/metadata/x509/firebase-adminsdk-3w5p3%40bursa-gold-dinar-60900.iam.gserviceaccount.com"
}
