# jasmine package version: V11.0.28.0.QDIMIXM, unless stated otherwise

# ADSP - from jasmine
vendor/bin/adsprpcd|0cdd541ee0a365c5dccd0613e495611f4d0f6607
vendor/bin/cdsprpcd|c9fc5873c205e1ebb844d18bc10f89dd428a01ee
vendor/lib/libadsp_default_listener.so|85bdbaf59256e3a01e3d1bf1f5ac753eea4f935b
vendor/lib/libadsp_hvx_callback_skel.so|17e18628d5f06f5ad46b9577baac0d3571b42be1
vendor/lib/libadsp_hvx_stub.so|d3f2bfdf3f6bd4911e5015a022a098582addcf6f
vendor/lib/libadsprpc.so|35bf7c53dc7149b39126638c5c1bac3b08e262be
vendor/lib/libcdsp_default_listener.so|6347d41d3c3704a04ae0f8e816f071057c483163
vendor/lib/libcdsprpc.so|2774f0faf3728faf425fdeb81b9820a3c231a5ba
vendor/lib/libfastcvadsp_stub.so|43740cca4f7549c86e4b2ab1daf4d703d9a9b258
vendor/lib/libfastcvopt.so|77789b2b6e978bcc2ee7e848d6163fc31d6b5393
vendor/lib/libmdsprpc.so|caae31754dee7a45267ae3912685773046ab6b47
vendor/lib/libsdsprpc.so|b78c12ebe73d344af786dd39f1313ec88668aacc
vendor/lib/libsysmon_cdsp_skel.so|0da55092206d94a43a82d5a416969cbfd208acf2
vendor/lib64/libadsp_default_listener.so|abace257c0ae59ddc693f1e42d16670312673873
vendor/lib64/libadsprpc.so|02d0684cba8bd52d2a291f85afae9ce343c94bd4
vendor/lib64/libcdsp_default_listener.so|ebde03266606d634172d41bbc97ba9ebc5606423
vendor/lib64/libcdsprpc.so|6636d9b8e1c3b80bae94cf1728c5168ef77cca5f
vendor/lib64/libfastcvadsp_stub.so|ef3fd1a7d1217ad9bfff9cff0aa52db36eb73143
vendor/lib64/libfastcvopt.so|9f95397d7e1b171f9b00323ed7acc17341200e01
vendor/lib64/libmdsprpc.so|7aca0cc4524687c48df9e2247a6c59d0be9581bc
vendor/lib64/libsdsprpc.so|9c3ac49b1a3c7d383c64f7fb554b1c00e2963527
vendor/lib64/libsysmon_cdsp_skel.so|a76815923b46dbc41ba1a6b0f4942b8da8e52ce0

# ADSP modules - from jasmine
vendor/lib/rfsa/adsp/dirac_resource.dar|7728d5b2ee2927a01df5bd6d7edae3736186c844
vendor/lib/rfsa/adsp/libadsp_fd_skel.so|677d2932dac248049f031fc5893163e22b49439a
vendor/lib/rfsa/adsp/libadsp_hvx_add_constant.so|26fb64a92d48e801a31a867976d325efa366a255
vendor/lib/rfsa/adsp/libadsp_hvx_skel.so|05776246445316aea822eaa9cb6ae7a47b23c9aa
vendor/lib/rfsa/adsp/libapps_mem_heap.so|fd362c6b0e30f62cc3fc4566855f46706d2c3c50
vendor/lib/rfsa/adsp/libdirac-capiv2.so|e56031dfaee094d5267e3cc16625cfceaa07cc27
vendor/lib/rfsa/adsp/libdspCV_skel.so|a788855fe98d5f6ea73d2693c983efb29165eae1
vendor/lib/rfsa/adsp/libfastcvadsp.so|603711dc1af1f1952d8978a5b494b1541b24c54c
vendor/lib/rfsa/adsp/libfastcvadsp_skel.so|a06a3f52e89d219d2da0c7205e714cd7429b267c
vendor/lib/rfsa/adsp/libFastRPC_AUE_Forward_skel.so|f4d8675a46c5e52add8f8e90e35b29cd33ac582b
vendor/lib/rfsa/adsp/libFastRPC_UTF_Forward_800h_skel.so|c240d45c3a5fc37b964c4adab06f4cb0bfda62f5
vendor/lib/rfsa/adsp/libFastRPC_UTF_Forward_Qtc2_skel.so|b9f68e320d24e9c51871a2056e1f47239bd1cb40
vendor/lib/rfsa/adsp/libscveBlobDescriptor_skel.so|99752b14bc669589f598b2c555af96834147e41e
vendor/lib/rfsa/adsp/libscveObjectSegmentation_skel.so|d2174a2a4a680e93ee4262b5e6d99fd3c398620c
vendor/lib/rfsa/adsp/libscveT2T_skel.so|487f830aca26c85ef79c8b599b2f03668ab732b5

# Alarm - from jasmine
-product/app/PowerOffAlarm/PowerOffAlarm.apk|46387fe02067df3c4c09ec49fff7737473ea1145
vendor/bin/hw/vendor.qti.hardware.alarm@1.0-service|faccc2a7d94d486c2f61a5fe85f5c4598b4147a7
vendor/etc/init/vendor.qti.hardware.alarm@1.0-service.rc|c9877b6cae0353d5fdea5bc23dba77101b3d6980
vendor/lib64/hw/vendor.qti.hardware.alarm@1.0-impl.so|1e2631850cc97dfedbde50a9d0d55c8d14881b44
vendor/lib64/vendor.qti.hardware.alarm@1.0.so|271f85f1c6dc0c65dc3aa9a8603f3910fa50e1ea

# ANT+ - from jasmine
-lib/libantradio.so:system_ext/lib/libantradio.so|37c36369eeab19d5e6266d9d25ae0de9bb59502d
product/lib64/com.qualcomm.qti.ant@1.0.so:system_ext/lib64/com.qualcomm.qti.ant@1.0.so|f40868ad57012f1a512b14c889bc8380652cc50f
-lib64/libantradio.so:system_ext/lib64/libantradio.so|43f6105678c082216f1606d8dd43fa1b0b753d7e
vendor/lib64/com.qualcomm.qti.ant@1.0.so|181a8ab9b1d40705d3151821b53732c5566a2848
vendor/lib64/hw/com.qualcomm.qti.ant@1.0-impl.so|aa08f9ec51392ed841f60ad08b7f083312c8c5ee

# Audio - from jasmine
vendor/lib/libacdb-fts.so|7e542fe676bdeaf0347dada88683a67cb861d96d
vendor/lib/libacdbloader.so|ce2494e403e79552793d65f344ce9f79b52ba51a
vendor/lib/libacdbrtac.so|bacaa968f7da0ed014e6594b928823f0d08a06e6
vendor/lib/libadiertac.so|ebdd9b6c4e64b38ef39401b1a1e03696583440dc
vendor/lib/libadm.so|d7c7d22c4fe53312e1e49fbffd587b25fdf0ac89
vendor/lib/libaudcal.so|f935b8c33972b8cee40f760478f1b64a54705683
vendor/lib/libqtigef.so|e0c548247e923f1e972e7765a678566dd874afb7
vendor/lib/soundfx/libasphere.so|b1b26f99d9fbfe75f109349de5505ca39ccd4c8c
vendor/lib/soundfx/libqcbassboost.so|73339450a42b598a3c13e67b3d4a2266d986fea2
vendor/lib/soundfx/libqcreverb.so|eb437cd5e264b1adb4546c6a5617c5da17be5839
vendor/lib/soundfx/libqcvirt.so|ee9eaa81bb24ac0379e06b44ef257967a4d32614

# Audio (A2dp) - from jasmine
vendor/lib/btaudio_offload_if.so|d9a9795e173dffd4b5ee000acac66c1ad6f1648c
vendor/lib/hw/audio.bluetooth_qti.default.so|c64b101dd33042d2f702ab5059231ca9684fc1d0
vendor/lib/hw/vendor.qti.hardware.bluetooth_audio@2.0-impl.so|947afef6bf7a05a9a2b45022edfed06bd7c00e64
vendor/lib/libbluetooth_audio_session_qti.so|53fd0369c50fbaef12c22e25e3073a6fc9f05bb7

# Bluetooth - from jasmine
vendor/bin/hw/android.hardware.bluetooth@1.0-service-qti|57a0a575a2b1b96176fda1bcb84ea8371c4070d1
vendor/etc/init/android.hardware.bluetooth@1.0-service-qti.rc|a979981c55f3dcaf6cf2212e71b901ca4d58b959
vendor/lib64/hw/android.hardware.bluetooth@1.0-impl-qti.so|7c0d54f84dd3d2da1806affa7c16dea4bba4d16a
vendor/lib64/hw/vendor.qti.hardware.bluetooth_sar@1.0-impl.so|71ad8980142e7d8d754607accc0cffd8f5e68dbd
vendor/lib64/hw/vendor.qti.hardware.btconfigstore@1.0-impl.so|f9dcf9a19a0b601969bcd606bedb8a8419de9d81
vendor/lib64/libbtnv.so|08fc5c0a38eca63ebe6f0cd854f6525537141d44
vendor/lib64/vendor.qti.hardware.bluetooth_sar@1.0.so|9346946b110086a6b473c8226e072e9a0cdbb87e
vendor/lib64/vendor.qti.hardware.fm@1.0.so|073cace3aa8d0ffa025d9df67c45f8a907109339

# Bluetooth (aptX) - from jasmine
vendor/lib/rfsa/adsp/capi_v2_aptX_Classic.so|8305c614ebf13f84f15989631b8fdfdb9828d9be
vendor/lib/rfsa/adsp/capi_v2_aptX_HD.so|eb0e912d25b06f977d5a89345c72d142b7ffb8ae

# Charger - from jasmine
vendor/bin/hvdcp_opti|120837d6d44abfd86515731dd26183be9cdd5596

# CNE - from jasmine
etc/cne/Nexus/ATT/ATT_profiles.xml|33e568627fd3f94dc45bca1c01ad10e6d8fb5b52
etc/cne/Nexus/ROW/ROW_profiles.xml|238e785e9674b27c4b2365958d127533d7293132
etc/cne/Nexus/VZW/VZW_profiles.xml|0f63b632e3a3f114def7aeadaabd13851c8ceec5
-vendor/app/CneApp/CneApp.apk|2356a0335ab8e0106832a9325f972467654fd1f0
-vendor/app/IWlanService/IWlanService.apk|450aa6da382446125d06f328f8c1a0e2e33e52bb
vendor/bin/cnd|ca653a8064fe83a12a12798a73c9cc8c1fecf758
vendor/etc/cne/wqeclient/ATT/ATT_profile1.xml|578f3f8f56059bfdbef926bcc68d01c15e06951f
vendor/etc/cne/wqeclient/ATT/ATT_profile2.xml|1fb42c672a12b6660bdce3ea94e0c43719dd9de8
vendor/etc/cne/wqeclient/ATT/ATT_profile3.xml|f88e13f1dd7b82388c90358f71813026370c9ed8
vendor/etc/cne/wqeclient/ATT/ATT_profile4.xml|fb08e04f57797c5684bf734f7ce4bb4968859b18
vendor/etc/cne/wqeclient/ATT/ATT_profile5.xml|eb726ad1a42b9b78b9ee3b821fc108611bc9eeac
vendor/etc/cne/wqeclient/ATT/ATT_profile6.xml|be97b46b0d07ee2f6ebcc677d8099ed2140d5d85
vendor/etc/cne/wqeclient/ROW/ROW_profile1.xml|e7ca213d0998cb3a6a603ad3eca7bda69830ff55
vendor/etc/cne/wqeclient/ROW/ROW_profile15.xml|0130dfd8326ee710bf4e15718ede87c49a85b763
vendor/etc/cne/wqeclient/ROW/ROW_profile16.xml|e05b935d7ccf48d306b71c719b2e4df83187d9c0
vendor/etc/cne/wqeclient/ROW/ROW_profile17.xml|f1b33204799268eda78dd8314f26abf2e37431e2
vendor/etc/cne/wqeclient/ROW/ROW_profile18.xml|19db16f62dabb806a62f192858a9d52b5bc2a064
vendor/etc/cne/wqeclient/ROW/ROW_profile19.xml|1fcc57b1fa4dbbc7d250e8dd92acf1527d447eb3
vendor/etc/cne/wqeclient/ROW/ROW_profile2.xml|169a5209000e357a1a3183e8e5bfdf6fd07c2787
vendor/etc/cne/wqeclient/ROW/ROW_profile20.xml|7be0614cf0116c39b736c58fe5eca36838aeb3db
vendor/etc/cne/wqeclient/ROW/ROW_profile21.xml|cc62517e6c37e12ee1ebebbb27f9c22878749be3
vendor/etc/cne/wqeclient/ROW/ROW_profile3.xml|4be4060e8ac2d9fcea490feec7938cadcff46e1f
vendor/etc/cne/wqeclient/ROW/ROW_profile32.xml|b87542b9284efe4c2bd0ae868bb9a765c2c3dbc5
vendor/etc/cne/wqeclient/ROW/ROW_profile4.xml|f88e13f1dd7b82388c90358f71813026370c9ed8
vendor/etc/cne/wqeclient/ROW/ROW_profile5.xml|96101f6b01436a02572c67a469ff67ccfb738874
vendor/etc/cne/wqeclient/ROW/ROW_profile6.xml|cef14ff8a160c7ad719b85d024a4b3301c3638d0
vendor/etc/cne/wqeclient/ROW/ROW_profile7.xml|8d6773a4c418d0dcc4dc9096017d2681c7a1defe
vendor/etc/cne/wqeclient/VZW/VZW_profile1.xml|c89d3c062790b442cbe941cafc641a4e322f2d59
vendor/etc/cne/wqeclient/VZW/VZW_profile2.xml|ba14a9df975cf872ed0cbe28bee8fac63cd848d4
vendor/etc/cne/wqeclient/VZW/VZW_profile3.xml|9b123d81c9b8991499cda33b0706810e0c8fb974
vendor/etc/cne/wqeclient/VZW/VZW_profile4.xml|ff91feb5060a6df07e3e4d9bc99ae58bccad7649
vendor/etc/cne/wqeclient/VZW/VZW_profile5.xml|f76c894f3c6d5b6ed35113a088dc3174c900501b
vendor/etc/cne/wqeclient/VZW/VZW_profile6.xml|14d136e7fcc682311757d3edc0b9d3eaeba11815
vendor/etc/init/cnd.rc|ff205cff8e00ec6805fd1e19f3ca6ff86700cbb6
vendor/lib64/libcne.so|1344c4749026a55eee9e3a814c7a71b6733e08fb
vendor/lib64/libcneapiclient.so|a99c0ebb180bca17ed05c2ac348ee8e16227a5a3
vendor/lib64/libcneoplookup.so|99dbc1b2ae37181ae49a72d581fe53abe8207c42
vendor/lib64/libcneqmiutils.so|f2fc09230fdf877020f734451c13a6adb749838d
vendor/lib64/libwms.so|19a39c776120515292dc821599cf504a5fd600b3
vendor/lib64/libwqe.so|e762bb803cdb4fa55224df58e06c3a5bca5f36a7
vendor/lib64/libxml.so|9fa23668a2ab5fb0aff7e694fe44fb050b20f83d
vendor/lib64/vendor.qti.data.factory@2.0.so|428b56ac165ba30c450a1e191db9b386752f653b
vendor/lib64/vendor.qti.hardware.data.cne.internal.api@1.0.so|fc8634f7cf90524c24c45d8771eec888d652db92
vendor/lib64/vendor.qti.hardware.data.cne.internal.constants@1.0.so|ffa8e4013bc1bd8bd44e3d64c278be0d36274f6e
vendor/lib64/vendor.qti.hardware.data.cne.internal.server@1.0.so|f4e1e9991fa90546dfe0d4f9c7da8441b6a0af35
vendor/lib64/vendor.qti.hardware.data.connection@1.0.so|e2f77b104fbc3abe7423fc24743051b69cc887be
vendor/lib64/vendor.qti.hardware.data.connection@1.1.so|7b2e00bfbc40280a520dffc3eb99c68c1832761d
vendor/lib64/vendor.qti.hardware.data.dynamicdds@1.0.so|bf7766fbd49a3aa3426a93ab82bcd825cc72334a
vendor/lib64/vendor.qti.hardware.data.iwlan@1.0.so|c471659fc3fb56dcdcda183e080397a737e4708b
vendor/lib64/vendor.qti.hardware.data.latency@1.0.so|ff7a319e51ddd4de14af28a84f7bca5e82547f6e
vendor/lib64/vendor.qti.hardware.data.qmi@1.0.so|90f1106f7462a9e01721e1159ed3301579adee07
vendor/lib64/vendor.qti.latency@2.0.so|91a8b05b20485057ee9f42c55ce70207ef6af761

# DPM - from jasmine
product/bin/dpmd:system_ext/bin/dpmd|49caa8e7d8af8055efdd7ebc0d7f7d67bc600041
product/etc/dpm/dpm.conf:system_ext/etc/dpm/dpm.conf|95e27da8c989e96c6faea6f0697bce11955b62a5
product/etc/init/dpmd.rc:system_ext/etc/init/dpmd.rc|f061bb76ae844f6df04c1d78caf00cf29a41b112
product/etc/permissions/com.qti.dpmframework.xml:system_ext/etc/permissions/com.qti.dpmframework.xml|ab94e634782b7a2e833ce129eda74cb9333ed3f7
product/etc/permissions/dpmapi.xml:system_ext/etc/permissions/dpmapi.xml|697c88d7ebef6232ef214b17b4023bbb3ff4e625
product/framework/com.qti.dpmframework.jar:system_ext/framework/com.qti.dpmframework.jar|e39a7e06af2d1e95a3724c19c36b8716277f53a1
product/framework/dpmapi.jar:system_ext/framework/dpmapi.jar|4696df9793ad676b305d53b5d7ce65ecf74771ad
product/lib64/com.qualcomm.qti.dpm.api@1.0.so:system_ext/lib64/com.qualcomm.qti.dpm.api@1.0.so|a763bb1bbeecb84723bff6f547a3b23fab68dee3
product/lib64/libdpmctmgr.so:system_ext/lib64/libdpmctmgr.so|3d4b87a4937caf3a8d276f48a4f0dc2cad246c5b
product/lib64/libdpmfdmgr.so:system_ext/lib64/libdpmfdmgr.so|e809155312a05d83b323ab0be64cb393d936e52a
product/lib64/libdpmframework.so:system_ext/lib64/libdpmframework.so|8fd037eb8740a468a67c78e7fa01c69b1ba3fd2a|dad2493b5d4f42078713066130b0703af449c82f
product/lib64/libdpmtcm.so:system_ext/lib64/libdpmtcm.so|71a3d624602807f6fa6cbdb3a489efe9e93de634
-product/priv-app/dpmserviceapp/dpmserviceapp.apk:system_ext/priv-app/dpmserviceapp/dpmserviceapp.apk|9fd873c5330c03c62dfdeb6540b5984588295319
vendor/bin/dpmQmiMgr|d536096b310a2d3f30a683c1bdcad8658db1ba52
vendor/etc/init/dpmQmiMgr.rc|67569302d3a8828a9118c835e5b69c51b0c8ac68
vendor/lib64/com.qualcomm.qti.dpm.api@1.0.so|fbff6357ee46dd6d62f490a942ff567b6ce955d1
vendor/lib64/libdpmqmihal.so|30a170684219dd589d05ce5b446e73b7501f13e3

# DRM - from jasmine
vendor/bin/qseecomd|0c5e6d088e4d5600ce08915e7ef6ef28a99a2611
vendor/lib/libQSEEComAPI.so|1c134972d1629e7ec8e854f0fa43e2886556dbd7
vendor/lib/libsdedrm.so|b603b6beaa50d49604ab2ebe0977a9ef79252b20
vendor/lib64/libdrmfs.so|d5847a27b74955a0ccfb2da499fa42902c5bf1df
vendor/lib64/libdrmtime.so|9f1337004246fa7e6f726486bcab949fe5e2459f
vendor/lib64/libGPreqcancel.so|76b35e76a85b333f46ab749b7865c26ba0ca7bc4
vendor/lib64/libGPreqcancel_svc.so|610f0d55e3c3b31a5fdd590dcd6ec8c2cf258d9b
vendor/lib64/libqisl.so|f81d523e3e257e99bd055f6576521519a074e630
vendor/lib64/libQSEEComAPI.so|1dfc70896af18264af46be4bf797680cdd6b018b
vendor/lib64/librpmb.so|a6add4226a289242eb2e1ccef23a94d100a94064
vendor/lib64/libsdedrm.so|2add69c575f5745d0db2bbe8dfb7f75f9dc03ce6
vendor/lib64/libsecureui_svcsock.so|889d4a12c5dee56ed4b10548abbd7b9033cbdad2
vendor/lib64/libSecureUILib.so|3a059d1fe3395eaefeb7817ad3af46987b6f4794
vendor/lib64/libssd.so|a64337d8044607b81adcf7e8c5760cf8cdcf82b4
vendor/lib64/libStDrvInt.so|a7bd8140e2cd5aa70a7d929e01233e5b71844cd8

# GPS - from jasmine
vendor/bin/loc_launcher|d0d1465a7f8eb24c50b3c616dccaf68b3dc7888a
vendor/bin/lowi-server|6f11d0315e49aff2d8b24759bf7b2ca12659ac10
vendor/bin/slim_daemon|46c8844febb57ad741b38b26b26cadbb3b436cc9
vendor/bin/xtra-daemon|ebcb5645b3f1058f0775a145dc462dc27550919d
-vendor/etc/vintf/manifest/vendor.qti.gnss@3.0-service.xml|9b2f6691d6c224bcb9ab9a0d57adfb9e52f1b53e
vendor/lib64/hw/vendor.qti.gnss@3.0-impl.so|afc3f78aa065770d41dee37a13d43b8bef05f681
vendor/lib64/libdataitems.so|9525fdefa7da294ade8e3a50e947eb3eb168796d
vendor/lib64/libgdtap.so|e04f18737d839c00fa8542ba20961abee985d45b
vendor/lib64/libizat_client_api.so|420b3a97a4ead9ee62798a8c909654605f8c85de
vendor/lib64/libizat_core.so|93dbf5b5c2fc62baaecd7893f9a144da14eb1868
vendor/lib64/liblbs_core.so|44400a816810ee827ddce5fc05a55c73aaeb12f6
vendor/lib64/libloc_api_v02.so|ff1912cda0457535a68b9016bee9ac0a9d6d4ff4
vendor/lib64/liblocationservice.so|0b8dae52ab64d68b9e953abb163caee9c16548f6
vendor/lib64/liblocationservice_glue.so|d6d2cf3d2f2a4e1a3705ab4168686a6ea05c0e32
vendor/lib64/liblowi_client.so|753dd774baf8a207b4816f8880d64654668213a5
vendor/lib64/liblowi_wifihal.so|668425838cb21181b5fd49eff604fd937cc2e703
vendor/lib64/libqdma_file_agent.so|db515f94ffe2d06eabe93311de54dd3966cc6a1e
vendor/lib64/libslimclient.so|c1d4ce35678ac5bac407a772d0dbe0c67dd18faf
vendor/lib64/libxtadapter.so|5c4fbe5c6bb99a42bb80c39f983995e1056c3017
vendor/lib64/vendor.qti.gnss@1.0.so|5b5a503d27a9eb6371941cbed71b160d67983dbb
vendor/lib64/vendor.qti.gnss@1.1.so|f97415b13145e3a76e821d754650aa1a2696824d
vendor/lib64/vendor.qti.gnss@1.2.so|fa5bf9caf30f72e6ca13b8edd85d06dd76a807f5
vendor/lib64/vendor.qti.gnss@2.0.so|bbbfa8efc140ef3ee2594137e09f76212b732397
vendor/lib64/vendor.qti.gnss@2.1.so|a395bb7d4df874c0e0efadf8ef51d3510afedad3
vendor/lib64/vendor.qti.gnss@3.0-service.so|947bfafbf110d70656f434ab5845b6691b6b61c1
vendor/lib64/vendor.qti.gnss@3.0.so|ff1733d10abd97fa4381c798ae74b4cc5dac39e8

# Graphics - from jasmine
vendor/lib/egl/libQTapGLES.so|788a1833fd3e343a218c03b56b9569441ceb878a
vendor/lib/libOpenCL.so|df83abbc452249d07b52bf67c1c9b537c76019af
vendor/lib64/egl/libQTapGLES.so|c6eb23a9bb8fb6c502101f1bd5eeddc2b80bdec6
vendor/lib64/libOpenCL.so|21897637e702c4a97eb748934e9f1fc8880881c5

# Graphics - from taimen RP1A.201005.004
vendor/lib/egl/eglSubDriverAndroid.so|1626fe65bbeb29b8072d4448d30ed3c1acbab8fd
vendor/lib/egl/libEGL_adreno.so|5f205e8e61b11339681b63a999960ecaf73e68dd
vendor/lib/egl/libGLESv1_CM_adreno.so|701afdaca670a639da608d6aaaef35cc13539d91
vendor/lib/egl/libGLESv2_adreno.so|975f265f675e3916431a6ba13ab7c5007ae2d115
vendor/lib/egl/libq3dtools_adreno.so|faac3a7bf40ac604187f2d4b18acd83f10bfdf39
vendor/lib/egl/libq3dtools_esx.so|d734ba67d2a7d8ad1da6c2b70009a8284dac907c
vendor/lib/libadreno_utils.so|e5e139df49b28c6e4c86ef0834f65902cba417da
vendor/lib/libbccQTI.so|211ebb7159a41917bfc98fdf816b7c8d0f1fa2e6
vendor/lib/libC2D2.so|d1d61bb2f808d6674df0ba488fc21fc343d76448
vendor/lib/libc2d30_bltlib.so|8b322e28528cb8b809583b8993ab721ddf77d262
vendor/lib/libCB.so|1388b73a0cb6c217ec1ccaffa551d3b11223690b
vendor/lib/libgsl.so|7ca8850220224f7fd3e98d0afa305d465c95a0b8
vendor/lib/libllvm-glnext.so|ba7c741f5c57a6c3fc5f45b39ec395958e22ae33
vendor/lib/libllvm-qcom.so|d8dac9efbecb3f9cd18c2fc3fb5eeae8f7ee711b
vendor/lib/librs_adreno.so|532f2cbf31ba9a703e14cacc3d84792583b645e0
vendor/lib/librs_adreno_sha1.so|0a4ba1eb8c673a0869c3eb8546824f9bfc85bc2b
vendor/lib/libRSDriver_adreno.so|f0cd0cd3b662ef26965eaa952dcc858555c2fbeb
vendor/lib64/egl/eglSubDriverAndroid.so|61c6f382f0e0a81605006c3aefcfea48e9413a48
vendor/lib64/egl/libEGL_adreno.so|45b70c1a5558310cc496cdd0d40f8786c797324f
vendor/lib64/egl/libGLESv1_CM_adreno.so|7aefd667c43615f59afa7681a901e00ead3cdbda
vendor/lib64/egl/libGLESv2_adreno.so|52c992bae2b2fdc738f15d4fede7753710ace12f
vendor/lib64/egl/libq3dtools_adreno.so|4650e44cbc156a14692e8fc46b616e942d481051
vendor/lib64/egl/libq3dtools_esx.so|5005ba392e567ee7d39945627495a3e72bcb7d72
vendor/lib64/libadreno_utils.so|47a247a0d597d5206ee64883180e2cd6b0a84140
vendor/lib64/libbccQTI.so|35c8a31625d47110b984ccdafd7e2f64eebffa23
vendor/lib64/libC2D2.so|6f654c9bfc9f246b4fa015feb19a787234906f81
vendor/lib64/libc2d30_bltlib.so|c191be93eac34b27e6515163d64a5f375784cfc2
vendor/lib64/libCB.so|0f108fa6772c3ca9e5c1208a04677b1715de6477
vendor/lib64/libgsl.so|b708bdf03dde86f3214060b93a8a0ca56196e1cb
vendor/lib64/libllvm-glnext.so|78bb8d245478e212412e34c49eb1120e875cd0b9
vendor/lib64/libllvm-qcom.so|5b9c69743b6563094fb6879135c32e29acaccafa
vendor/lib64/librs_adreno.so|f76ffe1488c0622698b15884940eb6fd33346a71
vendor/lib64/librs_adreno_sha1.so|13dc11654b454d5d5ebe5583765811e4fa11ba4a
vendor/lib64/libRSDriver_adreno.so|d1a6c079de14a665fa73cc217c46977ef84c08aa

# Graphics (HDR) - from jasmine
vendor/lib/libhdr_tm.so|8d253c28c1fd976ac009088e36d483c16566f9a5
vendor/lib64/libhdr_tm.so|1e74de5b505c8f742f1fb0379725ec9f5fd53282

# Graphics (SDM) - from jasmine
vendor/lib/libqseed3.so|f1c5c5e2db7cf1bf1cd6782af3476ec721c525e7
vendor/lib/libsdm-color.so|2856bf71af603076b23d4c206dacba7c82350387
vendor/lib/libsdm-diag.so|b1813c5639553537ccda31b2e44b5d4a85eb2adc
vendor/lib/libsdmextension.so|37d5fca198c8e8526d6a4cb95f9c4bdf719e0efd
vendor/lib/libtinyxml2_1.so|f54f81359c78715315bc24678c34c129413e6c92
vendor/lib64/libqseed3.so|24ae4dfe5d9fa27a858b64dfafd1c713da6e6fde
vendor/lib64/libsdm-color.so|ed022cfcc1546c11b82991986e0a938464400858
vendor/lib64/libsdm-diag.so|6eb99b83036f917070393fa067eaebc50a5ff307
vendor/lib64/libsdm-disp-vndapis.so|ba4978c373f9892d884d07c4cf25dba9d73fda1f
vendor/lib64/libsdmextension.so|264c00a0920d291700b2948b9337037684986921
vendor/lib64/libtinyxml2_1.so|ba981e332895a053a67fc54a8190365a3ad37f2d

# Graphics (Vulkan) - from taimen RP1A.201005.004
vendor/lib/hw/vulkan.sdm660.so|6df3aa5c6badc46bc7a0367b9a62b0ab5b406159
vendor/lib64/hw/vulkan.sdm660.so|f0cf8bccfcfd0473a2c0322b1274dc4d752f2abbe

# Keymaster - from jasmine
vendor/lib/libkeymasterdeviceutils.so|bc2aac023d99ec9e423d2f769019d187c99a8afb
vendor/lib/libkeymasterprovision.so|ae6bbb9fec083307336b6191194d5c48b5dfd3a5
vendor/lib/libkeymasterutils.so|599755dde51af5289f1f2776651bb2f93eb8507e
vendor/lib64/libkeymasterdeviceutils.so|763a02841eb133e698180e0cacf309450a4ce0e0
vendor/lib64/libkeymasterprovision.so|f7e215595c2f7e62a6575b23a109b6b18556fc3b
vendor/lib64/libkeymasterutils.so|679491d7b415f45469990380e4fd61e4bfbc445e

# Listen - from jasmine
vendor/lib/hw/sound_trigger.primary.sdm660.so|8bae35ddf095f33543413bec940f538a7fada63b
vendor/lib/libadpcmdec.so|6e9be864a1380e099a2d68237e13a724f3143314
vendor/lib/libgcs-calwrapper.so|a7ee01ad02f69c182b9f28cb1c10b105ec8d607f
vendor/lib/libgcs-ipc.so|d2a33d059bc02c6f635c350f0c3d524a0216557d
vendor/lib/libgcs-osal.so|dfae7d1bb15b7bd19fef7427f0a6f6df28d5d30a
vendor/lib/libgcs.so|91e2a7e52bbc076eb3761586bcaf623160612a79
vendor/lib/libsmwrapper.so|d28c31e4dd25de2eb7d1face701b0f6acf1b1d0e

# Media - from jasmine
lib/libFileMux.so|79661e6dffc90234ad446641264fd0fa1a3fe6ab
lib/libmmosal.so|9464733295e192301b2577f52fab720e72c0d152
lib/libmmparser_lite.so|f4c24fd214acfb32ebbdd1e8ff361c886237f490
lib/libOmxMux.so|1ad1aa835a3dfb8bfea2a29291f82a173ba6a868
lib64/libmmosal.so|9ceff2581e86d32bc2795dffb96ebe4bdc88f2f7
vendor/lib/libAlacSwDec.so|bca4278cb74a63772a0fc369480b5d9814063d9b
vendor/lib/libApeSwDec.so|d175422c4b2e691dd5f2a3fe0c7dbc978084e838
vendor/lib/libdsd2pcm.so|df3b8b4f7c209f061fd6c48bf833cb2ad3342791
vendor/lib/libFlacSwDec.so|05013a9ca75ffe5ca7ec25747679b0addabdb0c1
vendor/lib/libgpustats.so|51338b96a0a61b1062a11723c86faba3c1f1d58e
vendor/lib/libI420colorconvert.so|3398b258f5454361e15c063798fe03974dc1cfd4
vendor/lib/libmm-color-convertor.so|43d7d4ac5587ecf5a7e8428e0437f45254acd767
vendor/lib/libmmosal_proprietary.so|a339e7b1dcf86fbb3ee3262ebb15d93cbd5a1916
vendor/lib/libOmxAacDec.so|2693bce6d624a008b7d4417f625ee363808762c1
vendor/lib/libOmxAlacDec.so|a1562f6e7319339f1a3c2164d7929a58d14d355c
vendor/lib/libOmxAlacDecSw.so|195745033c16f74745ef7fb73834a1781618ff32
vendor/lib/libOmxAmrDec.so|ffd66ca58bb0f083b8ba19f9114db08d4b3d38c1
vendor/lib/libOmxAmrwbplusDec.so|0ad2fbab0051880fc4cfaa75685100a470af1467
vendor/lib/libOmxApeDec.so|34f86d1617f9683a290642bd2452319dad50d431
vendor/lib/libOmxApeDecSw.so|50681d86957d6a6adc71967e67b24e2114fbf1ab
vendor/lib/libOmxDsdDec.so|d81e103794648cf58a363cacbfa21a2ab96bda7b
vendor/lib/libOmxEvrcDec.so|e16f0f94e91742f1aef16aad6f2438a12611a6b3
vendor/lib/libOmxG711Dec.so|fc022c86a72ea2d6e25bb1565c6f93ee63498fa1
vendor/lib/libOmxQcelp13Dec.so|2674324f46dfb77d2e586a04d380d6cea188e79e
vendor/lib/libOmxVideoDSMode.so|a5a6bd8e1fe4ee4ceb11ba77fae441435a4ae207
vendor/lib/libOmxWmaDec.so|469d6be621fab38ece0921c3f08e1638556cef0f
vendor/lib/libvqzip.so|d037d6e54f6cff1755acb5e1f04a43536bcb8acf
vendor/lib64/libgpustats.so|b7f9e1ee3f0d86e87d96db55404f3507db8cac6f

# Mlipay - from wayne V11.0.3.0.PDCCNXM
vendor/bin/mlipayd@1.1|4c30cfd1b32f99ff3043eadca8e7a4b7b9a00c79
vendor/etc/init/vendor.xiaomi.hardware.mlipay@1.1-service.rc|b5ab5bcd031fe4d9781b5911c0595eaeac8b80ea
vendor/lib64/libmlipay.so|c988ff04fcd90621cf46d219bdbc7eef341d1ce6
vendor/lib64/libmlipay@1.1.so|7d07b19faa36c62babf39a41b2baf8de370d706c
vendor/lib64/vendor.xiaomi.hardware.mlipay@1.0.so|2c05d2902c757410aec30c6a5d0bf77b016583fa
vendor/lib64/vendor.xiaomi.hardware.mlipay@1.1.so|0c4bb0c8ba1cbf357bb0b5117e93db0382ffcf49

# Perf - from jasmine
vendor/bin/energy-awareness|6515fada09432a437d2ed591ce141bb70fb10a9e
vendor/bin/hw/vendor.qti.hardware.perf@2.0-service|82db9da81990fe8ab08487780a3783a1d147edfc
vendor/bin/msm_irqbalance|e917104fbd26c844d27ffb2b7ec4f665fdfb8b78
vendor/etc/init/vendor.qti.hardware.perf@2.0-service.rc|cc8658db5e19f8e5e575fb986e7d38147e675f8d
vendor/etc/perf/commonresourceconfigs.xml|1db765e3a8fb902bdb648091178a709c34f3fb16
vendor/etc/perf/perfboostsconfig.xml|79662db6bf1ceea7a27ab2b89bb41d3e38005d90
vendor/etc/perf/perfconfigstore.xml|760248b82c4f1ad8b0e7ed1924d2b198229e118d
vendor/etc/perf/targetconfig.xml|376ae331df9d6c30b6208f25d04ae4ea11c0e2ea
vendor/etc/perf/targetresourceconfigs.xml|7132f1e9ce3bb21b4854b81d6e5d24409251f177
vendor/lib/libperfconfig.so|519fe27ba0fcc96704cd7930cae62547c60c318a
vendor/lib/libperfgluelayer.so|569bc942fcd54c1a52d345178694917642707b47
vendor/lib/libqti-perfd-client.so|8be3bcc67cdf3704cf6a328fcef7e87403747cb3
vendor/lib/libqti-perfd.so|f09adaadc93019827274d4eb7725d09412911d82
vendor/lib/libqti-util.so|e7882172095bb0df546d4c358744761aba932b5a
vendor/lib64/libperfconfig.so|cfab233f6442be6d590184394aa36bf6c9802438
vendor/lib64/libperfgluelayer.so|bfb9706a184fca4163e5a7cb5fcad11674958761
vendor/lib64/libqti-perfd-client.so|c15dfa389d28bdc6a170734c3f8f039819f09486
vendor/lib64/libqti-perfd.so|184e4a124ef4f509ce377ce3941353948917e605
vendor/lib64/libqti-util.so|c78b855b3909b01071ced5fc898add769de4a5b6

# Peripheral manager - from jasmine
vendor/bin/pm-proxy|bc4e972e3fe595b973197efe5114da8ff4339a59
vendor/bin/pm-service|b0f77edfe04a3cc6284738196c0044e676d5eeb3
vendor/lib64/libperipheral_client.so|a0dd574c8af3135adae10ef49065fa765906db7a

# Postprocessing - from jasmine
vendor/bin/hw/vendor.display.color@1.0-service|b091c0d0f898959afedf8a3f83b5e97205fdfbc8
vendor/bin/mm-pp-dpps|87650deb0e6df4afae33020b23af0d1cf33ec51c
vendor/etc/init/vendor.display.color@1.0-service.rc|5ad673f879b3685a0e79b5633437e5499cb94f48
vendor/lib64/libdisp-aba.so|fcb06e36e31d741c92d189ad95bc2f69bbf1e17b
vendor/lib64/vendor.display.color@1.0.so|3939e4d1ab4f74e6bbd04524a9e6211ade9c5d0b
vendor/lib64/vendor.display.color@1.1.so|ce0030a7e6593236277962ffff290b834eaf1f25
vendor/lib64/vendor.display.postproc@1.0.so|0b578a42706c770c6c61eccdee8a9e4c89c08b10

# QMI - from jasmine
etc/permissions/qti_permissions.xml:system_ext/etc/permissions/qti_permissions.xml|e6ff4572352b1a4f91b6b9d7cbb1cad9924410a0
product/lib64/libdiag_system.so:system_ext/lib64/libdiag_system.so|588e842c56dfba4c978d2ef864a567d9cc0051da
vendor/bin/irsc_util|4381ded94ac2775cf186c97c7ad6236eaa209eac
vendor/bin/pd-mapper|d8d15467cc543bf99ebac8391c07ba5d8b7ecdc8
vendor/lib/libdiag.so|47c193e73ba04a9a6d1f974efffcf8a9338b41c9
vendor/lib/libdsutils.so|cbbda80e97126230dc38700f99dbafd201418f2f
vendor/lib/libidl.so|e2e8ee4f5df52dfb4cfd3ac617bfec5823808913
vendor/lib/libqcci_legacy.so|60225e8fcc09df55d6a7530a1041ab78abd6021c
vendor/lib/libqdi.so|23f6512fda349d5b049014128c03f533d7cd0f30
vendor/lib/libqdp.so|a0ad439bb9f12c2de16f6e6d9213857735be5ee0
vendor/lib/libqmi.so|b99c89faf141b49f7c2941d171465c03514cdb4b
vendor/lib/libqmi_cci.so|b310d02f4e997a8867dc78bf5628db21ea61b7d4
vendor/lib/libqmi_client_helper.so|e39ec54e41f3bb78dafc5decaf57652840cb5fad
vendor/lib/libqmi_client_qmux.so|c58618e1cd16aa6b30583f25daff66eca7fe63fc
vendor/lib/libqmi_common_so.so|a021eeb3a0d80bf3f5b98b49e110b1ae20ca5d9d
vendor/lib/libqmi_csi.so|3fcf42288ca84340312c21471c00d2b5fea495c0
vendor/lib/libqmi_encdec.so|c8f3cbe2ab3712d673d73d4fd8038e249b24662a
vendor/lib/libqmiservices.so|02f6f19fec5865351e192d9e4176f2e98f949a8c
vendor/lib64/libdiag.so|7ce454d7ee5f2cb638839890dc2437eeb51736e5
vendor/lib64/libdsutils.so|6ade782e322d267381d85a38504878b785bf7156
vendor/lib64/libidl.so|ea0cd6e8dd41264eefbbb843d47e60cc62d2037e
vendor/lib64/libqcci_legacy.so|aaea71603cf893dd4239abda65771df3fc6a64b0
vendor/lib64/libqdi.so|406b251bc0fb25374e1f30b17e8dff1c87c7870e
vendor/lib64/libqdp.so|3a3bf182b6b752fd188aab5e44eeb6255a9429e8
vendor/lib64/libqmi.so|7deedb951c97f720cfb102fa57a77b3e9a933721
vendor/lib64/libqmi_cci.so|00d7bfe2ca99b9ec477235b39cb3b7b3bb501930
vendor/lib64/libqmi_client_helper.so|d19ee214a84e5645c3681e3edd4a36930ccb3aaf
vendor/lib64/libqmi_client_qmux.so|f2b83d980656210909f5e1d554dac4841ecd9302
vendor/lib64/libqmi_common_so.so|6603cbb04df47395ae2dac6dd518266f0366e5e0
vendor/lib64/libqmi_csi.so|4bae09fa2ce8335528f171abed518853eb2208c4
vendor/lib64/libqmi_encdec.so|5e536057be350651379b772aa1bba5f4735d11ee
vendor/lib64/libqmiservices.so|0c2930a50082aa9e9d341bd4286971e9143fd358

# Radio - from jasmine
-product/app/datastatusnotification/datastatusnotification.apk:system_ext/app/datastatusnotification/datastatusnotification.apk|272156d88ac5a05f76fcea7f1a31087e1acbcd85
-product/app/QtiTelephonyService/QtiTelephonyService.apk:system_ext/app/QtiTelephonyService/QtiTelephonyService.apk|db60b6fe27b3033f6468b3170b23af18dd0bcdaf
product/etc/permissions/qcrilhook.xml:system_ext/etc/permissions/qcrilhook.xml|30397e293b2c40e6b7a1d11c2a615cdd05de625a
product/etc/permissions/telephonyservice.xml:system_ext/etc/permissions/telephonyservice.xml|b7831598d3c19c6ce4ef431d1cc44d94c3c35a8d
product/framework/qcrilhook.jar:system_ext/framework/qcrilhook.jar|4eece9eb40a8976d2fd9a6a4d5d6dfea0c7674f5
product/framework/qti-telephony-common.jar:system_ext/framework/qti-telephony-common.jar|5b1c23ce0d42e1b666d387eedde3444dd07e61bc
product/framework/QtiTelephonyServicelibrary.jar:system_ext/framework/QtiTelephonyServicelibrary.jar|ea30b05eaad3ebee157421b3f31bf8585566b4cd
-product/priv-app/qcrilmsgtunnel/qcrilmsgtunnel.apk:system_ext/priv-app/qcrilmsgtunnel/qcrilmsgtunnel.apk|20c011ffc54539161fa7cc05c55c9c5ed3f936b4
vendor/bin/adpl|cd2af02673c750d3cc2da4089bec751dc24f8597
vendor/bin/ATFWD-daemon|bc2492087298a328d76d60560b11e480a79f3ad9
vendor/bin/hw/qcrild|8d4ef5aa4f730e29d58b7e34ebb99ee17887e761
vendor/bin/netmgrd|04d48a2e2ea3538e442d700b063692a10bd7d3f6
vendor/bin/port-bridge|e5f40c19a55f3e60c461ddff2d55105c2bd4b1fe
vendor/bin/qti|5c8a78f385b11f8df80e28a044cfdc40adc7db6f
vendor/bin/rmt_storage|a0d5fd0f9dcfb820bea1ee537eb274ffa017087a
vendor/bin/tftp_server|3ea8b4c05df7d9b8c21374cecfa92d62d8b236b6
vendor/etc/data/dsi_config.xml|1e1667f631d81a2d3153b5002b9012c4bc7db393
vendor/etc/data/netmgr_config.xml|25353d12070faa9295c076bb534330817125def0
vendor/etc/init/dataadpl.rc|cd4907d9bfd438fe5f5c86f5d6cec590ac0bac2a
vendor/etc/init/dataqti.rc|6abfd1a850d782adbbb6f42c9d8ca870036b2ad1
vendor/etc/init/port-bridge.rc|e52d61a0de5e8a3b21bfbfca929e862422645377
vendor/etc/init/qcrild.rc|17cf4934bf443cf6469d8b3ff622eeb0e4a0aac6
vendor/lib/libmdmdetect.so|eb82808a2e4e9cfe3746ddf71f49058d811b2e7d
vendor/lib64/libconfigdb.so|5107646977df88facf9d94a68435be098e347e16
vendor/lib64/libdsi_netctrl.so|0ebac49bf30689509783a442825fe20e4e208753
vendor/lib64/liblqe.so|11feb3081e1c517993d8bf730f1a65a4354280dc
vendor/lib64/libmdmdetect.so|f4f86ce18e47b098be199fe0f40c42ebd3c8a932
vendor/lib64/libnetmgr.so|584f76d5f83c782cf8d9d8c8f5d1c5394f6f257d
vendor/lib64/libnetmgr_common.so|de4b78f00992aa0c5473e9c51dab8c70d5ac0bb0
vendor/lib64/libnetmgr_nr_fusion.so|84e84bc70dc51fbfcce023bfcd6d5dc8f2a90bf3
vendor/lib64/libnetmgr_rmnet_ext.so|f473632073e155016bfe54eb7185fcafce36c8a4
vendor/lib64/libnlnetmgr.so|c5bbb11161b7673e02a0b2b9cec06565c8c46372
vendor/lib64/libpdmapper.so|913532702507b64ef3384c68c958a29b89ebcef2
vendor/lib64/libpdnotifier.so|41b80e0e26a2bdd324af8382b3384289c7b07c79
vendor/lib64/libqcmaputils.so|eacd5bec984bae24bda1f041975357b2d72edfc2
vendor/lib64/libqcrilFramework.so|3ea985b5e2d77aa5629429e6a535c485236e5b01
vendor/lib64/libqrtr.so|9addbb504885bb2a82e0b19e38077742bc48c10f
vendor/lib64/libqsocket.so|dd4067d7a79565f11034277d4ef46698cd17c19b
vendor/lib64/libril-qc-hal-qmi.so|4179bc3e9eab1194b186fff08287a14b65543c1e
vendor/lib64/libril-qc-ltedirectdisc.so|1bb5daeb65a48eb5dbac5db7f1fe8975fcb6be28
vendor/lib64/libril-qc-radioconfig.so|c37def8f254404839a413918e94c4aab4d6de137
vendor/lib64/libril-qcril-hook-oem.so|bc216efecb94b352b1d9be890bbcf5fc29e2f830
vendor/lib64/librilqmiservices.so|716b1b545d8446c6e66e03291bf42fe60683ba1a
vendor/lib64/libsettings.so|1be7d1d33e562ff1b2db672d394100c0aa747b19
vendor/lib64/libsystem_health_mon.so|a329ee0593f1811528a2d6fa9661160cbd1cc405
vendor/lib64/qcrild_librilutils.so|314a90af94477d973109f0162a0a0d0d38ae1226
vendor/lib64/qtibus.so|0d9c3b08a7350ee8db01abb625c032feaac4d2c1
vendor/lib64/qtimutex.so|06f87b3bfd6459e72800f35dad4359e94f23edfb
vendor/lib64/vendor.qti.hardware.radio.am@1.0.so|437d740fd549753fe6cc1db97e6e45b2f75d4076
vendor/lib64/vendor.qti.hardware.radio.atcmdfwd@1.0.so|092576b954a499b590c10a4f8dcc2c281bc32798
vendor/lib64/vendor.qti.hardware.radio.internal.deviceinfo@1.0.so|0ed46db784c55564219ac2097753df6c5b37bd2f
vendor/lib64/vendor.qti.hardware.radio.lpa@1.0.so|c79cb5039eedab26e6c2a9e398e06ad642c24abe
vendor/lib64/vendor.qti.hardware.radio.qcrilhook@1.0.so|c85d9ea1f787d2ac47f6440a8410ceb2163ddca5
vendor/lib64/vendor.qti.hardware.radio.qtiradio@1.0.so|3b70695e8b05de4c6ff9ee113af525231f90ee34
vendor/lib64/vendor.qti.hardware.radio.qtiradio@2.0.so|d30776beb0cde0589eae8e597ee01f07095ce0c7
vendor/lib64/vendor.qti.hardware.radio.qtiradio@2.1.so|6e1fb8770c14adf59a327806418f8a7fbcc313cd
vendor/lib64/vendor.qti.hardware.radio.qtiradio@2.2.so|d68c419b6a95c5ed3d250a888a493782e3923c81
vendor/lib64/vendor.qti.hardware.radio.qtiradio@2.3.so|d3106666f96f03cff66b9a6561916571f35a11f4
vendor/lib64/vendor.qti.hardware.radio.uim@1.0.so|1d41599d951103b45e726944e173ab10772ad378
vendor/lib64/vendor.qti.hardware.radio.uim@1.1.so|8873c8a8852655d579d4ec937143a07e201a863e
vendor/lib64/vendor.qti.hardware.radio.uim@1.2.so|a82e851b3a2084cdb436bb3397c4abc826a8e94c
vendor/lib64/vendor.qti.hardware.radio.uim_remote_client@1.0.so|e9fea0c010f809e29333841bc9ded5ac744a55be
vendor/lib64/vendor.qti.hardware.radio.uim_remote_client@1.1.so|21773237c68924b6ee5a27c78a981b31c0405408
vendor/lib64/vendor.qti.hardware.radio.uim_remote_server@1.0.so|22ab381fb2e85004d07c5a94386f29490f17a191
vendor/radio/qcril_database/qcril.db|6d0926901523730f4f8a33518b3746ff4e601e42
vendor/radio/qcril_database/upgrade/0_initial.sql|34974bfec8d658bec6af889c954e86dda0a8b09e
vendor/radio/qcril_database/upgrade/1_version_intro.sql|67b96cb3e94737bfe271b2519b9eb5fae17373a2
vendor/radio/qcril_database/upgrade/2_version_add_wps_config.sql|b4a825ba20fea3e2f20c7f02c8bd64596c24a75e
vendor/radio/qcril_database/upgrade/3_version_update_wps_config.sql|0571aacaf9fc0868c48bba2f7542f5b4e68c9022
vendor/radio/qcril_database/upgrade/4_version_update_ecc_table.sql|0734c6a2863edadc7a8422b8310d267c594d11a0
vendor/radio/qcril_database/upgrade/5_version_update_ecc_table.sql|0622cde777945432d8fc46c248c17031808729ba
vendor/radio/qcril_database/upgrade/8_version_mi.sql|760367d2b12a6b957092383017ddb030a4b1f251

# Radio - from jasmine - modified
vendor/etc/init/netmgrd.rc|213d147cfcfe175aa4cdf1a345f3b148ea72982d

# Radio - IMS - from jasmine
-product/app/imssettings/imssettings.apk:system_ext/app/imssettings/imssettings.apk|a1cc6f2e1ab37fb24dadad5d3b45c425e72c1e4a
-product/app/uceShimService/uceShimService.apk:system_ext/app/uceShimService/uceShimService.apk|a4f64644c7c7f4340745df98d9da5e3243134b21
product/lib64/lib-imscamera.so:system_ext/lib64/lib-imscamera.so|8611f22989e922c9bf5e55ab40b5e5021bc3f92b
product/lib64/lib-imsvideocodec.so:system_ext/lib64/lib-imsvideocodec.so|c2e541068f9195888deaa9807cd8025587a0aae6
product/lib64/lib-imsvt.so:system_ext/lib64/lib-imsvt.so|02a422f752ae83d2c9c376d2a78056605bcf962c
product/lib64/lib-imsvtextutils.so:system_ext/lib64/lib-imsvtextutils.so|c065912c11045bbccc06e98782963d1492e21e1a
product/lib64/lib-imsvtutils.so:system_ext/lib64/lib-imsvtutils.so|bf2da369eabe1d93f14ba8388b3ae8d98e767a2d
product/lib64/libimscamera_jni.so:system_ext/lib64/libimscamera_jni.so|7cb89110cca94d37d68c705f12a7a5a4ee106139
product/lib64/libimsmedia_jni.so:system_ext/lib64/libimsmedia_jni.so|3540752cc3658261ea3c909f03018eea4398f84e
product/lib64/vendor.qti.imsrtpservice@2.0.so:system_ext/lib64/vendor.qti.imsrtpservice@2.0.so|2a5bca02128b51f8d47dd2f9cf886e0d23e7bbd9
product/lib64/vendor.qti.imsrtpservice@2.1.so:system_ext/lib64/vendor.qti.imsrtpservice@2.1.so|4c9f4eb70e8697472d96522a5118964d7beb73fe
-product/priv-app/ims/ims.apk:system_ext/priv-app/ims/ims.apk|fe11b3fe75a52e586ca6390adbd1b234f4f565ed
vendor/bin/ims_rtp_daemon|d9054d1804e110a449cb52afd5e4fea27d0f8630
vendor/bin/imsdatadaemon|3154c28ce863ed3013ea3884a41d1763a63a445b
vendor/bin/imsqmidaemon|88dfdf4cb54f104d2f15187028a212b7ff605f96
vendor/bin/imsrcsd|2aa595f3335fac4e2d98dd0a1de3a33e800bb29a
vendor/etc/init/imsdatadaemon.rc|29face37c174aebcd1358f7d7ad0bd4baf83063b
vendor/etc/init/imsqmidaemon.rc|dda16d842b7c65296e97bc9921b723a43b152ba3
vendor/etc/init/imsrcsd.rc|2dc42ff6e4b6dd389bd3bc9a7af30dec2f1a45df
vendor/etc/init/ims_rtp_daemon.rc|b3c3a380204d7b1b3a58937db8c8e76c00ac8825
vendor/lib64/com.qualcomm.qti.imscmservice@2.0.so|e820dad2c12bda6ae8d997dacccee2f6a553870f
vendor/lib64/com.qualcomm.qti.imscmservice@2.1.so|1c849e793bd10e723ce1ec01d18e067240144685
vendor/lib64/com.qualcomm.qti.imscmservice@2.2.so|988b20c398c14bc4e1ff62df39edeba5ae904202
vendor/lib64/com.qualcomm.qti.uceservice@2.0.so|9fba788a6df8f3fdd86e9e16716acfcc07aa121d
vendor/lib64/com.qualcomm.qti.uceservice@2.1.so|86605caa308898745ec3fcf0882da3279b06db29
vendor/lib64/lib-imscmservice.so|ee1f88673ccdb9e94e96b9de8a808e6f11e624ed
vendor/lib64/lib-imsdpl.so|fb734fbd7833707cc9b65120fd4c8f93e3f4663c
vendor/lib64/lib-imsqimf.so|86cb96802ba81abd7601d08f9bef52cf8f08c202
vendor/lib64/lib-imsrcs-v2.so|d287ca0a3d1f762861071c92e5ad0f50a1900b26
vendor/lib64/lib-imsrcsbaseimpl.so|77e07c4ac1bfccee717d773433e7a04499493ff7
vendor/lib64/lib-imsvtcore.so|c878c4bca7a0f481b365e93e21818ed52aafee08
vendor/lib64/lib-imsxml.so|d6e7a7d7a4ce7f0b1508475e20bd4840847b4d98
vendor/lib64/lib-rtpcommon.so|89afbec10a1acc9783497e19aae256a6465ab31c
vendor/lib64/lib-rtpcore.so|5fcefd4135b7239534e2a5362c0f5a34fd792d9a
vendor/lib64/lib-rtpsl.so|d029a9164cda2b34296311be615b2a9cb844bb2b
vendor/lib64/lib-siputility.so|65ec399952eed4478851bc99e4d5e519a59e21a2
vendor/lib64/lib-uceservice.so|a6d9b6a6e79d272287bbbc0237de4f6bee527a5b
vendor/lib64/librcc.so|b4e1182d6a6a99e03a4bee0b795cf669ac075eb4
vendor/lib64/vendor.qti.hardware.radio.ims@1.0.so|25bf74687bfc377511bd3ad0565124555e5cd132
vendor/lib64/vendor.qti.hardware.radio.ims@1.1.so|96282d57c08a178d1ca4f4c4dfc32562d91284a5
vendor/lib64/vendor.qti.hardware.radio.ims@1.2.so|c0e0f373acdb66bc23db5386a78b310b982b5f54
vendor/lib64/vendor.qti.hardware.radio.ims@1.3.so|d09c4f5f88dbd448848dbf544e8739e31b87cc08
vendor/lib64/vendor.qti.hardware.radio.ims@1.4.so|7ec8f30fe49d648499ee7ec639a5d22505a12a43
vendor/lib64/vendor.qti.hardware.radio.ims@1.5.so|82343bf59ed284de116afe4a94ec420f3fa5952f
vendor/lib64/vendor.qti.hardware.radio.ims@1.6.so|c79ce389573c3ff1708e9699989cae1d122cbc90
vendor/lib64/vendor.qti.ims.callinfo@1.0.so|ebd8c3f0ebcccf5a8d5adbcd45f618e92c110a58
vendor/lib64/vendor.qti.ims.rcsconfig@1.0.so|38080477e0515ea698fb2cc7ed33f1d1a39cd1f4
vendor/lib64/vendor.qti.imsrtpservice@2.0.so|fdc13f23a021c98bd8f8ebb1169b2b5841f1f764
vendor/lib64/vendor.qti.imsrtpservice@2.1-service-Impl.so|0fb9dae5a902c89fc0467c7215772f837408cdcd
vendor/lib64/vendor.qti.imsrtpservice@2.1.so|7b227f1a007619dcae8d541eabe99eb5581d226d

# Soter - from jason V12.0.1.0.PCHCNXM
-app/SoterService/SoterService.apk|c6c6063f83588db6c572779624458a4d1f094213

# Soter - from jasmine
vendor/bin/hw/vendor.qti.hardware.soter@1.0-service|4f7e3c8a6cde9efefd8b9bf440fb1ed442e21fd3
vendor/etc/init/vendor.qti.hardware.soter@1.0-service.rc|76447a61ad5529949365eeb7e8ca000e48bd28ae
vendor/lib64/hw/vendor.qti.hardware.soter@1.0-impl.so|9cf774301dfb59173cc2a6871ff851ea6b546f39
vendor/lib64/vendor.qti.hardware.soter@1.0.so|5815859dc07d3181901596d06612b379e86fe6fd

# Time services - from jasmine
-vendor/app/TimeService/TimeService.apk|27f9b81621c446baa8c37581d9bfbca2fd67b496
vendor/bin/time_daemon|d647fa02dfb28b6cb981c4e77daee75a67406351
vendor/etc/init/init.time_daemon.rc|b253ca2a498757e14e1d7a051bf504ae09218f51
vendor/lib64/libtime_genoff.so|c8e0bbc9c6b7b5beddba43bc4125a9eaeba7c79f

# TUI - from jasmine
vendor/bin/hw/vendor.qti.hardware.tui_comm@1.0-service-qti|a0d692fe10ef9dc4479497fa666640612f06fbb4
vendor/etc/init/vendor.qti.hardware.tui_comm@1.0-service-qti.rc|2cfc563d7e1579374f001c94588fae7835a12ffc
vendor/lib64/vendor.qti.hardware.tui_comm@1.0.so|e47baed52f1c0637de34fa55e45a86b4b412a672

# Widevine - from jasmine
vendor/bin/hw/android.hardware.drm@1.2-service.widevine|1aed116c6cd73ee0c89a5eec050afab5c64b9f87
vendor/etc/init/android.hardware.drm@1.2-service.widevine.rc|dee5b7838ac561a2292e89fc0c4ccd1932224215
vendor/lib64/libwvhidl.so|0466cd3b2a7b93efd23945e2637430513472ad7c
