(kicad_sch (version 20211123) (generator eeschema)

  (uuid 91686bb5-7a82-42fb-9000-db29e45a41fa)

  (paper "A4")

  (title_block
    (title "piEreader Daughter Board")
    (date "2023-01-27")
    (rev "Rev 1")
    (company "Guyrandy Jean-Gilles")
    (comment 1 "Creative Commons SA 4.0")
  )

  (lib_symbols
    (symbol "Connector_Generic:Conn_01x07" (pin_names (offset 1.016) hide) (in_bom yes) (on_board yes)
      (property "Reference" "J" (id 0) (at 0 10.16 0)
        (effects (font (size 1.27 1.27)))
      )
      (property "Value" "Conn_01x07" (id 1) (at 0 -10.16 0)
        (effects (font (size 1.27 1.27)))
      )
      (property "Footprint" "" (id 2) (at 0 0 0)
        (effects (font (size 1.27 1.27)) hide)
      )
      (property "Datasheet" "~" (id 3) (at 0 0 0)
        (effects (font (size 1.27 1.27)) hide)
      )
      (property "ki_keywords" "connector" (id 4) (at 0 0 0)
        (effects (font (size 1.27 1.27)) hide)
      )
      (property "ki_description" "Generic connector, single row, 01x07, script generated (kicad-library-utils/schlib/autogen/connector/)" (id 5) (at 0 0 0)
        (effects (font (size 1.27 1.27)) hide)
      )
      (property "ki_fp_filters" "Connector*:*_1x??_*" (id 6) (at 0 0 0)
        (effects (font (size 1.27 1.27)) hide)
      )
      (symbol "Conn_01x07_1_1"
        (rectangle (start -1.27 -7.493) (end 0 -7.747)
          (stroke (width 0.1524) (type default) (color 0 0 0 0))
          (fill (type none))
        )
        (rectangle (start -1.27 -4.953) (end 0 -5.207)
          (stroke (width 0.1524) (type default) (color 0 0 0 0))
          (fill (type none))
        )
        (rectangle (start -1.27 -2.413) (end 0 -2.667)
          (stroke (width 0.1524) (type default) (color 0 0 0 0))
          (fill (type none))
        )
        (rectangle (start -1.27 0.127) (end 0 -0.127)
          (stroke (width 0.1524) (type default) (color 0 0 0 0))
          (fill (type none))
        )
        (rectangle (start -1.27 2.667) (end 0 2.413)
          (stroke (width 0.1524) (type default) (color 0 0 0 0))
          (fill (type none))
        )
        (rectangle (start -1.27 5.207) (end 0 4.953)
          (stroke (width 0.1524) (type default) (color 0 0 0 0))
          (fill (type none))
        )
        (rectangle (start -1.27 7.747) (end 0 7.493)
          (stroke (width 0.1524) (type default) (color 0 0 0 0))
          (fill (type none))
        )
        (rectangle (start -1.27 8.89) (end 1.27 -8.89)
          (stroke (width 0.254) (type default) (color 0 0 0 0))
          (fill (type background))
        )
        (pin passive line (at -5.08 7.62 0) (length 3.81)
          (name "Pin_1" (effects (font (size 1.27 1.27))))
          (number "1" (effects (font (size 1.27 1.27))))
        )
        (pin passive line (at -5.08 5.08 0) (length 3.81)
          (name "Pin_2" (effects (font (size 1.27 1.27))))
          (number "2" (effects (font (size 1.27 1.27))))
        )
        (pin passive line (at -5.08 2.54 0) (length 3.81)
          (name "Pin_3" (effects (font (size 1.27 1.27))))
          (number "3" (effects (font (size 1.27 1.27))))
        )
        (pin passive line (at -5.08 0 0) (length 3.81)
          (name "Pin_4" (effects (font (size 1.27 1.27))))
          (number "4" (effects (font (size 1.27 1.27))))
        )
        (pin passive line (at -5.08 -2.54 0) (length 3.81)
          (name "Pin_5" (effects (font (size 1.27 1.27))))
          (number "5" (effects (font (size 1.27 1.27))))
        )
        (pin passive line (at -5.08 -5.08 0) (length 3.81)
          (name "Pin_6" (effects (font (size 1.27 1.27))))
          (number "6" (effects (font (size 1.27 1.27))))
        )
        (pin passive line (at -5.08 -7.62 0) (length 3.81)
          (name "Pin_7" (effects (font (size 1.27 1.27))))
          (number "7" (effects (font (size 1.27 1.27))))
        )
      )
    )
    (symbol "Switch:SW_MEC_5E" (pin_names (offset 1.016) hide) (in_bom yes) (on_board yes)
      (property "Reference" "SW" (id 0) (at 0.635 5.715 0)
        (effects (font (size 1.27 1.27)) (justify left))
      )
      (property "Value" "SW_MEC_5E" (id 1) (at 0 -3.175 0)
        (effects (font (size 1.27 1.27)))
      )
      (property "Footprint" "" (id 2) (at 0 7.62 0)
        (effects (font (size 1.27 1.27)) hide)
      )
      (property "Datasheet" "http://www.apem.com/int/index.php?controller=attachment&id_attachment=1371" (id 3) (at 0 7.62 0)
        (effects (font (size 1.27 1.27)) hide)
      )
      (property "ki_keywords" "switch normally-open pushbutton push-button" (id 4) (at 0 0 0)
        (effects (font (size 1.27 1.27)) hide)
      )
      (property "ki_description" "MEC 5E single pole normally-open tactile switch" (id 5) (at 0 0 0)
        (effects (font (size 1.27 1.27)) hide)
      )
      (property "ki_fp_filters" "SW*MEC*5G*" (id 6) (at 0 0 0)
        (effects (font (size 1.27 1.27)) hide)
      )
      (symbol "SW_MEC_5E_0_1"
        (circle (center -1.778 2.54) (radius 0.508)
          (stroke (width 0) (type default) (color 0 0 0 0))
          (fill (type none))
        )
        (polyline
          (pts
            (xy -2.286 3.81)
            (xy 2.286 3.81)
          )
          (stroke (width 0) (type default) (color 0 0 0 0))
          (fill (type none))
        )
        (polyline
          (pts
            (xy 0 3.81)
            (xy 0 5.588)
          )
          (stroke (width 0) (type default) (color 0 0 0 0))
          (fill (type none))
        )
        (polyline
          (pts
            (xy -2.54 0)
            (xy -2.54 2.54)
            (xy -2.286 2.54)
          )
          (stroke (width 0) (type default) (color 0 0 0 0))
          (fill (type none))
        )
        (polyline
          (pts
            (xy 2.54 0)
            (xy 2.54 2.54)
            (xy 2.286 2.54)
          )
          (stroke (width 0) (type default) (color 0 0 0 0))
          (fill (type none))
        )
        (circle (center 1.778 2.54) (radius 0.508)
          (stroke (width 0) (type default) (color 0 0 0 0))
          (fill (type none))
        )
        (pin passive line (at -5.08 2.54 0) (length 2.54)
          (name "1" (effects (font (size 1.27 1.27))))
          (number "1" (effects (font (size 1.27 1.27))))
        )
        (pin passive line (at -5.08 0 0) (length 2.54)
          (name "2" (effects (font (size 1.27 1.27))))
          (number "2" (effects (font (size 1.27 1.27))))
        )
        (pin passive line (at 5.08 0 180) (length 2.54)
          (name "K" (effects (font (size 1.27 1.27))))
          (number "3" (effects (font (size 1.27 1.27))))
        )
        (pin passive line (at 5.08 2.54 180) (length 2.54)
          (name "A" (effects (font (size 1.27 1.27))))
          (number "4" (effects (font (size 1.27 1.27))))
        )
      )
    )
    (symbol "power:+3V3" (power) (pin_names (offset 0)) (in_bom yes) (on_board yes)
      (property "Reference" "#PWR" (id 0) (at 0 -3.81 0)
        (effects (font (size 1.27 1.27)) hide)
      )
      (property "Value" "+3V3" (id 1) (at 0 3.556 0)
        (effects (font (size 1.27 1.27)))
      )
      (property "Footprint" "" (id 2) (at 0 0 0)
        (effects (font (size 1.27 1.27)) hide)
      )
      (property "Datasheet" "" (id 3) (at 0 0 0)
        (effects (font (size 1.27 1.27)) hide)
      )
      (property "ki_keywords" "power-flag" (id 4) (at 0 0 0)
        (effects (font (size 1.27 1.27)) hide)
      )
      (property "ki_description" "Power symbol creates a global label with name \"+3V3\"" (id 5) (at 0 0 0)
        (effects (font (size 1.27 1.27)) hide)
      )
      (symbol "+3V3_0_1"
        (polyline
          (pts
            (xy -0.762 1.27)
            (xy 0 2.54)
          )
          (stroke (width 0) (type default) (color 0 0 0 0))
          (fill (type none))
        )
        (polyline
          (pts
            (xy 0 0)
            (xy 0 2.54)
          )
          (stroke (width 0) (type default) (color 0 0 0 0))
          (fill (type none))
        )
        (polyline
          (pts
            (xy 0 2.54)
            (xy 0.762 1.27)
          )
          (stroke (width 0) (type default) (color 0 0 0 0))
          (fill (type none))
        )
      )
      (symbol "+3V3_1_1"
        (pin power_in line (at 0 0 90) (length 0) hide
          (name "+3V3" (effects (font (size 1.27 1.27))))
          (number "1" (effects (font (size 1.27 1.27))))
        )
      )
    )
    (symbol "power:GND" (power) (pin_names (offset 0)) (in_bom yes) (on_board yes)
      (property "Reference" "#PWR" (id 0) (at 0 -6.35 0)
        (effects (font (size 1.27 1.27)) hide)
      )
      (property "Value" "GND" (id 1) (at 0 -3.81 0)
        (effects (font (size 1.27 1.27)))
      )
      (property "Footprint" "" (id 2) (at 0 0 0)
        (effects (font (size 1.27 1.27)) hide)
      )
      (property "Datasheet" "" (id 3) (at 0 0 0)
        (effects (font (size 1.27 1.27)) hide)
      )
      (property "ki_keywords" "power-flag" (id 4) (at 0 0 0)
        (effects (font (size 1.27 1.27)) hide)
      )
      (property "ki_description" "Power symbol creates a global label with name \"GND\" , ground" (id 5) (at 0 0 0)
        (effects (font (size 1.27 1.27)) hide)
      )
      (symbol "GND_0_1"
        (polyline
          (pts
            (xy 0 0)
            (xy 0 -1.27)
            (xy 1.27 -1.27)
            (xy 0 -2.54)
            (xy -1.27 -1.27)
            (xy 0 -1.27)
          )
          (stroke (width 0) (type default) (color 0 0 0 0))
          (fill (type none))
        )
      )
      (symbol "GND_1_1"
        (pin power_in line (at 0 0 270) (length 0) hide
          (name "GND" (effects (font (size 1.27 1.27))))
          (number "1" (effects (font (size 1.27 1.27))))
        )
      )
    )
    (symbol "power:PWR_FLAG" (power) (pin_numbers hide) (pin_names (offset 0) hide) (in_bom yes) (on_board yes)
      (property "Reference" "#FLG" (id 0) (at 0 1.905 0)
        (effects (font (size 1.27 1.27)) hide)
      )
      (property "Value" "PWR_FLAG" (id 1) (at 0 3.81 0)
        (effects (font (size 1.27 1.27)))
      )
      (property "Footprint" "" (id 2) (at 0 0 0)
        (effects (font (size 1.27 1.27)) hide)
      )
      (property "Datasheet" "~" (id 3) (at 0 0 0)
        (effects (font (size 1.27 1.27)) hide)
      )
      (property "ki_keywords" "power-flag" (id 4) (at 0 0 0)
        (effects (font (size 1.27 1.27)) hide)
      )
      (property "ki_description" "Special symbol for telling ERC where power comes from" (id 5) (at 0 0 0)
        (effects (font (size 1.27 1.27)) hide)
      )
      (symbol "PWR_FLAG_0_0"
        (pin power_out line (at 0 0 90) (length 0)
          (name "pwr" (effects (font (size 1.27 1.27))))
          (number "1" (effects (font (size 1.27 1.27))))
        )
      )
      (symbol "PWR_FLAG_0_1"
        (polyline
          (pts
            (xy 0 0)
            (xy 0 1.27)
            (xy -1.016 1.905)
            (xy 0 2.54)
            (xy 1.016 1.905)
            (xy 0 1.27)
          )
          (stroke (width 0) (type default) (color 0 0 0 0))
          (fill (type none))
        )
      )
    )
  )

  (junction (at 167.64 74.93) (diameter 0) (color 0 0 0 0)
    (uuid 62db8e3b-6561-4e26-83c3-14528f0b407d)
  )
  (junction (at 170.18 102.87) (diameter 0) (color 0 0 0 0)
    (uuid aafe30f6-950f-4f66-8450-9d9ba8b7e6cf)
  )

  (no_connect (at 116.84 77.47) (uuid f28aeed1-04b4-4af4-8169-fc00de91b586))
  (no_connect (at 127 74.93) (uuid f28aeed1-04b4-4af4-8169-fc00de91b587))
  (no_connect (at 127 96.52) (uuid f28aeed1-04b4-4af4-8169-fc00de91b588))
  (no_connect (at 127 54.61) (uuid f28aeed1-04b4-4af4-8169-fc00de91b589))
  (no_connect (at 116.84 57.15) (uuid f28aeed1-04b4-4af4-8169-fc00de91b58a))
  (no_connect (at 116.84 142.24) (uuid f28aeed1-04b4-4af4-8169-fc00de91b58b))
  (no_connect (at 127 139.7) (uuid f28aeed1-04b4-4af4-8169-fc00de91b58c))
  (no_connect (at 127 118.11) (uuid f28aeed1-04b4-4af4-8169-fc00de91b58d))
  (no_connect (at 116.84 120.65) (uuid f28aeed1-04b4-4af4-8169-fc00de91b58e))
  (no_connect (at 116.84 99.06) (uuid f28aeed1-04b4-4af4-8169-fc00de91b58f))

  (wire (pts (xy 147.32 57.15) (xy 147.32 88.9))
    (stroke (width 0) (type default) (color 0 0 0 0))
    (uuid 12d18e20-3a6e-4b7f-ac40-5879c5d47e0c)
  )
  (wire (pts (xy 186.69 86.36) (xy 167.64 86.36))
    (stroke (width 0) (type default) (color 0 0 0 0))
    (uuid 3118f219-32ae-4a9a-bdf2-73445da15b06)
  )
  (wire (pts (xy 147.32 57.15) (xy 127 57.15))
    (stroke (width 0) (type default) (color 0 0 0 0))
    (uuid 3563f4d1-0c25-424e-9bd4-38e4c73cc687)
  )
  (wire (pts (xy 111.76 54.61) (xy 111.76 46.99))
    (stroke (width 0) (type default) (color 0 0 0 0))
    (uuid 3e528c84-7d54-4ffe-a586-9bee295561a4)
  )
  (wire (pts (xy 116.84 54.61) (xy 111.76 54.61))
    (stroke (width 0) (type default) (color 0 0 0 0))
    (uuid 4d6b2de1-4d2c-493a-b338-56fa7f9e678f)
  )
  (wire (pts (xy 186.69 88.9) (xy 147.32 88.9))
    (stroke (width 0) (type default) (color 0 0 0 0))
    (uuid 517a5fd9-9731-41ab-9d1e-7268d233c3ee)
  )
  (wire (pts (xy 186.69 96.52) (xy 147.32 96.52))
    (stroke (width 0) (type default) (color 0 0 0 0))
    (uuid 5fe3b711-12d7-4aeb-a270-124c3cfa9290)
  )
  (wire (pts (xy 167.64 74.93) (xy 167.64 86.36))
    (stroke (width 0) (type default) (color 0 0 0 0))
    (uuid 6714140a-b45e-4788-8772-de1278bbd131)
  )
  (wire (pts (xy 116.84 74.93) (xy 111.76 74.93))
    (stroke (width 0) (type default) (color 0 0 0 0))
    (uuid 6be3305e-01c1-485c-9047-0558e5fb80e5)
  )
  (wire (pts (xy 143.51 99.06) (xy 127 99.06))
    (stroke (width 0) (type default) (color 0 0 0 0))
    (uuid 711fdc99-019e-4f5a-a6bc-f73b8589a3ec)
  )
  (wire (pts (xy 111.76 74.93) (xy 111.76 67.31))
    (stroke (width 0) (type default) (color 0 0 0 0))
    (uuid 7b23dc4c-9ecc-4aa7-bceb-877fa18581ce)
  )
  (wire (pts (xy 147.32 96.52) (xy 147.32 120.65))
    (stroke (width 0) (type default) (color 0 0 0 0))
    (uuid 7b7d8e3e-b5e8-444f-a5fa-dc276ccbd78f)
  )
  (wire (pts (xy 116.84 139.7) (xy 111.76 139.7))
    (stroke (width 0) (type default) (color 0 0 0 0))
    (uuid 7d4c4446-1d39-45ae-9e07-0c2c2ef635a7)
  )
  (wire (pts (xy 143.51 93.98) (xy 143.51 99.06))
    (stroke (width 0) (type default) (color 0 0 0 0))
    (uuid 97b54594-aaf9-4886-b88e-b2a6d75abef8)
  )
  (wire (pts (xy 143.51 77.47) (xy 127 77.47))
    (stroke (width 0) (type default) (color 0 0 0 0))
    (uuid 9f021692-b7d9-4314-bc76-e886c924b952)
  )
  (wire (pts (xy 186.69 91.44) (xy 143.51 91.44))
    (stroke (width 0) (type default) (color 0 0 0 0))
    (uuid ad37c17d-f37a-4410-a4f9-de82c3c8ab0a)
  )
  (wire (pts (xy 167.64 72.39) (xy 167.64 74.93))
    (stroke (width 0) (type default) (color 0 0 0 0))
    (uuid b127294a-e7fb-47b1-9557-3ef640930d9f)
  )
  (wire (pts (xy 127 120.65) (xy 147.32 120.65))
    (stroke (width 0) (type default) (color 0 0 0 0))
    (uuid b28fd3d1-de6b-40cc-bca7-bbf9facd393c)
  )
  (wire (pts (xy 186.69 83.82) (xy 170.18 83.82))
    (stroke (width 0) (type default) (color 0 0 0 0))
    (uuid b6fe02f9-2fe3-4083-aa6b-6b5c42c23b68)
  )
  (wire (pts (xy 170.18 83.82) (xy 170.18 102.87))
    (stroke (width 0) (type default) (color 0 0 0 0))
    (uuid bd43d280-f837-43a1-82ea-fe58bbcf8427)
  )
  (wire (pts (xy 127 142.24) (xy 151.13 142.24))
    (stroke (width 0) (type default) (color 0 0 0 0))
    (uuid c7b3ef16-e1fa-4bb2-8a64-176446d97278)
  )
  (wire (pts (xy 186.69 99.06) (xy 151.13 99.06))
    (stroke (width 0) (type default) (color 0 0 0 0))
    (uuid c8421733-21ba-4333-837e-9841c2ef53f3)
  )
  (wire (pts (xy 151.13 99.06) (xy 151.13 142.24))
    (stroke (width 0) (type default) (color 0 0 0 0))
    (uuid c8a5000a-e476-48ec-8326-1ffc2e04bbcb)
  )
  (wire (pts (xy 186.69 93.98) (xy 143.51 93.98))
    (stroke (width 0) (type default) (color 0 0 0 0))
    (uuid d38646b7-e165-48b3-b457-f3b076148f9b)
  )
  (wire (pts (xy 170.18 102.87) (xy 170.18 105.41))
    (stroke (width 0) (type default) (color 0 0 0 0))
    (uuid d92585aa-452e-4bb8-9772-e4eb958de396)
  )
  (wire (pts (xy 111.76 118.11) (xy 111.76 110.49))
    (stroke (width 0) (type default) (color 0 0 0 0))
    (uuid dd86176e-4183-41ee-b213-8f95bd21fce9)
  )
  (wire (pts (xy 143.51 91.44) (xy 143.51 77.47))
    (stroke (width 0) (type default) (color 0 0 0 0))
    (uuid e3ef14c8-b98d-44d8-a3d5-171d9e8300da)
  )
  (wire (pts (xy 116.84 96.52) (xy 111.76 96.52))
    (stroke (width 0) (type default) (color 0 0 0 0))
    (uuid ece1de81-5665-41cd-a25a-4d8864505a84)
  )
  (wire (pts (xy 111.76 139.7) (xy 111.76 132.08))
    (stroke (width 0) (type default) (color 0 0 0 0))
    (uuid f54839a1-4c31-409b-83a5-8cfa0a95890b)
  )
  (wire (pts (xy 111.76 96.52) (xy 111.76 88.9))
    (stroke (width 0) (type default) (color 0 0 0 0))
    (uuid f8a316b7-0e2b-4281-bc96-b006fe255773)
  )
  (wire (pts (xy 116.84 118.11) (xy 111.76 118.11))
    (stroke (width 0) (type default) (color 0 0 0 0))
    (uuid fe320a13-46e3-4b06-9432-a0876cf3fed6)
  )

  (text "Inteneral resistors will pull each GPIO pin down." (at 147.32 53.34 0)
    (effects (font (size 1.27 1.27)) (justify left bottom))
    (uuid eb1b2aa2-a3cc-4a96-87ec-70fcae365f0f)
  )

  (label "GPIO22(GEN3)" (at 128.27 77.47 0)
    (effects (font (size 1.27 1.27)) (justify left bottom))
    (uuid 1865020b-537d-484c-9ced-8061fbd10159)
  )
  (label "GPIO23(GEN4)" (at 172.72 93.98 0)
    (effects (font (size 1.27 1.27)) (justify left bottom))
    (uuid 1c669d58-a53d-4501-99e9-89b6295ff8db)
  )
  (label "GPIO27(GEN2)" (at 172.72 88.9 0)
    (effects (font (size 1.27 1.27)) (justify left bottom))
    (uuid 2d58ea71-8992-428d-b843-de6198026b09)
  )
  (label "GPIO23(GEN4)" (at 128.27 99.06 0)
    (effects (font (size 1.27 1.27)) (justify left bottom))
    (uuid 30c64bd1-d89e-42a7-b959-422182fb6ca2)
  )
  (label "GPIO22(GEN3)" (at 172.72 91.44 0)
    (effects (font (size 1.27 1.27)) (justify left bottom))
    (uuid 371691f2-143f-438c-aa8b-f9da5b7e1f88)
  )
  (label "GPIO5" (at 128.27 120.65 0)
    (effects (font (size 1.27 1.27)) (justify left bottom))
    (uuid 5a65cdc1-6cbd-4f67-9c55-bf5dcee8e970)
  )
  (label "GPIO26" (at 128.27 142.24 0)
    (effects (font (size 1.27 1.27)) (justify left bottom))
    (uuid 5ce5f99b-d600-4746-a2e2-030ed8a935cb)
  )
  (label "GPIO26" (at 172.72 99.06 0)
    (effects (font (size 1.27 1.27)) (justify left bottom))
    (uuid 72ab7287-f7b7-4e4c-a21d-e98ae501700b)
  )
  (label "GPIO27(GEN2)" (at 128.27 57.15 0)
    (effects (font (size 1.27 1.27)) (justify left bottom))
    (uuid 90de5409-ca1e-410f-888b-d6ce06252c11)
  )
  (label "GPIO5" (at 172.72 96.52 0)
    (effects (font (size 1.27 1.27)) (justify left bottom))
    (uuid f23a3d04-41e2-4110-abe1-c0c05ae3c388)
  )

  (symbol (lib_id "power:+3V3") (at 111.76 132.08 0) (unit 1)
    (in_bom yes) (on_board yes) (fields_autoplaced)
    (uuid 1b1523df-977b-4912-b1a6-33af55db9b50)
    (property "Reference" "#PWR0106" (id 0) (at 111.76 135.89 0)
      (effects (font (size 1.27 1.27)) hide)
    )
    (property "Value" "+3V3" (id 1) (at 111.76 127 0))
    (property "Footprint" "" (id 2) (at 111.76 132.08 0)
      (effects (font (size 1.27 1.27)) hide)
    )
    (property "Datasheet" "" (id 3) (at 111.76 132.08 0)
      (effects (font (size 1.27 1.27)) hide)
    )
    (pin "1" (uuid 0de52315-91f0-436a-8d65-80cb33834cfe))
  )

  (symbol (lib_id "Connector_Generic:Conn_01x07") (at 191.77 91.44 0) (unit 1)
    (in_bom yes) (on_board yes) (fields_autoplaced)
    (uuid 1cb5053a-6826-45d6-9868-74e43185d90b)
    (property "Reference" "J2" (id 0) (at 194.31 90.1699 0)
      (effects (font (size 1.27 1.27)) (justify left))
    )
    (property "Value" "Conn_01x07" (id 1) (at 194.31 92.7099 0)
      (effects (font (size 1.27 1.27)) (justify left))
    )
    (property "Footprint" "piEreader:Molex_PicoBlade_53048-0710_1x07_P1.25mm_Horizontal" (id 2) (at 191.77 91.44 0)
      (effects (font (size 1.27 1.27)) hide)
    )
    (property "Datasheet" "~" (id 3) (at 191.77 91.44 0)
      (effects (font (size 1.27 1.27)) hide)
    )
    (pin "1" (uuid cbf3391b-34b0-4eb6-998a-05f2a4514e9a))
    (pin "2" (uuid b0d4ce2a-8cc0-4ca3-8181-bb1dd7b972d2))
    (pin "3" (uuid 305fd381-524a-4a7d-8de5-c33ca2e2d79e))
    (pin "4" (uuid cf23a361-13a9-4e6e-ac17-0635d0eba55c))
    (pin "5" (uuid 78c8280f-f1af-4ae7-9b06-c909666b93d7))
    (pin "6" (uuid 9349f3a6-c519-4eb0-9954-e3b37f9f23c4))
    (pin "7" (uuid 22fcd17e-1dbc-42a7-a925-719c0087999d))
  )

  (symbol (lib_id "power:+3V3") (at 111.76 46.99 0) (unit 1)
    (in_bom yes) (on_board yes) (fields_autoplaced)
    (uuid 2c90a84b-e2fb-41b4-9970-599c36ed4982)
    (property "Reference" "#PWR0105" (id 0) (at 111.76 50.8 0)
      (effects (font (size 1.27 1.27)) hide)
    )
    (property "Value" "+3V3" (id 1) (at 111.76 41.91 0))
    (property "Footprint" "" (id 2) (at 111.76 46.99 0)
      (effects (font (size 1.27 1.27)) hide)
    )
    (property "Datasheet" "" (id 3) (at 111.76 46.99 0)
      (effects (font (size 1.27 1.27)) hide)
    )
    (pin "1" (uuid 3bfce2d4-77be-4acb-b80b-4f290d51be2c))
  )

  (symbol (lib_id "Switch:SW_MEC_5E") (at 121.92 99.06 0) (unit 1)
    (in_bom yes) (on_board yes) (fields_autoplaced)
    (uuid 2fdd499f-2c2a-435b-b9db-b598648bc059)
    (property "Reference" "SW3" (id 0) (at 121.92 88.9 0))
    (property "Value" "SW_MEC_5E" (id 1) (at 121.92 91.44 0))
    (property "Footprint" "piEreader:SW_TH_Tactile_Omron_B3F-100xx" (id 2) (at 121.92 91.44 0)
      (effects (font (size 1.27 1.27)) hide)
    )
    (property "Datasheet" "http://www.apem.com/int/index.php?controller=attachment&id_attachment=1371" (id 3) (at 121.92 91.44 0)
      (effects (font (size 1.27 1.27)) hide)
    )
    (pin "1" (uuid 4ac0f8c6-f91b-46fe-bdfc-85e863f1232f))
    (pin "2" (uuid 34948550-a4f3-4baf-8fb4-ff8c30459c3a))
    (pin "3" (uuid 5db332e5-863d-407e-907a-22f91b19084d))
    (pin "4" (uuid 2c5267fa-b9bd-461b-99ce-b1b07c3a7fe9))
  )

  (symbol (lib_id "power:PWR_FLAG") (at 167.64 74.93 270) (unit 1)
    (in_bom yes) (on_board yes) (fields_autoplaced)
    (uuid 594eb499-401a-4092-9a2b-1cc8f8989e5b)
    (property "Reference" "#FLG0101" (id 0) (at 169.545 74.93 0)
      (effects (font (size 1.27 1.27)) hide)
    )
    (property "Value" "PWR_FLAG" (id 1) (at 171.45 74.9299 90)
      (effects (font (size 1.27 1.27)) (justify left))
    )
    (property "Footprint" "" (id 2) (at 167.64 74.93 0)
      (effects (font (size 1.27 1.27)) hide)
    )
    (property "Datasheet" "~" (id 3) (at 167.64 74.93 0)
      (effects (font (size 1.27 1.27)) hide)
    )
    (pin "1" (uuid 47472735-41ec-4096-96fb-ce611f148c4c))
  )

  (symbol (lib_id "Switch:SW_MEC_5E") (at 121.92 77.47 0) (unit 1)
    (in_bom yes) (on_board yes) (fields_autoplaced)
    (uuid 6061bf4a-3db5-4587-a225-1c033182e011)
    (property "Reference" "SW2" (id 0) (at 121.92 67.31 0))
    (property "Value" "SW_MEC_5E" (id 1) (at 121.92 69.85 0))
    (property "Footprint" "piEreader:SW_TH_Tactile_Omron_B3F-100xx" (id 2) (at 121.92 69.85 0)
      (effects (font (size 1.27 1.27)) hide)
    )
    (property "Datasheet" "http://www.apem.com/int/index.php?controller=attachment&id_attachment=1371" (id 3) (at 121.92 69.85 0)
      (effects (font (size 1.27 1.27)) hide)
    )
    (pin "1" (uuid 45c35e5e-f3ca-4609-81d2-c675bffa910c))
    (pin "2" (uuid 7cc0d007-ac34-4904-abd4-64c1bcdd68f0))
    (pin "3" (uuid 9257c6df-f202-470d-87f4-0ed96b161e88))
    (pin "4" (uuid b6d0518a-c047-4561-975d-e80d7aa6cc31))
  )

  (symbol (lib_id "Switch:SW_MEC_5E") (at 121.92 142.24 0) (unit 1)
    (in_bom yes) (on_board yes) (fields_autoplaced)
    (uuid 721c78ae-4f76-41de-bd86-5e491e51ea82)
    (property "Reference" "SW5" (id 0) (at 121.92 132.08 0))
    (property "Value" "SW_MEC_5E" (id 1) (at 121.92 134.62 0))
    (property "Footprint" "piEreader:SW_TH_Tactile_Omron_B3F-100xx" (id 2) (at 121.92 134.62 0)
      (effects (font (size 1.27 1.27)) hide)
    )
    (property "Datasheet" "http://www.apem.com/int/index.php?controller=attachment&id_attachment=1371" (id 3) (at 121.92 134.62 0)
      (effects (font (size 1.27 1.27)) hide)
    )
    (pin "1" (uuid 1c15b548-a6ce-4dba-ac8b-2a8b11428335))
    (pin "2" (uuid 083a872f-9f03-49d3-8f0e-1cce2859fbeb))
    (pin "3" (uuid 2324d177-3589-4550-958d-5c9b3c825b51))
    (pin "4" (uuid 89c263fe-88cd-4c8c-b232-c27295cc6a94))
  )

  (symbol (lib_id "Switch:SW_MEC_5E") (at 121.92 120.65 0) (unit 1)
    (in_bom yes) (on_board yes) (fields_autoplaced)
    (uuid 7f743305-a8ea-470b-9dee-f1f81edd32c2)
    (property "Reference" "SW4" (id 0) (at 121.92 110.49 0))
    (property "Value" "SW_MEC_5E" (id 1) (at 121.92 113.03 0))
    (property "Footprint" "piEreader:SW_TH_Tactile_Omron_B3F-100xx" (id 2) (at 121.92 113.03 0)
      (effects (font (size 1.27 1.27)) hide)
    )
    (property "Datasheet" "http://www.apem.com/int/index.php?controller=attachment&id_attachment=1371" (id 3) (at 121.92 113.03 0)
      (effects (font (size 1.27 1.27)) hide)
    )
    (pin "1" (uuid 77b31455-7259-4deb-8560-70fda1e9886b))
    (pin "2" (uuid f6fe6e32-30e8-476e-9292-428f465eea70))
    (pin "3" (uuid 17d9c70e-4077-4570-9769-20c4dbd5155a))
    (pin "4" (uuid f0ab5d34-6865-43cb-90fc-c8dc50c6c356))
  )

  (symbol (lib_id "power:GND") (at 170.18 105.41 0) (unit 1)
    (in_bom yes) (on_board yes) (fields_autoplaced)
    (uuid 85a664fb-fcef-4c25-bce3-eb1ac336ff52)
    (property "Reference" "#PWR012" (id 0) (at 170.18 111.76 0)
      (effects (font (size 1.27 1.27)) hide)
    )
    (property "Value" "GND" (id 1) (at 170.18 110.49 0))
    (property "Footprint" "" (id 2) (at 170.18 105.41 0)
      (effects (font (size 1.27 1.27)) hide)
    )
    (property "Datasheet" "" (id 3) (at 170.18 105.41 0)
      (effects (font (size 1.27 1.27)) hide)
    )
    (pin "1" (uuid 8409c241-091e-4b7c-a3aa-448d723bc8e8))
  )

  (symbol (lib_id "Switch:SW_MEC_5E") (at 121.92 57.15 0) (unit 1)
    (in_bom yes) (on_board yes) (fields_autoplaced)
    (uuid 9c7706f6-1591-43a2-b50e-44d393a156e4)
    (property "Reference" "SW1" (id 0) (at 121.92 46.99 0))
    (property "Value" "SW_MEC_5E" (id 1) (at 121.92 49.53 0))
    (property "Footprint" "piEreader:SW_TH_Tactile_Omron_B3F-100xx" (id 2) (at 121.92 49.53 0)
      (effects (font (size 1.27 1.27)) hide)
    )
    (property "Datasheet" "http://www.apem.com/int/index.php?controller=attachment&id_attachment=1371" (id 3) (at 121.92 49.53 0)
      (effects (font (size 1.27 1.27)) hide)
    )
    (pin "1" (uuid 11831d8e-3347-4947-a7ab-520a174c1695))
    (pin "2" (uuid d5aaefbd-0670-426a-9974-3956d6cdf7ff))
    (pin "3" (uuid ed79f4d1-ac16-44ae-b127-4dadf0d3648a))
    (pin "4" (uuid 01e9714a-3cb3-4d90-a3a6-108ccc7c2640))
  )

  (symbol (lib_id "power:PWR_FLAG") (at 170.18 102.87 270) (unit 1)
    (in_bom yes) (on_board yes) (fields_autoplaced)
    (uuid 9fd9e8ec-fc98-4154-ad2e-11ac105668bf)
    (property "Reference" "#FLG0102" (id 0) (at 172.085 102.87 0)
      (effects (font (size 1.27 1.27)) hide)
    )
    (property "Value" "PWR_FLAG" (id 1) (at 173.99 102.8699 90)
      (effects (font (size 1.27 1.27)) (justify left))
    )
    (property "Footprint" "" (id 2) (at 170.18 102.87 0)
      (effects (font (size 1.27 1.27)) hide)
    )
    (property "Datasheet" "~" (id 3) (at 170.18 102.87 0)
      (effects (font (size 1.27 1.27)) hide)
    )
    (pin "1" (uuid e1bb8278-8661-48b3-8c4a-2e2543ea53b5))
  )

  (symbol (lib_id "power:+3V3") (at 167.64 72.39 0) (unit 1)
    (in_bom yes) (on_board yes) (fields_autoplaced)
    (uuid aa228f0e-8638-47f4-8980-2bf3c05dc636)
    (property "Reference" "#PWR0108" (id 0) (at 167.64 76.2 0)
      (effects (font (size 1.27 1.27)) hide)
    )
    (property "Value" "+3V3" (id 1) (at 167.64 67.31 0))
    (property "Footprint" "" (id 2) (at 167.64 72.39 0)
      (effects (font (size 1.27 1.27)) hide)
    )
    (property "Datasheet" "" (id 3) (at 167.64 72.39 0)
      (effects (font (size 1.27 1.27)) hide)
    )
    (pin "1" (uuid 88350172-7586-4942-8543-a3defd62f285))
  )

  (symbol (lib_id "power:+3V3") (at 111.76 110.49 0) (unit 1)
    (in_bom yes) (on_board yes) (fields_autoplaced)
    (uuid e242ce66-55ea-483a-994e-2585b7e75f33)
    (property "Reference" "#PWR0107" (id 0) (at 111.76 114.3 0)
      (effects (font (size 1.27 1.27)) hide)
    )
    (property "Value" "+3V3" (id 1) (at 111.76 105.41 0))
    (property "Footprint" "" (id 2) (at 111.76 110.49 0)
      (effects (font (size 1.27 1.27)) hide)
    )
    (property "Datasheet" "" (id 3) (at 111.76 110.49 0)
      (effects (font (size 1.27 1.27)) hide)
    )
    (pin "1" (uuid 3e0e88aa-3e9b-488b-8ac1-df465c4da286))
  )

  (symbol (lib_id "power:+3V3") (at 111.76 88.9 0) (unit 1)
    (in_bom yes) (on_board yes) (fields_autoplaced)
    (uuid eb75f13a-445e-402d-aa79-0933d9fc2277)
    (property "Reference" "#PWR0104" (id 0) (at 111.76 92.71 0)
      (effects (font (size 1.27 1.27)) hide)
    )
    (property "Value" "+3V3" (id 1) (at 111.76 83.82 0))
    (property "Footprint" "" (id 2) (at 111.76 88.9 0)
      (effects (font (size 1.27 1.27)) hide)
    )
    (property "Datasheet" "" (id 3) (at 111.76 88.9 0)
      (effects (font (size 1.27 1.27)) hide)
    )
    (pin "1" (uuid 5a2afeb8-784f-42ee-b657-6adc4f7bb8f2))
  )

  (symbol (lib_id "power:+3V3") (at 111.76 67.31 0) (unit 1)
    (in_bom yes) (on_board yes) (fields_autoplaced)
    (uuid f354b158-00b8-4d42-bdca-9566a0c2fd13)
    (property "Reference" "#PWR0103" (id 0) (at 111.76 71.12 0)
      (effects (font (size 1.27 1.27)) hide)
    )
    (property "Value" "+3V3" (id 1) (at 111.76 62.23 0))
    (property "Footprint" "" (id 2) (at 111.76 67.31 0)
      (effects (font (size 1.27 1.27)) hide)
    )
    (property "Datasheet" "" (id 3) (at 111.76 67.31 0)
      (effects (font (size 1.27 1.27)) hide)
    )
    (pin "1" (uuid 89630a6f-6e88-42e0-956b-de599370e06d))
  )

  (sheet_instances
    (path "/" (page "1"))
  )

  (symbol_instances
    (path "/594eb499-401a-4092-9a2b-1cc8f8989e5b"
      (reference "#FLG0101") (unit 1) (value "PWR_FLAG") (footprint "")
    )
    (path "/9fd9e8ec-fc98-4154-ad2e-11ac105668bf"
      (reference "#FLG0102") (unit 1) (value "PWR_FLAG") (footprint "")
    )
    (path "/85a664fb-fcef-4c25-bce3-eb1ac336ff52"
      (reference "#PWR012") (unit 1) (value "GND") (footprint "")
    )
    (path "/f354b158-00b8-4d42-bdca-9566a0c2fd13"
      (reference "#PWR0103") (unit 1) (value "+3V3") (footprint "")
    )
    (path "/eb75f13a-445e-402d-aa79-0933d9fc2277"
      (reference "#PWR0104") (unit 1) (value "+3V3") (footprint "")
    )
    (path "/2c90a84b-e2fb-41b4-9970-599c36ed4982"
      (reference "#PWR0105") (unit 1) (value "+3V3") (footprint "")
    )
    (path "/1b1523df-977b-4912-b1a6-33af55db9b50"
      (reference "#PWR0106") (unit 1) (value "+3V3") (footprint "")
    )
    (path "/e242ce66-55ea-483a-994e-2585b7e75f33"
      (reference "#PWR0107") (unit 1) (value "+3V3") (footprint "")
    )
    (path "/aa228f0e-8638-47f4-8980-2bf3c05dc636"
      (reference "#PWR0108") (unit 1) (value "+3V3") (footprint "")
    )
    (path "/1cb5053a-6826-45d6-9868-74e43185d90b"
      (reference "J2") (unit 1) (value "Conn_01x07") (footprint "piEreader:Molex_PicoBlade_53048-0710_1x07_P1.25mm_Horizontal")
    )
    (path "/9c7706f6-1591-43a2-b50e-44d393a156e4"
      (reference "SW1") (unit 1) (value "SW_MEC_5E") (footprint "piEreader:SW_TH_Tactile_Omron_B3F-100xx")
    )
    (path "/6061bf4a-3db5-4587-a225-1c033182e011"
      (reference "SW2") (unit 1) (value "SW_MEC_5E") (footprint "piEreader:SW_TH_Tactile_Omron_B3F-100xx")
    )
    (path "/2fdd499f-2c2a-435b-b9db-b598648bc059"
      (reference "SW3") (unit 1) (value "SW_MEC_5E") (footprint "piEreader:SW_TH_Tactile_Omron_B3F-100xx")
    )
    (path "/7f743305-a8ea-470b-9dee-f1f81edd32c2"
      (reference "SW4") (unit 1) (value "SW_MEC_5E") (footprint "piEreader:SW_TH_Tactile_Omron_B3F-100xx")
    )
    (path "/721c78ae-4f76-41de-bd86-5e491e51ea82"
      (reference "SW5") (unit 1) (value "SW_MEC_5E") (footprint "piEreader:SW_TH_Tactile_Omron_B3F-100xx")
    )
  )
)
