<?xml version="1.0" encoding="utf-8"?>
<!-- Generator: Adobe Illustrator 23.0.0, SVG Export Plug-In . SVG Version: 6.00 Build 0)  -->
<svg version="1.1" id="Layer_1" xmlns="http://www.w3.org/2000/svg" xmlns:xlink="http://www.w3.org/1999/xlink" x="0px" y="0px"
	 viewBox="0 0 64 59" style="enable-background:new 0 0 64 59;" xml:space="preserve">
<style type="text/css">
	.st0{fill:none;stroke:#3C4E5F;stroke-width:0.5;}
	.st1{fill:#3C4E5F;}
	.st2{fill:none;stroke:#3C4E5F;stroke-width:0.5;stroke-dasharray:2,1;}
</style>
<g>
	<line class="st0" x1="18.6" y1="50" x2="18.6" y2="52.1"/>
	<line class="st0" x1="18.3" y1="52.1" x2="44.4" y2="52.1"/>
	<polyline class="st0" points="44.4,52.1 44.7,52.1 44.7,50 44.4,50 	"/>
	<path class="st0" d="M3,6.9L3,6.9C2.8,6.9,2.6,7,2.5,7.1C2.4,7.3,2.3,7.5,2.3,7.7v0v39.2v0c0,0.2,0.1,0.4,0.2,0.5l0,0
		c0.1,0.1,0.3,0.2,0.5,0.2h0H61h0c0.2,0,0.4-0.1,0.5-0.2c0.1-0.1,0.2-0.3,0.2-0.5v0V7.7v0c0-0.2-0.1-0.4-0.2-0.5
		C61.4,7,61.2,6.9,61,6.9h0H3z"/>
	<path class="st1" d="M10.6,38.6c0.1-0.1,0.2-0.1,0.3-0.1h13.3c0.1,0,0.2,0.1,0.3,0.1c0.1,0.1,0.1,0.2,0.1,0.3c0,0.1,0,0.2-0.1,0.3
		c-0.1,0.1-0.2,0.1-0.3,0.1H10.9c-0.1,0-0.2-0.1-0.3-0.1c-0.1-0.1-0.1-0.2-0.1-0.3C10.4,38.8,10.5,38.6,10.6,38.6z"/>
	<path class="st1" d="M10.4,35.8c0-0.1,0-0.2,0.1-0.3v0c0.1-0.1,0.2-0.1,0.3-0.1h13.3c0.1,0,0.2,0.1,0.3,0.1
		c0.1,0.1,0.1,0.2,0.1,0.3s0,0.2-0.1,0.3c-0.1,0.1-0.2,0.1-0.3,0.1H10.9c-0.1,0-0.2-0.1-0.3-0.1C10.5,36.1,10.4,35.9,10.4,35.8z"/>
	<path class="st1" d="M25.3,17.6L25.3,17.6c0.7,1.3,1.1,2.7,1.2,4.1c0.1,1.4-0.2,2.7-0.8,4l-7.3-4.2v-8.4c1.4,0.1,2.7,0.6,3.8,1.3v0
		C23.6,15.3,24.6,16.3,25.3,17.6z"/>
	<path class="st0" d="M16.5,13.2v9.4v0.1l0.1,0.1l8.1,4.7c-0.8,1.1-1.9,2.1-3.2,2.7c-1.4,0.7-2.9,1-4.4,0.9c-1.5-0.1-3-0.5-4.3-1.3
		c-1.3-0.8-2.4-1.9-3.1-3.2c-0.8-1.3-1.2-2.8-1.2-4.3c0-1.5,0.3-3,1-4.4c0.7-1.3,1.7-2.5,3-3.3l-0.1-0.2l0.1,0.2
		C13.8,13.8,15.1,13.3,16.5,13.2z"/>
	<g>
		<path class="st1" d="M52.8,10.9l0.3,0.2l0.2,0.1l-0.1,0.2l-4.7,6.3c0,0,0,0,0,0c-0.2,0.2-0.4,0.4-0.6,0.5
			c-0.2,0.1-0.5,0.2-0.8,0.2s-0.5-0.1-0.8-0.2l0,0c-0.2-0.1-0.4-0.3-0.6-0.6l-3.2-5c-0.2-0.4-0.5-0.7-0.9-0.9
			c-0.4-0.2-0.8-0.3-1.2-0.4l-1,1.2c0.1,0,0.1-0.1,0.2-0.1v0c0.2-0.1,0.5-0.2,0.8-0.1c0.3,0,0.5,0.1,0.8,0.2h0
			c0.2,0.1,0.4,0.3,0.6,0.6l3.1,4.9l0,0l0.1,0.1c0.2,0.4,0.5,0.7,0.9,0.9h0c0.4,0.2,0.8,0.3,1.2,0.4c0.4,0,0.9-0.1,1.2-0.3
			c0.4-0.2,0.7-0.5,1-0.8l4.7-6.3l0.1-0.2l0.2,0.1l0.3,0.2l0.1-2L52.8,10.9z"/>
		<path class="st1" d="M40.4,11.4c-0.4,0-0.8,0-1.2,0.2v0c-0.4,0.2-0.7,0.4-1,0.7v0l-3.9,4.7l0.7,0.6l4.4-5.1c0,0,0,0,0,0L40.4,11.4
			z"/>
	</g>
	<path class="st0" d="M52.4,24.2h2.3v12.7h-2.3V24.2z"/>
	<path class="st2" d="M45.9,36.9v-7h2.3v7H45.9z"/>
	<path class="st0" d="M39.5,36.9V22.5h2.3v14.4H39.5z"/>
	<path class="st2" d="M35.4,36.9h-2.3V26.7h2.3V36.9z"/>
</g>
</svg>
