<?xml version="1.0" encoding="utf-8"?>
<!-- Generator: Adobe Illustrator 23.0.0, SVG Export Plug-In . SVG Version: 6.00 Build 0)  -->
<svg version="1.1" id="Layer_1" xmlns="http://www.w3.org/2000/svg" xmlns:xlink="http://www.w3.org/1999/xlink" x="0px" y="0px"
	 viewBox="0 0 64 64" style="enable-background:new 0 0 64 64;" xml:space="preserve">
<style type="text/css">
	.st0{fill:none;stroke:#3C4E5F;stroke-miterlimit:10;}
</style>
<g>
	<polyline class="st0" points="3,25.5 3,3.4 25.5,3.4 	"/>
	<line class="st0" x1="24.7" y1="24.7" x2="3" y2="3.4"/>
</g>
<g>
	<polyline class="st0" points="24.9,61.3 2.8,61.3 2.8,38.9 	"/>
	<line class="st0" x1="24.1" y1="39.7" x2="2.8" y2="61.3"/>
</g>
<g>
	<polyline class="st0" points="61,39.1 61,61.2 38.6,61.2 	"/>
	<line class="st0" x1="39.3" y1="39.9" x2="61" y2="61.2"/>
</g>
<g>
	<polyline class="st0" points="38.7,2.8 60.8,2.8 60.8,25.2 	"/>
	<line class="st0" x1="39.5" y1="24.5" x2="60.8" y2="2.8"/>
</g>
</svg>
