<svg xmlns="http://www.w3.org/2000/svg" xmlns:xlink="http://www.w3.org/1999/xlink" xml:space="preserve" version="1.1" style="shape-rendering:geometricPrecision;text-rendering:geometricPrecision;image-rendering:optimizeQuality;" viewBox="0 0 50000 62500" x="0px" y="0px" fill-rule="evenodd" clip-rule="evenodd"><defs><style type="text/css">
   
    .fil0 {fill:black;fill-rule:nonzero}
   
  </style></defs><g><path class="fil0" d="M39177.88 12540.38c-1628.84,1619.82 -4089.94,-854.64 -2460.94,-2474.62l1045.53 -1039.08c304.56,-302.69 358.36,-279.45 -87.77,-239.29 -3887.66,350.25 -7507.66,2085.85 -10227.88,4899.4 4731.08,6772.56 4730.96,15850.76 -0.07,22623.3 3078.18,3184.82 7276.78,4965.06 11704.67,4965.06 2304.08,0 2304.08,3500 0,3500 -5250.21,0 -10247.53,-2066.08 -13965.17,-5773.77 -3322.43,3312.76 -7679.7,5326.53 -12339.65,5705.96 -834.88,67.97 -696.63,-11.76 -65.07,619.8l632.06 632.06c1629.09,1629.09 -845.53,4103.71 -2474.62,2474.62l-5493.59 -5493.62 5569.67 -5535.27c1628.84,-1619.82 4089.94,854.64 2460.94,2474.62l-981.97 975.9c-468.27,465.38 -515.77,416.81 173.28,356.14 3897.83,-343.38 7530.74,-2077.86 10260.54,-4902.17 -4730.54,-6772.36 -4730.28,-15850.47 0.52,-22622.63 -3079,-3184.63 -7276.11,-4964.97 -11704.6,-4964.97 -2304.08,0 -2304.08,-3500 0,-3500 5249.59,0 10246.26,2065.57 13963.83,5772.44 3323.54,-3314.01 7681.2,-5327.79 12345.48,-5706.02 593.08,-48.07 597.49,49.1 165.61,-382.78l-919.34 -919.35c-1629.09,-1629.09 845.53,-4103.71 2474.62,-2474.62l5493.59 5493.62 -5569.67 5535.27zm-351.56 -353.52l5214.08 -5181.87 -5139.96 -5139.98c-1163.61,-1163.61 -2931.19,603.97 -1767.58,1767.58l1599.31 1599.34c614.87,614.87 568.56,464.82 -278.19,511.4 -5248.37,288.73 -9522.71,2132.49 -13266.39,5962.89 -3753.37,-3840.32 -8565.19,-5984.4 -13963.83,-5984.4 -1645.81,0 -1645.8,2500 0,2500 4784.81,0 9076.42,1948.63 12348.56,5419.32 -4937.34,6912.78 -4934.37,15805.09 -0.43,22714.11 -3304.36,3504.89 -7089.96,5132.38 -11731.09,5390.58 -1141.06,63.48 -1122.4,171.37 -346.95,-599.29l1630.58 -1620.51c1163.69,-1157.25 -593.94,-2925.02 -1757.82,-1767.58l-5214.08 5181.87 5139.96 5139.98c1163.61,1163.61 2931.19,-603.97 1767.58,-1767.58l-1367.6 -1367.62c-710.34,-710.34 -891.84,-641.53 63.98,-686.56 5302.35,-249.91 9630.66,-2081.57 13430.31,-5968.59 3752.65,3838.96 8562.29,5985.2 13964.66,5985.2 1645.81,0 1645.8,-2500 0,-2500 -4785.12,0 -9076.2,-1948.63 -12348.63,-5419.39 4942.87,-6920.93 4946.17,-15789.61 0.07,-22714.62 3319.1,-3517.61 7102.67,-5074.59 11804.21,-5392.03 771.83,-52.09 789.71,-143.73 251.09,391.56l-1789.66 1778.61c-1163.69,1157.25 593.94,2925.02 1757.82,1767.58zm-13638.73 4443.62c-3079.97,5127.61 -3080.07,11607.72 -0.34,16735.45 3080.32,-5128.07 3080.57,-11607.26 0.34,-16735.45zm-210.94 -609.25l210.94 -332.38 210.94 332.38c3631.82,5722.88 3381.06,12625.78 -211.3,18286.36 -3591.82,-5660.28 -3842.07,-12564.05 -210.58,-18286.36z"/></g></svg>