<?xml version="1.0" encoding="utf-8"?>
<!-- Generator: Adobe Illustrator 23.0.0, SVG Export Plug-In . SVG Version: 6.00 Build 0)  -->
<svg version="1.1" id="Layer_1" xmlns="http://www.w3.org/2000/svg" xmlns:xlink="http://www.w3.org/1999/xlink" x="0px" y="0px"
	 viewBox="0 0 64 67" style="enable-background:new 0 0 64 67;" xml:space="preserve">
<style type="text/css">
	.st0{fill:#3C4E5F;}
</style>
<g>
	<path class="st0" d="M40.2,45.9c0.2,0,0.3-0.1,0.4-0.2c0.1-0.1,0.2-0.3,0.2-0.4V21.7c0-0.3-0.3-0.6-0.6-0.6H23.8
		c-0.3,0-0.6,0.3-0.6,0.6v23.6c0,0.3,0.3,0.6,0.6,0.6H40.2z M23.6,45.3V21.7c0-0.1,0.1-0.2,0.2-0.2h16.4c0.1,0,0.2,0.1,0.2,0.2v23.6
		c0,0.1-0.1,0.2-0.2,0.2H23.8C23.7,45.5,23.6,45.4,23.6,45.3z"/>
	<path class="st0" d="M34.8,43.8h0.8c0.3,0,0.6-0.3,0.6-0.6v-0.8c0-0.3-0.3-0.6-0.6-0.6h-0.8c-0.3,0-0.6,0.3-0.6,0.6v0.8
		C34.3,43.6,34.5,43.8,34.8,43.8z M34.7,42.5c0-0.1,0.1-0.2,0.2-0.2h0.8c0.1,0,0.2,0.1,0.2,0.2v0.8c0,0.1-0.1,0.2-0.2,0.2h-0.8
		c-0.1,0-0.2-0.1-0.2-0.2V42.5z"/>
	<path class="st0" d="M37.3,43.8h0.8c0.3,0,0.6-0.3,0.6-0.6v-0.8c0-0.3-0.3-0.6-0.6-0.6h-0.8c-0.3,0-0.6,0.3-0.6,0.6v0.8
		C36.7,43.6,37,43.8,37.3,43.8z M37.1,42.5c0-0.1,0.1-0.2,0.2-0.2h0.8c0.1,0,0.2,0.1,0.2,0.2v0.8c0,0.1-0.1,0.2-0.2,0.2h-0.8
		c-0.1,0-0.2-0.1-0.2-0.2V42.5z"/>
	<path class="st0" d="M24.9,26h14.2c0.3,0,0.6-0.3,0.6-0.6v-2.5c0-0.3-0.3-0.6-0.6-0.6H24.9c-0.3,0-0.6,0.3-0.6,0.6v2.5
		C24.3,25.7,24.6,26,24.9,26z M24.7,22.9c0-0.1,0.1-0.2,0.2-0.2h14.2c0.1,0,0.2,0.1,0.2,0.2v2.5c0,0.1-0.1,0.2-0.2,0.2H24.9
		c-0.1,0-0.2-0.1-0.2-0.2V22.9z"/>
	<path class="st0" d="M37.3,25.1h0.8c0.3,0,0.6-0.3,0.6-0.6v-0.8c0-0.3-0.3-0.6-0.6-0.6h-0.8c-0.3,0-0.6,0.3-0.6,0.6v0.8
		C36.7,24.9,37,25.1,37.3,25.1z M37.1,23.8c0-0.1,0.1-0.2,0.2-0.2h0.8c0.1,0,0.2,0.1,0.2,0.2v0.8c0,0.1-0.1,0.2-0.2,0.2h-0.8
		c-0.1,0-0.2-0.1-0.2-0.2V23.8z"/>
	<path class="st0" d="M34.8,25.1h0.8c0.3,0,0.6-0.3,0.6-0.6v-0.8c0-0.3-0.3-0.6-0.6-0.6h-0.8c-0.3,0-0.6,0.3-0.6,0.6v0.8
		C34.3,24.9,34.5,25.1,34.8,25.1z M34.7,23.8c0-0.1,0.1-0.2,0.2-0.2h0.8c0.1,0,0.2,0.1,0.2,0.2v0.8c0,0.1-0.1,0.2-0.2,0.2h-0.8
		c-0.1,0-0.2-0.1-0.2-0.2V23.8z"/>
	<path class="st0" d="M32.4,25.1h0.8c0.3,0,0.6-0.3,0.6-0.6v-0.8c0-0.3-0.3-0.6-0.6-0.6h-0.8c-0.3,0-0.6,0.3-0.6,0.6v0.8
		C31.8,24.9,32,25.1,32.4,25.1z M32.2,23.8c0-0.1,0.1-0.2,0.2-0.2h0.8c0.1,0,0.2,0.1,0.2,0.2v0.8c0,0.1-0.1,0.2-0.2,0.2h-0.8
		c-0.1,0-0.2-0.1-0.2-0.2V23.8z"/>
	<path class="st0" d="M29.3,25.1c0.1,0,0.2-0.1,0.2-0.2v-1.6c0-0.1-0.1-0.2-0.2-0.2s-0.2,0.1-0.2,0.2v1.6
		C29.1,25,29.2,25.1,29.3,25.1z"/>
	<path class="st0" d="M28.4,25.1c0.1,0,0.2-0.1,0.2-0.2v-1.6c0-0.1-0.1-0.2-0.2-0.2s-0.2,0.1-0.2,0.2v1.6
		C28.2,25,28.3,25.1,28.4,25.1z"/>
	<path class="st0" d="M27.4,25.1c0.1,0,0.2-0.1,0.2-0.2v-1.6c0-0.1-0.1-0.2-0.2-0.2s-0.2,0.1-0.2,0.2v1.6
		C27.2,25,27.3,25.1,27.4,25.1z"/>
	<path class="st0" d="M26.5,25.1c0.1,0,0.2-0.1,0.2-0.2v-1.6c0-0.1-0.1-0.2-0.2-0.2s-0.2,0.1-0.2,0.2v1.6
		C26.3,25,26.4,25.1,26.5,25.1z"/>
	<path class="st0" d="M25.5,25.1c0.1,0,0.2-0.1,0.2-0.2v-1.6c0-0.1-0.1-0.2-0.2-0.2c-0.1,0-0.2,0.1-0.2,0.2v1.6
		C25.3,25,25.4,25.1,25.5,25.1z"/>
	<path class="st0" d="M24.9,30.7h14.2c0.3,0,0.6-0.3,0.6-0.6v-2.5c0-0.3-0.3-0.6-0.6-0.6H24.9c-0.3,0-0.6,0.3-0.6,0.6v2.5
		C24.3,30.4,24.6,30.7,24.9,30.7z M24.7,27.6c0-0.1,0.1-0.2,0.2-0.2h14.2c0.1,0,0.2,0.1,0.2,0.2v2.5c0,0.1-0.1,0.2-0.2,0.2H24.9
		c-0.1,0-0.2-0.1-0.2-0.2V27.6z"/>
	<path class="st0" d="M34.8,29.8h0.8c0.3,0,0.6-0.3,0.6-0.6v-0.8c0-0.3-0.3-0.6-0.6-0.6h-0.8c-0.3,0-0.6,0.3-0.6,0.6v0.8
		C34.3,29.5,34.5,29.8,34.8,29.8z M34.7,28.4c0-0.1,0.1-0.2,0.2-0.2h0.8c0.1,0,0.2,0.1,0.2,0.2v0.8c0,0.1-0.1,0.2-0.2,0.2h-0.8
		c-0.1,0-0.2-0.1-0.2-0.2V28.4z"/>
	<path class="st0" d="M32.4,29.8h0.8c0.3,0,0.6-0.3,0.6-0.6v-0.8c0-0.3-0.3-0.6-0.6-0.6h-0.8c-0.3,0-0.6,0.3-0.6,0.6v0.8
		C31.8,29.5,32,29.8,32.4,29.8z M32.2,28.4c0-0.1,0.1-0.2,0.2-0.2h0.8c0.1,0,0.2,0.1,0.2,0.2v0.8c0,0.1-0.1,0.2-0.2,0.2h-0.8
		c-0.1,0-0.2-0.1-0.2-0.2V28.4z"/>
	<path class="st0" d="M37.3,29.8h0.8c0.3,0,0.6-0.3,0.6-0.6v-0.8c0-0.3-0.3-0.6-0.6-0.6h-0.8c-0.3,0-0.6,0.3-0.6,0.6v0.8
		C36.7,29.5,37,29.8,37.3,29.8z M37.1,28.4c0-0.1,0.1-0.2,0.2-0.2h0.8c0.1,0,0.2,0.1,0.2,0.2v0.8c0,0.1-0.1,0.2-0.2,0.2h-0.8
		c-0.1,0-0.2-0.1-0.2-0.2V28.4z"/>
	<path class="st0" d="M29.3,29.8c0.1,0,0.2-0.1,0.2-0.2V28c0-0.1-0.1-0.2-0.2-0.2s-0.2,0.1-0.2,0.2v1.6
		C29.1,29.7,29.2,29.8,29.3,29.8z"/>
	<path class="st0" d="M28.4,29.8c0.1,0,0.2-0.1,0.2-0.2V28c0-0.1-0.1-0.2-0.2-0.2s-0.2,0.1-0.2,0.2v1.6
		C28.2,29.7,28.3,29.8,28.4,29.8z"/>
	<path class="st0" d="M27.4,29.8c0.1,0,0.2-0.1,0.2-0.2V28c0-0.1-0.1-0.2-0.2-0.2s-0.2,0.1-0.2,0.2v1.6
		C27.2,29.7,27.3,29.8,27.4,29.8z"/>
	<path class="st0" d="M26.5,29.8c0.1,0,0.2-0.1,0.2-0.2V28c0-0.1-0.1-0.2-0.2-0.2s-0.2,0.1-0.2,0.2v1.6
		C26.3,29.7,26.4,29.8,26.5,29.8z"/>
	<path class="st0" d="M25.5,29.8c0.1,0,0.2-0.1,0.2-0.2V28c0-0.1-0.1-0.2-0.2-0.2c-0.1,0-0.2,0.1-0.2,0.2v1.6
		C25.3,29.7,25.4,29.8,25.5,29.8z"/>
	<path class="st0" d="M24.9,35.4h14.2c0.3,0,0.6-0.3,0.6-0.6v-2.5c0-0.3-0.3-0.6-0.6-0.6H24.9c-0.3,0-0.6,0.3-0.6,0.6v2.5
		C24.3,35.1,24.6,35.4,24.9,35.4z M24.7,32.2c0-0.1,0.1-0.2,0.2-0.2h14.2c0.1,0,0.2,0.1,0.2,0.2v2.5c0,0.1-0.1,0.2-0.2,0.2H24.9
		c-0.1,0-0.2-0.1-0.2-0.2V32.2z"/>
	<path class="st0" d="M34.8,34.5h0.8c0.3,0,0.6-0.3,0.6-0.6v-0.8c0-0.3-0.3-0.6-0.6-0.6h-0.8c-0.3,0-0.6,0.3-0.6,0.6v0.8
		C34.3,34.2,34.5,34.5,34.8,34.5z M34.7,33.1c0-0.1,0.1-0.2,0.2-0.2h0.8c0.1,0,0.2,0.1,0.2,0.2v0.8c0,0.1-0.1,0.2-0.2,0.2h-0.8
		c-0.1,0-0.2-0.1-0.2-0.2V33.1z"/>
	<path class="st0" d="M32.4,34.5h0.8c0.3,0,0.6-0.3,0.6-0.6v-0.8c0-0.3-0.3-0.6-0.6-0.6h-0.8c-0.3,0-0.6,0.3-0.6,0.6v0.8
		C31.8,34.2,32,34.5,32.4,34.5z M32.2,33.1c0-0.1,0.1-0.2,0.2-0.2h0.8c0.1,0,0.2,0.1,0.2,0.2v0.8c0,0.1-0.1,0.2-0.2,0.2h-0.8
		c-0.1,0-0.2-0.1-0.2-0.2V33.1z"/>
	<path class="st0" d="M37.3,34.5h0.8c0.3,0,0.6-0.3,0.6-0.6v-0.8c0-0.3-0.3-0.6-0.6-0.6h-0.8c-0.3,0-0.6,0.3-0.6,0.6v0.8
		C36.7,34.2,37,34.5,37.3,34.5z M37.1,33.1c0-0.1,0.1-0.2,0.2-0.2h0.8c0.1,0,0.2,0.1,0.2,0.2v0.8c0,0.1-0.1,0.2-0.2,0.2h-0.8
		c-0.1,0-0.2-0.1-0.2-0.2V33.1z"/>
	<path class="st0" d="M29.3,34.5c0.1,0,0.2-0.1,0.2-0.2v-1.6c0-0.1-0.1-0.2-0.2-0.2s-0.2,0.1-0.2,0.2v1.6
		C29.1,34.4,29.2,34.5,29.3,34.5z"/>
	<path class="st0" d="M28.4,34.5c0.1,0,0.2-0.1,0.2-0.2v-1.6c0-0.1-0.1-0.2-0.2-0.2s-0.2,0.1-0.2,0.2v1.6
		C28.2,34.4,28.3,34.5,28.4,34.5z"/>
	<path class="st0" d="M27.4,34.5c0.1,0,0.2-0.1,0.2-0.2v-1.6c0-0.1-0.1-0.2-0.2-0.2s-0.2,0.1-0.2,0.2v1.6
		C27.2,34.4,27.3,34.5,27.4,34.5z"/>
	<path class="st0" d="M26.5,34.5c0.1,0,0.2-0.1,0.2-0.2v-1.6c0-0.1-0.1-0.2-0.2-0.2s-0.2,0.1-0.2,0.2v1.6
		C26.3,34.4,26.4,34.5,26.5,34.5z"/>
	<path class="st0" d="M25.5,34.5c0.1,0,0.2-0.1,0.2-0.2v-1.6c0-0.1-0.1-0.2-0.2-0.2c-0.1,0-0.2,0.1-0.2,0.2v1.6
		C25.3,34.4,25.4,34.5,25.5,34.5z"/>
	<path class="st0" d="M34.8,39.2h0.8c0.3,0,0.6-0.3,0.6-0.6v-0.8c0-0.3-0.3-0.6-0.6-0.6h-0.8c-0.3,0-0.6,0.3-0.6,0.6v0.8
		C34.3,38.9,34.5,39.2,34.8,39.2z M34.7,37.8c0-0.1,0.1-0.2,0.2-0.2h0.8c0.1,0,0.2,0.1,0.2,0.2v0.8c0,0.1-0.1,0.2-0.2,0.2h-0.8
		c-0.1,0-0.2-0.1-0.2-0.2V37.8z"/>
	<path class="st0" d="M37.3,39.2h0.8c0.3,0,0.6-0.3,0.6-0.6v-0.8c0-0.3-0.3-0.6-0.6-0.6h-0.8c-0.3,0-0.6,0.3-0.6,0.6v0.8
		C36.7,38.9,37,39.2,37.3,39.2z M37.1,37.8c0-0.1,0.1-0.2,0.2-0.2h0.8c0.1,0,0.2,0.1,0.2,0.2v0.8c0,0.1-0.1,0.2-0.2,0.2h-0.8
		c-0.1,0-0.2-0.1-0.2-0.2V37.8z"/>
	<path class="st0" d="M24.9,40h14.2c0.3,0,0.6-0.3,0.6-0.6v-2.5c0-0.3-0.3-0.6-0.6-0.6H24.9c-0.3,0-0.6,0.3-0.6,0.6v2.5
		C24.3,39.8,24.6,40,24.9,40z M24.7,36.9c0-0.1,0.1-0.2,0.2-0.2h14.2c0.1,0,0.2,0.1,0.2,0.2v2.5c0,0.1-0.1,0.2-0.2,0.2H24.9
		c-0.1,0-0.2-0.1-0.2-0.2V36.9z"/>
	<path class="st0" d="M32.4,39.2h0.8c0.3,0,0.6-0.3,0.6-0.6v-0.8c0-0.3-0.3-0.6-0.6-0.6h-0.8c-0.3,0-0.6,0.3-0.6,0.6v0.8
		C31.8,38.9,32,39.2,32.4,39.2z M32.2,37.8c0-0.1,0.1-0.2,0.2-0.2h0.8c0.1,0,0.2,0.1,0.2,0.2v0.8c0,0.1-0.1,0.2-0.2,0.2h-0.8
		c-0.1,0-0.2-0.1-0.2-0.2V37.8z"/>
	<path class="st0" d="M29.3,39.2c0.1,0,0.2-0.1,0.2-0.2v-1.6c0-0.1-0.1-0.2-0.2-0.2s-0.2,0.1-0.2,0.2V39
		C29.1,39.1,29.2,39.2,29.3,39.2z"/>
	<path class="st0" d="M28.4,39.2c0.1,0,0.2-0.1,0.2-0.2v-1.6c0-0.1-0.1-0.2-0.2-0.2s-0.2,0.1-0.2,0.2V39
		C28.2,39.1,28.3,39.2,28.4,39.2z"/>
	<path class="st0" d="M27.4,39.2c0.1,0,0.2-0.1,0.2-0.2v-1.6c0-0.1-0.1-0.2-0.2-0.2s-0.2,0.1-0.2,0.2V39
		C27.2,39.1,27.3,39.2,27.4,39.2z"/>
	<path class="st0" d="M26.5,39.2c0.1,0,0.2-0.1,0.2-0.2v-1.6c0-0.1-0.1-0.2-0.2-0.2s-0.2,0.1-0.2,0.2V39
		C26.3,39.1,26.4,39.2,26.5,39.2z"/>
	<path class="st0" d="M25.5,39.2c0.1,0,0.2-0.1,0.2-0.2v-1.6c0-0.1-0.1-0.2-0.2-0.2c-0.1,0-0.2,0.1-0.2,0.2V39
		C25.3,39.1,25.4,39.2,25.5,39.2z"/>
	<path class="st0" d="M24.9,44.7h14.2c0.3,0,0.6-0.3,0.6-0.6v-2.5c0-0.3-0.3-0.6-0.6-0.6H24.9c-0.3,0-0.6,0.3-0.6,0.6v2.5
		C24.3,44.4,24.6,44.7,24.9,44.7z M24.7,41.6c0-0.1,0.1-0.2,0.2-0.2h14.2c0.1,0,0.2,0.1,0.2,0.2v2.5c0,0.1-0.1,0.2-0.2,0.2H24.9
		c-0.1,0-0.2-0.1-0.2-0.2V41.6z"/>
	<path class="st0" d="M32.4,43.8h0.8c0.3,0,0.6-0.3,0.6-0.6v-0.8c0-0.3-0.3-0.6-0.6-0.6h-0.8c-0.3,0-0.6,0.3-0.6,0.6v0.8
		C31.8,43.6,32,43.8,32.4,43.8z M32.2,42.5c0-0.1,0.1-0.2,0.2-0.2h0.8c0.1,0,0.2,0.1,0.2,0.2v0.8c0,0.1-0.1,0.2-0.2,0.2h-0.8
		c-0.1,0-0.2-0.1-0.2-0.2V42.5z"/>
	<path class="st0" d="M29.3,43.8c0.1,0,0.2-0.1,0.2-0.2v-1.6c0-0.1-0.1-0.2-0.2-0.2s-0.2,0.1-0.2,0.2v1.6
		C29.1,43.7,29.2,43.8,29.3,43.8z"/>
	<path class="st0" d="M28.4,43.8c0.1,0,0.2-0.1,0.2-0.2v-1.6c0-0.1-0.1-0.2-0.2-0.2s-0.2,0.1-0.2,0.2v1.6
		C28.2,43.7,28.3,43.8,28.4,43.8z"/>
	<path class="st0" d="M27.4,43.8c0.1,0,0.2-0.1,0.2-0.2v-1.6c0-0.1-0.1-0.2-0.2-0.2s-0.2,0.1-0.2,0.2v1.6
		C27.2,43.7,27.3,43.8,27.4,43.8z"/>
	<path class="st0" d="M26.5,43.8c0.1,0,0.2-0.1,0.2-0.2v-1.6c0-0.1-0.1-0.2-0.2-0.2s-0.2,0.1-0.2,0.2v1.6
		C26.3,43.7,26.4,43.8,26.5,43.8z"/>
	<path class="st0" d="M25.5,43.8c0.1,0,0.2-0.1,0.2-0.2v-1.6c0-0.1-0.1-0.2-0.2-0.2c-0.1,0-0.2,0.1-0.2,0.2v1.6
		C25.3,43.7,25.4,43.8,25.5,43.8z"/>
	<path class="st0" d="M45.2,27.1h16.4c0.3,0,0.6-0.3,0.6-0.6l0-23.6c0-0.3-0.3-0.6-0.6-0.6H45.2c-0.3,0-0.6,0.3-0.6,0.6v23.6
		C44.6,26.8,44.9,27.1,45.2,27.1z M45,2.9c0-0.1,0.1-0.2,0.2-0.2h16.4c0.1,0,0.2,0.1,0.2,0.2v23.6c0,0.1-0.1,0.2-0.2,0.2H45.2
		c-0.1,0-0.2-0.1-0.2-0.2V2.9z"/>
	<path class="st0" d="M56.3,25H57c0.3,0,0.6-0.3,0.6-0.6v-0.8c0-0.3-0.3-0.6-0.6-0.6h-0.8c-0.3,0-0.6,0.3-0.6,0.6v0.8
		C55.7,24.8,55.9,25,56.3,25z M56.1,23.7c0-0.1,0.1-0.2,0.2-0.2H57c0.1,0,0.2,0.1,0.2,0.2v0.8c0,0.1-0.1,0.2-0.2,0.2h-0.8
		c-0.1,0-0.2-0.1-0.2-0.2V23.7z"/>
	<path class="st0" d="M58.7,25h0.8c0.3,0,0.6-0.3,0.6-0.6v-0.8c0-0.3-0.3-0.6-0.6-0.6h-0.8c-0.3,0-0.6,0.3-0.6,0.6v0.8
		C58.2,24.8,58.4,25,58.7,25z M58.5,23.7c0-0.1,0.1-0.2,0.2-0.2h0.8c0.1,0,0.2,0.1,0.2,0.2v0.8c0,0.1-0.1,0.2-0.2,0.2h-0.8
		c-0.1,0-0.2-0.1-0.2-0.2V23.7z"/>
	<path class="st0" d="M46.3,7.2h14.2c0.3,0,0.6-0.3,0.6-0.6V4.1c0-0.3-0.3-0.6-0.6-0.6H46.3c-0.3,0-0.6,0.3-0.6,0.6v2.5
		C45.8,6.9,46,7.2,46.3,7.2z M46.2,4.1c0-0.1,0.1-0.2,0.2-0.2h14.2c0.1,0,0.2,0.1,0.2,0.2v2.5c0,0.1-0.1,0.2-0.2,0.2H46.3
		c-0.1,0-0.2-0.1-0.2-0.2V4.1z"/>
	<path class="st0" d="M58.7,6.3h0.8c0.3,0,0.6-0.3,0.6-0.6V5c0-0.3-0.3-0.6-0.6-0.6h-0.8c-0.3,0-0.6,0.3-0.6,0.6v0.8
		C58.2,6.1,58.4,6.3,58.7,6.3z M58.5,5c0-0.1,0.1-0.2,0.2-0.2h0.8c0.1,0,0.2,0.1,0.2,0.2v0.8c0,0.1-0.1,0.2-0.2,0.2h-0.8
		c-0.1,0-0.2-0.1-0.2-0.2V5z"/>
	<path class="st0" d="M56.3,6.3H57c0.3,0,0.6-0.3,0.6-0.6V5c0-0.3-0.3-0.6-0.6-0.6h-0.8c-0.3,0-0.6,0.3-0.6,0.6v0.8
		C55.7,6.1,55.9,6.3,56.3,6.3z M56.1,5c0-0.1,0.1-0.2,0.2-0.2H57c0.1,0,0.2,0.1,0.2,0.2v0.8c0,0.1-0.1,0.2-0.2,0.2h-0.8
		c-0.1,0-0.2-0.1-0.2-0.2V5z"/>
	<path class="st0" d="M53.8,6.3h0.8c0.3,0,0.6-0.3,0.6-0.6V5c0-0.3-0.3-0.6-0.6-0.6h-0.8c-0.3,0-0.6,0.3-0.6,0.6v0.8
		C53.2,6.1,53.4,6.3,53.8,6.3z M53.6,5c0-0.1,0.1-0.2,0.2-0.2h0.8c0.1,0,0.2,0.1,0.2,0.2v0.8c0,0.1-0.1,0.2-0.2,0.2h-0.8
		c-0.1,0-0.2-0.1-0.2-0.2V5z"/>
	<path class="st0" d="M50.7,6.3c0.1,0,0.2-0.1,0.2-0.2V4.6c0-0.1-0.1-0.2-0.2-0.2c-0.1,0-0.2,0.1-0.2,0.2v1.6
		C50.5,6.2,50.6,6.3,50.7,6.3z"/>
	<path class="st0" d="M49.8,6.3c0.1,0,0.2-0.1,0.2-0.2V4.6c0-0.1-0.1-0.2-0.2-0.2c-0.1,0-0.2,0.1-0.2,0.2v1.6
		C49.6,6.2,49.7,6.3,49.8,6.3z"/>
	<path class="st0" d="M48.8,6.3c0.1,0,0.2-0.1,0.2-0.2V4.6c0-0.1-0.1-0.2-0.2-0.2c-0.1,0-0.2,0.1-0.2,0.2v1.6
		C48.6,6.2,48.7,6.3,48.8,6.3z"/>
	<path class="st0" d="M47.9,6.3c0.1,0,0.2-0.1,0.2-0.2V4.6c0-0.1-0.1-0.2-0.2-0.2c-0.1,0-0.2,0.1-0.2,0.2v1.6
		C47.7,6.2,47.8,6.3,47.9,6.3z"/>
	<path class="st0" d="M46.9,6.3c0.1,0,0.2-0.1,0.2-0.2V4.6c0-0.1-0.1-0.2-0.2-0.2c-0.1,0-0.2,0.1-0.2,0.2v1.6
		C46.7,6.2,46.8,6.3,46.9,6.3z"/>
	<path class="st0" d="M46.3,11.9h14.2c0.3,0,0.6-0.3,0.6-0.6V8.8c0-0.3-0.3-0.6-0.6-0.6H46.3c-0.3,0-0.6,0.3-0.6,0.6v2.5
		C45.8,11.6,46,11.9,46.3,11.9z M46.2,8.8c0-0.1,0.1-0.2,0.2-0.2h14.2c0.1,0,0.2,0.1,0.2,0.2v2.5c0,0.1-0.1,0.2-0.2,0.2H46.3
		c-0.1,0-0.2-0.1-0.2-0.2V8.8z"/>
	<path class="st0" d="M56.3,11H57c0.3,0,0.6-0.3,0.6-0.6V9.6C57.6,9.3,57.4,9,57,9h-0.8c-0.3,0-0.6,0.3-0.6,0.6v0.8
		C55.7,10.7,55.9,11,56.3,11z M56.1,9.6c0-0.1,0.1-0.2,0.2-0.2H57c0.1,0,0.2,0.1,0.2,0.2v0.8c0,0.1-0.1,0.2-0.2,0.2h-0.8
		c-0.1,0-0.2-0.1-0.2-0.2V9.6z"/>
	<path class="st0" d="M53.8,11h0.8c0.3,0,0.6-0.3,0.6-0.6V9.6c0-0.3-0.3-0.6-0.6-0.6h-0.8c-0.3,0-0.6,0.3-0.6,0.6v0.8
		C53.2,10.7,53.4,11,53.8,11z M53.6,9.6c0-0.1,0.1-0.2,0.2-0.2h0.8c0.1,0,0.2,0.1,0.2,0.2v0.8c0,0.1-0.1,0.2-0.2,0.2h-0.8
		c-0.1,0-0.2-0.1-0.2-0.2V9.6z"/>
	<path class="st0" d="M58.7,11h0.8c0.3,0,0.6-0.3,0.6-0.6V9.6c0-0.3-0.3-0.6-0.6-0.6h-0.8c-0.3,0-0.6,0.3-0.6,0.6v0.8
		C58.2,10.7,58.4,11,58.7,11z M58.5,9.6c0-0.1,0.1-0.2,0.2-0.2h0.8c0.1,0,0.2,0.1,0.2,0.2v0.8c0,0.1-0.1,0.2-0.2,0.2h-0.8
		c-0.1,0-0.2-0.1-0.2-0.2V9.6z"/>
	<path class="st0" d="M50.7,11c0.1,0,0.2-0.1,0.2-0.2V9.2c0-0.1-0.1-0.2-0.2-0.2c-0.1,0-0.2,0.1-0.2,0.2v1.6
		C50.5,10.9,50.6,11,50.7,11z"/>
	<path class="st0" d="M49.8,11c0.1,0,0.2-0.1,0.2-0.2V9.2C50,9.1,49.9,9,49.8,9c-0.1,0-0.2,0.1-0.2,0.2v1.6
		C49.6,10.9,49.7,11,49.8,11z"/>
	<path class="st0" d="M48.8,11c0.1,0,0.2-0.1,0.2-0.2V9.2C49,9.1,48.9,9,48.8,9c-0.1,0-0.2,0.1-0.2,0.2v1.6
		C48.6,10.9,48.7,11,48.8,11z"/>
	<path class="st0" d="M47.9,11c0.1,0,0.2-0.1,0.2-0.2V9.2C48.1,9.1,48,9,47.9,9c-0.1,0-0.2,0.1-0.2,0.2v1.6
		C47.7,10.9,47.8,11,47.9,11z"/>
	<path class="st0" d="M46.9,11c0.1,0,0.2-0.1,0.2-0.2V9.2C47.1,9.1,47,9,46.9,9c-0.1,0-0.2,0.1-0.2,0.2v1.6
		C46.7,10.9,46.8,11,46.9,11z"/>
	<path class="st0" d="M46.3,16.6h14.2c0.3,0,0.6-0.3,0.6-0.6v-2.5c0-0.3-0.3-0.6-0.6-0.6H46.3c-0.3,0-0.6,0.3-0.6,0.6V16
		C45.8,16.3,46,16.6,46.3,16.6z M46.2,13.4c0-0.1,0.1-0.2,0.2-0.2h14.2c0.1,0,0.2,0.1,0.2,0.2V16c0,0.1-0.1,0.2-0.2,0.2H46.3
		c-0.1,0-0.2-0.1-0.2-0.2V13.4z"/>
	<path class="st0" d="M56.3,15.7H57c0.3,0,0.6-0.3,0.6-0.6v-0.8c0-0.3-0.3-0.6-0.6-0.6h-0.8c-0.3,0-0.6,0.3-0.6,0.6v0.8
		C55.7,15.4,55.9,15.7,56.3,15.7z M56.1,14.3c0-0.1,0.1-0.2,0.2-0.2H57c0.1,0,0.2,0.1,0.2,0.2v0.8c0,0.1-0.1,0.2-0.2,0.2h-0.8
		c-0.1,0-0.2-0.1-0.2-0.2V14.3z"/>
	<path class="st0" d="M53.8,15.7h0.8c0.3,0,0.6-0.3,0.6-0.6v-0.8c0-0.3-0.3-0.6-0.6-0.6h-0.8c-0.3,0-0.6,0.3-0.6,0.6v0.8
		C53.2,15.4,53.4,15.7,53.8,15.7z M53.6,14.3c0-0.1,0.1-0.2,0.2-0.2h0.8c0.1,0,0.2,0.1,0.2,0.2v0.8c0,0.1-0.1,0.2-0.2,0.2h-0.8
		c-0.1,0-0.2-0.1-0.2-0.2V14.3z"/>
	<path class="st0" d="M58.7,15.7h0.8c0.3,0,0.6-0.3,0.6-0.6v-0.8c0-0.3-0.3-0.6-0.6-0.6h-0.8c-0.3,0-0.6,0.3-0.6,0.6v0.8
		C58.2,15.4,58.4,15.7,58.7,15.7z M58.5,14.3c0-0.1,0.1-0.2,0.2-0.2h0.8c0.1,0,0.2,0.1,0.2,0.2v0.8c0,0.1-0.1,0.2-0.2,0.2h-0.8
		c-0.1,0-0.2-0.1-0.2-0.2V14.3z"/>
	<path class="st0" d="M50.7,15.7c0.1,0,0.2-0.1,0.2-0.2v-1.6c0-0.1-0.1-0.2-0.2-0.2c-0.1,0-0.2,0.1-0.2,0.2v1.6
		C50.5,15.6,50.6,15.7,50.7,15.7z"/>
	<path class="st0" d="M49.8,15.7c0.1,0,0.2-0.1,0.2-0.2v-1.6c0-0.1-0.1-0.2-0.2-0.2c-0.1,0-0.2,0.1-0.2,0.2v1.6
		C49.6,15.6,49.7,15.7,49.8,15.7z"/>
	<path class="st0" d="M48.8,15.7c0.1,0,0.2-0.1,0.2-0.2v-1.6c0-0.1-0.1-0.2-0.2-0.2c-0.1,0-0.2,0.1-0.2,0.2v1.6
		C48.6,15.6,48.7,15.7,48.8,15.7z"/>
	<path class="st0" d="M47.9,15.7c0.1,0,0.2-0.1,0.2-0.2v-1.6c0-0.1-0.1-0.2-0.2-0.2c-0.1,0-0.2,0.1-0.2,0.2v1.6
		C47.7,15.6,47.8,15.7,47.9,15.7z"/>
	<path class="st0" d="M46.9,15.7c0.1,0,0.2-0.1,0.2-0.2v-1.6c0-0.1-0.1-0.2-0.2-0.2c-0.1,0-0.2,0.1-0.2,0.2v1.6
		C46.7,15.6,46.8,15.7,46.9,15.7z"/>
	<path class="st0" d="M56.3,20.4H57c0.3,0,0.6-0.3,0.6-0.6V19c0-0.3-0.3-0.6-0.6-0.6h-0.8c-0.3,0-0.6,0.3-0.6,0.6v0.8
		C55.7,20.1,55.9,20.4,56.3,20.4z M56.1,19c0-0.1,0.1-0.2,0.2-0.2H57c0.1,0,0.2,0.1,0.2,0.2v0.8c0,0.1-0.1,0.2-0.2,0.2h-0.8
		c-0.1,0-0.2-0.1-0.2-0.2V19z"/>
	<path class="st0" d="M58.7,20.4h0.8c0.3,0,0.6-0.3,0.6-0.6V19c0-0.3-0.3-0.6-0.6-0.6h-0.8c-0.3,0-0.6,0.3-0.6,0.6v0.8
		C58.2,20.1,58.4,20.4,58.7,20.4z M58.5,19c0-0.1,0.1-0.2,0.2-0.2h0.8c0.1,0,0.2,0.1,0.2,0.2v0.8c0,0.1-0.1,0.2-0.2,0.2h-0.8
		c-0.1,0-0.2-0.1-0.2-0.2V19z"/>
	<path class="st0" d="M46.3,21.2h14.2c0.3,0,0.6-0.3,0.6-0.6v-2.5c0-0.3-0.3-0.6-0.6-0.6H46.3c-0.3,0-0.6,0.3-0.6,0.6v2.5
		C45.8,21,46,21.2,46.3,21.2z M46.2,18.1c0-0.1,0.1-0.2,0.2-0.2h14.2c0.1,0,0.2,0.1,0.2,0.2v2.5c0,0.1-0.1,0.2-0.2,0.2H46.3
		c-0.1,0-0.2-0.1-0.2-0.2V18.1z"/>
	<path class="st0" d="M53.8,20.4h0.8c0.3,0,0.6-0.3,0.6-0.6V19c0-0.3-0.3-0.6-0.6-0.6h-0.8c-0.3,0-0.6,0.3-0.6,0.6v0.8
		C53.2,20.1,53.4,20.4,53.8,20.4z M53.6,19c0-0.1,0.1-0.2,0.2-0.2h0.8c0.1,0,0.2,0.1,0.2,0.2v0.8c0,0.1-0.1,0.2-0.2,0.2h-0.8
		c-0.1,0-0.2-0.1-0.2-0.2V19z"/>
	<path class="st0" d="M50.7,20.3c0.1,0,0.2-0.1,0.2-0.2v-1.6c0-0.1-0.1-0.2-0.2-0.2c-0.1,0-0.2,0.1-0.2,0.2v1.6
		C50.5,20.3,50.6,20.3,50.7,20.3z"/>
	<path class="st0" d="M49.8,20.3c0.1,0,0.2-0.1,0.2-0.2v-1.6c0-0.1-0.1-0.2-0.2-0.2c-0.1,0-0.2,0.1-0.2,0.2v1.6
		C49.6,20.3,49.7,20.3,49.8,20.3z"/>
	<path class="st0" d="M48.8,20.3c0.1,0,0.2-0.1,0.2-0.2v-1.6c0-0.1-0.1-0.2-0.2-0.2c-0.1,0-0.2,0.1-0.2,0.2v1.6
		C48.6,20.3,48.7,20.3,48.8,20.3z"/>
	<path class="st0" d="M47.9,20.3c0.1,0,0.2-0.1,0.2-0.2v-1.6c0-0.1-0.1-0.2-0.2-0.2c-0.1,0-0.2,0.1-0.2,0.2v1.6
		C47.7,20.3,47.8,20.3,47.9,20.3z"/>
	<path class="st0" d="M46.9,20.3c0.1,0,0.2-0.1,0.2-0.2v-1.6c0-0.1-0.1-0.2-0.2-0.2c-0.1,0-0.2,0.1-0.2,0.2v1.6
		C46.7,20.3,46.8,20.3,46.9,20.3z"/>
	<path class="st0" d="M46.3,25.9h14.2c0.3,0,0.6-0.3,0.6-0.6v-2.5c0-0.3-0.3-0.6-0.6-0.6H46.3c-0.3,0-0.6,0.3-0.6,0.6v2.5
		C45.8,25.6,46,25.9,46.3,25.9z M46.2,22.8c0-0.1,0.1-0.2,0.2-0.2h14.2c0.1,0,0.2,0.1,0.2,0.2v2.5c0,0.1-0.1,0.2-0.2,0.2H46.3
		c-0.1,0-0.2-0.1-0.2-0.2V22.8z"/>
	<path class="st0" d="M53.8,25h0.8c0.3,0,0.6-0.3,0.6-0.6v-0.8c0-0.3-0.3-0.6-0.6-0.6h-0.8c-0.3,0-0.6,0.3-0.6,0.6v0.8
		C53.2,24.8,53.4,25,53.8,25z M53.6,23.7c0-0.1,0.1-0.2,0.2-0.2h0.8c0.1,0,0.2,0.1,0.2,0.2v0.8c0,0.1-0.1,0.2-0.2,0.2h-0.8
		c-0.1,0-0.2-0.1-0.2-0.2V23.7z"/>
	<path class="st0" d="M50.7,25c0.1,0,0.2-0.1,0.2-0.2v-1.6c0-0.1-0.1-0.2-0.2-0.2c-0.1,0-0.2,0.1-0.2,0.2v1.6
		C50.5,24.9,50.6,25,50.7,25z"/>
	<path class="st0" d="M49.8,25c0.1,0,0.2-0.1,0.2-0.2v-1.6c0-0.1-0.1-0.2-0.2-0.2c-0.1,0-0.2,0.1-0.2,0.2v1.6
		C49.6,24.9,49.7,25,49.8,25z"/>
	<path class="st0" d="M48.8,25c0.1,0,0.2-0.1,0.2-0.2v-1.6c0-0.1-0.1-0.2-0.2-0.2c-0.1,0-0.2,0.1-0.2,0.2v1.6
		C48.6,24.9,48.7,25,48.8,25z"/>
	<path class="st0" d="M47.9,25c0.1,0,0.2-0.1,0.2-0.2v-1.6c0-0.1-0.1-0.2-0.2-0.2c-0.1,0-0.2,0.1-0.2,0.2v1.6
		C47.7,24.9,47.8,25,47.9,25z"/>
	<path class="st0" d="M46.9,25c0.1,0,0.2-0.1,0.2-0.2v-1.6c0-0.1-0.1-0.2-0.2-0.2c-0.1,0-0.2,0.1-0.2,0.2v1.6
		C46.7,24.9,46.8,25,46.9,25z"/>
	<path class="st0" d="M61.6,39.9H45.2c-0.3,0-0.6,0.3-0.6,0.6v23.6c0,0.3,0.3,0.6,0.6,0.6h16.4c0.3,0,0.6-0.3,0.6-0.6l0-23.6
		C62.2,40.2,61.9,39.9,61.6,39.9z M61.6,64.3H45.2c-0.1,0-0.2-0.1-0.2-0.2V40.5c0-0.1,0.1-0.2,0.2-0.2h16.4c0.1,0,0.2,0.1,0.2,0.2
		v23.6C61.8,64.2,61.7,64.3,61.6,64.3z"/>
	<path class="st0" d="M57,60.7h-0.8c-0.3,0-0.6,0.3-0.6,0.6V62c0,0.3,0.3,0.6,0.6,0.6H57c0.3,0,0.6-0.3,0.6-0.6v-0.8
		C57.6,60.9,57.4,60.7,57,60.7z M57.2,62c0,0.1-0.1,0.2-0.2,0.2h-0.8c-0.1,0-0.2-0.1-0.2-0.2v-0.8c0-0.1,0.1-0.2,0.2-0.2H57
		c0.1,0,0.2,0.1,0.2,0.2V62z"/>
	<path class="st0" d="M59.5,60.7h-0.8c-0.3,0-0.6,0.3-0.6,0.6V62c0,0.3,0.3,0.6,0.6,0.6h0.8c0.3,0,0.6-0.3,0.6-0.6v-0.8
		C60.1,60.9,59.8,60.7,59.5,60.7z M59.7,62c0,0.1-0.1,0.2-0.2,0.2h-0.8c-0.1,0-0.2-0.1-0.2-0.2v-0.8c0-0.1,0.1-0.2,0.2-0.2h0.8
		c0.1,0,0.2,0.1,0.2,0.2V62z"/>
	<path class="st0" d="M60.6,41.1H46.3c-0.3,0-0.6,0.3-0.6,0.6v2.5c0,0.3,0.3,0.6,0.6,0.6h14.2c0.3,0,0.6-0.3,0.6-0.6v-2.5
		C61.1,41.4,60.9,41.1,60.6,41.1z M60.8,44.2c0,0.1-0.1,0.2-0.2,0.2H46.3c-0.1,0-0.2-0.1-0.2-0.2v-2.5c0-0.1,0.1-0.2,0.2-0.2h14.2
		c0.1,0,0.2,0.1,0.2,0.2V44.2z"/>
	<path class="st0" d="M59.5,42h-0.8c-0.3,0-0.6,0.3-0.6,0.6v0.8c0,0.3,0.3,0.6,0.6,0.6h0.8c0.3,0,0.6-0.3,0.6-0.6v-0.8
		C60.1,42.2,59.8,42,59.5,42z M59.7,43.3c0,0.1-0.1,0.2-0.2,0.2h-0.8c-0.1,0-0.2-0.1-0.2-0.2v-0.8c0-0.1,0.1-0.2,0.2-0.2h0.8
		c0.1,0,0.2,0.1,0.2,0.2V43.3z"/>
	<path class="st0" d="M57,42h-0.8c-0.3,0-0.6,0.3-0.6,0.6v0.8c0,0.3,0.3,0.6,0.6,0.6H57c0.3,0,0.6-0.3,0.6-0.6v-0.8
		C57.6,42.2,57.4,42,57,42z M57.2,43.3c0,0.1-0.1,0.2-0.2,0.2h-0.8c-0.1,0-0.2-0.1-0.2-0.2v-0.8c0-0.1,0.1-0.2,0.2-0.2H57
		c0.1,0,0.2,0.1,0.2,0.2V43.3z"/>
	<path class="st0" d="M54.5,42h-0.8c-0.3,0-0.6,0.3-0.6,0.6v0.8c0,0.3,0.3,0.6,0.6,0.6h0.8c0.3,0,0.6-0.3,0.6-0.6v-0.8
		C55.1,42.2,54.9,42,54.5,42z M54.7,43.3c0,0.1-0.1,0.2-0.2,0.2h-0.8c-0.1,0-0.2-0.1-0.2-0.2v-0.8c0-0.1,0.1-0.2,0.2-0.2h0.8
		c0.1,0,0.2,0.1,0.2,0.2V43.3z"/>
	<path class="st0" d="M50.7,42c-0.1,0-0.2,0.1-0.2,0.2v1.6c0,0.1,0.1,0.2,0.2,0.2c0.1,0,0.2-0.1,0.2-0.2v-1.6
		C50.9,42.1,50.8,42,50.7,42z"/>
	<path class="st0" d="M49.8,42c-0.1,0-0.2,0.1-0.2,0.2v1.6c0,0.1,0.1,0.2,0.2,0.2c0.1,0,0.2-0.1,0.2-0.2v-1.6
		C50,42.1,49.9,42,49.8,42z"/>
	<path class="st0" d="M48.8,42c-0.1,0-0.2,0.1-0.2,0.2v1.6c0,0.1,0.1,0.2,0.2,0.2c0.1,0,0.2-0.1,0.2-0.2v-1.6
		C49,42.1,48.9,42,48.8,42z"/>
	<path class="st0" d="M47.9,42c-0.1,0-0.2,0.1-0.2,0.2v1.6c0,0.1,0.1,0.2,0.2,0.2c0.1,0,0.2-0.1,0.2-0.2v-1.6
		C48.1,42.1,48,42,47.9,42z"/>
	<path class="st0" d="M46.9,42c-0.1,0-0.2,0.1-0.2,0.2v1.6c0,0.1,0.1,0.2,0.2,0.2c0.1,0,0.2-0.1,0.2-0.2v-1.6
		C47.1,42.1,47,42,46.9,42z"/>
	<path class="st0" d="M60.6,45.8H46.3c-0.3,0-0.6,0.3-0.6,0.6v2.5c0,0.3,0.3,0.6,0.6,0.6h14.2c0.3,0,0.6-0.3,0.6-0.6v-2.5
		C61.1,46,60.9,45.8,60.6,45.8z M60.8,48.9c0,0.1-0.1,0.2-0.2,0.2H46.3c-0.1,0-0.2-0.1-0.2-0.2v-2.5c0-0.1,0.1-0.2,0.2-0.2h14.2
		c0.1,0,0.2,0.1,0.2,0.2V48.9z"/>
	<path class="st0" d="M57,46.7h-0.8c-0.3,0-0.6,0.3-0.6,0.6V48c0,0.3,0.3,0.6,0.6,0.6H57c0.3,0,0.6-0.3,0.6-0.6v-0.8
		C57.6,46.9,57.4,46.7,57,46.7z M57.2,48c0,0.1-0.1,0.2-0.2,0.2h-0.8c-0.1,0-0.2-0.1-0.2-0.2v-0.8c0-0.1,0.1-0.2,0.2-0.2H57
		c0.1,0,0.2,0.1,0.2,0.2V48z"/>
	<path class="st0" d="M54.5,46.7h-0.8c-0.3,0-0.6,0.3-0.6,0.6V48c0,0.3,0.3,0.6,0.6,0.6h0.8c0.3,0,0.6-0.3,0.6-0.6v-0.8
		C55.1,46.9,54.9,46.7,54.5,46.7z M54.7,48c0,0.1-0.1,0.2-0.2,0.2h-0.8c-0.1,0-0.2-0.1-0.2-0.2v-0.8c0-0.1,0.1-0.2,0.2-0.2h0.8
		c0.1,0,0.2,0.1,0.2,0.2V48z"/>
	<path class="st0" d="M59.5,46.7h-0.8c-0.3,0-0.6,0.3-0.6,0.6V48c0,0.3,0.3,0.6,0.6,0.6h0.8c0.3,0,0.6-0.3,0.6-0.6v-0.8
		C60.1,46.9,59.8,46.7,59.5,46.7z M59.7,48c0,0.1-0.1,0.2-0.2,0.2h-0.8c-0.1,0-0.2-0.1-0.2-0.2v-0.8c0-0.1,0.1-0.2,0.2-0.2h0.8
		c0.1,0,0.2,0.1,0.2,0.2V48z"/>
	<path class="st0" d="M50.7,46.7c-0.1,0-0.2,0.1-0.2,0.2v1.6c0,0.1,0.1,0.2,0.2,0.2c0.1,0,0.2-0.1,0.2-0.2v-1.6
		C50.9,46.7,50.8,46.7,50.7,46.7z"/>
	<path class="st0" d="M49.8,46.7c-0.1,0-0.2,0.1-0.2,0.2v1.6c0,0.1,0.1,0.2,0.2,0.2c0.1,0,0.2-0.1,0.2-0.2v-1.6
		C50,46.7,49.9,46.7,49.8,46.7z"/>
	<path class="st0" d="M48.8,46.7c-0.1,0-0.2,0.1-0.2,0.2v1.6c0,0.1,0.1,0.2,0.2,0.2c0.1,0,0.2-0.1,0.2-0.2v-1.6
		C49,46.7,48.9,46.7,48.8,46.7z"/>
	<path class="st0" d="M47.9,46.7c-0.1,0-0.2,0.1-0.2,0.2v1.6c0,0.1,0.1,0.2,0.2,0.2c0.1,0,0.2-0.1,0.2-0.2v-1.6
		C48.1,46.7,48,46.7,47.9,46.7z"/>
	<path class="st0" d="M46.9,46.7c-0.1,0-0.2,0.1-0.2,0.2v1.6c0,0.1,0.1,0.2,0.2,0.2c0.1,0,0.2-0.1,0.2-0.2v-1.6
		C47.1,46.7,47,46.7,46.9,46.7z"/>
	<path class="st0" d="M60.6,50.4H46.3c-0.3,0-0.6,0.3-0.6,0.6v2.5c0,0.3,0.3,0.6,0.6,0.6h14.2c0.3,0,0.6-0.3,0.6-0.6V51
		C61.1,50.7,60.9,50.4,60.6,50.4z M60.8,53.6c0,0.1-0.1,0.2-0.2,0.2H46.3c-0.1,0-0.2-0.1-0.2-0.2V51c0-0.1,0.1-0.2,0.2-0.2h14.2
		c0.1,0,0.2,0.1,0.2,0.2V53.6z"/>
	<path class="st0" d="M57,51.3h-0.8c-0.3,0-0.6,0.3-0.6,0.6v0.8c0,0.3,0.3,0.6,0.6,0.6H57c0.3,0,0.6-0.3,0.6-0.6v-0.8
		C57.6,51.6,57.4,51.3,57,51.3z M57.2,52.7c0,0.1-0.1,0.2-0.2,0.2h-0.8c-0.1,0-0.2-0.1-0.2-0.2v-0.8c0-0.1,0.1-0.2,0.2-0.2H57
		c0.1,0,0.2,0.1,0.2,0.2V52.7z"/>
	<path class="st0" d="M54.5,51.3h-0.8c-0.3,0-0.6,0.3-0.6,0.6v0.8c0,0.3,0.3,0.6,0.6,0.6h0.8c0.3,0,0.6-0.3,0.6-0.6v-0.8
		C55.1,51.6,54.9,51.3,54.5,51.3z M54.7,52.7c0,0.1-0.1,0.2-0.2,0.2h-0.8c-0.1,0-0.2-0.1-0.2-0.2v-0.8c0-0.1,0.1-0.2,0.2-0.2h0.8
		c0.1,0,0.2,0.1,0.2,0.2V52.7z"/>
	<path class="st0" d="M59.5,51.3h-0.8c-0.3,0-0.6,0.3-0.6,0.6v0.8c0,0.3,0.3,0.6,0.6,0.6h0.8c0.3,0,0.6-0.3,0.6-0.6v-0.8
		C60.1,51.6,59.8,51.3,59.5,51.3z M59.7,52.7c0,0.1-0.1,0.2-0.2,0.2h-0.8c-0.1,0-0.2-0.1-0.2-0.2v-0.8c0-0.1,0.1-0.2,0.2-0.2h0.8
		c0.1,0,0.2,0.1,0.2,0.2V52.7z"/>
	<path class="st0" d="M50.7,51.3c-0.1,0-0.2,0.1-0.2,0.2v1.6c0,0.1,0.1,0.2,0.2,0.2c0.1,0,0.2-0.1,0.2-0.2v-1.6
		C50.9,51.4,50.8,51.3,50.7,51.3z"/>
	<path class="st0" d="M49.8,51.3c-0.1,0-0.2,0.1-0.2,0.2v1.6c0,0.1,0.1,0.2,0.2,0.2c0.1,0,0.2-0.1,0.2-0.2v-1.6
		C50,51.4,49.9,51.3,49.8,51.3z"/>
	<path class="st0" d="M48.8,51.3c-0.1,0-0.2,0.1-0.2,0.2v1.6c0,0.1,0.1,0.2,0.2,0.2c0.1,0,0.2-0.1,0.2-0.2v-1.6
		C49,51.4,48.9,51.3,48.8,51.3z"/>
	<path class="st0" d="M47.9,51.3c-0.1,0-0.2,0.1-0.2,0.2v1.6c0,0.1,0.1,0.2,0.2,0.2c0.1,0,0.2-0.1,0.2-0.2v-1.6
		C48.1,51.4,48,51.3,47.9,51.3z"/>
	<path class="st0" d="M46.9,51.3c-0.1,0-0.2,0.1-0.2,0.2v1.6c0,0.1,0.1,0.2,0.2,0.2c0.1,0,0.2-0.1,0.2-0.2v-1.6
		C47.1,51.4,47,51.3,46.9,51.3z"/>
	<path class="st0" d="M57,56h-0.8c-0.3,0-0.6,0.3-0.6,0.6v0.8c0,0.3,0.3,0.6,0.6,0.6H57c0.3,0,0.6-0.3,0.6-0.6v-0.8
		C57.6,56.3,57.4,56,57,56z M57.2,57.4c0,0.1-0.1,0.2-0.2,0.2h-0.8c-0.1,0-0.2-0.1-0.2-0.2v-0.8c0-0.1,0.1-0.2,0.2-0.2H57
		c0.1,0,0.2,0.1,0.2,0.2V57.4z"/>
	<path class="st0" d="M59.5,56h-0.8c-0.3,0-0.6,0.3-0.6,0.6v0.8c0,0.3,0.3,0.6,0.6,0.6h0.8c0.3,0,0.6-0.3,0.6-0.6v-0.8
		C60.1,56.3,59.8,56,59.5,56z M59.7,57.4c0,0.1-0.1,0.2-0.2,0.2h-0.8c-0.1,0-0.2-0.1-0.2-0.2v-0.8c0-0.1,0.1-0.2,0.2-0.2h0.8
		c0.1,0,0.2,0.1,0.2,0.2V57.4z"/>
	<path class="st0" d="M60.6,55.1H46.3c-0.3,0-0.6,0.3-0.6,0.6v2.5c0,0.3,0.3,0.6,0.6,0.6h14.2c0.3,0,0.6-0.3,0.6-0.6v-2.5
		C61.1,55.4,60.9,55.1,60.6,55.1z M60.8,58.2c0,0.1-0.1,0.2-0.2,0.2H46.3c-0.1,0-0.2-0.1-0.2-0.2v-2.5c0-0.1,0.1-0.2,0.2-0.2h14.2
		c0.1,0,0.2,0.1,0.2,0.2V58.2z"/>
	<path class="st0" d="M54.5,56h-0.8c-0.3,0-0.6,0.3-0.6,0.6v0.8c0,0.3,0.3,0.6,0.6,0.6h0.8c0.3,0,0.6-0.3,0.6-0.6v-0.8
		C55.1,56.3,54.9,56,54.5,56z M54.7,57.4c0,0.1-0.1,0.2-0.2,0.2h-0.8c-0.1,0-0.2-0.1-0.2-0.2v-0.8c0-0.1,0.1-0.2,0.2-0.2h0.8
		c0.1,0,0.2,0.1,0.2,0.2V57.4z"/>
	<path class="st0" d="M50.7,56c-0.1,0-0.2,0.1-0.2,0.2v1.6c0,0.1,0.1,0.2,0.2,0.2c0.1,0,0.2-0.1,0.2-0.2v-1.6
		C50.9,56.1,50.8,56,50.7,56z"/>
	<path class="st0" d="M49.8,56c-0.1,0-0.2,0.1-0.2,0.2v1.6c0,0.1,0.1,0.2,0.2,0.2c0.1,0,0.2-0.1,0.2-0.2v-1.6
		C50,56.1,49.9,56,49.8,56z"/>
	<path class="st0" d="M48.8,56c-0.1,0-0.2,0.1-0.2,0.2v1.6c0,0.1,0.1,0.2,0.2,0.2c0.1,0,0.2-0.1,0.2-0.2v-1.6
		C49,56.1,48.9,56,48.8,56z"/>
	<path class="st0" d="M47.9,56c-0.1,0-0.2,0.1-0.2,0.2v1.6c0,0.1,0.1,0.2,0.2,0.2c0.1,0,0.2-0.1,0.2-0.2v-1.6
		C48.1,56.1,48,56,47.9,56z"/>
	<path class="st0" d="M46.9,56c-0.1,0-0.2,0.1-0.2,0.2v1.6c0,0.1,0.1,0.2,0.2,0.2c0.1,0,0.2-0.1,0.2-0.2v-1.6
		C47.1,56.1,47,56,46.9,56z"/>
	<path class="st0" d="M60.6,59.8H46.3c-0.3,0-0.6,0.3-0.6,0.6v2.5c0,0.3,0.3,0.6,0.6,0.6h14.2c0.3,0,0.6-0.3,0.6-0.6v-2.5
		C61.1,60.1,60.9,59.8,60.6,59.8z M60.8,62.9c0,0.1-0.1,0.2-0.2,0.2H46.3c-0.1,0-0.2-0.1-0.2-0.2v-2.5c0-0.1,0.1-0.2,0.2-0.2h14.2
		c0.1,0,0.2,0.1,0.2,0.2V62.9z"/>
	<path class="st0" d="M54.5,60.7h-0.8c-0.3,0-0.6,0.3-0.6,0.6V62c0,0.3,0.3,0.6,0.6,0.6h0.8c0.3,0,0.6-0.3,0.6-0.6v-0.8
		C55.1,60.9,54.9,60.7,54.5,60.7z M54.7,62c0,0.1-0.1,0.2-0.2,0.2h-0.8c-0.1,0-0.2-0.1-0.2-0.2v-0.8c0-0.1,0.1-0.2,0.2-0.2h0.8
		c0.1,0,0.2,0.1,0.2,0.2V62z"/>
	<path class="st0" d="M50.7,60.7c-0.1,0-0.2,0.1-0.2,0.2v1.6c0,0.1,0.1,0.2,0.2,0.2c0.1,0,0.2-0.1,0.2-0.2v-1.6
		C50.9,60.8,50.8,60.7,50.7,60.7z"/>
	<path class="st0" d="M49.8,60.7c-0.1,0-0.2,0.1-0.2,0.2v1.6c0,0.1,0.1,0.2,0.2,0.2c0.1,0,0.2-0.1,0.2-0.2v-1.6
		C50,60.8,49.9,60.7,49.8,60.7z"/>
	<path class="st0" d="M48.8,60.7c-0.1,0-0.2,0.1-0.2,0.2v1.6c0,0.1,0.1,0.2,0.2,0.2c0.1,0,0.2-0.1,0.2-0.2v-1.6
		C49,60.8,48.9,60.7,48.8,60.7z"/>
	<path class="st0" d="M47.9,60.7c-0.1,0-0.2,0.1-0.2,0.2v1.6c0,0.1,0.1,0.2,0.2,0.2c0.1,0,0.2-0.1,0.2-0.2v-1.6
		C48.1,60.8,48,60.7,47.9,60.7z"/>
	<path class="st0" d="M46.9,60.7c-0.1,0-0.2,0.1-0.2,0.2v1.6c0,0.1,0.1,0.2,0.2,0.2c0.1,0,0.2-0.1,0.2-0.2v-1.6
		C47.1,60.8,47,60.7,46.9,60.7z"/>
	<path class="st0" d="M18.8,2.3H2.4c-0.3,0-0.6,0.3-0.6,0.6v23.6c0,0.3,0.3,0.6,0.6,0.6h16.4c0.3,0,0.6-0.3,0.6-0.6V2.9
		C19.4,2.6,19.1,2.3,18.8,2.3z M19,26.5c0,0.1-0.1,0.2-0.2,0.2H2.4c-0.1,0-0.2-0.1-0.2-0.2V2.9c0-0.1,0.1-0.2,0.2-0.2h16.4
		c0.1,0,0.2,0.1,0.2,0.2L19,26.5z"/>
	<path class="st0" d="M14.2,23.1h-0.8c-0.3,0-0.6,0.3-0.6,0.6v0.8c0,0.3,0.3,0.6,0.6,0.6h0.8c0.3,0,0.6-0.3,0.6-0.6v-0.8
		C14.8,23.3,14.5,23.1,14.2,23.1z M14.4,24.4c0,0.1-0.1,0.2-0.2,0.2h-0.8c-0.1,0-0.2-0.1-0.2-0.2v-0.8c0-0.1,0.1-0.2,0.2-0.2h0.8
		c0.1,0,0.2,0.1,0.2,0.2V24.4z"/>
	<path class="st0" d="M16.7,23.1h-0.8c-0.3,0-0.6,0.3-0.6,0.6v0.8c0,0.3,0.3,0.6,0.6,0.6h0.8c0.3,0,0.6-0.3,0.6-0.6v-0.8
		C17.3,23.3,17,23.1,16.7,23.1z M16.9,24.4c0,0.1-0.1,0.2-0.2,0.2h-0.8c-0.1,0-0.2-0.1-0.2-0.2v-0.8c0-0.1,0.1-0.2,0.2-0.2h0.8
		c0.1,0,0.2,0.1,0.2,0.2V24.4z"/>
	<path class="st0" d="M17.7,3.5H3.5c-0.3,0-0.6,0.3-0.6,0.6v2.5c0,0.3,0.3,0.6,0.6,0.6h14.2c0.3,0,0.6-0.3,0.6-0.6V4.1
		C18.3,3.8,18.1,3.5,17.7,3.5z M17.9,6.6c0,0.1-0.1,0.2-0.2,0.2H3.5c-0.1,0-0.2-0.1-0.2-0.2V4.1c0-0.1,0.1-0.2,0.2-0.2h14.2
		c0.1,0,0.2,0.1,0.2,0.2V6.6z"/>
	<path class="st0" d="M16.7,4.4h-0.8c-0.3,0-0.6,0.3-0.6,0.6v0.8c0,0.3,0.3,0.6,0.6,0.6h0.8c0.3,0,0.6-0.3,0.6-0.6V5
		C17.3,4.6,17,4.4,16.7,4.4z M16.9,5.7c0,0.1-0.1,0.2-0.2,0.2h-0.8c-0.1,0-0.2-0.1-0.2-0.2V5c0-0.1,0.1-0.2,0.2-0.2h0.8
		c0.1,0,0.2,0.1,0.2,0.2V5.7z"/>
	<path class="st0" d="M14.2,4.4h-0.8c-0.3,0-0.6,0.3-0.6,0.6v0.8c0,0.3,0.3,0.6,0.6,0.6h0.8c0.3,0,0.6-0.3,0.6-0.6V5
		C14.8,4.6,14.5,4.4,14.2,4.4z M14.4,5.7c0,0.1-0.1,0.2-0.2,0.2h-0.8c-0.1,0-0.2-0.1-0.2-0.2V5c0-0.1,0.1-0.2,0.2-0.2h0.8
		c0.1,0,0.2,0.1,0.2,0.2V5.7z"/>
	<path class="st0" d="M11.7,4.4h-0.8c-0.3,0-0.6,0.3-0.6,0.6v0.8c0,0.3,0.3,0.6,0.6,0.6h0.8c0.3,0,0.6-0.3,0.6-0.6V5
		C12.3,4.6,12,4.4,11.7,4.4z M11.9,5.7c0,0.1-0.1,0.2-0.2,0.2h-0.8c-0.1,0-0.2-0.1-0.2-0.2V5c0-0.1,0.1-0.2,0.2-0.2h0.8
		c0.1,0,0.2,0.1,0.2,0.2V5.7z"/>
	<path class="st0" d="M7.9,4.4c-0.1,0-0.2,0.1-0.2,0.2v1.6c0,0.1,0.1,0.2,0.2,0.2c0.1,0,0.2-0.1,0.2-0.2V4.6C8.1,4.5,8,4.4,7.9,4.4z
		"/>
	<path class="st0" d="M7,4.4c-0.1,0-0.2,0.1-0.2,0.2v1.6c0,0.1,0.1,0.2,0.2,0.2s0.2-0.1,0.2-0.2V4.6C7.2,4.5,7.1,4.4,7,4.4z"/>
	<path class="st0" d="M6,4.4c-0.1,0-0.2,0.1-0.2,0.2v1.6c0,0.1,0.1,0.2,0.2,0.2s0.2-0.1,0.2-0.2V4.6C6.2,4.5,6.1,4.4,6,4.4z"/>
	<path class="st0" d="M5.1,4.4c-0.1,0-0.2,0.1-0.2,0.2v1.6c0,0.1,0.1,0.2,0.2,0.2s0.2-0.1,0.2-0.2V4.6C5.3,4.5,5.2,4.4,5.1,4.4z"/>
	<path class="st0" d="M4.1,4.4C4,4.4,3.9,4.5,3.9,4.6v1.6c0,0.1,0.1,0.2,0.2,0.2s0.2-0.1,0.2-0.2V4.6C4.3,4.5,4.2,4.4,4.1,4.4z"/>
	<path class="st0" d="M17.7,8.2H3.5c-0.3,0-0.6,0.3-0.6,0.6v2.5c0,0.3,0.3,0.6,0.6,0.6h14.2c0.3,0,0.6-0.3,0.6-0.6V8.8
		C18.3,8.4,18.1,8.2,17.7,8.2z M17.9,11.3c0,0.1-0.1,0.2-0.2,0.2H3.5c-0.1,0-0.2-0.1-0.2-0.2V8.8c0-0.1,0.1-0.2,0.2-0.2h14.2
		c0.1,0,0.2,0.1,0.2,0.2V11.3z"/>
	<path class="st0" d="M14.2,9h-0.8c-0.3,0-0.6,0.3-0.6,0.6v0.8c0,0.3,0.3,0.6,0.6,0.6h0.8c0.3,0,0.6-0.3,0.6-0.6V9.6
		C14.8,9.3,14.5,9,14.2,9z M14.4,10.4c0,0.1-0.1,0.2-0.2,0.2h-0.8c-0.1,0-0.2-0.1-0.2-0.2V9.6c0-0.1,0.1-0.2,0.2-0.2h0.8
		c0.1,0,0.2,0.1,0.2,0.2V10.4z"/>
	<path class="st0" d="M11.7,9h-0.8c-0.3,0-0.6,0.3-0.6,0.6v0.8c0,0.3,0.3,0.6,0.6,0.6h0.8c0.3,0,0.6-0.3,0.6-0.6V9.6
		C12.3,9.3,12,9,11.7,9z M11.9,10.4c0,0.1-0.1,0.2-0.2,0.2h-0.8c-0.1,0-0.2-0.1-0.2-0.2V9.6c0-0.1,0.1-0.2,0.2-0.2h0.8
		c0.1,0,0.2,0.1,0.2,0.2V10.4z"/>
	<path class="st0" d="M16.7,9h-0.8c-0.3,0-0.6,0.3-0.6,0.6v0.8c0,0.3,0.3,0.6,0.6,0.6h0.8c0.3,0,0.6-0.3,0.6-0.6V9.6
		C17.3,9.3,17,9,16.7,9z M16.9,10.4c0,0.1-0.1,0.2-0.2,0.2h-0.8c-0.1,0-0.2-0.1-0.2-0.2V9.6c0-0.1,0.1-0.2,0.2-0.2h0.8
		c0.1,0,0.2,0.1,0.2,0.2V10.4z"/>
	<path class="st0" d="M7.9,9C7.8,9,7.7,9.1,7.7,9.2v1.6c0,0.1,0.1,0.2,0.2,0.2c0.1,0,0.2-0.1,0.2-0.2V9.2C8.1,9.1,8,9,7.9,9z"/>
	<path class="st0" d="M7,9C6.9,9,6.8,9.1,6.8,9.2v1.6C6.8,10.9,6.9,11,7,11s0.2-0.1,0.2-0.2V9.2C7.2,9.1,7.1,9,7,9z"/>
	<path class="st0" d="M6,9C5.9,9,5.8,9.1,5.8,9.2v1.6C5.8,10.9,5.9,11,6,11s0.2-0.1,0.2-0.2V9.2C6.2,9.1,6.1,9,6,9z"/>
	<path class="st0" d="M5.1,9C4.9,9,4.9,9.1,4.9,9.2v1.6c0,0.1,0.1,0.2,0.2,0.2s0.2-0.1,0.2-0.2V9.2C5.3,9.1,5.2,9,5.1,9z"/>
	<path class="st0" d="M4.1,9C4,9,3.9,9.1,3.9,9.2v1.6C3.9,10.9,4,11,4.1,11s0.2-0.1,0.2-0.2V9.2C4.3,9.1,4.2,9,4.1,9z"/>
	<path class="st0" d="M17.7,12.8H3.5c-0.3,0-0.6,0.3-0.6,0.6V16c0,0.3,0.3,0.6,0.6,0.6h14.2c0.3,0,0.6-0.3,0.6-0.6v-2.5
		C18.3,13.1,18.1,12.8,17.7,12.8z M17.9,16c0,0.1-0.1,0.2-0.2,0.2H3.5c-0.1,0-0.2-0.1-0.2-0.2v-2.5c0-0.1,0.1-0.2,0.2-0.2h14.2
		c0.1,0,0.2,0.1,0.2,0.2V16z"/>
	<path class="st0" d="M14.2,13.7h-0.8c-0.3,0-0.6,0.3-0.6,0.6v0.8c0,0.3,0.3,0.6,0.6,0.6h0.8c0.3,0,0.6-0.3,0.6-0.6v-0.8
		C14.8,14,14.5,13.7,14.2,13.7z M14.4,15.1c0,0.1-0.1,0.2-0.2,0.2h-0.8c-0.1,0-0.2-0.1-0.2-0.2v-0.8c0-0.1,0.1-0.2,0.2-0.2h0.8
		c0.1,0,0.2,0.1,0.2,0.2V15.1z"/>
	<path class="st0" d="M11.7,13.7h-0.8c-0.3,0-0.6,0.3-0.6,0.6v0.8c0,0.3,0.3,0.6,0.6,0.6h0.8c0.3,0,0.6-0.3,0.6-0.6v-0.8
		C12.3,14,12,13.7,11.7,13.7z M11.9,15.1c0,0.1-0.1,0.2-0.2,0.2h-0.8c-0.1,0-0.2-0.1-0.2-0.2v-0.8c0-0.1,0.1-0.2,0.2-0.2h0.8
		c0.1,0,0.2,0.1,0.2,0.2V15.1z"/>
	<path class="st0" d="M16.7,13.7h-0.8c-0.3,0-0.6,0.3-0.6,0.6v0.8c0,0.3,0.3,0.6,0.6,0.6h0.8c0.3,0,0.6-0.3,0.6-0.6v-0.8
		C17.3,14,17,13.7,16.7,13.7z M16.9,15.1c0,0.1-0.1,0.2-0.2,0.2h-0.8c-0.1,0-0.2-0.1-0.2-0.2v-0.8c0-0.1,0.1-0.2,0.2-0.2h0.8
		c0.1,0,0.2,0.1,0.2,0.2V15.1z"/>
	<path class="st0" d="M7.9,13.7c-0.1,0-0.2,0.1-0.2,0.2v1.6c0,0.1,0.1,0.2,0.2,0.2c0.1,0,0.2-0.1,0.2-0.2v-1.6
		C8.1,13.8,8,13.7,7.9,13.7z"/>
	<path class="st0" d="M7,13.7c-0.1,0-0.2,0.1-0.2,0.2v1.6c0,0.1,0.1,0.2,0.2,0.2s0.2-0.1,0.2-0.2v-1.6C7.2,13.8,7.1,13.7,7,13.7z"/>
	<path class="st0" d="M6,13.7c-0.1,0-0.2,0.1-0.2,0.2v1.6c0,0.1,0.1,0.2,0.2,0.2s0.2-0.1,0.2-0.2v-1.6C6.2,13.8,6.1,13.7,6,13.7z"/>
	<path class="st0" d="M5.1,13.7c-0.1,0-0.2,0.1-0.2,0.2v1.6c0,0.1,0.1,0.2,0.2,0.2s0.2-0.1,0.2-0.2v-1.6C5.3,13.8,5.2,13.7,5.1,13.7
		z"/>
	<path class="st0" d="M4.1,13.7c-0.1,0-0.2,0.1-0.2,0.2v1.6c0,0.1,0.1,0.2,0.2,0.2s0.2-0.1,0.2-0.2v-1.6C4.3,13.8,4.2,13.7,4.1,13.7
		z"/>
	<path class="st0" d="M14.2,18.4h-0.8c-0.3,0-0.6,0.3-0.6,0.6v0.8c0,0.3,0.3,0.6,0.6,0.6h0.8c0.3,0,0.6-0.3,0.6-0.6V19
		C14.8,18.7,14.5,18.4,14.2,18.4z M14.4,19.8c0,0.1-0.1,0.2-0.2,0.2h-0.8c-0.1,0-0.2-0.1-0.2-0.2V19c0-0.1,0.1-0.2,0.2-0.2h0.8
		c0.1,0,0.2,0.1,0.2,0.2V19.8z"/>
	<path class="st0" d="M16.7,18.4h-0.8c-0.3,0-0.6,0.3-0.6,0.6v0.8c0,0.3,0.3,0.6,0.6,0.6h0.8c0.3,0,0.6-0.3,0.6-0.6V19
		C17.3,18.7,17,18.4,16.7,18.4z M16.9,19.8c0,0.1-0.1,0.2-0.2,0.2h-0.8c-0.1,0-0.2-0.1-0.2-0.2V19c0-0.1,0.1-0.2,0.2-0.2h0.8
		c0.1,0,0.2,0.1,0.2,0.2V19.8z"/>
	<path class="st0" d="M17.7,17.5H3.5c-0.3,0-0.6,0.3-0.6,0.6v2.5c0,0.3,0.3,0.6,0.6,0.6h14.2c0.3,0,0.6-0.3,0.6-0.6v-2.5
		C18.3,17.8,18.1,17.5,17.7,17.5z M17.9,20.6c0,0.1-0.1,0.2-0.2,0.2H3.5c-0.1,0-0.2-0.1-0.2-0.2v-2.5c0-0.1,0.1-0.2,0.2-0.2h14.2
		c0.1,0,0.2,0.1,0.2,0.2V20.6z"/>
	<path class="st0" d="M11.7,18.4h-0.8c-0.3,0-0.6,0.3-0.6,0.6v0.8c0,0.3,0.3,0.6,0.6,0.6h0.8c0.3,0,0.6-0.3,0.6-0.6V19
		C12.3,18.7,12,18.4,11.7,18.4z M11.9,19.8c0,0.1-0.1,0.2-0.2,0.2h-0.8c-0.1,0-0.2-0.1-0.2-0.2V19c0-0.1,0.1-0.2,0.2-0.2h0.8
		c0.1,0,0.2,0.1,0.2,0.2V19.8z"/>
	<path class="st0" d="M7.9,18.4c-0.1,0-0.2,0.1-0.2,0.2v1.6c0,0.1,0.1,0.2,0.2,0.2c0.1,0,0.2-0.1,0.2-0.2v-1.6
		C8.1,18.5,8,18.4,7.9,18.4z"/>
	<path class="st0" d="M7,18.4c-0.1,0-0.2,0.1-0.2,0.2v1.6c0,0.1,0.1,0.2,0.2,0.2s0.2-0.1,0.2-0.2v-1.6C7.2,18.5,7.1,18.4,7,18.4z"/>
	<path class="st0" d="M6,18.4c-0.1,0-0.2,0.1-0.2,0.2v1.6c0,0.1,0.1,0.2,0.2,0.2s0.2-0.1,0.2-0.2v-1.6C6.2,18.5,6.1,18.4,6,18.4z"/>
	<path class="st0" d="M5.1,18.4c-0.1,0-0.2,0.1-0.2,0.2v1.6c0,0.1,0.1,0.2,0.2,0.2s0.2-0.1,0.2-0.2v-1.6C5.3,18.5,5.2,18.4,5.1,18.4
		z"/>
	<path class="st0" d="M4.1,18.4c-0.1,0-0.2,0.1-0.2,0.2v1.6c0,0.1,0.1,0.2,0.2,0.2s0.2-0.1,0.2-0.2v-1.6C4.3,18.5,4.2,18.4,4.1,18.4
		z"/>
	<path class="st0" d="M17.7,22.2H3.5c-0.3,0-0.6,0.3-0.6,0.6v2.5c0,0.3,0.3,0.6,0.6,0.6h14.2c0.3,0,0.6-0.3,0.6-0.6v-2.5
		C18.3,22.5,18.1,22.2,17.7,22.2z M17.9,25.3c0,0.1-0.1,0.2-0.2,0.2H3.5c-0.1,0-0.2-0.1-0.2-0.2v-2.5c0-0.1,0.1-0.2,0.2-0.2h14.2
		c0.1,0,0.2,0.1,0.2,0.2V25.3z"/>
	<path class="st0" d="M11.7,23.1h-0.8c-0.3,0-0.6,0.3-0.6,0.6v0.8c0,0.3,0.3,0.6,0.6,0.6h0.8c0.3,0,0.6-0.3,0.6-0.6v-0.8
		C12.3,23.3,12,23.1,11.7,23.1z M11.9,24.4c0,0.1-0.1,0.2-0.2,0.2h-0.8c-0.1,0-0.2-0.1-0.2-0.2v-0.8c0-0.1,0.1-0.2,0.2-0.2h0.8
		c0.1,0,0.2,0.1,0.2,0.2V24.4z"/>
	<path class="st0" d="M7.9,23.1c-0.1,0-0.2,0.1-0.2,0.2v1.6c0,0.1,0.1,0.2,0.2,0.2c0.1,0,0.2-0.1,0.2-0.2v-1.6
		C8.1,23.2,8,23.1,7.9,23.1z"/>
	<path class="st0" d="M7,23.1c-0.1,0-0.2,0.1-0.2,0.2v1.6C6.8,24.9,6.9,25,7,25s0.2-0.1,0.2-0.2v-1.6C7.2,23.2,7.1,23.1,7,23.1z"/>
	<path class="st0" d="M6,23.1c-0.1,0-0.2,0.1-0.2,0.2v1.6C5.8,24.9,5.9,25,6,25s0.2-0.1,0.2-0.2v-1.6C6.2,23.2,6.1,23.1,6,23.1z"/>
	<path class="st0" d="M5.1,23.1c-0.1,0-0.2,0.1-0.2,0.2v1.6c0,0.1,0.1,0.2,0.2,0.2s0.2-0.1,0.2-0.2v-1.6C5.3,23.2,5.2,23.1,5.1,23.1
		z"/>
	<path class="st0" d="M4.1,23.1c-0.1,0-0.2,0.1-0.2,0.2v1.6C3.9,24.9,4,25,4.1,25s0.2-0.1,0.2-0.2v-1.6C4.3,23.2,4.2,23.1,4.1,23.1z
		"/>
	<path class="st0" d="M18.8,39.9H2.4c-0.3,0-0.6,0.3-0.6,0.6v23.6c0,0.3,0.3,0.6,0.6,0.6h16.4c0.3,0,0.6-0.3,0.6-0.6V40.5
		C19.4,40.2,19.1,39.9,18.8,39.9z M19,64.1c0,0.1-0.1,0.2-0.2,0.2H2.4c-0.1,0-0.2-0.1-0.2-0.2V40.5c0-0.1,0.1-0.2,0.2-0.2h16.4
		c0.1,0,0.2,0.1,0.2,0.2L19,64.1z"/>
	<path class="st0" d="M14.2,60.7h-0.8c-0.3,0-0.6,0.3-0.6,0.6V62c0,0.3,0.3,0.6,0.6,0.6h0.8c0.3,0,0.6-0.3,0.6-0.6v-0.8
		C14.8,60.9,14.5,60.7,14.2,60.7z M14.4,62c0,0.1-0.1,0.2-0.2,0.2h-0.8c-0.1,0-0.2-0.1-0.2-0.2v-0.8c0-0.1,0.1-0.2,0.2-0.2h0.8
		c0.1,0,0.2,0.1,0.2,0.2V62z"/>
	<path class="st0" d="M16.7,60.7h-0.8c-0.3,0-0.6,0.3-0.6,0.6V62c0,0.3,0.3,0.6,0.6,0.6h0.8c0.3,0,0.6-0.3,0.6-0.6v-0.8
		C17.3,60.9,17,60.7,16.7,60.7z M16.9,62c0,0.1-0.1,0.2-0.2,0.2h-0.8c-0.1,0-0.2-0.1-0.2-0.2v-0.8c0-0.1,0.1-0.2,0.2-0.2h0.8
		c0.1,0,0.2,0.1,0.2,0.2V62z"/>
	<path class="st0" d="M17.7,41.1H3.5c-0.3,0-0.6,0.3-0.6,0.6v2.5c0,0.3,0.3,0.6,0.6,0.6h14.2c0.3,0,0.6-0.3,0.6-0.6v-2.5
		C18.3,41.4,18.1,41.1,17.7,41.1z M17.9,44.2c0,0.1-0.1,0.2-0.2,0.2H3.5c-0.1,0-0.2-0.1-0.2-0.2v-2.5c0-0.1,0.1-0.2,0.2-0.2h14.2
		c0.1,0,0.2,0.1,0.2,0.2V44.2z"/>
	<path class="st0" d="M16.7,42h-0.8c-0.3,0-0.6,0.3-0.6,0.6v0.8c0,0.3,0.3,0.6,0.6,0.6h0.8c0.3,0,0.6-0.3,0.6-0.6v-0.8
		C17.3,42.2,17,42,16.7,42z M16.9,43.3c0,0.1-0.1,0.2-0.2,0.2h-0.8c-0.1,0-0.2-0.1-0.2-0.2v-0.8c0-0.1,0.1-0.2,0.2-0.2h0.8
		c0.1,0,0.2,0.1,0.2,0.2V43.3z"/>
	<path class="st0" d="M14.2,42h-0.8c-0.3,0-0.6,0.3-0.6,0.6v0.8c0,0.3,0.3,0.6,0.6,0.6h0.8c0.3,0,0.6-0.3,0.6-0.6v-0.8
		C14.8,42.2,14.5,42,14.2,42z M14.4,43.3c0,0.1-0.1,0.2-0.2,0.2h-0.8c-0.1,0-0.2-0.1-0.2-0.2v-0.8c0-0.1,0.1-0.2,0.2-0.2h0.8
		c0.1,0,0.2,0.1,0.2,0.2V43.3z"/>
	<path class="st0" d="M11.7,42h-0.8c-0.3,0-0.6,0.3-0.6,0.6v0.8c0,0.3,0.3,0.6,0.6,0.6h0.8c0.3,0,0.6-0.3,0.6-0.6v-0.8
		C12.3,42.2,12,42,11.7,42z M11.9,43.3c0,0.1-0.1,0.2-0.2,0.2h-0.8c-0.1,0-0.2-0.1-0.2-0.2v-0.8c0-0.1,0.1-0.2,0.2-0.2h0.8
		c0.1,0,0.2,0.1,0.2,0.2V43.3z"/>
	<path class="st0" d="M7.9,42c-0.1,0-0.2,0.1-0.2,0.2v1.6c0,0.1,0.1,0.2,0.2,0.2c0.1,0,0.2-0.1,0.2-0.2v-1.6C8.1,42.1,8,42,7.9,42z"
		/>
	<path class="st0" d="M7,42c-0.1,0-0.2,0.1-0.2,0.2v1.6c0,0.1,0.1,0.2,0.2,0.2s0.2-0.1,0.2-0.2v-1.6C7.2,42.1,7.1,42,7,42z"/>
	<path class="st0" d="M6,42c-0.1,0-0.2,0.1-0.2,0.2v1.6c0,0.1,0.1,0.2,0.2,0.2s0.2-0.1,0.2-0.2v-1.6C6.2,42.1,6.1,42,6,42z"/>
	<path class="st0" d="M5.1,42c-0.1,0-0.2,0.1-0.2,0.2v1.6c0,0.1,0.1,0.2,0.2,0.2s0.2-0.1,0.2-0.2v-1.6C5.3,42.1,5.2,42,5.1,42z"/>
	<path class="st0" d="M4.1,42c-0.1,0-0.2,0.1-0.2,0.2v1.6c0,0.1,0.1,0.2,0.2,0.2s0.2-0.1,0.2-0.2v-1.6C4.3,42.1,4.2,42,4.1,42z"/>
	<path class="st0" d="M17.7,45.8H3.5c-0.3,0-0.6,0.3-0.6,0.6v2.5c0,0.3,0.3,0.6,0.6,0.6h14.2c0.3,0,0.6-0.3,0.6-0.6v-2.5
		C18.3,46,18.1,45.8,17.7,45.8z M17.9,48.9c0,0.1-0.1,0.2-0.2,0.2H3.5c-0.1,0-0.2-0.1-0.2-0.2v-2.5c0-0.1,0.1-0.2,0.2-0.2h14.2
		c0.1,0,0.2,0.1,0.2,0.2V48.9z"/>
	<path class="st0" d="M14.2,46.7h-0.8c-0.3,0-0.6,0.3-0.6,0.6V48c0,0.3,0.3,0.6,0.6,0.6h0.8c0.3,0,0.6-0.3,0.6-0.6v-0.8
		C14.8,46.9,14.5,46.7,14.2,46.7z M14.4,48c0,0.1-0.1,0.2-0.2,0.2h-0.8c-0.1,0-0.2-0.1-0.2-0.2v-0.8c0-0.1,0.1-0.2,0.2-0.2h0.8
		c0.1,0,0.2,0.1,0.2,0.2V48z"/>
	<path class="st0" d="M11.7,46.7h-0.8c-0.3,0-0.6,0.3-0.6,0.6V48c0,0.3,0.3,0.6,0.6,0.6h0.8c0.3,0,0.6-0.3,0.6-0.6v-0.8
		C12.3,46.9,12,46.7,11.7,46.7z M11.9,48c0,0.1-0.1,0.2-0.2,0.2h-0.8c-0.1,0-0.2-0.1-0.2-0.2v-0.8c0-0.1,0.1-0.2,0.2-0.2h0.8
		c0.1,0,0.2,0.1,0.2,0.2V48z"/>
	<path class="st0" d="M16.7,46.7h-0.8c-0.3,0-0.6,0.3-0.6,0.6V48c0,0.3,0.3,0.6,0.6,0.6h0.8c0.3,0,0.6-0.3,0.6-0.6v-0.8
		C17.3,46.9,17,46.7,16.7,46.7z M16.9,48c0,0.1-0.1,0.2-0.2,0.2h-0.8c-0.1,0-0.2-0.1-0.2-0.2v-0.8c0-0.1,0.1-0.2,0.2-0.2h0.8
		c0.1,0,0.2,0.1,0.2,0.2V48z"/>
	<path class="st0" d="M7.9,46.7c-0.1,0-0.2,0.1-0.2,0.2v1.6c0,0.1,0.1,0.2,0.2,0.2c0.1,0,0.2-0.1,0.2-0.2v-1.6
		C8.1,46.7,8,46.7,7.9,46.7z"/>
	<path class="st0" d="M7,46.7c-0.1,0-0.2,0.1-0.2,0.2v1.6c0,0.1,0.1,0.2,0.2,0.2s0.2-0.1,0.2-0.2v-1.6C7.2,46.7,7.1,46.7,7,46.7z"/>
	<path class="st0" d="M6,46.7c-0.1,0-0.2,0.1-0.2,0.2v1.6c0,0.1,0.1,0.2,0.2,0.2s0.2-0.1,0.2-0.2v-1.6C6.2,46.7,6.1,46.7,6,46.7z"/>
	<path class="st0" d="M5.1,46.7c-0.1,0-0.2,0.1-0.2,0.2v1.6c0,0.1,0.1,0.2,0.2,0.2s0.2-0.1,0.2-0.2v-1.6C5.3,46.7,5.2,46.7,5.1,46.7
		z"/>
	<path class="st0" d="M4.1,46.7c-0.1,0-0.2,0.1-0.2,0.2v1.6c0,0.1,0.1,0.2,0.2,0.2s0.2-0.1,0.2-0.2v-1.6C4.3,46.7,4.2,46.7,4.1,46.7
		z"/>
	<path class="st0" d="M17.7,50.4H3.5c-0.3,0-0.6,0.3-0.6,0.6v2.5c0,0.3,0.3,0.6,0.6,0.6h14.2c0.3,0,0.6-0.3,0.6-0.6V51
		C18.3,50.7,18.1,50.4,17.7,50.4z M17.9,53.6c0,0.1-0.1,0.2-0.2,0.2H3.5c-0.1,0-0.2-0.1-0.2-0.2V51c0-0.1,0.1-0.2,0.2-0.2h14.2
		c0.1,0,0.2,0.1,0.2,0.2V53.6z"/>
	<path class="st0" d="M14.2,51.3h-0.8c-0.3,0-0.6,0.3-0.6,0.6v0.8c0,0.3,0.3,0.6,0.6,0.6h0.8c0.3,0,0.6-0.3,0.6-0.6v-0.8
		C14.8,51.6,14.5,51.3,14.2,51.3z M14.4,52.7c0,0.1-0.1,0.2-0.2,0.2h-0.8c-0.1,0-0.2-0.1-0.2-0.2v-0.8c0-0.1,0.1-0.2,0.2-0.2h0.8
		c0.1,0,0.2,0.1,0.2,0.2V52.7z"/>
	<path class="st0" d="M11.7,51.3h-0.8c-0.3,0-0.6,0.3-0.6,0.6v0.8c0,0.3,0.3,0.6,0.6,0.6h0.8c0.3,0,0.6-0.3,0.6-0.6v-0.8
		C12.3,51.6,12,51.3,11.7,51.3z M11.9,52.7c0,0.1-0.1,0.2-0.2,0.2h-0.8c-0.1,0-0.2-0.1-0.2-0.2v-0.8c0-0.1,0.1-0.2,0.2-0.2h0.8
		c0.1,0,0.2,0.1,0.2,0.2V52.7z"/>
	<path class="st0" d="M16.7,51.3h-0.8c-0.3,0-0.6,0.3-0.6,0.6v0.8c0,0.3,0.3,0.6,0.6,0.6h0.8c0.3,0,0.6-0.3,0.6-0.6v-0.8
		C17.3,51.6,17,51.3,16.7,51.3z M16.9,52.7c0,0.1-0.1,0.2-0.2,0.2h-0.8c-0.1,0-0.2-0.1-0.2-0.2v-0.8c0-0.1,0.1-0.2,0.2-0.2h0.8
		c0.1,0,0.2,0.1,0.2,0.2V52.7z"/>
	<path class="st0" d="M7.9,51.3c-0.1,0-0.2,0.1-0.2,0.2v1.6c0,0.1,0.1,0.2,0.2,0.2c0.1,0,0.2-0.1,0.2-0.2v-1.6
		C8.1,51.4,8,51.3,7.9,51.3z"/>
	<path class="st0" d="M7,51.3c-0.1,0-0.2,0.1-0.2,0.2v1.6c0,0.1,0.1,0.2,0.2,0.2s0.2-0.1,0.2-0.2v-1.6C7.2,51.4,7.1,51.3,7,51.3z"/>
	<path class="st0" d="M6,51.3c-0.1,0-0.2,0.1-0.2,0.2v1.6c0,0.1,0.1,0.2,0.2,0.2s0.2-0.1,0.2-0.2v-1.6C6.2,51.4,6.1,51.3,6,51.3z"/>
	<path class="st0" d="M5.1,51.3c-0.1,0-0.2,0.1-0.2,0.2v1.6c0,0.1,0.1,0.2,0.2,0.2s0.2-0.1,0.2-0.2v-1.6C5.3,51.4,5.2,51.3,5.1,51.3
		z"/>
	<path class="st0" d="M4.1,51.3c-0.1,0-0.2,0.1-0.2,0.2v1.6c0,0.1,0.1,0.2,0.2,0.2s0.2-0.1,0.2-0.2v-1.6C4.3,51.4,4.2,51.3,4.1,51.3
		z"/>
	<path class="st0" d="M14.2,56h-0.8c-0.3,0-0.6,0.3-0.6,0.6v0.8c0,0.3,0.3,0.6,0.6,0.6h0.8c0.3,0,0.6-0.3,0.6-0.6v-0.8
		C14.8,56.3,14.5,56,14.2,56z M14.4,57.4c0,0.1-0.1,0.2-0.2,0.2h-0.8c-0.1,0-0.2-0.1-0.2-0.2v-0.8c0-0.1,0.1-0.2,0.2-0.2h0.8
		c0.1,0,0.2,0.1,0.2,0.2V57.4z"/>
	<path class="st0" d="M16.7,56h-0.8c-0.3,0-0.6,0.3-0.6,0.6v0.8c0,0.3,0.3,0.6,0.6,0.6h0.8c0.3,0,0.6-0.3,0.6-0.6v-0.8
		C17.3,56.3,17,56,16.7,56z M16.9,57.4c0,0.1-0.1,0.2-0.2,0.2h-0.8c-0.1,0-0.2-0.1-0.2-0.2v-0.8c0-0.1,0.1-0.2,0.2-0.2h0.8
		c0.1,0,0.2,0.1,0.2,0.2V57.4z"/>
	<path class="st0" d="M17.7,55.1H3.5c-0.3,0-0.6,0.3-0.6,0.6v2.5c0,0.3,0.3,0.6,0.6,0.6h14.2c0.3,0,0.6-0.3,0.6-0.6v-2.5
		C18.3,55.4,18.1,55.1,17.7,55.1z M17.9,58.2c0,0.1-0.1,0.2-0.2,0.2H3.5c-0.1,0-0.2-0.1-0.2-0.2v-2.5c0-0.1,0.1-0.2,0.2-0.2h14.2
		c0.1,0,0.2,0.1,0.2,0.2V58.2z"/>
	<path class="st0" d="M11.7,56h-0.8c-0.3,0-0.6,0.3-0.6,0.6v0.8c0,0.3,0.3,0.6,0.6,0.6h0.8c0.3,0,0.6-0.3,0.6-0.6v-0.8
		C12.3,56.3,12,56,11.7,56z M11.9,57.4c0,0.1-0.1,0.2-0.2,0.2h-0.8c-0.1,0-0.2-0.1-0.2-0.2v-0.8c0-0.1,0.1-0.2,0.2-0.2h0.8
		c0.1,0,0.2,0.1,0.2,0.2V57.4z"/>
	<path class="st0" d="M7.9,56c-0.1,0-0.2,0.1-0.2,0.2v1.6c0,0.1,0.1,0.2,0.2,0.2c0.1,0,0.2-0.1,0.2-0.2v-1.6C8.1,56.1,8,56,7.9,56z"
		/>
	<path class="st0" d="M7,56c-0.1,0-0.2,0.1-0.2,0.2v1.6C6.8,57.9,6.9,58,7,58s0.2-0.1,0.2-0.2v-1.6C7.2,56.1,7.1,56,7,56z"/>
	<path class="st0" d="M6,56c-0.1,0-0.2,0.1-0.2,0.2v1.6C5.8,57.9,5.9,58,6,58s0.2-0.1,0.2-0.2v-1.6C6.2,56.1,6.1,56,6,56z"/>
	<path class="st0" d="M5.1,56c-0.1,0-0.2,0.1-0.2,0.2v1.6c0,0.1,0.1,0.2,0.2,0.2s0.2-0.1,0.2-0.2v-1.6C5.3,56.1,5.2,56,5.1,56z"/>
	<path class="st0" d="M4.1,56c-0.1,0-0.2,0.1-0.2,0.2v1.6C3.9,57.9,4,58,4.1,58s0.2-0.1,0.2-0.2v-1.6C4.3,56.1,4.2,56,4.1,56z"/>
	<path class="st0" d="M17.7,59.8H3.5c-0.3,0-0.6,0.3-0.6,0.6v2.5c0,0.3,0.3,0.6,0.6,0.6h14.2c0.3,0,0.6-0.3,0.6-0.6v-2.5
		C18.3,60.1,18.1,59.8,17.7,59.8z M17.9,62.9c0,0.1-0.1,0.2-0.2,0.2H3.5c-0.1,0-0.2-0.1-0.2-0.2v-2.5c0-0.1,0.1-0.2,0.2-0.2h14.2
		c0.1,0,0.2,0.1,0.2,0.2V62.9z"/>
	<path class="st0" d="M11.7,60.7h-0.8c-0.3,0-0.6,0.3-0.6,0.6V62c0,0.3,0.3,0.6,0.6,0.6h0.8c0.3,0,0.6-0.3,0.6-0.6v-0.8
		C12.3,60.9,12,60.7,11.7,60.7z M11.9,62c0,0.1-0.1,0.2-0.2,0.2h-0.8c-0.1,0-0.2-0.1-0.2-0.2v-0.8c0-0.1,0.1-0.2,0.2-0.2h0.8
		c0.1,0,0.2,0.1,0.2,0.2V62z"/>
	<path class="st0" d="M7.9,60.7c-0.1,0-0.2,0.1-0.2,0.2v1.6c0,0.1,0.1,0.2,0.2,0.2c0.1,0,0.2-0.1,0.2-0.2v-1.6
		C8.1,60.8,8,60.7,7.9,60.7z"/>
	<path class="st0" d="M7,60.7c-0.1,0-0.2,0.1-0.2,0.2v1.6c0,0.1,0.1,0.2,0.2,0.2s0.2-0.1,0.2-0.2v-1.6C7.2,60.8,7.1,60.7,7,60.7z"/>
	<path class="st0" d="M6,60.7c-0.1,0-0.2,0.1-0.2,0.2v1.6c0,0.1,0.1,0.2,0.2,0.2s0.2-0.1,0.2-0.2v-1.6C6.2,60.8,6.1,60.7,6,60.7z"/>
	<path class="st0" d="M5.1,60.7c-0.1,0-0.2,0.1-0.2,0.2v1.6c0,0.1,0.1,0.2,0.2,0.2s0.2-0.1,0.2-0.2v-1.6C5.3,60.8,5.2,60.7,5.1,60.7
		z"/>
	<path class="st0" d="M4.1,60.7c-0.1,0-0.2,0.1-0.2,0.2v1.6c0,0.1,0.1,0.2,0.2,0.2s0.2-0.1,0.2-0.2v-1.6C4.3,60.8,4.2,60.7,4.1,60.7
		z"/>
	<path class="st0" d="M10.8,39V28c0-0.1-0.1-0.2-0.2-0.2s-0.2,0.1-0.2,0.2V39c0,0.1,0.1,0.2,0.2,0.2S10.8,39.1,10.8,39z"/>
	<path class="st0" d="M53.3,28V39c0,0.1,0.1,0.2,0.2,0.2c0.1,0,0.2-0.1,0.2-0.2V28c0-0.1-0.1-0.2-0.2-0.2
		C53.3,27.8,53.3,27.9,53.3,28z"/>
	<path class="st0" d="M42.6,54.8h-8.9c-0.1-0.8-0.7-1.4-1.5-1.5v-6.4c0-0.1-0.1-0.2-0.2-0.2c-0.1,0-0.2,0.1-0.2,0.2v6.4
		c-0.8,0.1-1.4,0.7-1.5,1.5h-8.9c-0.1,0-0.2,0.1-0.2,0.2c0,0.1,0.1,0.2,0.2,0.2h8.9c0.1,0.9,0.8,1.5,1.7,1.5c0.9,0,1.6-0.7,1.7-1.5
		h8.9c0.1,0,0.2-0.1,0.2-0.2C42.8,54.8,42.7,54.8,42.6,54.8z M32,56.3c-0.7,0-1.3-0.6-1.3-1.3c0-0.7,0.6-1.3,1.3-1.3
		s1.3,0.6,1.3,1.3C33.3,55.7,32.7,56.3,32,56.3z"/>
	<path class="st0" d="M42.6,11.9h-8.9c-0.1-0.9-0.8-1.5-1.7-1.5c-0.9,0-1.6,0.7-1.7,1.5h-8.9c-0.1,0-0.2,0.1-0.2,0.2
		c0,0.1,0.1,0.2,0.2,0.2h8.9c0.1,0.8,0.7,1.4,1.5,1.5v6.4c0,0.1,0.1,0.2,0.2,0.2c0.1,0,0.2-0.1,0.2-0.2v-6.4
		c0.8-0.1,1.4-0.7,1.5-1.5h8.9c0.1,0,0.2-0.1,0.2-0.2C42.8,11.9,42.7,11.9,42.6,11.9z M32,13.4L32,13.4L32,13.4
		c-0.7,0-1.3-0.6-1.3-1.3c0-0.7,0.6-1.3,1.3-1.3s1.3,0.6,1.3,1.3C33.3,12.8,32.7,13.4,32,13.4z"/>
</g>
</svg>
