#####
Sites
#####




***********
Create Site
***********



***********
Delete Site
***********



***********
Update Site
***********



***********************
Fetch details of a Site
***********************



*******************
Fetch List of Sites
*******************







.. toctree::
