##############################
Energy Monitoring System (EMS)
##############################


.. raw:: html

	<p>…</p>

.. toctree::

	specific_energy/index
	idle_energy/index
	product_variation/index
	other_info_ems/index