<svg width="64" height="63" viewBox="0 0 64 63" fill="none" xmlns="http://www.w3.org/2000/svg">
<g clip-path="url(#clip0)">
<mask id="mask0" mask-type="alpha" maskUnits="userSpaceOnUse" x="0" y="0" width="65" height="63">
<path d="M60.2188 31.8099C58.6183 31.8099 57.2179 32.8102 56.7177 34.3107H31.8099V27.8087H56.7177C57.3179 29.2091 58.6183 30.3094 60.2188 30.3094C62.3195 30.3094 64.02 28.6089 64.02 26.4082C64.02 24.2075 62.3195 22.507 60.2188 22.507C58.3182 22.507 56.7177 23.9074 56.5177 25.808H31.8099V20.9065H51.5161C51.8162 20.9065 52.1163 20.8065 52.3163 20.5064L57.2179 14.5045C57.618 14.7046 58.1182 14.8046 58.6183 14.8046C60.719 14.8046 62.4195 13.1041 62.4195 10.9034C62.4195 8.80273 60.719 7.00216 58.6183 7.00216C56.5177 7.00216 54.8171 8.70269 54.8171 10.9034C54.8171 11.8037 55.1172 12.6039 55.6174 13.3041L51.0159 18.9059H31.8099V14.3044V14.0044H47.8149C48.4151 14.0044 48.8153 13.6042 48.8153 13.004V7.70238C50.4158 7.20223 51.6161 5.80179 51.6161 4.00123C51.6161 1.90057 49.9156 0.100006 47.8149 0.100006C45.7143 0.100006 44.0138 1.80054 44.0138 4.00123C44.0138 5.80179 45.2141 7.30226 46.8146 7.70238V11.9037H31.8099V7.60235C31.8099 7.00216 31.4098 6.60204 30.8096 6.60204C29.9093 6.60204 28.909 6.70207 28.0088 6.8021L24.7077 0.800225C24.5077 0.4001 23.9075 0.200038 23.4073 0.4001L14.5045 4.00123C14.0044 4.20129 13.8043 4.70144 13.9043 5.2016L15.7049 11.8037C14.2044 13.004 12.804 14.4045 11.6036 15.9049L5.00156 14.0044C4.50141 13.9043 4.00125 14.1044 3.80119 14.6045L0.100031 23.5073C-0.100032 24.0075 0.100031 24.5076 0.500156 24.8077L6.50203 28.2088C6.30197 30.1094 6.30197 32.01 6.50203 34.0106L0.500156 37.4117C0.100031 37.6117 -0.100032 38.2119 0.100031 38.7121L3.80119 47.6149C4.00125 48.115 4.50141 48.3151 5.00156 48.215L11.6036 46.4145C12.804 47.915 14.1044 49.3154 15.7049 50.5158L13.8043 57.1178C13.7043 57.618 13.9043 58.1181 14.4045 58.3182L23.3073 62.0194C23.4073 62.1194 23.6074 62.1194 23.7074 62.1194C24.1075 62.1194 24.4076 61.9193 24.6077 61.6192L28.0088 55.6174C29.0091 55.7174 30.0094 55.8174 30.9097 55.8174C31.5098 55.8174 31.91 55.4173 31.91 54.8171V50.4157H46.9147V54.617C45.2141 54.7171 44.0138 56.2175 44.0138 58.0181C44.0138 60.1188 45.7143 61.9193 47.8149 61.9193C49.9156 61.9193 51.6161 60.2188 51.6161 58.0181C51.6161 56.2175 50.4158 54.7171 48.8153 54.317V49.1153C48.8153 48.5151 48.4151 48.115 47.8149 48.115H31.8099V47.8149V43.1135H51.0159L55.6174 48.7152C55.1172 49.4154 54.8171 50.2157 54.8171 51.116C54.8171 53.2166 56.5177 55.0172 58.6183 55.0172C60.719 55.0172 62.4195 53.3166 62.4195 51.116C62.4195 49.0153 60.719 47.2147 58.6183 47.2147C58.1182 47.2147 57.618 47.3148 57.2179 47.5148L52.3163 41.513C52.1163 41.3129 51.8162 41.1128 51.5161 41.1128H31.8099V36.2113H56.4176C56.7177 38.1119 58.2182 39.5123 60.1188 39.5123C62.2194 39.5123 63.92 37.8118 63.92 35.6111C64.02 33.5104 62.3195 31.8099 60.2188 31.8099ZM60.2188 24.5076C61.2191 24.5076 62.0194 25.3079 62.0194 26.4082C62.0194 27.5086 61.2191 28.3088 60.2188 28.3088C59.2185 28.3088 58.4183 27.5086 58.4183 26.4082C58.4183 25.3079 59.2185 24.5076 60.2188 24.5076ZM58.6183 9.00279C59.6186 9.00279 60.4189 9.80304 60.4189 10.9034C60.4189 12.0037 59.6186 12.804 58.6183 12.804C58.3182 12.804 58.0181 12.7039 57.718 12.5039L57.618 12.4039C57.518 12.3038 57.518 12.3038 57.4179 12.3038C57.0178 12.0037 56.8178 11.5036 56.8178 10.9034C56.8178 9.80304 57.618 9.00279 58.6183 9.00279ZM46.0144 4.00123C46.0144 3.00091 46.8146 2.10063 47.8149 2.10063C48.8153 2.10063 49.6155 2.90088 49.6155 4.00123C49.6155 5.10157 48.8153 5.90182 47.8149 5.90182C46.8146 5.90182 46.0144 5.00154 46.0144 4.00123ZM49.6155 58.0181C49.6155 59.0184 48.8153 59.9187 47.8149 59.9187C46.8146 59.9187 46.0144 59.1185 46.0144 58.0181C46.0144 56.9178 46.8146 56.1175 47.8149 56.1175C48.8153 56.1175 49.6155 57.0178 49.6155 58.0181ZM60.4189 51.116C60.4189 52.1163 59.6186 53.0165 58.6183 53.0165C57.618 53.0165 56.8178 52.2163 56.8178 51.116C56.8178 50.6158 57.0178 50.1156 57.3179 49.8155C57.4179 49.8155 57.518 49.7155 57.518 49.7155L57.618 49.6155C57.9181 49.4154 58.2182 49.3154 58.5183 49.3154C59.6186 49.2154 60.4189 50.1156 60.4189 51.116ZM29.8093 46.8146C21.6067 46.2144 15.0047 39.4123 15.0047 31.0097C15.0047 22.607 21.5067 15.8049 29.8093 15.3048V46.8146ZM29.8093 53.5167C29.0091 53.5167 28.2088 53.4167 27.5086 53.3166C27.1085 53.2166 26.7083 53.4167 26.5083 53.8168L23.2073 59.6186L15.905 56.6177L17.7055 50.2157C17.8056 49.8155 17.7055 49.4154 17.3054 49.1153C15.5048 47.8149 14.0044 46.2144 12.704 44.5139C12.5039 44.2138 12.0038 44.0137 11.6036 44.1138L5.20162 45.9143L2.20069 38.612L8.0025 35.411C8.40263 35.211 8.60269 34.8109 8.50266 34.4107C8.20256 32.21 8.20256 30.0094 8.50266 27.9087C8.60269 27.5086 8.40263 27.1084 8.0025 26.9084L2.20069 23.6074L5.20162 16.3051L11.6036 18.1056C12.0038 18.2057 12.4039 18.1056 12.704 17.7055C14.0044 15.9049 15.6049 14.4045 17.3054 13.1041C17.6055 12.904 17.8056 12.4039 17.7055 12.0037L16.005 5.50169L23.3073 2.50076L26.5083 8.30257C26.7083 8.7027 27.1085 8.90276 27.5086 8.80273C28.2088 8.7027 29.0091 8.60266 29.7093 8.60266V13.3041C20.5064 13.8043 13.0041 21.6067 13.0041 31.0097C13.0041 40.5126 20.4064 48.215 29.8093 48.7152V53.5167ZM60.2188 37.5117C59.2185 37.5117 58.4183 36.7115 58.4183 35.6111C58.4183 34.5108 59.2185 33.7105 60.2188 33.7105C61.2191 33.7105 62.0194 34.5108 62.0194 35.6111C62.0194 36.7115 61.2191 37.5117 60.2188 37.5117Z" fill="white"/>
</mask>
<g mask="url(#mask0)">
<path d="M60.2188 31.8099C58.6183 31.8099 57.2179 32.8102 56.7177 34.3107H31.8099V27.8087H56.7177C57.3179 29.2091 58.6183 30.3094 60.2188 30.3094C62.3195 30.3094 64.02 28.6089 64.02 26.4082C64.02 24.2075 62.3195 22.507 60.2188 22.507C58.3182 22.507 56.7177 23.9074 56.5177 25.808H31.8099V20.9065H51.5161C51.8162 20.9065 52.1163 20.8065 52.3163 20.5064L57.2179 14.5045C57.618 14.7046 58.1182 14.8046 58.6183 14.8046C60.719 14.8046 62.4195 13.1041 62.4195 10.9034C62.4195 8.80273 60.719 7.00216 58.6183 7.00216C56.5177 7.00216 54.8171 8.70269 54.8171 10.9034C54.8171 11.8037 55.1172 12.6039 55.6174 13.3041L51.0159 18.9059H31.8099V14.3044V14.0044H47.8149C48.4151 14.0044 48.8153 13.6042 48.8153 13.004V7.70238C50.4158 7.20223 51.6161 5.80179 51.6161 4.00123C51.6161 1.90057 49.9156 0.100006 47.8149 0.100006C45.7143 0.100006 44.0138 1.80054 44.0138 4.00123C44.0138 5.80179 45.2141 7.30226 46.8146 7.70238V11.9037H31.8099V7.60235C31.8099 7.00216 31.4098 6.60204 30.8096 6.60204C29.9093 6.60204 28.909 6.70207 28.0088 6.8021L24.7077 0.800225C24.5077 0.4001 23.9075 0.200038 23.4073 0.4001L14.5045 4.00123C14.0044 4.20129 13.8043 4.70144 13.9043 5.2016L15.7049 11.8037C14.2044 13.004 12.804 14.4045 11.6036 15.9049L5.00156 14.0044C4.50141 13.9043 4.00125 14.1044 3.80119 14.6045L0.100031 23.5073C-0.100032 24.0075 0.100031 24.5076 0.500156 24.8077L6.50203 28.2088C6.30197 30.1094 6.30197 32.01 6.50203 34.0106L0.500156 37.4117C0.100031 37.6117 -0.100032 38.2119 0.100031 38.7121L3.80119 47.6149C4.00125 48.115 4.50141 48.3151 5.00156 48.215L11.6036 46.4145C12.804 47.915 14.1044 49.3154 15.7049 50.5158L13.8043 57.1178C13.7043 57.618 13.9043 58.1181 14.4045 58.3182L23.3073 62.0194C23.4073 62.1194 23.6074 62.1194 23.7074 62.1194C24.1075 62.1194 24.4076 61.9193 24.6077 61.6192L28.0088 55.6174C29.0091 55.7174 30.0094 55.8174 30.9097 55.8174C31.5098 55.8174 31.91 55.4173 31.91 54.8171V50.4157H46.9147V54.617C45.2141 54.7171 44.0138 56.2175 44.0138 58.0181C44.0138 60.1188 45.7143 61.9193 47.8149 61.9193C49.9156 61.9193 51.6161 60.2188 51.6161 58.0181C51.6161 56.2175 50.4158 54.7171 48.8153 54.317V49.1153C48.8153 48.5151 48.4151 48.115 47.8149 48.115H31.8099V47.8149V43.1135H51.0159L55.6174 48.7152C55.1172 49.4154 54.8171 50.2157 54.8171 51.116C54.8171 53.2166 56.5177 55.0172 58.6183 55.0172C60.719 55.0172 62.4195 53.3166 62.4195 51.116C62.4195 49.0153 60.719 47.2147 58.6183 47.2147C58.1182 47.2147 57.618 47.3148 57.2179 47.5148L52.3163 41.513C52.1163 41.3129 51.8162 41.1128 51.5161 41.1128H31.8099V36.2113H56.4176C56.7177 38.1119 58.2182 39.5123 60.1188 39.5123C62.2194 39.5123 63.92 37.8118 63.92 35.6111C64.02 33.5104 62.3195 31.8099 60.2188 31.8099ZM60.2188 24.5076C61.2191 24.5076 62.0194 25.3079 62.0194 26.4082C62.0194 27.5086 61.2191 28.3088 60.2188 28.3088C59.2185 28.3088 58.4183 27.5086 58.4183 26.4082C58.4183 25.3079 59.2185 24.5076 60.2188 24.5076ZM58.6183 9.00279C59.6186 9.00279 60.4189 9.80304 60.4189 10.9034C60.4189 12.0037 59.6186 12.804 58.6183 12.804C58.3182 12.804 58.0181 12.7039 57.718 12.5039L57.618 12.4039C57.518 12.3038 57.518 12.3038 57.4179 12.3038C57.0178 12.0037 56.8178 11.5036 56.8178 10.9034C56.8178 9.80304 57.618 9.00279 58.6183 9.00279ZM46.0144 4.00123C46.0144 3.00091 46.8146 2.10063 47.8149 2.10063C48.8153 2.10063 49.6155 2.90088 49.6155 4.00123C49.6155 5.10157 48.8153 5.90182 47.8149 5.90182C46.8146 5.90182 46.0144 5.00154 46.0144 4.00123ZM49.6155 58.0181C49.6155 59.0184 48.8153 59.9187 47.8149 59.9187C46.8146 59.9187 46.0144 59.1185 46.0144 58.0181C46.0144 56.9178 46.8146 56.1175 47.8149 56.1175C48.8153 56.1175 49.6155 57.0178 49.6155 58.0181ZM60.4189 51.116C60.4189 52.1163 59.6186 53.0165 58.6183 53.0165C57.618 53.0165 56.8178 52.2163 56.8178 51.116C56.8178 50.6158 57.0178 50.1156 57.3179 49.8155C57.4179 49.8155 57.518 49.7155 57.518 49.7155L57.618 49.6155C57.9181 49.4154 58.2182 49.3154 58.5183 49.3154C59.6186 49.2154 60.4189 50.1156 60.4189 51.116ZM29.8093 46.8146C21.6067 46.2144 15.0047 39.4123 15.0047 31.0097C15.0047 22.607 21.5067 15.8049 29.8093 15.3048V46.8146ZM29.8093 53.5167C29.0091 53.5167 28.2088 53.4167 27.5086 53.3166C27.1085 53.2166 26.7083 53.4167 26.5083 53.8168L23.2073 59.6186L15.905 56.6177L17.7055 50.2157C17.8056 49.8155 17.7055 49.4154 17.3054 49.1153C15.5048 47.8149 14.0044 46.2144 12.704 44.5139C12.5039 44.2138 12.0038 44.0137 11.6036 44.1138L5.20162 45.9143L2.20069 38.612L8.0025 35.411C8.40263 35.211 8.60269 34.8109 8.50266 34.4107C8.20256 32.21 8.20256 30.0094 8.50266 27.9087C8.60269 27.5086 8.40263 27.1084 8.0025 26.9084L2.20069 23.6074L5.20162 16.3051L11.6036 18.1056C12.0038 18.2057 12.4039 18.1056 12.704 17.7055C14.0044 15.9049 15.6049 14.4045 17.3054 13.1041C17.6055 12.904 17.8056 12.4039 17.7055 12.0037L16.005 5.50169L23.3073 2.50076L26.5083 8.30257C26.7083 8.7027 27.1085 8.90276 27.5086 8.80273C28.2088 8.7027 29.0091 8.60266 29.7093 8.60266V13.3041C20.5064 13.8043 13.0041 21.6067 13.0041 31.0097C13.0041 40.5126 20.4064 48.215 29.8093 48.7152V53.5167ZM60.2188 37.5117C59.2185 37.5117 58.4183 36.7115 58.4183 35.6111C58.4183 34.5108 59.2185 33.7105 60.2188 33.7105C61.2191 33.7105 62.0194 34.5108 62.0194 35.6111C62.0194 36.7115 61.2191 37.5117 60.2188 37.5117Z" stroke="#5C9BD3"/>
</g>
</g>
<defs>
<clipPath id="clip0">
<rect width="64" height="63" fill="white"/>
</clipPath>
</defs>
</svg>
