####################
Condition Monitoring
####################


********************
Condition Monitoring
********************

.. toctree::

	summary/index
	asset_health_dashboard/index
	real_time_monitoring/index
	process_correlation/index
	fault_diagnostics/index
	other_info_cm/index