<svg width="64" height="67" viewBox="0 0 64 67" fill="none" xmlns="http://www.w3.org/2000/svg">
<path d="M17.6 33.3L17.5 33.2L18.2 33.1V33.2L17.6 33.3Z" fill="#687886"/>
<path d="M13.7 39.3V38.6C13.8 38.6 13.9 38.6 14 38.6V39.3C13.9 39.3 13.8 39.3 13.7 39.3ZM13.3 39.3C13.2 39.3 13.1 39.3 13 39.3L13.1 38.6C13.2 38.6 13.3 38.6 13.4 38.6L13.3 39.3ZM14.4 39.2V38.5C14.5 38.5 14.6 38.5 14.7 38.5L14.8 39.2C14.6 39.2 14.5 39.2 14.4 39.2ZM12.6 39.2C12.5 39.2 12.4 39.2 12.3 39.1L12.4 38.4C12.5 38.4 12.6 38.4 12.7 38.4L12.6 39.2ZM15 39.2V38.5C15.1 38.5 15.2 38.5 15.3 38.5L15.4 39.2C15.3 39.1 15.2 39.2 15 39.2ZM11.9 39.1C11.8 39.1 11.7 39 11.6 39L11.8 38.4C11.9 38.4 12 38.5 12.1 38.5L11.9 39.1ZM15.7 39.1L15.6 38.4C15.7 38.4 15.8 38.4 15.9 38.3L16.1 38.9C16 39 15.9 39 15.7 39.1ZM11.2 38.9C11.1 38.9 11 38.8 10.9 38.8L11.2 38.2C11.3 38.2 11.4 38.3 11.5 38.3L11.2 38.9ZM16.4 38.9L16.2 38.3C16.3 38.3 16.4 38.2 16.5 38.2L16.8 38.8C16.7 38.8 16.6 38.8 16.4 38.9ZM10.6 38.6C10.5 38.5 10.4 38.5 10.3 38.4L10.6 37.8C10.7 37.9 10.8 37.9 10.9 38L10.6 38.6ZM17.1 38.5L16.7 38C16.8 37.9 16.9 37.9 16.9 37.8L17.3 38.3C17.3 38.4 17.2 38.5 17.1 38.5ZM9.89998 38.2C9.79998 38.1 9.69998 38.1 9.59998 38L9.99998 37.5C10.1 37.6 10.2 37.6 10.3 37.7L9.89998 38.2ZM17.7 38.1L17.2 37.6C17.3 37.5 17.3 37.5 17.4 37.4L18 37.8C17.9 37.9 17.8 38 17.7 38.1ZM9.39998 37.8C9.29998 37.7 9.19998 37.6 9.09998 37.5L9.59998 37C9.69998 37.1 9.69998 37.2 9.79998 37.2L9.39998 37.8ZM18.1 37.4L17.5 37.1C17.5 37 17.6 36.9 17.6 36.8L18.2 37C18.2 37.2 18.2 37.3 18.1 37.4ZM8.89998 37.3C8.79998 37.2 8.79998 37.1 8.69998 37L9.19998 36.6C9.29998 36.7 9.29998 36.8 9.39998 36.9L8.89998 37.3ZM18.4 36.7L17.7 36.6C17.7 36.5 17.7 36.4 17.8 36.3L18.5 36.4C18.4 36.5 18.4 36.6 18.4 36.7ZM8.49998 36.7C8.39998 36.6 8.39998 36.5 8.29998 36.4L8.89998 36.1C8.89998 36.2 8.99998 36.2 8.99998 36.3L8.49998 36.7ZM8.09998 36.1C8.09998 36 7.99998 35.8 7.99998 35.7L8.59998 35.5C8.59998 35.6 8.69998 35.7 8.69998 35.8L8.09998 36.1ZM18.5 36H17.8C17.8 35.9 17.8 35.8 17.8 35.7H18.5C18.5 35.8 18.5 35.9 18.5 36ZM7.89998 35.4C7.89998 35.3 7.79998 35.2 7.79998 35L8.49998 34.9C8.49998 35 8.49998 35.1 8.59998 35.2L7.89998 35.4ZM17.8 35.3C17.8 35.2 17.8 35.1 17.8 35L18.5 34.9C18.5 35 18.5 35.1 18.5 35.2L17.8 35.3ZM7.79998 34.7C7.79998 34.6 7.79998 34.5 7.79998 34.4L8.49998 34.3C8.49998 34.4 8.49998 34.5 8.49998 34.6L7.79998 34.7ZM17.7 34.7V34.4L18.4 34.3C18.4 34.4 18.4 34.5 18.4 34.6L17.7 34.7ZM17.7 34L17.6 33.7L18.3 33.6L18.4 33.9L17.7 34ZM7.69998 34C7.69998 33.9 7.69998 33.8 7.69998 33.7H8.39998C8.39998 33.8 8.39998 33.9 8.39998 34H7.69998ZM7.59998 33.3V33H8.29998V33.3H7.59998ZM7.59998 32.6V32.3H8.29998V32.6H7.59998ZM7.59998 31.9V31.6H8.29998V31.9H7.59998ZM7.79998 31.2H7.59998V30.9H8.29998V31.2H7.79998ZM7.89998 30.6H7.59998V30.3H8.29998V30.6H7.89998ZM8.29998 29.9H7.59998V29.6H8.29998V29.9ZM7.89998 29.2H7.59998V28.9H8.29998V29.2H7.89998ZM7.99998 28.6H7.69998V28.3H8.39998V28.6H7.99998ZM8.29998 27.9H7.59998V27.6H8.29998V27.9ZM8.29998 27.2H7.59998V26.9H8.29998V27.2ZM8.29998 26.5H7.59998V26.2H8.29998V26.5ZM8.29998 25.9H7.59998V25.6H8.29998V25.9ZM7.69998 25.2V24.9H8.39998V25.2H7.69998ZM7.59998 24.5V24.2H8.29998V24.5H7.59998ZM7.59998 23.8V23.5H8.29998V23.8H7.59998ZM7.59998 23.2V22.9H8.29998V23.2H7.59998ZM7.59998 22.5V22.2H8.29998V22.5H7.59998ZM7.59998 21.8V21.5H8.29998V21.8H7.59998ZM7.49998 21.2V20.9H8.19998V21.2H7.49998ZM7.49998 20.5V20.2L8.19998 20.1V20.4L7.49998 20.5ZM7.39998 19.8V19.5L8.09998 19.4V19.7L7.39998 19.8ZM7.39998 19.2V18.9L7.99998 18.7V19L7.39998 19.2ZM7.29998 18.5L7.19998 18.2L7.89998 18.1L7.99998 18.4L7.29998 18.5ZM7.09998 17.9C7.09998 17.8 7.09998 17.7 6.99998 17.6L7.69998 17.4C7.69998 17.5 7.79998 17.6 7.79998 17.7L7.09998 17.9ZM6.99998 17.2C6.99998 17.1 6.89998 17 6.89998 16.9L7.49998 16.7C7.49998 16.8 7.59998 16.9 7.59998 17L6.99998 17.2ZM6.79998 16.6C6.79998 16.5 6.69998 16.4 6.69998 16.3L7.29998 16C7.29998 16.1 7.39998 16.2 7.39998 16.3L6.79998 16.6ZM6.49998 16C6.49998 15.9 6.39998 15.8 6.39998 15.7L6.99998 15.4C7.09998 15.5 7.09998 15.6 7.19998 15.7L6.49998 16ZM6.19998 15.5C6.09998 15.4 6.09998 15.3 5.99998 15.3L6.49998 14.9C6.59998 15 6.69998 15.1 6.69998 15.2L6.19998 15.5ZM5.79998 15C5.69998 14.9 5.69998 14.9 5.59998 14.8L5.99998 14.3C6.09998 14.4 6.19998 14.4 6.29998 14.5L5.79998 15ZM5.39998 14.8C5.29998 14.8 5.19998 14.7 5.09998 14.7L5.19998 14C5.29998 14 5.49998 14.1 5.59998 14.1L5.39998 14.8Z" fill="#687886"/>
<path d="M4.69998 14.7L4.59998 14C4.69998 14 4.69998 14 4.79998 14V14.7H4.69998Z" fill="#687886"/>
<path fill-rule="evenodd" clip-rule="evenodd" d="M18.1 22.5V13.2H10.5V28.3H12.4C12.4 25.2 15 22.6 18.1 22.5Z" fill="#687886"/>
<path d="M52 33.4H51.3V38.6H52V33.4Z" fill="#687886"/>
<path d="M53.9 43H49.4V38.5H53.9V43ZM50.1 42.3H53.2V39.2H50.1V42.3Z" fill="#687886"/>
<path d="M44.3 52.4L39.6 47.6L46.3 41L46.7 41.5L40.6 47.6L44.8 51.9L44.3 52.4Z" fill="#687886"/>
<path d="M51.6 23.2H18.5C15.6 23.2 13.3 25.5 13.3 28.4C13.3 31.3 15.6 33.6 18.5 33.6H51.6C54.5 33.6 56.8 31.3 56.8 28.4C56.8 25.5 54.5 23.2 51.6 23.2ZM51.8 30.7H18.1V25.6H51.8V30.7V30.7Z" stroke="#687886" stroke-width="0.5" stroke-miterlimit="10"/>
<path d="M48.2 29.9L47.3 28.4L48.2 26.9H49.9L50.8 28.4L49.9 29.9H48.2Z" fill="#687886"/>
<path d="M19.9 29.9L19 28.4L19.9 26.9H21.6L22.5 28.4L21.6 29.9H19.9Z" fill="#687886"/>
<path d="M48.6 40.9H45.9V41.6H48.6V40.9Z" fill="#687886"/>
<path d="M59 52.4L58.5 51.9L62.7 47.6L56.6 41.5L57 41L63.7 47.6L59 52.4Z" fill="#687886"/>
<path d="M57.5 40.9H54.8V41.6H57.5V40.9Z" fill="#687886"/>
<path d="M46.5 28.7H46V28H46.5V28.7ZM45.3 28.7H44.6V28H45.3V28.7ZM44 28.7H43.3V28H44V28.7ZM42.7 28.7H42V28H42.7V28.7ZM41.3 28.7H40.6V28H41.3V28.7ZM40 28.7H39.3V28H40V28.7ZM38.7 28.7H38V28H38.7V28.7ZM37.3 28.7H36.6V28H37.3V28.7ZM36 28.7H35.3V28H36V28.7ZM34.6 28.7H34V28H34.7V28.7H34.6ZM33.3 28.7H32.6V28H33.3V28.7ZM32 28.7H31.3V28H32V28.7ZM30.6 28.7H30V28H30.7V28.7H30.6ZM29.3 28.7H28.6V28H29.3V28.7ZM28 28.7H27.3V28H28V28.7ZM26.6 28.7H25.9V28H26.6V28.7ZM25.3 28.7H24.6V28H25.3V28.7ZM23.9 28.7H23.2V28H23.9V28.7Z" fill="#687886"/>
<path d="M9.99999 47C3.79999 42.4 0.299988 35.3 0.299988 27.7C0.299988 14.4 11.1 3.60001 24.4 3.60001C30.2 3.60001 35.7 5.70001 40.1 9.40001L39.7 9.90001C35.4 6.30001 30 4.20001 24.4 4.20001C11.5 4.20001 0.999988 14.8 0.999988 27.7C0.999988 35.2 4.39999 42 10.5 46.5L9.99999 47Z" fill="#687886"/>
<path fill-rule="evenodd" clip-rule="evenodd" d="M42.7 11C43.5 11 44.1 11.1 44.6 11.4C45 11.6 45.4 11.9 45.8 12.3C45.9 12.4 45.9 12.4 45.9 12.5C45.9 12.6 45.8 12.7 45.8 12.7C45.7 12.7 45.6 12.5 45.5 12.5C45.2 12.2 44.9 12 44.6 11.8C44.2 11.6 43.6 11.4 43 11.4C41.9 11.4 41.1 11.9 40.5 12.5C40.4 12.6 40.3 12.7 40.2 12.7C40.1 12.7 40.1 12.6 40 12.5C40 12.4 40.1 12.3 40.2 12.2C40.3 12.1 40.4 12 40.5 11.9C40.7 11.7 40.9 11.6 41.1 11.5C41.4 11.3 41.8 11.2 42.2 11.1C42.3 11 42.5 11 42.7 11Z" fill="#687886"/>
<path fill-rule="evenodd" clip-rule="evenodd" d="M42.8 11.9C43.4 11.9 43.9 12 44.2 12.2C44.5 12.3 44.7 12.5 45 12.8C45.1 12.9 45.2 13 45.2 13.1C45.2 13.2 45.1 13.3 45.1 13.3C45 13.3 44.9 13.2 44.9 13.1C44.4 12.6 43.8 12.3 42.9 12.3C42.1 12.3 41.4 12.7 40.9 13.1C40.8 13.2 40.8 13.3 40.7 13.3C40.6 13.3 40.6 13.2 40.5 13.1C40.5 13 40.6 12.9 40.7 12.8C41.2 12.3 41.9 12 42.8 11.9Z" fill="#687886"/>
<path fill-rule="evenodd" clip-rule="evenodd" d="M42.7 12.8C43.2 12.8 43.5 12.9 43.8 13C44 13.1 44.2 13.3 44.4 13.5C44.5 13.6 44.5 13.6 44.5 13.7C44.5 13.8 44.4 13.9 44.3 13.9C44.2 13.9 44.2 13.8 44.1 13.8C43.8 13.5 43.3 13.2 42.7 13.2C42.1 13.2 41.6 13.5 41.3 13.8C41.2 13.9 41.2 13.9 41.1 13.9C41 13.9 40.9 13.8 40.9 13.7C40.9 13.6 41.1 13.4 41.2 13.3C41.4 13.1 41.7 12.9 42 12.8C42.4 12.9 42.5 12.9 42.7 12.8Z" fill="#687886"/>
<path fill-rule="evenodd" clip-rule="evenodd" d="M42.7 13.8C43.1 13.8 43.5 13.9 43.8 14.1C43.9 14.2 44 14.3 44 14.4C44 14.5 43.9 14.6 43.8 14.6C43.7 14.6 43.7 14.5 43.6 14.4C43.4 14.2 43.2 14.1 42.8 14.1C42.5 14.1 42.2 14.2 42 14.4C41.9 14.5 41.9 14.6 41.8 14.6C41.7 14.6 41.6 14.5 41.6 14.4C41.6 14.3 41.7 14.2 41.8 14.2C42.1 14 42.4 13.8 42.7 13.8Z" fill="#687886"/>
<path d="M42.9 15.1C43.0657 15.1 43.2 14.9657 43.2 14.8C43.2 14.6343 43.0657 14.5 42.9 14.5C42.7343 14.5 42.6 14.6343 42.6 14.8C42.6 14.9657 42.7343 15.1 42.9 15.1Z" fill="#687886"/>
<path fill-rule="evenodd" clip-rule="evenodd" d="M14.3 46.3C15.1 46.3 15.7 46.4 16.2 46.7C16.6 46.9 17 47.2 17.4 47.6C17.5 47.7 17.5 47.7 17.5 47.8C17.5 47.9 17.4 48 17.4 48C17.3 48 17.2 47.8 17.1 47.8C16.8 47.5 16.5 47.3 16.2 47.1C15.8 46.9 15.2 46.7 14.6 46.7C13.5 46.7 12.7 47.2 12.1 47.8C12 47.9 11.9 48 11.8 48C11.7 48 11.7 47.9 11.6 47.8C11.6 47.7 11.7 47.6 11.8 47.5C11.9 47.4 12 47.3 12.1 47.2C12.3 47 12.5 46.9 12.7 46.8C13 46.6 13.4 46.5 13.8 46.4C14 46.3 14.1 46.3 14.3 46.3Z" fill="#687886"/>
<path fill-rule="evenodd" clip-rule="evenodd" d="M14.4 47.2C15 47.2 15.5 47.3 15.8 47.5C16.1 47.6 16.3 47.8 16.6 48.1C16.7 48.2 16.8 48.3 16.8 48.4C16.8 48.5 16.7 48.6 16.7 48.6C16.6 48.6 16.5 48.5 16.5 48.4C16 47.9 15.4 47.6 14.5 47.6C13.7 47.6 13 48 12.5 48.4C12.4 48.5 12.4 48.6 12.3 48.6C12.2 48.6 12.2 48.5 12.1 48.4C12.1 48.3 12.2 48.2 12.3 48.1C12.8 47.7 13.5 47.3 14.4 47.2Z" fill="#687886"/>
<path fill-rule="evenodd" clip-rule="evenodd" d="M14.4 48.2C14.9 48.2 15.2 48.3 15.5 48.4C15.7 48.5 15.9 48.7 16.1 48.9C16.2 49 16.2 49 16.2 49.1C16.2 49.2 16.1 49.3 16 49.3C15.9 49.3 15.9 49.3 15.8 49.2C15.5 48.9 15 48.6 14.4 48.6C13.8 48.6 13.3 48.9 13 49.2C12.9 49.3 12.9 49.3 12.8 49.3C12.7 49.3 12.6 49.2 12.6 49.1C12.6 49 12.8 48.8 12.9 48.7C13.1 48.5 13.4 48.3 13.7 48.2C14 48.2 14.2 48.2 14.4 48.2Z" fill="#687886"/>
<path fill-rule="evenodd" clip-rule="evenodd" d="M14.4 49.1C14.8 49.1 15.2 49.2 15.5 49.4C15.6 49.5 15.7 49.6 15.7 49.7C15.7 49.8 15.6 49.9 15.5 49.9C15.4 49.9 15.4 49.8 15.3 49.7C15.1 49.5 14.9 49.4 14.5 49.4C14.2 49.4 13.9 49.5 13.7 49.7C13.6 49.8 13.6 49.9 13.5 49.9C13.4 49.9 13.3 49.8 13.3 49.7C13.3 49.6 13.4 49.5 13.5 49.5C13.7 49.3 14 49.2 14.4 49.1Z" fill="#687886"/>
<path fill-rule="evenodd" clip-rule="evenodd" d="M14.8 50.2C14.8 50.4 14.7 50.5 14.5 50.5C14.3 50.5 14.2 50.4 14.2 50.2C14.2 50 14.3 49.9 14.5 49.9C14.7 49.9 14.8 50 14.8 50.2Z" fill="#687886"/>
<path fill-rule="evenodd" clip-rule="evenodd" d="M51.4 54.3C52.6 54.2 53.5 54.5 54.2 54.9C54.8 55.2 55.4 55.7 56 56.2C56.1 56.3 56.2 56.4 56.2 56.5C56.2 56.7 56.1 56.8 56 56.8C55.8 56.8 55.7 56.6 55.6 56.4C55.2 56 54.7 55.7 54.3 55.4C53.6 55 52.8 54.8 51.9 54.8C50.3 54.8 49 55.5 48.1 56.4C48 56.5 47.8 56.8 47.7 56.8C47.6 56.8 47.5 56.7 47.5 56.6C47.5 56.4 47.7 56.2 47.8 56.1C48 55.9 48.1 55.8 48.2 55.7C48.5 55.4 48.8 55.2 49.1 55C49.6 54.7 50.2 54.5 50.8 54.4C50.9 54.4 51.1 54.3 51.4 54.3Z" fill="#687886"/>
<path fill-rule="evenodd" clip-rule="evenodd" d="M51.5 55.7C52.3 55.7 53.1 55.9 53.7 56.2C54.1 56.4 54.5 56.7 54.9 57.1C55 57.2 55.2 57.3 55.2 57.5C55.2 57.7 55.1 57.8 55 57.8C54.9 57.8 54.7 57.6 54.6 57.5C53.9 56.8 52.9 56.2 51.6 56.2C50.3 56.2 49.3 56.8 48.6 57.5C48.5 57.6 48.4 57.8 48.3 57.8C48.2 57.8 48.1 57.7 48.1 57.5C48.1 57.3 48.3 57.2 48.4 57.1C49.1 56.4 50.1 55.8 51.5 55.7Z" fill="#687886"/>
<path fill-rule="evenodd" clip-rule="evenodd" d="M51.5 57.2C52.2 57.2 52.8 57.3 53.2 57.6C53.5 57.8 53.9 58 54.1 58.3C54.2 58.4 54.3 58.5 54.3 58.6C54.3 58.8 54.2 58.9 54.1 58.9C54 58.9 53.9 58.8 53.8 58.7C53.3 58.2 52.6 57.8 51.6 57.8C50.7 57.8 50 58.2 49.4 58.7C49.3 58.8 49.2 58.9 49.1 58.9C49 58.9 48.9 58.8 48.9 58.6C48.9 58.4 49.2 58.1 49.3 58.1C49.7 57.8 50 57.6 50.5 57.4C50.9 57.2 51.2 57.2 51.5 57.2Z" fill="#687886"/>
<path fill-rule="evenodd" clip-rule="evenodd" d="M51.5 58.6C52.2 58.5 52.7 58.8 53.1 59.1C53.2 59.2 53.4 59.3 53.4 59.5C53.4 59.7 53.3 59.8 53.2 59.8C53.1 59.8 53 59.7 52.9 59.6C52.6 59.3 52.2 59.1 51.7 59.1C51.2 59.1 50.8 59.3 50.5 59.6C50.4 59.7 50.3 59.8 50.2 59.8C50.1 59.8 49.9 59.7 50 59.5C50 59.4 50.2 59.2 50.3 59.1C50.5 58.9 50.9 58.7 51.5 58.6Z" fill="#687886"/>
<path fill-rule="evenodd" clip-rule="evenodd" d="M52.1 60.2C52.1 60.5 51.9 60.7 51.7 60.7C51.5 60.7 51.3 60.5 51.3 60.2C51.3 59.9 51.5 59.7 51.7 59.7C51.9 59.7 52.1 59.9 52.1 60.2Z" fill="#687886"/>
<path d="M57.5 51.6H45.7V63.4H57.5V51.6Z" stroke="#687886" stroke-width="0.5" stroke-miterlimit="10"/>
<path d="M42.9 17.6C45.3852 17.6 47.4 15.5853 47.4 13.1C47.4 10.6147 45.3852 8.60001 42.9 8.60001C40.4147 8.60001 38.4 10.6147 38.4 13.1C38.4 15.5853 40.4147 17.6 42.9 17.6Z" stroke="#687886" stroke-width="0.5" stroke-miterlimit="10"/>
<path d="M14.5 52.9C16.9853 52.9 19 50.8853 19 48.4C19 45.9147 16.9853 43.9 14.5 43.9C12.0147 43.9 10 45.9147 10 48.4C10 50.8853 12.0147 52.9 14.5 52.9Z" stroke="#687886" stroke-width="0.5" stroke-miterlimit="10"/>
</svg>
