<?xml version="1.0" standalone="no"?>
<!DOCTYPE svg PUBLIC "-//W3C//DTD SVG 20010904//EN"
 "http://www.w3.org/TR/2001/REC-SVG-20010904/DTD/svg10.dtd">
<svg version="1.0" xmlns="http://www.w3.org/2000/svg"
 width="1078.000000pt" height="609.000000pt" viewBox="0 0 1078.000000 609.000000"
 preserveAspectRatio="xMidYMid meet">

<g transform="translate(0.000000,609.000000) scale(0.100000,-0.100000)"
fill="#000000" stroke="none">
<path d="M2446 5223 c-4 -5 -35 -10 -69 -13 -79 -7 -85 -25 -10 -33 62 -6 103
9 103 38 0 16 -12 20 -24 8z"/>
<path d="M2216 5181 c-14 -16 -16 -42 -14 -212 l3 -194 48 0 c26 0 47 3 47 8
0 4 0 92 0 196 0 159 -3 192 -16 205 -21 21 -47 20 -68 -3z"/>
<path d="M2383 5057 c-50 -25 -63 -36 -63 -54 0 -28 10 -29 60 -3 38 19 40 20
40 2 0 -10 6 -26 13 -36 13 -17 16 -17 68 13 65 36 69 37 69 12 0 -40 25 -44
82 -12 30 17 58 31 61 31 4 0 7 -43 7 -95 l0 -95 -201 0 -200 0 3 -22 c3 -23
4 -23 207 -26 179 -2 206 0 222 14 17 15 19 33 19 155 0 82 -4 140 -10 144 -6
4 -34 -7 -64 -24 -60 -35 -66 -36 -66 -18 0 7 -6 21 -14 32 -12 17 -15 17 -68
-13 -65 -37 -68 -38 -68 -14 0 17 -18 43 -29 41 -4 0 -34 -14 -68 -32z"/>
<path d="M3178 5073 c8 -3 12 -28 12 -73 0 -45 -4 -70 -12 -73 -7 -3 7 -6 32
-6 34 -1 41 2 32 11 -7 7 -12 25 -12 40 0 24 4 28 29 28 26 0 28 -3 26 -31 -1
-17 -8 -35 -16 -40 -9 -5 19 -9 73 -9 48 0 89 -4 92 -9 4 -5 1 -11 -6 -13 -24
-8 4 -28 40 -28 46 0 65 12 60 36 -2 14 -13 20 -41 22 -20 2 -37 8 -37 14 0 6
-6 6 -15 -2 -23 -19 -28 -7 -34 78 -1 6 -9 12 -18 12 -15 0 -17 -8 -15 -50 4
-45 2 -50 -17 -50 -19 0 -21 6 -21 69 0 46 4 71 13 74 6 3 -10 6 -38 6 -27 0
-45 -3 -38 -7 6 -4 14 -20 17 -35 4 -24 2 -27 -25 -27 -24 0 -29 4 -29 23 0
13 5 28 12 35 9 9 2 12 -32 11 -25 0 -39 -3 -32 -6z m327 -183 c-3 -5 -17 -10
-31 -10 -13 0 -24 5 -24 10 0 6 14 10 31 10 17 0 28 -4 24 -10z"/>
<path d="M3370 5065 c0 -8 7 -15 15 -15 8 0 15 7 15 15 0 8 -7 15 -15 15 -8 0
-15 -7 -15 -15z"/>
<path d="M3545 5000 l0 -80 55 0 56 0 -6 53 c-5 49 -7 52 -32 52 -24 -1 -28 3
-28 27 0 22 -5 28 -22 28 -22 0 -23 -4 -23 -80z m65 -30 c0 -22 -4 -40 -10
-40 -11 0 -14 63 -3 73 11 12 13 8 13 -33z"/>
<path d="M3738 5073 c8 -3 12 -28 12 -73 0 -45 -4 -70 -12 -73 -7 -3 22 -6 65
-6 l77 -1 0 33 -1 32 -15 -28 c-12 -22 -21 -28 -42 -25 -26 3 -27 6 -28 61 -1
39 4 63 13 73 13 12 8 14 -34 13 -26 0 -42 -3 -35 -6z"/>
<path d="M4229 5062 c9 -17 6 -115 -4 -133 -4 -5 6 -9 22 -9 l28 0 -3 80 c-3
77 -4 80 -28 80 -20 0 -23 -3 -15 -18z"/>
<path d="M4968 5001 l3 -79 42 2 c33 1 44 6 56 28 19 34 2 78 -30 78 -17 0
-19 -3 -10 -14 15 -18 10 -78 -6 -84 -10 -3 -13 16 -13 72 0 72 -1 76 -22 76
-22 0 -23 -3 -20 -79z"/>
<path d="M5095 5000 c0 -79 0 -80 25 -80 25 0 25 0 22 80 -3 74 -5 80 -25 80
-21 0 -22 -5 -22 -80z"/>
<path d="M5478 5009 c3 -52 0 -74 -10 -80 -8 -6 0 -9 25 -9 25 0 36 4 31 11
-6 10 -11 53 -13 122 -1 19 -6 27 -18 27 -16 0 -18 -9 -15 -71z"/>
<path d="M6480 5065 c0 -8 7 -15 15 -15 8 0 15 7 15 15 0 8 -7 15 -15 15 -8 0
-15 -7 -15 -15z"/>
<path d="M6850 5065 c0 -8 7 -15 15 -15 8 0 15 7 15 15 0 8 -7 15 -15 15 -8 0
-15 -7 -15 -15z"/>
<path d="M6553 5043 c-12 -13 -18 -23 -13 -23 6 0 10 -20 10 -45 0 -48 20 -69
43 -45 9 10 9 14 0 17 -20 7 -16 71 5 76 15 4 15 5 0 6 -9 0 -18 9 -20 19 -3
15 -5 15 -25 -5z"/>
<path d="M5809 5045 c-9 -10 -13 -30 -10 -65 3 -57 22 -74 49 -46 12 12 13 16
3 14 -18 -4 -24 48 -7 65 10 10 9 15 -4 29 -14 15 -18 16 -31 3z"/>
<path d="M3436 5014 c-9 -8 -16 -19 -16 -24 0 -17 32 -40 54 -40 28 0 42 15
48 53 5 26 3 27 -33 27 -21 0 -45 -7 -53 -16z m46 -46 c-15 -15 -27 14 -17 40
6 15 8 15 18 -6 7 -16 7 -26 -1 -34z"/>
<path d="M3918 5019 c-21 -12 -24 -69 -6 -87 20 -20 56 -14 69 11 11 20 11 21
-5 7 -16 -13 -20 -12 -33 5 -13 19 -12 20 16 23 32 3 40 19 19 40 -15 15 -37
15 -60 1z m42 -20 c0 -5 -7 -9 -15 -9 -9 0 -12 6 -9 15 6 15 24 11 24 -6z"/>
<path d="M4019 4975 c14 -30 28 -55 31 -55 3 0 18 25 33 55 25 52 26 55 7 55
-13 0 -17 -5 -14 -14 3 -8 1 -23 -5 -33 -9 -16 -11 -14 -17 15 -5 26 -11 32
-33 32 l-27 0 25 -55z"/>
<path d="M4137 5012 c-21 -23 -22 -56 -1 -76 20 -20 48 -20 64 -1 11 13 10 14
-5 9 -10 -4 -21 -1 -26 7 -15 23 -10 29 21 29 24 0 28 3 23 18 -13 36 -50 43
-76 14z m39 -19 c-10 -10 -19 5 -10 18 6 11 8 11 12 0 2 -7 1 -15 -2 -18z"/>
<path d="M4373 5023 c-18 -7 -16 -33 2 -33 8 0 15 7 15 16 0 8 4 13 8 10 13
-8 12 -65 0 -72 -7 -5 -9 0 -6 14 7 27 -3 28 -26 3 -26 -28 -13 -39 41 -37 36
2 47 6 44 17 -2 7 -4 26 -6 40 -1 15 -5 32 -9 38 -7 11 -41 14 -63 4z"/>
<path d="M4482 5018 c-17 -17 -15 -24 15 -52 30 -28 26 -44 -6 -26 -17 8 -21
8 -21 -3 0 -21 60 -16 74 6 9 15 6 22 -19 42 -16 13 -26 27 -22 31 3 4 13 1
22 -6 12 -10 15 -10 15 2 0 17 -42 22 -58 6z"/>
<path d="M4570 5014 c-11 -12 -8 -20 15 -44 27 -28 29 -58 3 -32 -17 17 -28
15 -21 -4 8 -20 53 -14 67 9 9 15 6 23 -18 43 -28 25 -30 48 -1 24 12 -10 15
-10 15 2 0 19 -45 21 -60 2z"/>
<path d="M4678 5019 c-21 -12 -24 -69 -6 -87 20 -20 56 -14 69 11 11 20 11 21
-5 7 -16 -13 -20 -12 -33 5 -13 19 -12 20 16 23 32 3 40 19 19 40 -15 15 -37
15 -60 1z m42 -20 c0 -5 -7 -9 -15 -9 -9 0 -12 6 -9 15 6 15 24 11 24 -6z"/>
<path d="M4765 4974 l0 -54 93 0 c59 0 91 4 87 10 -3 5 -9 29 -13 52 l-7 43
-80 2 -80 2 0 -55z m67 -21 c-2 -13 -8 -23 -13 -23 -11 0 -12 64 -2 74 10 10
20 -23 15 -51z m68 11 c0 -24 -5 -34 -15 -34 -10 0 -15 10 -15 33 0 19 3 37 6
40 13 13 24 -5 24 -39z"/>
<path d="M5176 4983 c29 -56 32 -94 7 -90 -10 1 -20 -2 -23 -8 -3 -5 5 -11 16
-13 18 -3 26 8 49 65 15 37 31 74 37 81 8 9 5 12 -11 12 -12 0 -20 -4 -17 -9
4 -5 2 -20 -2 -32 l-9 -23 -12 22 c-7 12 -9 27 -6 32 4 6 -7 10 -23 10 l-29 0
23 -47z"/>
<path d="M5345 4949 l0 -79 30 0 c22 0 26 3 17 12 -20 20 -15 47 8 41 29 -8
50 14 50 52 0 41 -14 53 -65 53 l-40 1 0 -80z m69 45 c8 -32 -2 -66 -17 -61
-15 5 -20 32 -13 63 8 31 22 31 30 -2z"/>
<path d="M5552 5018 c-18 -18 -15 -28 8 -28 13 0 18 5 14 15 -4 8 -1 15 5 15
20 0 11 -29 -14 -46 -14 -9 -25 -25 -25 -35 0 -15 7 -18 47 -16 l48 2 -4 45
c-1 25 -8 48 -14 52 -18 12 -52 9 -65 -4z m38 -64 c0 -8 -5 -12 -10 -9 -6 4
-8 11 -5 16 9 14 15 11 15 -7z"/>
<path d="M5655 4975 l0 -55 55 0 56 0 -6 53 -5 52 -50 2 -50 3 0 -55z m65 -5
c0 -22 -4 -40 -10 -40 -11 0 -14 63 -3 73 11 12 13 8 13 -33z"/>
<path d="M5877 5023 c-14 -13 -7 -43 13 -55 11 -7 20 -18 20 -25 0 -16 -12
-17 -28 -1 -9 9 -12 9 -12 -3 0 -12 9 -16 32 -15 44 1 48 29 12 67 -15 16 -23
29 -16 29 6 0 14 -4 17 -10 9 -14 25 -12 25 3 0 13 -52 22 -63 10z"/>
<path d="M6025 4974 l0 -54 85 0 85 0 -4 51 c-3 55 -20 71 -52 51 -10 -6 -20
-8 -23 -3 -3 4 -25 8 -48 8 l-43 1 0 -54z m65 -4 c0 -37 -18 -59 -21 -25 -4
47 -1 65 11 65 6 0 10 -18 10 -40z m64 -10 c-1 -8 -3 -18 -3 -22 -1 -5 -5 -8
-11 -8 -11 0 -14 63 -3 74 9 9 21 -23 17 -44z"/>
<path d="M6236 5014 c-34 -33 -12 -94 34 -94 31 0 50 22 50 59 0 25 -26 51
-50 51 -10 0 -26 -7 -34 -16z m46 -16 c4 -30 -2 -68 -12 -68 -11 0 -18 35 -13
64 6 32 20 34 25 4z"/>
<path d="M6349 4983 c2 -31 -1 -48 -10 -54 -9 -5 27 -9 89 -9 68 0 101 4 97
10 -4 6 -8 29 -9 53 -2 33 -7 43 -22 45 -17 2 -19 -3 -16 -48 3 -41 1 -50 -12
-50 -9 0 -17 3 -17 8 -1 4 -3 20 -5 36 -5 48 -10 53 -56 53 l-43 1 4 -45z m61
-19 c0 -35 -16 -46 -26 -19 -8 21 4 67 16 60 6 -3 10 -22 10 -41z"/>
<path d="M6623 5004 c-15 -24 -15 -29 -2 -53 11 -19 23 -26 44 -26 21 0 33 7
44 26 13 24 13 29 -2 53 -11 16 -27 26 -42 26 -15 0 -31 -10 -42 -26z m55 -35
c-2 -19 -7 -33 -13 -32 -12 3 -19 49 -10 71 10 26 27 -2 23 -39z"/>
<path d="M6745 4974 c0 -54 0 -54 30 -53 17 0 24 3 18 6 -13 5 -17 41 -7 66 3
9 13 13 25 10 10 -3 19 0 19 6 0 6 5 11 11 11 7 0 10 -18 7 -50 l-3 -50 87 0
88 0 -4 45 c-6 59 -8 62 -58 62 l-43 1 3 -49 c3 -40 1 -49 -12 -49 -16 0 -18
4 -20 63 l-1 32 -70 1 -70 2 0 -54z m235 -10 c0 -35 -16 -46 -26 -19 -8 21 4
67 16 60 6 -3 10 -22 10 -41z"/>
<path d="M7052 5018 c-15 -15 -16 -45 -2 -53 8 -5 8 -11 1 -19 -6 -7 -9 -25
-8 -41 2 -27 6 -30 43 -33 28 -2 45 2 54 13 18 21 -4 45 -41 45 -16 0 -29 5
-29 10 0 6 9 10 19 10 27 0 54 29 48 51 -3 10 0 20 7 23 6 2 -9 5 -34 5 -26 1
-51 -4 -58 -11z m48 -28 c0 -16 -4 -30 -9 -30 -12 0 -19 21 -13 43 7 28 22 20
22 -13z m20 -100 c0 -5 -11 -10 -24 -10 -14 0 -28 5 -31 10 -4 6 7 10 24 10
17 0 31 -4 31 -10z"/>
<path d="M2354 4916 c-12 -31 0 -51 31 -51 27 0 30 4 33 33 3 30 1 32 -28 32
-17 0 -33 -6 -36 -14z"/>
<path d="M2483 4914 c-9 -24 10 -49 40 -52 21 -3 28 2 33 22 3 14 3 30 -1 35
-10 17 -65 13 -72 -5z"/>
<path d="M2622 4898 c3 -29 6 -33 33 -33 27 0 30 3 30 30 0 27 -4 30 -33 33
-32 3 -33 2 -30 -30z"/>
<path d="M3160 4890 c0 -6 47 -10 120 -10 73 0 120 4 120 10 0 6 -47 10 -120
10 -73 0 -120 -4 -120 -10z"/>
<path d="M3560 4890 c0 -7 268 -10 785 -10 517 0 785 3 785 10 0 7 -268 10
-785 10 -517 0 -785 -3 -785 -10z"/>
<path d="M5230 4890 c0 -5 20 -10 45 -10 25 0 45 5 45 10 0 6 -20 10 -45 10
-25 0 -45 -4 -45 -10z"/>
<path d="M5410 4890 c0 -7 273 -10 800 -10 527 0 800 3 800 10 0 7 -273 10
-800 10 -527 0 -800 -3 -800 -10z"/>
<path d="M2165 4130 c-4 -6 -2 -17 4 -24 7 -8 7 -16 0 -23 -5 -5 -9 -37 -7
-69 l3 -59 47 -3 c25 -2 52 -10 58 -18 9 -10 37 -14 106 -14 l93 0 3 -97 3
-98 115 -3 c88 -2 116 -6 123 -17 11 -20 57 -20 57 0 0 8 -7 15 -15 15 -21 0
-20 59 2 75 9 7 13 17 9 23 -10 17 -46 15 -52 -3 -5 -11 -24 -15 -80 -15 l-74
0 0 60 0 60 69 0 c47 0 72 4 80 14 8 9 11 47 9 107 l-3 94 -272 3 c-183 1
-274 -1 -278 -8z m521 -42 l-1 -23 -225 -3 c-203 -2 -226 -1 -237 15 -7 9 -13
20 -13 25 0 4 107 8 239 8 l238 0 -1 -22z m-456 -95 c0 -7 -9 -13 -20 -13 -17
0 -20 7 -20 43 l0 42 20 -30 c11 -16 20 -36 20 -42z m460 2 l0 -35 -202 2
-202 3 -19 33 -19 32 221 0 221 0 0 -35z m-160 -150 l0 -75 90 0 c53 0 90 -4
90 -10 0 -6 -40 -10 -100 -10 l-100 0 0 85 c0 50 4 85 10 85 6 0 10 -32 10
-75z"/>
<path d="M3192 4008 c-25 -25 -14 -56 28 -80 43 -25 49 -51 13 -56 -13 -2 -27
5 -37 20 l-16 22 0 -24 c0 -22 5 -25 39 -28 78 -5 95 56 26 95 -44 24 -52 46
-18 51 13 2 27 -5 37 -20 l16 -22 0 24 c0 22 -5 25 -38 28 -21 1 -43 -3 -50
-10z"/>
<path d="M3315 3940 l0 -80 50 0 51 0 -6 53 c-5 49 -6 52 -32 50 -25 -2 -28 2
-28 28 0 21 -5 29 -17 29 -16 0 -18 -10 -18 -80z m65 -30 c0 -29 -4 -40 -15
-40 -10 0 -15 10 -15 33 0 19 3 37 7 40 15 16 23 5 23 -33z"/>
<path d="M3722 4008 c-7 -7 -12 -17 -12 -24 0 -7 -6 -15 -12 -17 -10 -4 -10
-6 0 -6 7 -1 12 -17 12 -45 0 -26 -5 -46 -12 -49 -7 -3 5 -5 27 -5 22 0 34 2
28 5 -8 3 -13 23 -13 48 0 25 5 45 13 48 10 4 10 6 0 6 -7 1 -13 10 -13 21 0
18 2 19 21 8 18 -11 20 -21 17 -76 -3 -56 -1 -62 17 -62 19 0 20 6 17 80 l-4
80 -37 0 c-20 0 -42 -5 -49 -12z"/>
<path d="M4238 4013 c8 -3 12 -28 12 -73 0 -45 -4 -70 -12 -73 -7 -3 0 -6 17
-6 22 -1 26 2 17 11 -7 7 -12 37 -12 68 l1 55 27 -63 c15 -35 32 -63 37 -63 6
1 19 26 30 56 28 75 35 77 35 12 0 -43 -4 -58 -17 -66 -14 -8 -7 -10 32 -10
28 0 44 3 38 6 -9 3 -13 28 -13 73 0 45 4 70 13 73 6 3 -4 6 -24 6 -35 1 -37
-2 -59 -51 l-22 -53 -23 53 c-22 48 -26 52 -57 51 -18 0 -27 -3 -20 -6z"/>
<path d="M4725 4009 c-10 -15 1 -23 20 -15 9 3 13 10 10 16 -8 13 -22 13 -30
-1z"/>
<path d="M5095 4009 c-10 -15 1 -23 20 -15 9 3 13 10 10 16 -8 13 -22 13 -30
-1z"/>
<path d="M5515 4004 c-9 -9 -15 -24 -13 -33 2 -9 -7 -24 -19 -34 -25 -20 -30
-46 -11 -65 14 -14 57 -16 77 -3 9 6 21 5 31 -1 10 -6 25 -8 35 -4 17 6 17 7
-1 21 -18 13 -18 15 -2 45 l17 30 -26 0 c-20 0 -23 -3 -15 -13 6 -7 7 -18 3
-25 -8 -14 -29 5 -50 45 -15 30 -14 43 5 43 12 0 15 -7 11 -25 -5 -29 10 -29
27 -2 21 33 -39 51 -69 21z m16 -86 c22 -27 24 -38 6 -38 -19 0 -50 37 -42 49
9 16 14 14 36 -11z"/>
<path d="M5735 4007 c-27 -21 -13 -59 30 -80 34 -16 45 -39 25 -52 -17 -10
-46 4 -58 28 -10 21 -11 21 -11 -8 -1 -27 2 -30 35 -33 81 -5 102 50 34 93
-22 14 -40 30 -40 35 0 20 31 22 50 5 17 -15 20 -16 20 -3 0 29 -53 37 -85 15z"/>
<path d="M6310 4005 c0 -8 7 -15 15 -15 8 0 15 7 15 15 0 8 -7 15 -15 15 -8 0
-15 -7 -15 -15z"/>
<path d="M4800 3986 c-11 -11 -14 -31 -11 -66 3 -57 22 -74 49 -46 14 14 14
17 2 14 -24 -5 -27 69 -3 75 15 4 16 5 1 6 -9 0 -18 8 -20 16 -3 14 -5 14 -18
1z"/>
<path d="M6381 3979 c-13 -10 -18 -19 -12 -19 6 0 11 -19 11 -45 0 -48 20 -69
43 -46 8 8 8 11 -1 11 -7 0 -12 16 -12 41 0 33 3 40 17 37 10 -2 28 -22 41
-46 19 -34 22 -47 14 -70 -6 -15 -11 -21 -11 -14 -1 6 -8 12 -17 12 -9 0 -14
-6 -11 -12 2 -7 12 -13 22 -13 13 0 27 21 50 78 32 75 33 77 12 77 -16 0 -18
-3 -8 -9 10 -7 11 -13 1 -31 l-12 -23 -13 24 c-7 13 -11 27 -9 31 3 5 -13 8
-35 8 -26 0 -41 5 -43 14 -2 12 -8 11 -27 -5z"/>
<path d="M3456 3954 c-32 -32 -10 -94 34 -94 26 0 50 27 50 55 0 28 -24 55
-50 55 -10 0 -26 -7 -34 -16z m49 -13 c7 -22 -3 -71 -15 -71 -12 0 -20 42 -13
68 7 27 20 28 28 3z"/>
<path d="M3565 3889 l0 -79 30 0 c22 0 26 3 17 12 -20 20 -15 47 8 41 29 -8
50 14 50 52 0 41 -14 53 -65 53 l-40 1 0 -80z m70 25 c0 -28 -4 -39 -15 -39
-17 0 -24 27 -16 62 10 37 31 22 31 -23z"/>
<path d="M3856 3954 c-19 -18 -21 -65 -4 -82 7 -7 22 -12 34 -12 49 0 72 61
36 93 -23 21 -46 22 -66 1z m44 -40 c0 -32 -4 -44 -12 -42 -14 5 -23 51 -14
74 11 30 26 12 26 -32z"/>
<path d="M3963 3944 c-15 -24 -15 -29 -2 -53 11 -19 23 -26 44 -26 21 0 33 7
44 26 13 24 13 29 -2 53 -11 16 -27 26 -42 26 -15 0 -31 -10 -42 -26z m55 -35
c-2 -19 -7 -33 -13 -32 -12 3 -19 49 -10 71 10 26 27 -2 23 -39z"/>
<path d="M4085 3915 c0 -54 0 -55 30 -55 21 0 26 3 16 9 -9 6 -12 20 -9 42 7
43 1 59 -20 59 -14 0 -17 -10 -17 -55z"/>
<path d="M4135 3960 c-3 -5 -4 -10 -1 -10 2 0 11 -3 20 -6 11 -4 16 -1 16 10
0 18 -25 22 -35 6z"/>
<path d="M4473 3944 c-15 -24 -15 -29 -2 -53 29 -52 89 -35 89 25 0 55 -57 74
-87 28z m52 -29 c0 -22 -5 -40 -12 -42 -9 -3 -13 9 -13 42 0 33 4 45 13 43 7
-3 12 -21 12 -43z"/>
<path d="M4585 3914 l0 -54 56 0 56 0 -8 46 c-11 60 -12 61 -61 61 l-43 1 0
-54z m65 -4 c0 -40 -15 -54 -26 -25 -8 20 4 65 16 65 6 0 10 -18 10 -40z"/>
<path d="M4715 3915 c0 -52 1 -55 25 -55 24 0 25 2 22 55 -3 49 -6 55 -25 55
-20 0 -22 -5 -22 -55z"/>
<path d="M4876 3954 c-19 -18 -21 -65 -4 -82 7 -7 22 -12 34 -12 49 0 72 61
36 93 -23 21 -46 22 -66 1z m44 -40 c0 -32 -4 -44 -12 -42 -14 5 -23 51 -14
74 11 30 26 12 26 -32z"/>
<path d="M4985 3915 c0 -52 1 -55 25 -55 24 0 25 3 21 46 -3 43 -2 46 18 39
15 -4 21 -2 21 8 0 10 -13 15 -42 15 l-43 1 0 -54z"/>
<path d="M5085 3915 c0 -52 1 -55 25 -55 24 0 25 2 22 55 -3 49 -6 55 -25 55
-20 0 -22 -5 -22 -55z"/>
<path d="M5155 3914 l0 -54 56 0 56 0 -8 46 c-11 60 -12 61 -61 61 l-43 1 0
-54z m65 -4 c0 -40 -15 -54 -26 -25 -8 20 4 65 16 65 6 0 10 -18 10 -40z"/>
<path d="M5298 3959 c-21 -12 -23 -40 -6 -57 9 -9 9 -15 0 -24 -18 -18 5 -38
45 -38 20 0 32 -4 28 -10 -8 -14 -48 -13 -63 2 -13 13 -27 5 -17 -11 10 -16
81 -13 95 4 20 24 4 45 -35 45 -44 0 -45 13 -2 25 25 8 32 15 32 35 0 14 5 28
10 32 15 12 -68 9 -87 -3z m47 -19 c7 -21 0 -40 -16 -40 -5 0 -9 14 -9 30 0
34 15 40 25 10z"/>
<path d="M5866 3954 c-19 -18 -21 -65 -4 -82 20 -20 56 -14 69 11 11 20 11 21
-5 7 -16 -13 -20 -12 -33 5 -13 19 -12 20 16 23 32 3 40 19 19 40 -17 17 -44
15 -62 -4z m44 -9 c0 -8 -7 -15 -15 -15 -16 0 -20 12 -8 23 11 12 23 8 23 -8z"/>
<path d="M5976 3954 c-19 -18 -21 -65 -4 -82 17 -17 53 -15 69 4 12 15 11 16
-8 10 -18 -6 -25 -2 -34 18 -7 13 -9 32 -6 41 6 13 10 13 26 3 11 -7 24 -9 28
-5 9 10 -16 27 -39 27 -9 0 -24 -7 -32 -16z"/>
<path d="M6068 3928 c5 -56 14 -65 65 -66 l42 -1 -3 54 c-3 49 -6 55 -25 55
-20 0 -22 -4 -19 -45 3 -28 0 -45 -7 -45 -6 0 -11 19 -11 45 0 40 -2 45 -23
45 -20 0 -22 -4 -19 -42z"/>
<path d="M6205 3915 c0 -54 0 -55 30 -55 21 0 26 3 16 9 -9 6 -12 20 -9 42 7
43 1 59 -20 59 -14 0 -17 -10 -17 -55z"/>
<path d="M6255 3960 c-3 -5 -4 -10 -1 -10 2 0 11 -3 20 -6 11 -4 16 -1 16 10
0 18 -25 22 -35 6z"/>
<path d="M6305 3915 c0 -48 2 -55 20 -55 18 0 20 5 17 55 -3 43 -7 55 -20 55
-14 0 -17 -10 -17 -55z"/>
<path d="M3160 3830 c0 -6 70 -10 190 -10 120 0 190 4 190 10 0 6 -70 10 -190
10 -120 0 -190 -4 -190 -10z"/>
<path d="M3630 3830 c0 -7 278 -10 815 -10 537 0 815 3 815 10 0 7 -278 10
-815 10 -537 0 -815 -3 -815 -10z"/>
<path d="M5410 3830 c0 -7 175 -10 505 -10 330 0 505 3 505 10 0 7 -175 10
-505 10 -330 0 -505 -3 -505 -10z"/>
<path d="M6520 3830 c0 -5 9 -10 20 -10 11 0 20 5 20 10 0 6 -9 10 -20 10 -11
0 -20 -4 -20 -10z"/>
<path d="M2590 3110 c-15 -21 -30 -30 -50 -30 -16 0 -32 -4 -35 -10 -3 -5 -28
-10 -56 -10 l-49 0 0 -45 0 -45 54 0 c30 0 58 -4 61 -10 3 -5 16 -10 28 -10
11 0 35 -14 53 -31 l31 -30 62 36 c58 34 74 56 51 70 -6 4 -31 -5 -57 -19
l-46 -26 -24 22 c-29 27 -29 57 -2 92 l20 26 43 -25 c50 -29 76 -32 76 -7 0
17 -99 82 -125 82 -8 0 -23 -13 -35 -30z"/>
<path d="M2263 3088 c-70 -34 -41 -148 38 -148 82 0 110 108 38 145 -32 17
-46 18 -76 3z m67 -42 c6 -8 10 -25 8 -38 -2 -18 -10 -24 -35 -26 -28 -3 -33
1 -39 23 -11 45 37 75 66 41z"/>
<path d="M2280 3021 c0 -26 17 -36 35 -21 18 15 8 40 -16 40 -12 0 -19 -7 -19
-19z"/>
<path d="M3158 2943 c8 -3 12 -28 12 -73 0 -45 -4 -70 -12 -73 -7 -3 13 -6 45
-6 49 -1 62 3 82 24 16 15 25 36 25 55 0 19 -9 40 -25 55 -20 21 -33 25 -82
24 -32 0 -52 -3 -45 -6z m92 -18 c29 -35 10 -125 -26 -125 -11 0 -14 17 -14
70 0 73 12 89 40 55z"/>
<path d="M3640 2935 c0 -8 7 -15 15 -15 8 0 15 7 15 15 0 8 -7 15 -15 15 -8 0
-15 -7 -15 -15z"/>
<path d="M3698 2943 c8 -3 12 -28 12 -73 0 -45 -4 -70 -12 -73 -7 -3 1 -6 17
-6 l30 -1 -3 80 c-4 79 -4 80 -30 79 -15 0 -21 -3 -14 -6z"/>
<path d="M3928 2943 c6 -2 12 -13 12 -24 0 -13 -7 -19 -23 -19 -32 0 -47 -18
-47 -56 0 -42 19 -56 70 -50 39 5 68 16 42 16 -8 0 -12 23 -12 70 0 70 0 70
-27 69 -16 0 -22 -3 -15 -6z m7 -98 c0 -42 -19 -58 -30 -25 -9 29 3 72 18 67
7 -2 12 -21 12 -42z"/>
<path d="M4118 2943 c6 -2 12 -13 12 -24 0 -14 -7 -19 -25 -19 -39 0 -63 -73
-32 -98 15 -12 79 -13 98 -1 10 6 10 9 2 9 -9 0 -13 21 -13 70 0 70 0 70 -27
69 -16 0 -22 -3 -15 -6z m7 -98 c0 -21 -5 -40 -11 -42 -15 -5 -25 35 -17 65 9
35 28 20 28 -23z"/>
<path d="M4427 2944 c-9 -10 2 -24 19 -24 8 0 14 7 14 15 0 15 -21 21 -33 9z"/>
<path d="M5125 2870 c0 -79 0 -80 25 -80 25 0 25 0 22 80 -3 74 -5 80 -25 80
-21 0 -22 -5 -22 -80z"/>
<path d="M5410 2935 c0 -10 7 -15 18 -13 21 4 19 22 -2 26 -10 2 -16 -3 -16
-13z"/>
<path d="M2350 2924 c-30 -17 -55 -18 -82 -3 -11 6 -21 9 -23 7 -2 -2 23 -48
56 -103 l58 -100 -27 -3 c-71 -7 -73 -9 -70 -60 l3 -47 180 0 180 0 3 47 3 47
-57 3 -58 3 -65 112 c-36 62 -68 112 -71 112 -3 -1 -16 -7 -30 -15z"/>
<path d="M3455 2920 c-19 -21 -22 -66 -9 -113 7 -21 45 -20 52 2 3 8 0 11 -7
7 -7 -5 -11 6 -11 33 0 26 5 41 13 41 8 0 9 2 1 8 -7 4 -13 15 -15 26 -4 17
-5 17 -24 -4z"/>
<path d="M3346 2884 c-19 -18 -21 -65 -4 -82 20 -20 56 -14 69 11 11 20 11 21
-5 7 -16 -13 -20 -12 -33 5 -13 19 -12 20 16 23 32 3 40 19 19 40 -17 17 -44
15 -62 -4z m44 -9 c0 -8 -7 -15 -15 -15 -16 0 -20 12 -8 23 11 12 23 8 23 -8z"/>
<path d="M3533 2894 c-19 -8 -16 -34 3 -34 10 0 14 6 10 15 -3 9 0 15 8 15 9
0 14 -13 14 -40 0 -22 -4 -40 -10 -40 -6 0 -8 9 -5 20 7 25 -5 26 -27 1 -25
-28 -13 -39 39 -37 42 1 48 5 39 31 -2 6 -4 24 -6 40 -2 24 -8 30 -28 32 -14
1 -31 -1 -37 -3z"/>
<path d="M3635 2845 c0 -48 2 -55 20 -55 18 0 20 5 17 55 -3 43 -7 55 -20 55
-14 0 -17 -10 -17 -55z"/>
<path d="M3775 2876 c-23 -35 -13 -74 21 -82 17 -4 31 -1 40 8 13 13 12 15 -8
14 -14 -1 -24 6 -26 17 -3 13 3 17 28 17 31 0 32 1 18 23 -22 32 -53 33 -73 3z
m45 -1 c0 -8 -4 -15 -10 -15 -5 0 -10 7 -10 15 0 8 5 15 10 15 6 0 10 -7 10
-15z"/>
<path d="M4205 2876 c-23 -35 -13 -74 21 -82 17 -4 31 -1 40 8 13 13 12 15 -8
14 -14 -1 -24 6 -26 17 -3 13 3 17 28 17 31 0 32 1 18 23 -22 32 -53 33 -73 3z
m45 -1 c0 -8 -4 -15 -10 -15 -5 0 -10 7 -10 15 0 8 5 15 10 15 6 0 10 -7 10
-15z"/>
<path d="M4311 2860 c10 -21 19 -43 19 -49 0 -30 23 -16 42 26 13 26 31 49 41
51 14 3 17 -4 17 -41 0 -27 -5 -47 -12 -50 -7 -3 1 -6 17 -6 l30 -1 -3 55 -4
55 -41 0 c-38 0 -42 -2 -43 -26 -2 -27 -10 -41 -20 -31 -3 3 -7 17 -8 31 -1
21 -6 26 -28 26 l-26 0 19 -40z"/>
<path d="M4502 2888 c-35 -45 -8 -107 41 -94 15 3 27 11 27 17 0 6 -5 7 -10 4
-16 -10 -40 14 -40 40 0 29 10 37 27 23 15 -12 28 -5 18 11 -9 15 -50 14 -63
-1z"/>
<path d="M4606 2884 c-19 -18 -21 -65 -4 -82 20 -20 56 -14 69 11 11 20 11 21
-5 7 -16 -13 -20 -12 -33 5 -13 19 -12 20 16 23 32 3 40 19 19 40 -17 17 -44
15 -62 -4z m44 -9 c0 -8 -7 -15 -15 -15 -9 0 -12 6 -9 15 4 8 10 15 15 15 5 0
9 -7 9 -15z"/>
<path d="M4773 2893 c-18 -7 -16 -33 2 -33 8 0 15 7 15 15 0 8 4 15 9 15 5 0
9 -18 9 -40 0 -22 -4 -40 -10 -40 -6 0 -8 9 -5 20 6 25 -5 26 -26 2 -23 -25
-8 -39 43 -38 l45 1 -3 40 c-2 22 -8 46 -14 53 -10 12 -42 15 -65 5z"/>
<path d="M4875 2844 l0 -54 56 0 56 0 -4 33 c-9 75 -9 75 -60 75 l-48 1 0 -55z
m65 -4 c0 -22 -4 -40 -10 -40 -11 0 -14 63 -3 73 11 12 13 8 13 -33z"/>
<path d="M5022 2888 c-16 -16 -15 -28 3 -28 8 0 15 7 15 15 0 8 5 15 10 15 21
0 9 -37 -15 -48 -14 -7 -25 -20 -25 -31 0 -17 6 -20 47 -18 l48 2 -4 45 c-1
25 -8 48 -14 52 -18 12 -52 9 -65 -4z m34 -75 c-10 -10 -19 5 -10 18 6 11 8
11 12 0 2 -7 1 -15 -2 -18z"/>
<path d="M5191 2883 c25 -30 49 -92 43 -108 -4 -10 -13 -13 -25 -10 -13 5 -19
1 -19 -10 0 -11 7 -15 21 -13 15 2 28 20 45 63 13 33 28 68 34 78 8 14 6 17
-10 17 -13 0 -18 -5 -14 -14 3 -8 1 -23 -4 -32 -9 -16 -11 -15 -21 5 -7 12 -9
26 -6 31 4 6 -8 10 -26 10 -29 0 -31 -1 -18 -17z"/>
<path d="M5317 2893 c-15 -14 -6 -42 20 -61 31 -22 24 -44 -7 -24 -16 10 -20
10 -20 -1 0 -9 11 -14 33 -13 44 1 49 36 10 71 -19 17 -23 24 -12 25 8 0 20
-5 27 -12 9 -9 12 -9 12 3 0 15 -51 25 -63 12z"/>
<path d="M5405 2845 c0 -52 1 -55 25 -55 24 0 25 2 22 55 -3 49 -6 55 -25 55
-20 0 -22 -5 -22 -55z"/>
<path d="M5477 2893 c-15 -14 -6 -42 20 -61 31 -22 24 -44 -7 -24 -16 10 -20
10 -20 -1 0 -9 11 -14 33 -13 44 1 49 36 10 71 -19 17 -23 24 -12 25 8 0 20
-5 27 -12 9 -9 12 -9 12 3 0 15 -51 25 -63 12z"/>
<path d="M3140 2760 c0 -7 343 -10 1010 -10 667 0 1010 3 1010 10 0 7 -343 10
-1010 10 -667 0 -1010 -3 -1010 -10z"/>
<path d="M5270 2760 c0 -6 53 -10 140 -10 87 0 140 4 140 10 0 6 -53 10 -140
10 -87 0 -140 -4 -140 -10z"/>
<path d="M2170 1850 l0 -190 120 0 c66 0 120 -2 120 -4 0 -21 -23 -56 -39 -61
-12 -3 -21 -13 -21 -21 0 -11 21 -14 110 -14 89 0 110 3 110 14 0 8 -9 18 -21
21 -16 5 -39 40 -39 61 0 2 54 4 120 4 l120 0 0 190 0 190 -290 0 -290 0 0
-190z m550 0 l0 -160 -260 0 -260 0 0 160 0 160 260 0 260 0 0 -160z m-236
-212 c10 -41 7 -48 -24 -48 -17 0 -30 5 -30 13 0 31 14 57 30 57 10 0 20 -10
24 -22z"/>
<path d="M2565 1933 l-80 -46 -68 12 c-64 10 -72 10 -102 -9 -43 -27 -61 -48
-49 -60 6 -6 24 0 47 17 36 26 38 26 107 14 l70 -13 85 52 c47 29 85 59 85 66
0 21 -8 18 -95 -33z"/>
<path d="M2570 1800 l0 -90 40 0 40 0 0 90 0 90 -40 0 -40 0 0 -90z m50 0 c0
-33 -4 -60 -10 -60 -6 0 -10 27 -10 60 0 33 4 60 10 60 6 0 10 -27 10 -60z"/>
<path d="M2370 1775 l0 -65 40 0 40 0 0 65 0 65 -40 0 -40 0 0 -65z m50 -1 c0
-21 -4 -33 -10 -29 -5 3 -10 19 -10 36 0 16 5 29 10 29 6 0 10 -16 10 -36z"/>
<path d="M2477 1814 c-4 -4 -7 -29 -7 -56 l0 -48 41 0 40 0 -3 53 c-3 50 -4
52 -33 55 -17 2 -34 0 -38 -4z m43 -48 c0 -8 -4 -18 -10 -21 -5 -3 -10 3 -10
14 0 12 5 21 10 21 6 0 10 -6 10 -14z"/>
<path d="M2270 1750 l0 -40 40 0 40 0 0 40 0 40 -40 0 -40 0 0 -40z m50 0 c0
-5 -4 -10 -10 -10 -5 0 -10 5 -10 10 0 6 5 10 10 10 6 0 10 -4 10 -10z"/>
<path d="M3158 1883 c8 -3 12 -28 12 -73 0 -45 -4 -70 -12 -73 -7 -3 7 -5 32
-5 25 0 39 2 33 5 -7 2 -13 18 -13 34 0 24 4 29 24 29 27 0 56 24 56 45 0 30
-31 45 -88 44 -31 0 -51 -3 -44 -6z m86 -25 c7 -12 6 -21 -3 -32 -21 -25 -31
-19 -31 20 0 37 14 42 34 12z"/>
<path d="M3568 1883 c6 -2 12 -13 12 -24 0 -13 -7 -19 -23 -19 -13 0 -28 -5
-35 -12 -16 -16 -15 -73 1 -85 6 -6 48 -10 92 -11 l80 -1 -3 55 c-4 53 -4 54
-35 53 -18 0 -26 -3 -19 -6 7 -3 12 -23 12 -50 0 -37 -3 -44 -16 -39 -9 3 -18
6 -20 6 -2 0 -4 32 -4 70 0 70 0 70 -27 69 -16 0 -22 -3 -15 -6z m8 -77 c7
-31 2 -58 -12 -63 -15 -5 -25 35 -17 65 7 29 21 28 29 -2z"/>
<path d="M3650 1875 c0 -8 7 -15 15 -15 8 0 15 7 15 15 0 8 -7 15 -15 15 -8 0
-15 -7 -15 -15z"/>
<path d="M3900 1875 c0 -8 7 -15 15 -15 8 0 15 7 15 15 0 8 -7 15 -15 15 -8 0
-15 -7 -15 -15z"/>
<path d="M4615 1810 c0 -79 0 -80 25 -80 25 0 25 0 22 80 -3 74 -5 80 -25 80
-21 0 -22 -5 -22 -80z"/>
<path d="M4880 1875 c0 -8 9 -15 20 -15 11 0 20 7 20 15 0 8 -9 15 -20 15 -11
0 -20 -7 -20 -15z"/>
<path d="M5226 1859 c-19 -23 -26 -42 -26 -74 0 -32 7 -51 26 -74 35 -42 46
-39 22 7 -23 44 -19 123 8 153 10 11 12 19 6 19 -5 0 -22 -14 -36 -31z"/>
<path d="M5710 1875 c0 -10 7 -15 18 -13 21 4 19 22 -2 26 -10 2 -16 -3 -16
-13z"/>
<path d="M6549 1864 c15 -19 21 -41 21 -79 0 -38 -6 -60 -21 -79 -26 -33 -6
-34 25 -1 42 45 42 115 0 160 -31 33 -51 32 -25 -1z"/>
<path d="M3835 1858 c-17 -19 -19 -32 -15 -73 l5 -50 60 -3 60 -2 -3 55 -4 55
-38 0 c-31 0 -39 4 -42 21 -3 21 -3 21 -23 -3z m65 -73 c0 -25 -4 -45 -10 -45
-5 0 -10 5 -10 11 0 5 -4 7 -10 4 -6 -4 -10 10 -10 34 0 34 3 41 20 41 17 0
20 -7 20 -45z"/>
<path d="M4822 1860 c-8 -13 -23 -20 -42 -20 -19 0 -28 -4 -25 -12 3 -7 0 -20
-5 -28 -9 -13 -11 -13 -20 0 -5 8 -8 21 -5 28 3 8 -6 12 -25 12 l-30 0 27 -54
c29 -60 27 -88 -8 -79 -16 4 -20 2 -17 -8 6 -19 39 -18 49 1 5 8 20 41 33 73
31 72 56 77 56 12 0 -51 20 -69 48 -41 15 15 15 16 -1 16 -13 0 -17 9 -17 35
0 29 4 35 21 35 19 0 21 -5 17 -50 -3 -48 -2 -50 22 -50 24 0 25 2 22 55 l-4
55 -38 0 c-31 0 -39 4 -42 20 l-3 21 -13 -21z"/>
<path d="M3305 1785 c0 -52 1 -55 25 -55 23 0 25 4 25 42 0 34 4 43 17 43 38
0 16 20 -24 22 l-43 3 0 -55z"/>
<path d="M3417 1822 c-31 -34 -11 -92 32 -92 19 0 41 18 41 35 0 5 -4 4 -9 -4
-8 -12 -12 -12 -25 -2 -24 20 -19 31 14 31 24 0 28 3 23 18 -13 36 -50 43 -76
14z m39 -19 c-10 -10 -19 5 -10 18 6 11 8 11 12 0 2 -7 1 -15 -2 -18z"/>
<path d="M3714 1814 c-16 -24 -16 -29 -3 -53 18 -31 60 -39 80 -15 12 15 12
16 -8 10 -18 -6 -25 -2 -34 18 -7 13 -8 33 -4 43 5 12 9 14 12 6 3 -7 11 -13
20 -13 25 0 8 25 -20 28 -19 2 -30 -4 -43 -24z"/>
<path d="M3974 1788 c13 -29 27 -53 32 -54 5 -2 21 22 35 52 23 49 24 54 8 54
-11 0 -16 -5 -14 -12 3 -7 0 -20 -5 -28 -9 -13 -11 -13 -20 0 -5 8 -8 21 -5
28 3 8 -6 12 -25 12 l-29 0 23 -52z"/>
<path d="M4085 1816 c-37 -56 23 -114 68 -65 13 13 14 17 5 10 -15 -11 -21
-11 -33 -1 -23 19 -18 30 15 30 33 0 35 3 20 31 -15 27 -56 24 -75 -5z m41
-13 c-10 -10 -19 5 -10 18 6 11 8 11 12 0 2 -7 1 -15 -2 -18z"/>
<path d="M4252 1828 c-18 -18 -15 -28 9 -28 15 0 19 5 15 15 -3 8 -1 15 4 15
21 0 9 -37 -15 -48 -14 -7 -25 -20 -25 -31 0 -17 6 -20 47 -18 l48 2 -4 45
c-1 25 -5 48 -8 52 -7 12 -58 9 -71 -4z m35 -70 c-3 -8 -6 -5 -6 6 -1 11 2 17
5 13 3 -3 4 -12 1 -19z"/>
<path d="M4365 1785 l0 -55 55 0 56 0 -4 43 c-5 55 -14 64 -65 65 l-42 1 0
-54z m65 -5 c0 -22 -4 -40 -10 -40 -11 0 -14 63 -3 73 11 12 13 8 13 -33z"/>
<path d="M4511 1831 c-8 -5 -11 -16 -8 -26 8 -19 27 -11 27 13 0 13 2 14 13 3
10 -10 8 -15 -8 -26 -61 -43 -58 -60 11 -60 l49 0 -3 40 c-2 22 -8 46 -14 53
-12 14 -47 16 -67 3z m39 -60 c0 -6 -4 -13 -10 -16 -5 -3 -10 1 -10 9 0 9 5
16 10 16 6 0 10 -4 10 -9z"/>
<path d="M4957 1822 c-42 -46 0 -108 57 -86 9 3 16 10 16 16 0 5 -5 6 -10 3
-6 -4 -17 -1 -25 5 -17 14 -20 56 -5 65 6 3 10 1 10 -4 0 -6 7 -11 16 -11 25
0 10 25 -17 28 -15 2 -32 -5 -42 -16z"/>
<path d="M5057 1833 c-14 -13 -7 -43 13 -55 11 -7 20 -18 20 -25 0 -16 -12
-17 -28 -1 -9 9 -12 9 -12 -3 0 -12 9 -16 33 -15 44 1 49 36 10 71 -15 13 -23
25 -16 25 6 0 15 -4 18 -10 9 -14 25 -12 25 3 0 13 -52 22 -63 10z"/>
<path d="M5292 1828 c-7 -7 -12 -26 -12 -43 0 -17 5 -36 12 -43 17 -17 53 -15
69 4 12 15 11 16 -9 10 -18 -6 -24 -2 -32 18 -14 37 -4 58 20 43 21 -12 36 -5
25 12 -9 15 -58 14 -73 -1z"/>
<path d="M5393 1814 c-15 -24 -15 -29 -2 -53 11 -19 23 -26 44 -26 21 0 33 7
44 26 13 24 13 29 -2 53 -11 16 -27 26 -42 26 -15 0 -31 -10 -42 -26z m55 -35
c-2 -19 -7 -33 -13 -32 -12 3 -19 49 -10 71 10 26 27 -2 23 -39z"/>
<path d="M5505 1784 l0 -54 91 0 91 0 -7 43 c-3 23 -9 48 -13 53 -3 6 -41 11
-84 12 l-78 0 0 -54z m65 -4 c0 -22 -4 -40 -10 -40 -11 0 -14 63 -3 73 11 12
13 8 13 -33z m70 0 c0 -29 -4 -40 -15 -40 -10 0 -15 10 -15 33 0 19 3 37 7 40
15 16 23 5 23 -33z"/>
<path d="M5705 1785 l0 -55 91 0 91 0 -8 46 c-5 25 -11 49 -13 53 -3 4 -29 8
-58 8 -29 1 -47 -1 -40 -4 18 -7 16 -93 -3 -93 -11 0 -15 12 -15 50 0 45 -2
50 -22 50 -21 0 -23 -5 -23 -55z m135 -11 c0 -35 -16 -46 -26 -19 -8 21 4 67
16 60 6 -3 10 -22 10 -41z"/>
<path d="M5912 1828 c-15 -15 -16 -45 -2 -53 8 -5 8 -11 1 -19 -6 -7 -9 -25
-8 -41 2 -27 6 -30 43 -33 28 -2 45 2 54 13 18 21 -4 45 -41 45 -16 0 -29 5
-29 10 0 6 9 10 19 10 27 0 54 29 48 51 -3 10 0 20 7 23 6 2 -9 5 -34 5 -26 1
-51 -4 -58 -11z m48 -28 c0 -16 -4 -30 -10 -30 -5 0 -10 14 -10 30 0 17 5 30
10 30 6 0 10 -13 10 -30z m20 -100 c0 -5 -11 -10 -24 -10 -14 0 -28 5 -31 10
-4 6 7 10 24 10 17 0 31 -4 31 -10z"/>
<path d="M6087 1833 c-15 -14 -6 -43 19 -59 17 -11 22 -20 15 -27 -7 -7 -15
-6 -26 3 -12 10 -15 10 -15 -2 0 -23 57 -22 70 1 8 16 5 25 -17 45 -28 26 -26
49 2 26 12 -10 15 -10 15 2 0 14 -51 24 -63 11z"/>
<path d="M6187 1822 c-22 -24 -21 -55 1 -75 38 -34 85 -13 85 38 0 52 -53 74
-86 37z m51 -43 c-2 -19 -7 -33 -13 -32 -12 3 -19 49 -10 71 10 26 27 -2 23
-39z"/>
<path d="M6307 1822 c-22 -24 -21 -55 1 -75 38 -34 85 -13 85 38 0 52 -53 74
-86 37z m51 -43 c-2 -19 -7 -33 -13 -32 -12 3 -19 49 -10 71 10 26 27 -2 23
-39z"/>
<path d="M6415 1785 l0 -55 55 0 56 0 -4 43 c-5 55 -14 64 -65 65 l-42 1 0
-54z m65 -5 c0 -22 -4 -40 -10 -40 -11 0 -14 63 -3 73 11 12 13 8 13 -33z"/>
</g>
</svg>
