<svg width="64" height="54" viewBox="0 0 64 54" fill="none" xmlns="http://www.w3.org/2000/svg">
<path d="M54.6 46.8V47H54.8H56.3C56.6 47 56.8 47.1 56.9 47.2C57 47.3 57.1 47.5 57.1 47.8C57.1 48.1 57 48.3 56.9 48.4C56.8 48.5 56.6 48.6 56.3 48.6H53.8H47.1H41.7H35H29.8H23.1H17.9H11.2H8.90001C8.60001 48.6 8.40001 48.5 8.30001 48.4C8.20001 48.3 8.10001 48.1 8.10001 47.8C8.10001 47.5 8.20001 47.3 8.30001 47.2C8.50001 47.1 8.70001 47 8.90001 47H10.4H10.6V46.8V30C10.6 29.7 10.7 29.5 10.8 29.4C10.9 29.3 11.1 29.2 11.4 29.2H18.3C18.6 29.2 18.8 29.3 18.9 29.4C19 29.5 19.1 29.7 19.1 30V46.8V47H19.3H22.2H22.4V46.8V14C22.4 13.8 22.5 13.6 22.7 13.4C22.9 13.3 23.2 13.2 23.4 13.2H30.1C30.4 13.2 30.6 13.3 30.7 13.4C30.8 13.5 30.9 13.7 30.9 14V46.8V47H31.1H34.2H34.4V46.8V24.1C34.4 23.8 34.5 23.6 34.6 23.5C34.7 23.4 34.9 23.3 35.2 23.3H42C42.3 23.3 42.5 23.4 42.6 23.5C42.7 23.6 42.8 23.8 42.8 24.1V46.8V47H43H46.1H46.3V46.8V19.6C46.3 19.3 46.4 19.1 46.5 19C46.6 18.9 46.8 18.8 47.1 18.8H53.8C54.1 18.8 54.3 18.9 54.4 19C54.5 19.1 54.6 19.3 54.6 19.6V46.8V46.8Z" stroke="#5C9BD3" stroke-width="0.5"/>
<path d="M13.5 46.2L12.6 46.6L12.7 47H13.7" stroke="#5C9BD3" stroke-width="0.25"/>
<path d="M14.3 47H16" stroke="#5C9BD3" stroke-width="0.25" stroke-dasharray="1.3 1.3"/>
<path d="M16.3 47H17H17.3V46.8V46" stroke="#5C9BD3" stroke-width="0.25"/>
<path d="M17.3 45.4V44.7V44.4L16.9 44.5L16.4 44.8" stroke="#5C9BD3" stroke-width="0.25"/>
<path d="M15.7 45.1L13.8 46" stroke="#5C9BD3" stroke-width="0.25" stroke-dasharray="1.6 1.6"/>
<path d="M16.6 43L17.4 42.6H17.5V42.4V41.6" stroke="#5C9BD3" stroke-width="0.25"/>
<path d="M17.5 40.3V37.1" stroke="#5C9BD3" stroke-width="0.25" stroke-dasharray="2.59 2.59"/>
<path d="M17.5 36.4V35.8V35.4L17.2 35.6L16.6 35.9" stroke="#5C9BD3" stroke-width="0.25"/>
<path d="M15.8 36.3L13.8 37.3" stroke="#5C9BD3" stroke-width="0.25" stroke-dasharray="1.82 1.82"/>
<path d="M13.3 37.5L12.6 37.9H12.4V38.1V38.9" stroke="#5C9BD3" stroke-width="0.25"/>
<path d="M12.4 40.2V43.5" stroke="#5C9BD3" stroke-width="0.25" stroke-dasharray="2.59 2.59"/>
<path d="M12.4 44.1V44.7V45.1L12.8 44.9L13.3 44.7" stroke="#5C9BD3" stroke-width="0.25"/>
<path d="M14.2 44.3L16.2 43.2" stroke="#5C9BD3" stroke-width="0.25" stroke-dasharray="1.82 1.82"/>
<path d="M41.1 35.8L41.2 35.7V35.6V28.9V28.5L40.8 28.7L36.3 31L36.1 31.1V31.2V37.9V38.2L36.5 38.1L41.1 35.8Z" stroke="#5C9BD3" stroke-width="0.25" stroke-dasharray="2 2"/>
<path d="M41.2 37.9V37.5L40.8 37.7L36.3 39.9L36.1 40V40.2V46.8V47.2L36.5 47L41.1 44.7H41.2V44.5V37.9Z" stroke="#5C9BD3" stroke-width="0.25" stroke-dasharray="2 2"/>
<path d="M41.2 25.2V25H41H36.4H36.1V25.2V28.9V29.3L36.5 29.1L41.1 26.9L41.2 26.8V26.6V25.2Z" stroke="#5C9BD3" stroke-width="0.25" stroke-dasharray="2 2"/>
<path d="M16.6 34.1L17.4 33.7L17.5 33.6V33.5V32.6" stroke="#5C9BD3" stroke-width="0.25"/>
<path d="M17.5 32V31.5V31.2V31H17.3H16.3" stroke="#5C9BD3" stroke-width="0.25"/>
<path d="M15.6 31H13.8" stroke="#5C9BD3" stroke-width="0.25" stroke-dasharray="1.4 1.4"/>
<path d="M13.4 31H12.7H12.4V31.2V32" stroke="#5C9BD3" stroke-width="0.25"/>
<path d="M12.4 32.8V34.8" stroke="#5C9BD3" stroke-width="0.25" stroke-dasharray="1.59 1.59"/>
<path d="M12.4 35.2V35.8V36.2L12.8 36L13.3 35.7" stroke="#5C9BD3" stroke-width="0.25"/>
<path d="M14.2 35.3L16.2 34.3" stroke="#5C9BD3" stroke-width="0.25" stroke-dasharray="1.82 1.82"/>
<path d="M61.7 51H3.5C3.2 51 3 51 2.9 51C2.8 51 2.7 51 2.7 51C2.7 51 2.8 51 2.9 51C3 51 3.2 51 3.5 51H61.7ZM61.7 51C62 51 62.2 51 62.3 51C62.4 51 62.5 51 62.5 51C62.5 51 62.4 51 62.3 51C62.2 51 62 51 61.7 51Z" stroke="#5C9BD3" stroke-width="0.5" stroke-miterlimit="10"/>
<path d="M14 18.3C13.9 18.1 13.8 18 13.8 17.8C13.8 17.6 13.8 17.4 13.9 17.3L26.2 1.90001C26.3 1.80001 26.4 1.70001 26.5 1.70001C26.6 1.60001 26.8 1.60001 26.8 1.60001C27.1 1.60001 27.3 1.70001 27.5 1.90001L38.7 14.8L38.8 15L39 14.9L47.9 9.00001L48.4 8.70001L47.8 8.60001L43.7 7.80001C43.4 7.70001 43.2 7.60001 43.1 7.40001C43 7.30001 43 7.10001 43 6.80001C43.1 6.50001 43.2 6.30001 43.4 6.20001C43.5 6.10001 43.7 6.10001 44 6.10001L50.7 7.60001C50.8 7.60001 50.8 7.60001 50.8 7.60001C50.8 7.60001 50.8 7.60001 50.9 7.70001C50.9 7.80001 51 7.90001 51.1 8.00001L49.3 14C49.1 14.3 48.8 14.5 48.5 14.5C48.3 14.4 48.2 14.3 48.1 14.1C48 14 48 13.8 48 13.5L49 10.6L49.2 9.90001L48.6 10.3L39.3 16.3C39.1 16.4 39 16.4 38.8 16.4C38.7 16.4 38.5 16.3 38.3 16.1L27 3.50001L26.8 3.30001L26.6 3.50001L15.2 18C15.1 18.1 15 18.2 14.9 18.2C14.8 18.3 14.6 18.3 14.6 18.3C14.6 18.3 14.6 18.3 14.5 18.3H14.4C14.2 18.3 14.1 18.3 14 18.3Z" fill="#5C9BD3"/>
</svg>
