<svg width="64" height="54" viewBox="0 0 64 54" fill="none" xmlns="http://www.w3.org/2000/svg">
<g clip-path="url(#clip0)">
<path d="M56.4673 45.9034V46.1534H56.7173H58.2621C58.5363 46.1534 58.7454 46.2437 58.8853 46.3836C59.0252 46.5235 59.1155 46.7326 59.1155 47.0069C59.1155 47.2812 59.0252 47.4902 58.8853 47.6301C58.7454 47.77 58.5364 47.8603 58.2621 47.8603H55.6138H48.5517H42.8138H35.7517H30.2345H23.1724H17.6552H10.5931H7.94485C7.67061 47.8603 7.46152 47.77 7.32162 47.6301C7.18172 47.4902 7.0914 47.2811 7.0914 47.0069C7.0914 46.7327 7.18172 46.5236 7.32163 46.3836C7.46154 46.2437 7.67063 46.1534 7.94485 46.1534H9.48968H9.73968V45.9034V28.0276C9.73968 27.7534 9.83 27.5443 9.96991 27.4043C10.1098 27.2644 10.3189 27.1741 10.5931 27.1741H17.8759C18.1501 27.1741 18.3592 27.2644 18.4991 27.4043C18.639 27.5442 18.7293 27.7533 18.7293 28.0276V45.9034V46.1534H18.9793H22.069H22.319V45.9034V11.0345C22.319 10.7945 22.437 10.5868 22.6363 10.4318C22.8383 10.2747 23.1146 10.181 23.3931 10.181H30.4552C30.7294 10.181 30.9385 10.2713 31.0784 10.4112C31.2183 10.5511 31.3086 10.7602 31.3086 11.0345V45.9034V46.1534H31.5586H34.869H35.119V45.9034V21.8483C35.119 21.5741 35.2093 21.365 35.3492 21.225C35.4891 21.0851 35.6982 20.9948 35.9724 20.9948H43.0345C43.3087 20.9948 43.5178 21.0851 43.6577 21.225C43.7976 21.3649 43.8879 21.574 43.8879 21.8483V45.9034V46.1534H44.1379H47.4483H47.6983V45.9034V16.9931C47.6983 16.7189 47.7886 16.5098 47.9285 16.3698C48.0684 16.2299 48.2775 16.1396 48.5517 16.1396H55.6138C55.888 16.1396 56.0971 16.2299 56.2371 16.3698C56.377 16.5098 56.4673 16.7189 56.4673 16.9931V45.9034ZM11.8098 45.6777L11.9173 46.1534H16.5517H16.8017V45.9034V43.6965V43.3005L16.4442 43.4708L11.8098 45.6777ZM16.8842 41.4926L17.0224 41.4235V41.269V34.2069V33.8024L16.6606 33.9833L11.8055 36.4109L11.6673 36.48V36.6345V43.6965V44.101L12.0291 43.9201L16.8842 41.4926ZM42.0429 34.2098L42.1811 34.1407V33.9862V26.9241V26.5196L41.8193 26.7005L36.9641 29.1281L36.8259 29.1972V29.3517V36.4138V36.8183L37.1877 36.6374L42.0429 34.2098ZM42.1811 36.4138V36.0093L41.8193 36.1902L36.9641 38.6178L36.8259 38.6869V38.8414V45.9034V46.3079L37.1877 46.127L42.0429 43.6995L42.1811 43.6304V43.4759V36.4138ZM49.6552 17.8465H49.4052V18.0965V45.9034V46.1534H49.6552H54.5104H54.7604V45.9034V18.0965V17.8465H54.5104H49.6552ZM42.1811 22.9517V22.7017H41.9311H37.0759H36.8259V22.9517V26.9241V27.3286L37.1877 27.1477L42.0429 24.7201L42.1811 24.651V24.4965V22.9517ZM24.2759 11.8879H24.0259V12.1379V45.9034V46.1534H24.2759H29.1311H29.3811V45.9034V12.1379V11.8879H29.1311H24.2759ZM16.8842 32.0029L17.0224 31.9338V31.7793V29.6017V29.3517V29.131H16.7724V29.1017H11.9173H11.6673V29.3517V34.2069V34.6114L12.0291 34.4305L16.8842 32.0029Z" stroke="#5C9BD3" stroke-width="0.5"/>
<path d="M64 53.3776H2.2069C1.93268 53.3776 1.72359 53.2873 1.58368 53.1474C1.44377 53.0075 1.35345 52.7984 1.35345 52.5241C1.35345 52.2499 1.44377 52.0408 1.58367 51.9009C1.72358 51.761 1.93267 51.6707 2.2069 51.6707H64C64.2743 51.6707 64.4834 51.761 64.6233 51.9009C64.7632 52.0408 64.8535 52.2499 64.8535 52.5241C64.8535 52.7984 64.7632 53.0075 64.6233 53.1474C64.4833 53.2873 64.2742 53.3776 64 53.3776Z" stroke="#5C9BD3" stroke-width="0.5"/>
<path d="M13.2906 17.776C13.1649 17.6158 13.0782 17.4405 13.0452 17.2751C13.0036 17.0672 13.0454 16.8806 13.1975 16.7285L13.2074 16.7185L13.2162 16.7076L26.2275 0.388344C26.3138 0.305084 26.4499 0.213188 26.5946 0.140837C26.7525 0.0618862 26.8745 0.0292969 26.9242 0.0292969C27.2525 0.0292969 27.4091 0.176601 27.6241 0.391387L39.5357 14.0676L39.6785 14.2315L39.8606 14.1129L49.3502 7.93362L49.8638 7.59917L49.2628 7.47897L44.8647 6.59935C44.567 6.498 44.3491 6.35682 44.2276 6.19482C44.114 6.04332 44.0686 5.85382 44.1545 5.59629C44.2562 5.29123 44.3993 5.06825 44.5638 4.94481C44.7153 4.8312 44.9048 4.78579 45.1624 4.87164L45.175 4.87585L45.188 4.8787L52.2501 6.42352L52.2765 6.4293H52.3035C52.3794 6.4293 52.4067 6.43119 52.4145 6.43189C52.4187 6.43467 52.4285 6.44188 52.4466 6.45823C52.4634 6.47332 52.4828 6.49197 52.5075 6.51642C52.5398 6.65912 52.6258 6.74498 52.6737 6.79269L52.6784 6.79742C52.7128 6.83187 52.7181 6.83984 52.7176 6.84137C52.7174 6.84194 52.7165 6.84163 52.7159 6.84145C52.7158 6.84142 52.7157 6.84139 52.7156 6.84137C52.7156 6.84135 52.7155 6.84134 52.7155 6.84137V6.84141V6.84146V6.84149V6.84153V6.84157V6.84162V6.84167V6.84173V6.84179V6.84186V6.84193V6.84201V6.84209V6.84218V6.84227V6.84237V6.84247V6.84258V6.84269V6.8428V6.84292V6.84305V6.84318V6.84331V6.84345V6.8436V6.84375V6.8439V6.84406V6.84422V6.84439V6.84457V6.84474V6.84493V6.84511V6.84531V6.8455V6.8457V6.84591V6.84612V6.84633V6.84655V6.84678V6.84701V6.84724V6.84748V6.84772V6.84797V6.84822V6.84848V6.84874V6.849V6.84927V6.84955V6.84982V6.85011V6.85039V6.85069V6.85098V6.85128V6.85159V6.8519V6.85221V6.85253V6.85285V6.85318V6.85351V6.85385V6.85419V6.85453V6.85488V6.85524V6.85559V6.85596V6.85632V6.85669V6.85707V6.85745V6.85783V6.85822V6.85861V6.859V6.8594V6.85981V6.86022V6.86063V6.86105V6.86147V6.86189V6.86232V6.86275V6.86319V6.86363V6.86408V6.86453V6.86498V6.86544V6.8659V6.86637V6.86684V6.86731V6.86779V6.86827V6.86876V6.86925V6.86974V6.87024V6.87074V6.87125V6.87176V6.87227V6.87279V6.87331V6.87384V6.87436V6.8749V6.87543V6.87598V6.87652V6.87707V6.87762V6.87818V6.87874V6.8793V6.87987V6.88044V6.88102V6.88159V6.88218V6.88276V6.88335V6.88395V6.88454V6.88515V6.88575V6.88636V6.88697V6.88759V6.88821V6.88883V6.88946V6.89009V6.89072V6.89136V6.892V6.89265V6.8933V6.89395V6.8946V6.89526V6.89592V6.89659V6.89726V6.89793V6.89861V6.89929V6.89997V6.90066V6.90135V6.90205V6.90274V6.90344V6.90415V6.90486V6.90557V6.90628V6.907V6.90772V6.90845V6.90917V6.9099V6.91064V6.91138V6.91212V6.91286V6.91361V6.91436V6.91512V6.91587V6.91663V6.9174V6.91817V6.91894V6.91971V6.92049V6.92127V6.92205V6.92284V6.92363V6.92442V6.92521V6.92601V6.92682V6.92762V6.92843V6.92924V6.93005V6.93087V6.93169V6.93252V6.93334V6.93417V6.93501V6.93584V6.93668V6.93752V6.93837V6.93921V6.94006V6.94092V6.94177V6.94263V6.9435V6.94436V6.94523V6.9461V6.94697V6.94785V6.94873V6.94961V6.9505V6.95139V6.95228V6.95317V6.95407V6.95497V6.95587V6.95678V6.95768V6.95859V6.95951V6.96042V6.96134V6.96226V6.96319V6.96411V6.96504V6.96598V6.96691V6.96785V6.96879V6.96973V6.97068V6.97162V6.97258V6.97353V6.97448V6.97544V6.9764V6.97737V6.97833V6.9793V6.98027V6.98125V6.98222V6.9832V6.98418V6.98517V6.98615V6.98714V6.98813V6.98912V6.99012V6.99112V6.99212V6.99312V6.99413V6.99514V6.99615V6.99716V6.99817V6.99919V7.00021V7.00123V7.00226V7.00328V7.00431V7.00534V7.00637V7.00741V7.00845V7.00949V7.01053V7.01158V7.01262V7.01367V7.01472V7.01578V7.01683V7.01789V7.01895V7.02001V7.02107V7.02214V7.02321V7.02428V7.02535V7.02643V7.0275V7.02858V7.02966V7.03074V7.03183V7.03292V7.034V7.0351V7.03619V7.03728V7.03838V7.03948V7.04058V7.04168V7.04279V7.04389V7.045V7.04611V7.04722V7.04834V7.04945V7.05057V7.05169V7.05281V7.05394V7.05506V7.05619V7.05732V7.05845V7.05958V7.06071V7.06185V7.06299V7.06413V7.06527V7.06641V7.06756V7.0687V7.06985V7.071V7.07215V7.07331V7.07446V7.07562V7.07677V7.07793V7.07909V7.08026V7.08142V7.08259V7.08376V7.08493V7.0861V7.08727V7.08844V7.08962V7.09079V7.09197V7.09315V7.09433V7.09552V7.0967V7.09789V7.09907V7.10026V7.10145V7.10264V7.10384V7.10503V7.10623V7.10742V7.10862V7.10982V7.11102V7.11223V7.11343V7.11464V7.11584V7.11705V7.11826V7.11947V7.12068V7.12189V7.12311V7.12432V7.12554V7.12676V7.12798V7.1292V7.13042V7.13164V7.13287V7.13409V7.13532V7.13654V7.13777V7.139V7.14023V7.14146V7.1427V7.14393V7.14517V7.1464V7.14764V7.14888V7.15012V7.15136V7.1526V7.15384V7.15508V7.15633V7.15757V7.15882V7.16007V7.16131V7.16256V7.16381V7.16506V7.16632V7.16757V7.16882V7.17008V7.17133V7.17259V7.17385V7.1751V7.17636V7.17762V7.17888V7.18014V7.18141V7.18267V7.18393V7.1852V7.18646V7.18773V7.18899V7.19026V7.19153V7.1928V7.19407V7.19534V7.19661V7.19788V7.19915V7.20042V7.2017V7.20297V7.20424V7.20552V7.20679V7.20807V7.20935V7.21063V7.2119V7.21318V7.21446V7.21574V7.21702V7.2183V7.21958V7.22086V7.22215V7.22343V7.22471V7.22599V7.22728V7.22856V7.22985V7.23113V7.23242V7.2337V7.23499V7.23628V7.23756V7.23885V7.24014V7.24142V7.24218L50.7481 13.1445C50.5732 13.4796 50.2312 13.6534 49.8759 13.6534H49.8746H49.8733H49.8721H49.8708H49.8695H49.8682H49.867H49.8657H49.8645H49.8632H49.862H49.8607H49.8595H49.8583H49.8571H49.8559H49.8546H49.8534H49.8522H49.851H49.8498H49.8486H49.8475H49.8463H49.8451H49.8439H49.8428H49.8416H49.8405H49.8393H49.8382H49.837H49.8359H49.8347H49.8336H49.8325H49.8314H49.8302H49.8291H49.828H49.8269H49.8258H49.8247H49.8236H49.8225H49.8214H49.8204H49.8193H49.8182H49.8172H49.8161H49.815H49.814H49.8129H49.8119H49.8108H49.8098H49.8088H49.8077H49.8067H49.8057H49.8047H49.8036H49.8026H49.8016H49.8006H49.7996H49.7986H49.7976H49.7966H49.7956H49.7947H49.7937H49.7927H49.7917H49.7908H49.7898H49.7888H49.7879H49.7869H49.786H49.785H49.7841H49.7832H49.7822H49.7813H49.7804H49.7794H49.7785H49.7776H49.7767H49.7758H49.7748H49.7739H49.773H49.7721H49.7712H49.7703H49.7694H49.7686H49.7677H49.7668H49.7659H49.765H49.7642H49.7633H49.7624H49.7616H49.7607H49.7598H49.759H49.7581H49.7573H49.7564H49.7556H49.7548H49.7539H49.7531H49.7522H49.7514H49.7506H49.7498H49.7489H49.7481H49.7473H49.7465H49.7457H49.7449H49.7441H49.7433H49.7425H49.7417H49.7409H49.7401H49.7393H49.7385H49.7377H49.7369H49.7361H49.7353H49.7346H49.7338H49.733H49.7322H49.7315H49.7307H49.7299H49.7292H49.7284H49.7277H49.7269H49.7262H49.7254H49.7247H49.7239H49.7232H49.7224H49.7217H49.7209H49.7202H49.7195H49.7187H49.718H49.7173H49.7165H49.7158H49.7151H49.7143H49.7136H49.7129H49.7122H49.7115H49.7108H49.71H49.7093H49.7086H49.7079H49.7072H49.7065H49.7058H49.7051H49.7044H49.7037H49.703H49.7023H49.7016H49.7009H49.7002H49.6995H49.6988H49.6981H49.6975H49.6968H49.6961H49.6954H49.6947H49.694H49.6934H49.6927H49.692H49.6913H49.6906H49.69H49.6893H49.6886H49.688H49.6873H49.6866H49.6859H49.6853H49.6846H49.6839H49.6833H49.6826H49.6819H49.6813H49.6806H49.68H49.6793H49.6786H49.678H49.6773H49.6767H49.676H49.6754H49.6747H49.674H49.6734H49.6727H49.6721H49.6714H49.6708H49.6701H49.6695H49.6688H49.6682H49.6675H49.6669H49.6662H49.6656H49.6649H49.6643H49.6636H49.663H49.6623H49.6617H49.661H49.6604H49.6597H49.6591H49.6584H49.6578H49.6572H49.6565H49.6559H49.6552H49.6546H49.6539H49.6533H49.6526H49.652H49.6513H49.6507H49.65H49.6494H49.6487H49.6481H49.6474H49.6468H49.6461H49.6455H49.6449H49.6442H49.6436H49.6429H49.6423H49.6416H49.6409H49.6403H49.6396H49.639H49.6383H49.6377H49.637H49.6364H49.6357H49.6351H49.6344H49.6338H49.6331H49.6324H49.6318H49.6311H49.6305H49.6298H49.6291H49.6285H49.6278H49.6271H49.6265H49.6258H49.6251H49.6245H49.6238H49.6231H49.6225H49.6218H49.6211H49.6204H49.6198H49.6191H49.6184H49.6177H49.6171H49.6164H49.6157H49.615H49.6143H49.6137H49.613H49.6123H49.6116H49.6109H49.6102H49.6095H49.6088H49.6081H49.6074H49.6067H49.606H49.6053H49.6046H49.6039H49.6032H49.6025H49.6018H49.6011H49.6004H49.5997H49.5989H49.5982H49.5975H49.5968H49.5961H49.5953H49.5946H49.5939H49.5932H49.5924H49.5917H49.591H49.5902H49.5895H49.5887H49.588H49.5873H49.5865H49.5858H49.585H49.5843H49.5835H49.5828H49.582H49.5812H49.5805H49.5797H49.5789H49.5782H49.5774H49.5766H49.5759H49.5751H49.5743H49.5735H49.5727H49.5719H49.5711H49.5704H49.5696H49.5688H49.568H49.5672H49.5664H49.5655H49.5647H49.5639H49.5631H49.5623H49.5615H49.5607H49.5598H49.559H49.5582H49.5573H49.5565H49.5557H49.5548H49.554H49.5531H49.5523H49.5514H49.5506H49.5497H49.5489H49.548H49.5471H49.5463H49.5454H49.5445H49.5436H49.5427H49.5419H49.541H49.5401H49.5392H49.5383H49.5374H49.5365H49.5356H49.5347H49.5337H49.5328H49.5319H49.531H49.5301H49.5291H49.5282H49.5273H49.5263H49.5254H49.5244H49.5235H49.5225H49.5216H49.5206H49.5196H49.5187H49.5177H49.5167H49.5158H49.5148H49.5138H49.5128H49.5118H49.5108H49.5098H49.5088H49.5078H49.5068H49.5058H49.5047H49.5037H49.5027H49.5017H49.5006H49.4996H49.4985H49.4975H49.4964H49.4958C49.3207 13.5578 49.1637 13.4288 49.0672 13.2744C48.9679 13.1156 48.9238 12.9178 49.0088 12.6608C49.009 12.66 49.0093 12.6592 49.0096 12.6584L50.1113 9.57373L50.3587 8.88107L49.7405 9.2795L39.8213 15.6718C39.6343 15.7634 39.4677 15.7987 39.3138 15.7795C39.161 15.7604 38.9912 15.6839 38.8035 15.4982L27.1129 2.04291L26.9145 1.81456L26.7276 2.05242L14.5996 17.4881C14.5132 17.5712 14.3774 17.6628 14.2331 17.735C14.0752 17.8139 13.9532 17.8465 13.9035 17.8465C13.8875 17.8465 13.8619 17.8423 13.8125 17.8268C13.8029 17.8238 13.79 17.8195 13.7751 17.8146C13.7347 17.8012 13.6794 17.7828 13.6331 17.7712C13.5607 17.7531 13.4658 17.738 13.3609 17.7577C13.3369 17.7622 13.3135 17.7683 13.2906 17.776Z" stroke="#5C9BD3" stroke-width="0.5"/>
</g>
<defs>
<clipPath id="clip0">
<rect width="64" height="54" fill="white"/>
</clipPath>
</defs>
</svg>
