**Configuration APIs**
=======================

.. toctree::

   assets
   functions
   monitors
   plants
   pipelines
   pipelines_edge
   pipelines_IU
   sites
   licenses
   samples
   tags
   others