<svg width="64" height="64" viewBox="0 0 64 64" fill="none" xmlns="http://www.w3.org/2000/svg">
<mask id="mask0" mask-type="alpha" maskUnits="userSpaceOnUse" x="0" y="0" width="64" height="59">
<path d="M60 24H54.6293C54.3458 23.2032 54.02 22.4221 53.6533 21.66L57.456 17.8587C57.8277 17.4872 58.1226 17.0461 58.3238 16.5607C58.5249 16.0752 58.6285 15.5548 58.6285 15.0293C58.6285 14.5038 58.5249 13.9835 58.3238 13.498C58.1226 13.0125 57.8277 12.5715 57.456 12.2L51.8 6.544C51.4285 6.17229 50.9875 5.87743 50.502 5.67625C50.0165 5.47507 49.4962 5.37152 48.9707 5.37152C48.4452 5.37152 47.9248 5.47507 47.4393 5.67625C46.9539 5.87743 46.5128 6.17229 46.1413 6.544L42.34 10.3467C41.5779 9.97996 40.7968 9.65417 40 9.37067V4C40 2.93913 39.5786 1.92172 38.8284 1.17157C38.0783 0.421427 37.0609 0 36 0H28C26.9391 0 25.9217 0.421427 25.1716 1.17157C24.4214 1.92172 24 2.93913 24 4V9.37067C23.2032 9.65417 22.4221 9.97996 21.66 10.3467L17.8587 6.544C17.4872 6.17229 17.0461 5.87743 16.5607 5.67625C16.0752 5.47507 15.5548 5.37152 15.0293 5.37152C14.5038 5.37152 13.9835 5.47507 13.498 5.67625C13.0125 5.87743 12.5715 6.17229 12.2 6.544L6.544 12.2C6.17229 12.5715 5.87743 13.0125 5.67625 13.498C5.47507 13.9835 5.37152 14.5038 5.37152 15.0293C5.37152 15.5548 5.47507 16.0752 5.67625 16.5607C5.87743 17.0461 6.17229 17.4872 6.544 17.8587L10.3467 21.66C9.97996 22.4221 9.65417 23.2032 9.37067 24H4C2.93913 24 1.92172 24.4214 1.17157 25.1716C0.421427 25.9217 0 26.9391 0 28V36C0 37.0609 0.421427 38.0783 1.17157 38.8284C1.92172 39.5786 2.93913 40 4 40H9.37067C9.65417 40.7968 9.97996 41.5779 10.3467 42.34L6.544 46.1413C6.17229 46.5128 5.87743 46.9539 5.67625 47.4393C5.47507 47.9248 5.37152 48.4452 5.37152 48.9707C5.37152 49.4962 5.47507 50.0165 5.67625 50.502C5.87743 50.9875 6.17229 51.4285 6.544 51.8L12.2 57.456C12.9624 58.1834 13.9756 58.5892 15.0293 58.5892C16.083 58.5892 17.0963 58.1834 17.8587 57.456C18.1087 57.2058 18.2491 56.8666 18.2489 56.5129C18.2488 56.1592 18.1082 55.82 17.858 55.57C17.6078 55.32 17.2686 55.1796 16.9149 55.1797C16.5612 55.1799 16.222 55.3205 15.972 55.5707C15.8482 55.6946 15.7011 55.793 15.5393 55.8601C15.3774 55.9272 15.2039 55.9617 15.0287 55.9617C14.8534 55.9617 14.6799 55.9272 14.5181 55.8601C14.3562 55.793 14.2092 55.6946 14.0853 55.5707L8.42933 49.9147C8.30537 49.7908 8.20702 49.6438 8.13992 49.4819C8.07282 49.3201 8.03828 49.1466 8.03828 48.9713C8.03828 48.7961 8.07282 48.6226 8.13992 48.4607C8.20702 48.2989 8.30537 48.1518 8.42933 48.028L12.9147 43.5427C13.1164 43.3408 13.2481 43.0796 13.2904 42.7973C13.3326 42.5151 13.2832 42.2267 13.1493 41.9747C12.5201 40.7927 12.004 39.5538 11.608 38.2747C11.5242 38.0021 11.3551 37.7635 11.1257 37.5941C10.8962 37.4247 10.6185 37.3333 10.3333 37.3333H4C3.64638 37.3333 3.30724 37.1929 3.05719 36.9428C2.80714 36.6928 2.66667 36.3536 2.66667 36V28C2.66667 27.6464 2.80714 27.3072 3.05719 27.0572C3.30724 26.8071 3.64638 26.6667 4 26.6667H10.3333C10.6185 26.6667 10.8962 26.5753 11.1257 26.4059C11.3551 26.2365 11.5242 25.9979 11.608 25.7253C12.004 24.4462 12.5201 23.2073 13.1493 22.0253C13.2832 21.7733 13.3326 21.4849 13.2904 21.2027C13.2481 20.9204 13.1164 20.6592 12.9147 20.4573L8.42933 15.972C8.30537 15.8482 8.20702 15.7011 8.13992 15.5393C8.07282 15.3774 8.03828 15.2039 8.03828 15.0287C8.03828 14.8534 8.07282 14.6799 8.13992 14.5181C8.20702 14.3562 8.30537 14.2092 8.42933 14.0853L14.0853 8.42933C14.2092 8.30537 14.3562 8.20702 14.5181 8.13992C14.6799 8.07282 14.8534 8.03828 15.0287 8.03828C15.2039 8.03828 15.3774 8.07282 15.5393 8.13992C15.7011 8.20702 15.8482 8.30537 15.972 8.42933L20.4573 12.9147C20.6592 13.1164 20.9204 13.2481 21.2027 13.2904C21.4849 13.3326 21.7733 13.2832 22.0253 13.1493C23.2073 12.5201 24.4462 12.004 25.7253 11.608C25.9979 11.5242 26.2365 11.3551 26.4059 11.1257C26.5753 10.8962 26.6667 10.6185 26.6667 10.3333V4C26.6667 3.64638 26.8071 3.30724 27.0572 3.05719C27.3072 2.80714 27.6464 2.66667 28 2.66667H36C36.3536 2.66667 36.6928 2.80714 36.9428 3.05719C37.1929 3.30724 37.3333 3.64638 37.3333 4V10.3333C37.3333 10.6185 37.4247 10.8962 37.5941 11.1257C37.7635 11.3551 38.0021 11.5242 38.2747 11.608C39.5538 12.004 40.7927 12.5201 41.9747 13.1493C42.2267 13.2832 42.5151 13.3326 42.7973 13.2904C43.0796 13.2481 43.3408 13.1164 43.5427 12.9147L48.028 8.42933C48.1518 8.30537 48.2989 8.20702 48.4607 8.13992C48.6226 8.07282 48.7961 8.03828 48.9713 8.03828C49.1466 8.03828 49.3201 8.07282 49.4819 8.13992C49.6438 8.20702 49.7908 8.30537 49.9147 8.42933L55.5707 14.0853C55.6946 14.2092 55.793 14.3562 55.8601 14.5181C55.9272 14.6799 55.9617 14.8534 55.9617 15.0287C55.9617 15.2039 55.9272 15.3774 55.8601 15.5393C55.793 15.7011 55.6946 15.8482 55.5707 15.972L51.0853 20.4573C50.8836 20.6592 50.7519 20.9204 50.7096 21.2027C50.6674 21.4849 50.7168 21.7733 50.8507 22.0253C51.4799 23.2073 51.996 24.4462 52.392 25.7253C52.4759 25.9979 52.6449 26.2365 52.8743 26.4059C53.1038 26.5753 53.3815 26.6667 53.6667 26.6667H60C60.3536 26.6667 60.6928 26.8071 60.9428 27.0572C61.1929 27.3072 61.3333 27.6464 61.3333 28V36C61.3333 36.3536 61.1929 36.6928 60.9428 36.9428C60.6928 37.1929 60.3536 37.3333 60 37.3333H53.6667C53.3815 37.3333 53.1038 37.4247 52.8743 37.5941C52.6449 37.7635 52.4759 38.0021 52.392 38.2747C51.996 39.5538 51.4799 40.7927 50.8507 41.9747C50.7168 42.2267 50.6674 42.5151 50.7096 42.7973C50.7519 43.0796 50.8836 43.3408 51.0853 43.5427L55.5707 48.028C55.6946 48.1518 55.793 48.2989 55.8601 48.4607C55.9272 48.6226 55.9617 48.7961 55.9617 48.9713C55.9617 49.1466 55.9272 49.3201 55.8601 49.4819C55.793 49.6438 55.6946 49.7908 55.5707 49.9147L49.9147 55.5707C49.7908 55.6946 49.6438 55.793 49.4819 55.8601C49.3201 55.9272 49.1466 55.9617 48.9713 55.9617C48.7961 55.9617 48.6226 55.9272 48.4607 55.8601C48.2989 55.793 48.1518 55.6946 48.028 55.5707C47.778 55.3205 47.4388 55.1799 47.0851 55.1797C46.7314 55.1796 46.3922 55.32 46.142 55.57C45.8918 55.82 45.7512 56.1592 45.7511 56.5129C45.7509 56.8666 45.8913 57.2058 46.1413 57.456C46.5128 57.8277 46.9539 58.1226 47.4393 58.3238C47.9248 58.5249 48.4452 58.6285 48.9707 58.6285C49.4962 58.6285 50.0165 58.5249 50.502 58.3238C50.9875 58.1226 51.4285 57.8277 51.8 57.456L57.456 51.8C57.8277 51.4285 58.1226 50.9875 58.3238 50.502C58.5249 50.0165 58.6285 49.4962 58.6285 48.9707C58.6285 48.4452 58.5249 47.9248 58.3238 47.4393C58.1226 46.9539 57.8277 46.5128 57.456 46.1413L53.6533 42.34C54.02 41.5779 54.3458 40.7968 54.6293 40H60C61.0609 40 62.0783 39.5786 62.8284 38.8284C63.5786 38.0783 64 37.0609 64 36V28C64 26.9391 63.5786 25.9217 62.8284 25.1716C62.0783 24.4214 61.0609 24 60 24Z" fill="white"/>
</mask>
<g mask="url(#mask0)">
<path d="M60 24H54.6293C54.3458 23.2032 54.02 22.4221 53.6533 21.66L57.456 17.8587C57.8277 17.4872 58.1226 17.0461 58.3238 16.5607C58.5249 16.0752 58.6285 15.5548 58.6285 15.0293C58.6285 14.5038 58.5249 13.9835 58.3238 13.498C58.1226 13.0125 57.8277 12.5715 57.456 12.2L51.8 6.544C51.4285 6.17229 50.9875 5.87743 50.502 5.67625C50.0165 5.47507 49.4962 5.37152 48.9707 5.37152C48.4452 5.37152 47.9248 5.47507 47.4393 5.67625C46.9539 5.87743 46.5128 6.17229 46.1413 6.544L42.34 10.3467C41.5779 9.97996 40.7968 9.65417 40 9.37067V4C40 2.93913 39.5786 1.92172 38.8284 1.17157C38.0783 0.421427 37.0609 0 36 0H28C26.9391 0 25.9217 0.421427 25.1716 1.17157C24.4214 1.92172 24 2.93913 24 4V9.37067C23.2032 9.65417 22.4221 9.97996 21.66 10.3467L17.8587 6.544C17.4872 6.17229 17.0461 5.87743 16.5607 5.67625C16.0752 5.47507 15.5548 5.37152 15.0293 5.37152C14.5038 5.37152 13.9835 5.47507 13.498 5.67625C13.0125 5.87743 12.5715 6.17229 12.2 6.544L6.544 12.2C6.17229 12.5715 5.87743 13.0125 5.67625 13.498C5.47507 13.9835 5.37152 14.5038 5.37152 15.0293C5.37152 15.5548 5.47507 16.0752 5.67625 16.5607C5.87743 17.0461 6.17229 17.4872 6.544 17.8587L10.3467 21.66C9.97996 22.4221 9.65417 23.2032 9.37067 24H4C2.93913 24 1.92172 24.4214 1.17157 25.1716C0.421427 25.9217 0 26.9391 0 28V36C0 37.0609 0.421427 38.0783 1.17157 38.8284C1.92172 39.5786 2.93913 40 4 40H9.37067C9.65417 40.7968 9.97996 41.5779 10.3467 42.34L6.544 46.1413C6.17229 46.5128 5.87743 46.9539 5.67625 47.4393C5.47507 47.9248 5.37152 48.4452 5.37152 48.9707C5.37152 49.4962 5.47507 50.0165 5.67625 50.502C5.87743 50.9875 6.17229 51.4285 6.544 51.8L12.2 57.456C12.9624 58.1834 13.9756 58.5892 15.0293 58.5892C16.083 58.5892 17.0963 58.1834 17.8587 57.456C18.1087 57.2058 18.2491 56.8666 18.2489 56.5129C18.2488 56.1592 18.1082 55.82 17.858 55.57C17.6078 55.32 17.2686 55.1796 16.9149 55.1797C16.5612 55.1799 16.222 55.3205 15.972 55.5707C15.8482 55.6946 15.7011 55.793 15.5393 55.8601C15.3774 55.9272 15.2039 55.9617 15.0287 55.9617C14.8534 55.9617 14.6799 55.9272 14.5181 55.8601C14.3562 55.793 14.2092 55.6946 14.0853 55.5707L8.42933 49.9147C8.30537 49.7908 8.20702 49.6438 8.13992 49.4819C8.07282 49.3201 8.03828 49.1466 8.03828 48.9713C8.03828 48.7961 8.07282 48.6226 8.13992 48.4607C8.20702 48.2989 8.30537 48.1518 8.42933 48.028L12.9147 43.5427C13.1164 43.3408 13.2481 43.0796 13.2904 42.7973C13.3326 42.5151 13.2832 42.2267 13.1493 41.9747C12.5201 40.7927 12.004 39.5538 11.608 38.2747C11.5242 38.0021 11.3551 37.7635 11.1257 37.5941C10.8962 37.4247 10.6185 37.3333 10.3333 37.3333H4C3.64638 37.3333 3.30724 37.1929 3.05719 36.9428C2.80714 36.6928 2.66667 36.3536 2.66667 36V28C2.66667 27.6464 2.80714 27.3072 3.05719 27.0572C3.30724 26.8071 3.64638 26.6667 4 26.6667H10.3333C10.6185 26.6667 10.8962 26.5753 11.1257 26.4059C11.3551 26.2365 11.5242 25.9979 11.608 25.7253C12.004 24.4462 12.5201 23.2073 13.1493 22.0253C13.2832 21.7733 13.3326 21.4849 13.2904 21.2027C13.2481 20.9204 13.1164 20.6592 12.9147 20.4573L8.42933 15.972C8.30537 15.8482 8.20702 15.7011 8.13992 15.5393C8.07282 15.3774 8.03828 15.2039 8.03828 15.0287C8.03828 14.8534 8.07282 14.6799 8.13992 14.5181C8.20702 14.3562 8.30537 14.2092 8.42933 14.0853L14.0853 8.42933C14.2092 8.30537 14.3562 8.20702 14.5181 8.13992C14.6799 8.07282 14.8534 8.03828 15.0287 8.03828C15.2039 8.03828 15.3774 8.07282 15.5393 8.13992C15.7011 8.20702 15.8482 8.30537 15.972 8.42933L20.4573 12.9147C20.6592 13.1164 20.9204 13.2481 21.2027 13.2904C21.4849 13.3326 21.7733 13.2832 22.0253 13.1493C23.2073 12.5201 24.4462 12.004 25.7253 11.608C25.9979 11.5242 26.2365 11.3551 26.4059 11.1257C26.5753 10.8962 26.6667 10.6185 26.6667 10.3333V4C26.6667 3.64638 26.8071 3.30724 27.0572 3.05719C27.3072 2.80714 27.6464 2.66667 28 2.66667H36C36.3536 2.66667 36.6928 2.80714 36.9428 3.05719C37.1929 3.30724 37.3333 3.64638 37.3333 4V10.3333C37.3333 10.6185 37.4247 10.8962 37.5941 11.1257C37.7635 11.3551 38.0021 11.5242 38.2747 11.608C39.5538 12.004 40.7927 12.5201 41.9747 13.1493C42.2267 13.2832 42.5151 13.3326 42.7973 13.2904C43.0796 13.2481 43.3408 13.1164 43.5427 12.9147L48.028 8.42933C48.1518 8.30537 48.2989 8.20702 48.4607 8.13992C48.6226 8.07282 48.7961 8.03828 48.9713 8.03828C49.1466 8.03828 49.3201 8.07282 49.4819 8.13992C49.6438 8.20702 49.7908 8.30537 49.9147 8.42933L55.5707 14.0853C55.6946 14.2092 55.793 14.3562 55.8601 14.5181C55.9272 14.6799 55.9617 14.8534 55.9617 15.0287C55.9617 15.2039 55.9272 15.3774 55.8601 15.5393C55.793 15.7011 55.6946 15.8482 55.5707 15.972L51.0853 20.4573C50.8836 20.6592 50.7519 20.9204 50.7096 21.2027C50.6674 21.4849 50.7168 21.7733 50.8507 22.0253C51.4799 23.2073 51.996 24.4462 52.392 25.7253C52.4759 25.9979 52.6449 26.2365 52.8743 26.4059C53.1038 26.5753 53.3815 26.6667 53.6667 26.6667H60C60.3536 26.6667 60.6928 26.8071 60.9428 27.0572C61.1929 27.3072 61.3333 27.6464 61.3333 28V36C61.3333 36.3536 61.1929 36.6928 60.9428 36.9428C60.6928 37.1929 60.3536 37.3333 60 37.3333H53.6667C53.3815 37.3333 53.1038 37.4247 52.8743 37.5941C52.6449 37.7635 52.4759 38.0021 52.392 38.2747C51.996 39.5538 51.4799 40.7927 50.8507 41.9747C50.7168 42.2267 50.6674 42.5151 50.7096 42.7973C50.7519 43.0796 50.8836 43.3408 51.0853 43.5427L55.5707 48.028C55.6946 48.1518 55.793 48.2989 55.8601 48.4607C55.9272 48.6226 55.9617 48.7961 55.9617 48.9713C55.9617 49.1466 55.9272 49.3201 55.8601 49.4819C55.793 49.6438 55.6946 49.7908 55.5707 49.9147L49.9147 55.5707C49.7908 55.6946 49.6438 55.793 49.4819 55.8601C49.3201 55.9272 49.1466 55.9617 48.9713 55.9617C48.7961 55.9617 48.6226 55.9272 48.4607 55.8601C48.2989 55.793 48.1518 55.6946 48.028 55.5707C47.778 55.3205 47.4388 55.1799 47.0851 55.1797C46.7314 55.1796 46.3922 55.32 46.142 55.57C45.8918 55.82 45.7512 56.1592 45.7511 56.5129C45.7509 56.8666 45.8913 57.2058 46.1413 57.456C46.5128 57.8277 46.9539 58.1226 47.4393 58.3238C47.9248 58.5249 48.4452 58.6285 48.9707 58.6285C49.4962 58.6285 50.0165 58.5249 50.502 58.3238C50.9875 58.1226 51.4285 57.8277 51.8 57.456L57.456 51.8C57.8277 51.4285 58.1226 50.9875 58.3238 50.502C58.5249 50.0165 58.6285 49.4962 58.6285 48.9707C58.6285 48.4452 58.5249 47.9248 58.3238 47.4393C58.1226 46.9539 57.8277 46.5128 57.456 46.1413L53.6533 42.34C54.02 41.5779 54.3458 40.7968 54.6293 40H60C61.0609 40 62.0783 39.5786 62.8284 38.8284C63.5786 38.0783 64 37.0609 64 36V28C64 26.9391 63.5786 25.9217 62.8284 25.1716C62.0783 24.4214 61.0609 24 60 24Z" stroke="#5C9BD3"/>
<path d="M32.7699 52.7622H32.7698C32.5721 52.962 32.3046 53.077 32.0238 53.0831C31.8117 53.0631 31.5977 53.0893 31.3967 53.1599C31.1907 53.2323 31.0034 53.3495 30.8481 53.5031C30.6929 53.6568 30.5738 53.843 30.4994 54.0483C30.4263 54.2498 30.3982 54.4647 30.4167 54.678V61.3333V61.5833H30.6667H33.3333H33.5833V61.3333V56C33.5833 55.7127 33.6975 55.4371 33.9006 55.234L33.9007 55.2339C34.1038 55.0308 34.3794 54.9167 34.6667 54.9167C34.954 54.9167 35.2295 55.0308 35.4327 55.234C35.6358 55.4371 35.75 55.7127 35.75 56V62.6667C35.75 62.954 35.6358 63.2295 35.4327 63.4328C35.2294 63.6359 34.9539 63.75 34.6667 63.75H29.3333C29.0461 63.75 28.7705 63.6359 28.5673 63.4328C28.3641 63.2295 28.25 62.954 28.25 62.6667V54.6667H28.2503L28.2497 54.6547C28.2123 53.8739 28.4369 53.1031 28.888 52.4647C29.339 51.8263 29.9904 51.357 30.7388 51.1314L30.9167 51.0777V50.892V47.932V47.702L30.6875 47.6829C26.6382 47.3442 22.8764 45.4538 20.1885 42.4064C17.5004 39.359 16.0943 35.3908 16.2637 31.3308C16.4332 27.271 18.1652 23.4336 21.0977 20.6208C24.0304 17.8082 27.9366 16.2377 32 16.2377C36.0635 16.2377 39.9697 17.8082 42.9022 20.6208C45.8348 23.4336 47.5668 27.271 47.7363 31.3308C47.9057 35.3908 46.4995 39.359 43.8115 42.4064C41.1236 45.4538 37.3618 47.3442 33.3125 47.6829L33.0833 47.702V47.932V52V52.0001C33.0834 52.2854 32.9707 52.5594 32.7699 52.7622ZM18.4167 32V32.0003C18.4207 35.6015 19.853 39.0542 22.3994 41.6006C24.9459 44.1471 28.3985 45.5794 31.9997 45.5833H32C34.6865 45.5833 37.3128 44.7867 39.5465 43.2942C41.7803 41.8016 43.5212 39.6802 44.5494 37.1981C45.5775 34.7161 45.8464 31.9849 45.3224 29.35L45.0772 29.3988L45.3224 29.35C44.7982 26.7151 43.5045 24.2948 41.6049 22.3951C39.7052 20.4955 37.2849 19.2017 34.65 18.6777C32.0151 18.1536 29.2839 18.4225 26.8019 19.4506C24.3198 20.4788 22.1984 22.2197 20.7059 24.4535C19.2134 26.6873 18.4167 29.3135 18.4167 32Z" stroke="#5C9BD3" stroke-width="0.5"/>
<path d="M28.7658 27.234C28.5626 27.031 28.2872 26.917 28 26.917C27.7128 26.917 27.4373 27.031 27.2341 27.2341L28.7658 27.234ZM28.7658 27.234C28.9689 27.4373 29.0831 27.7128 29.0831 28C29.0831 28.2872 28.969 28.5626 28.7659 28.7659C28.7659 28.7659 28.7659 28.766 28.7658 28.766L25.7085 31.8232L25.5317 32L25.7085 32.1768L28.7643 35.2325C28.9607 35.4366 29.0693 35.7096 29.0669 35.993C29.0645 36.277 28.9505 36.5487 28.7496 36.7496C28.5487 36.9505 28.277 37.0645 27.993 37.0669C27.7097 37.0693 27.4367 36.9607 27.2324 36.7643L23.2341 32.766V32.7659C23.031 32.5627 22.917 32.2873 22.917 32C22.917 31.7127 23.031 31.4373 23.2341 31.2341C23.2341 31.234 23.2341 31.234 23.2341 31.234L27.234 27.2341L28.7658 27.234Z" stroke="#5C9BD3" stroke-width="0.5"/>
<path d="M35.2341 36.766C35.0311 36.5628 34.917 36.2872 34.917 36C34.917 35.7127 35.0311 35.4372 35.2341 35.234L38.2915 32.1768L38.4683 32L38.2915 31.8232L35.2357 28.7676C35.0393 28.5633 34.9307 28.2903 34.9331 28.0069C34.9355 27.7229 35.0495 27.4512 35.2504 27.2504C35.4512 27.0495 35.7229 26.9355 36.0069 26.9331C36.2904 26.9307 36.5634 27.0393 36.7675 27.2357L40.7658 31.234C40.7659 31.234 40.7659 31.234 40.7659 31.2341C40.969 31.4373 41.0831 31.7128 41.0831 32C41.0831 32.2871 40.969 32.5627 40.7659 32.7659C40.7659 32.7659 40.7659 32.766 40.7658 32.766L36.766 36.7658C36.766 36.7659 36.7659 36.7659 36.7659 36.7659L35.2341 36.766Z" stroke="#5C9BD3" stroke-width="0.5"/>
</g>
</svg>
