<svg width="66" height="66" viewBox="0 0 66 66" fill="none" xmlns="http://www.w3.org/2000/svg">
<g clip-path="url(#clip0)">
<path d="M65.1 64.65H11.5C11.2381 64.65 11.05 64.4619 11.05 64.2C11.05 63.9381 11.2381 63.75 11.5 63.75H65.1C65.3619 63.75 65.55 63.9381 65.55 64.2C65.55 64.4619 65.3619 64.65 65.1 64.65Z" stroke="#3C4E5F" stroke-width="0.5"/>
<path d="M14.9 30.5C13.8 40.7 17.8 48.7 23.8 56.7C27.8 61.7 34.8 64.7 40.8 63.7C61.8 56.7 63.8 31.7 60.8 12.7M60.8 12.7C61.8 22.3 61.8 22.3 60.8 12.7ZM60.8 12.7C52.8 12.7 45.8 11.7 38.8 8.7C34.8 6.7 30.8 11.7 26.9 11.9" stroke="#3C4E5F" stroke-width="0.25"/>
<path d="M15.6 21.4C12.4 21.4 9.7 18.8 9.7 15.5C9.7 12.3 12.3 9.60001 15.6 9.60001C18.8 9.60001 21.5 12.2 21.5 15.5C21.4 18.8 18.8 21.4 15.6 21.4ZM15.6 11.1C13.1 11.1 11.1 13.1 11.1 15.6C11.1 18.1 13.1 20.1 15.6 20.1C18.1 20.1 20.1 18.1 20.1 15.6C20.1 13.1 18.1 11.1 15.6 11.1Z" fill="#3C4E5F"/>
<path d="M15.6 11.1C13.1 11.1 11.1 13.1 11.1 15.6C11.1 18.1 13.1 20.1 15.6 20.1C18.1 20.1 20.1 18.1 20.1 15.6C20.1 13.1 18.1 11.1 15.6 11.1Z" fill="#3C4E5F"/>
<path d="M15.6 21.4C12.4 21.4 9.7 18.8 9.7 15.5C9.7 12.3 12.3 9.60001 15.6 9.60001C18.8 9.60001 21.5 12.2 21.5 15.5C21.4 18.8 18.8 21.4 15.6 21.4ZM15.6 11.1C13.1 11.1 11.1 13.1 11.1 15.6C11.1 18.1 13.1 20.1 15.6 20.1C18.1 20.1 20.1 18.1 20.1 15.6C20.1 13.1 18.1 11.1 15.6 11.1Z" stroke="#3C4E5F" stroke-width="0.25"/>
<path d="M15.6 11.1C13.1 11.1 11.1 13.1 11.1 15.6C11.1 18.1 13.1 20.1 15.6 20.1C18.1 20.1 20.1 18.1 20.1 15.6C20.1 13.1 18.1 11.1 15.6 11.1Z" stroke="#3C4E5F" stroke-width="0.25"/>
<path d="M12.7 26.5V26.4H12.6C11.7 26.2 10.9 25.8 10.1 25.4L10 25.2L9.9 25.3L6.8 27.2C6.5 27.4 6.2 27.3 5.9 27.1L4 25.2C3.8 25 3.7 24.6 3.9 24.3L5.8 21.2L5.9 21.1L5.8 21C5.4 20.2 5 19.4 4.8 18.5V18.4H4.7L1.2 17.6C0.899997 17.5 0.699997 17.3 0.699997 16.9V14.2C0.699997 13.9 0.899997 13.6 1.2 13.5L4.7 12.7H4.8V12.6C5 11.7 5.4 10.9 5.8 10.1L5.9 10L5.8 9.80001L3.9 6.80001C3.7 6.50001 3.8 6.20001 4 5.90001L5.9 4.00001C6.1 3.80001 6.5 3.70001 6.8 3.90001L9.9 5.80001L10 5.90001L10.1 5.80001C10.9 5.40001 11.7 5.00001 12.6 4.80001H12.7V4.70001L13.5 1.20001C13.6 0.900012 13.8 0.700012 14.2 0.700012H17C17.3 0.700012 17.6 0.900012 17.7 1.20001L18.5 4.70001V4.80001H18.6C19.5 5.00001 20.3 5.40001 21.1 5.80001L21.2 5.90001L21.3 5.80001L24.4 3.90001C24.6 3.70001 25 3.80001 25.2 4.00001L27.1 5.90001C27.3 6.10001 27.4 6.50001 27.2 6.80001L25.3 9.90001L25.2 10L25.3 10.1C25.7 10.9 26.1 11.7 26.3 12.6V12.7H26.4L29.9 13.5C30.2 13.6 30.4 13.8 30.4 14.2V16.9C30.4 17.2 30.2 17.5 29.9 17.6L26.4 18.4H26.3V18.5C26.1 19.4 25.7 20.2 25.3 21L25.2 21.1L25.3 21.2L27.2 24.3C27.4 24.6 27.3 24.9 27.1 25.2L25.2 27.1C25 27.3 24.6 27.4 24.3 27.2L21.2 25.3L21.1 25.2L21 25.3C20.2 25.7 19.4 26.1 18.5 26.3H18.4V26.4L17.6 30C17.5 30.3 17.3 30.5 16.9 30.5H14.2C13.9 30.5 13.6 30.3 13.5 30L12.7 26.5Z" stroke="#3C4E5F" stroke-width="0.25"/>
<path d="M27.6 43.6V43.9H27.9H50.7H51V43.6V41.6C51 41.2 51.3 40.9 51.7 40.9C52.1 40.9 52.4 41.2 52.4 41.6V44.6C52.4 45 52.1 45.3 51.7 45.3H26.9C26.5 45.3 26.2 45 26.2 44.6V41.6C26.2 41.2 26.5 40.9 26.9 40.9C27.3 40.9 27.6 41.2 27.6 41.6V43.6V43.6Z" fill="#3C4E5F" stroke="#3C4E5F" stroke-width="0.5"/>
<path d="M59.7 21.1H38.3C37.9 21.1 37.6 20.8 37.6 20.4C37.6 20 37.9 19.7 38.3 19.7H59.7C60.1 19.7 60.4 20 60.4 20.4C60.4 20.8 60.1 21.1 59.7 21.1Z" fill="#3C4E5F"/>
<path d="M59.7 26.5H47.7C47.3 26.5 47 26.2 47 25.8C47 25.4 47.3 25.1 47.7 25.1H59.8C60.2 25.1 60.5 25.4 60.5 25.8C60.4 26.2 60.1 26.5 59.7 26.5Z" fill="#3C4E5F"/>
<path d="M10.2 57.3H3.5C3.1 57.3 2.8 57 2.8 56.6C2.8 56.2 3.1 55.9 3.5 55.9H10.2C10.6 55.9 10.9 56.2 10.9 56.6C10.9 57 10.6 57.3 10.2 57.3Z" stroke="#3C4E5F" stroke-width="0.25" stroke-dasharray="0.49 0.49"/>
<path d="M10.2 53.3H3.5C3.1 53.3 2.8 53 2.8 52.6C2.8 52.2 3.1 51.9 3.5 51.9H10.2C10.6 51.9 10.9 52.2 10.9 52.6C10.9 52.9 10.6 53.3 10.2 53.3Z" stroke="#3C4E5F" stroke-width="0.25" stroke-dasharray="0.49 0.49"/>
<path d="M10.2 49.2H3.5C3.1 49.2 2.8 48.9 2.8 48.5C2.8 48.1 3.1 47.8 3.5 47.8H10.2C10.6 47.8 10.9 48.1 10.9 48.5C10.9 48.9 10.6 49.2 10.2 49.2Z" stroke="#3C4E5F" stroke-width="0.25" stroke-dasharray="0.49 0.49"/>
<path d="M10.2 45.2H3.5C3.1 45.2 2.8 44.9 2.8 44.5C2.8 44.1 3.1 43.8 3.5 43.8H10.2C10.6 43.8 10.9 44.1 10.9 44.5C10.9 44.9 10.6 45.2 10.2 45.2Z" stroke="#3C4E5F" stroke-width="0.25" stroke-dasharray="0.49 0.49"/>
<path d="M10.2 41.2H3.5C3.1 41.2 2.8 40.9 2.8 40.5C2.8 40.1 3.1 39.8 3.5 39.8H10.2C10.6 39.8 10.9 40.1 10.9 40.5C10.9 40.9 10.6 41.2 10.2 41.2Z" stroke="#3C4E5F" stroke-width="0.25" stroke-dasharray="0.49 0.49"/>
<path d="M27.7387 34.8647V33.9409L31.0742 33.9355V36.8574C30.5621 37.2656 30.034 37.5735 29.4897 37.7812C28.9454 37.9853 28.3868 38.0874 27.8139 38.0874C27.0405 38.0874 26.3369 37.9227 25.7031 37.5932C25.0729 37.2602 24.5966 36.7804 24.2744 36.1538C23.9521 35.5272 23.791 34.8271 23.791 34.0537C23.791 33.2874 23.9503 32.573 24.269 31.9106C24.5912 31.2446 25.0532 30.7505 25.6547 30.4282C26.2563 30.1059 26.9492 29.9448 27.7333 29.9448C28.3027 29.9448 28.8165 30.0379 29.2748 30.2241C29.7368 30.4067 30.0984 30.6627 30.3598 30.9922C30.6212 31.3216 30.8199 31.7513 30.956 32.2812L30.0161 32.539C29.8979 32.138 29.7511 31.8229 29.5756 31.5937C29.4002 31.3646 29.1495 31.1819 28.8237 31.0459C28.4978 30.9062 28.1362 30.8364 27.7387 30.8364C27.2625 30.8364 26.8507 30.9098 26.5034 31.0566C26.156 31.1998 25.8749 31.3896 25.6601 31.6259C25.4488 31.8623 25.2841 32.1219 25.166 32.4048C24.9654 32.8917 24.8652 33.4199 24.8652 33.9892C24.8652 34.6911 24.9851 35.2783 25.225 35.7509C25.4685 36.2236 25.8212 36.5745 26.2831 36.8037C26.7451 37.0328 27.2356 37.1474 27.7548 37.1474C28.206 37.1474 28.6464 37.0615 29.0761 36.8896C29.5058 36.7142 29.8316 36.528 30.0536 36.331V34.8647H27.7387ZM32.6157 37.9531V30.0791H35.3281C35.9404 30.0791 36.4077 30.1167 36.7299 30.1919C37.1811 30.2957 37.566 30.4837 37.8847 30.7558C38.3001 31.1067 38.6098 31.5561 38.8139 32.104C39.0216 32.6482 39.1254 33.2713 39.1254 33.9731C39.1254 34.5711 39.0556 35.101 38.916 35.563C38.7763 36.0249 38.5973 36.408 38.3788 36.7124C38.1604 37.0132 37.9205 37.2513 37.6591 37.4267C37.4013 37.5986 37.088 37.7293 36.7192 37.8188C36.3539 37.9083 35.9332 37.9531 35.457 37.9531H32.6157ZM33.6577 37.0239H35.3388C35.858 37.0239 36.2644 36.9756 36.558 36.8789C36.8552 36.7822 37.0916 36.6461 37.267 36.4707C37.5141 36.2236 37.7057 35.8924 37.8417 35.477C37.9814 35.0581 38.0512 34.5514 38.0512 33.957C38.0512 33.1334 37.9151 32.5014 37.643 32.061C37.3745 31.617 37.0468 31.3198 36.6601 31.1694C36.3808 31.062 35.9314 31.0083 35.312 31.0083H33.6577V37.0239ZM40.5649 37.9531V30.0791H43.5351C44.0579 30.0791 44.4571 30.1041 44.7328 30.1543C45.1196 30.2187 45.4436 30.3423 45.705 30.5249C45.9664 30.7039 46.1759 30.9563 46.3334 31.2822C46.4946 31.608 46.5751 31.9661 46.5751 32.3564C46.5751 33.026 46.3621 33.5936 45.936 34.0591C45.5099 34.521 44.74 34.7519 43.6264 34.7519H41.6069V37.9531H40.5649ZM41.6069 33.8227H43.6425C44.3157 33.8227 44.7937 33.6974 45.0766 33.4467C45.3595 33.1961 45.5009 32.8434 45.5009 32.3886C45.5009 32.0592 45.4168 31.7781 45.2485 31.5454C45.0838 31.3091 44.8653 31.1533 44.5932 31.0781C44.4177 31.0315 44.0937 31.0083 43.621 31.0083H41.6069V33.8227ZM47.9179 37.9531V30.0791H51.4091C52.1109 30.0791 52.6445 30.1507 53.0097 30.2939C53.3749 30.4336 53.6668 30.6824 53.8852 31.0405C54.1036 31.3986 54.2128 31.7942 54.2128 32.2275C54.2128 32.7861 54.032 33.257 53.6703 33.6401C53.3087 34.0232 52.7501 34.2667 51.9946 34.3706C52.2703 34.5031 52.4798 34.6338 52.623 34.7627C52.9273 35.042 53.2156 35.3911 53.4877 35.81L54.8574 37.9531H53.5468L52.5048 36.3149C52.2005 35.8423 51.9498 35.4806 51.7529 35.2299C51.5559 34.9793 51.3787 34.8038 51.2211 34.7036C51.0672 34.6033 50.9096 34.5335 50.7485 34.4941C50.6303 34.469 50.437 34.4565 50.1684 34.4565H48.9599V37.9531H47.9179ZM48.9599 33.5542H51.1996C51.6759 33.5542 52.0483 33.5058 52.3168 33.4091C52.5854 33.3089 52.7895 33.1513 52.9291 32.9365C53.0688 32.7181 53.1386 32.4817 53.1386 32.2275C53.1386 31.8551 53.0025 31.549 52.7304 31.3091C52.4619 31.0691 52.0357 30.9492 51.4521 30.9492H48.9599V33.5542Z" fill="#3C4E5F"/>
</g>
<defs>
<clipPath id="clip0">
<rect width="65.8" height="65.2" fill="white"/>
</clipPath>
</defs>
</svg>
