<svg width="64" height="65" viewBox="0 0 64 65" fill="none" xmlns="http://www.w3.org/2000/svg">
<g clip-path="url(#clip0)">
<path d="M62.2 0.600001C63 1 63.6 1.9 63.7 2.8H63.6V3V8.2V49.4C63.6 51 62.3 52.2 60.8 52.2H23.8H23.5V52.5V58.6C23.5 60.1 22.3 61.4 20.2 62.4C18.1 63.4 15.2 64 11.8 64C8.4 64 5.5 63.4 3.4 62.4C1.3 61.4 0.0999985 60.1 0.0999985 58.6V36.7C0.0999985 35.3 1.2 34 3.2 33C5.2 32 8 31.4 11.3 31.3H11.5V31.1V3C11.5 1.4 12.8 0.200001 14.3 0.200001H61C61.5 0.300001 61.9 0.300001 62.2 0.600001Z" stroke="#3C4E5F" stroke-width="0.5"/>
<path d="M61.6 1.9H61.5C61.4 1.9 61.4 1.9 61.3 1.9C61.2 1.9 61.1 1.8 61 1.8H14.5C13.7 1.8 13.2 2.4 13.2 3.1V7.3V7.6H13.5H62H62.3V7.2V3C62.2 2.5 62 2.1 61.6 1.9Z" stroke="#3C4E5F" stroke-width="0.5"/>
<path d="M2.3 39.8L1.9 39.5V40V44C1.9 44.5 2.2 45 2.7 45.4C3.2 45.8 3.9 46.3 4.8 46.6C6.6 47.3 9.1 47.9 12.2 47.9C15.3 47.9 17.8 47.4 19.6 46.6C20.5 46.2 21.2 45.8 21.7 45.4C22.2 45 22.5 44.5 22.5 44V40V39.5L22.1 39.8C20.1 41.3 16.5 42.2 12.3 42.2C7.8 42.2 4.3 41.3 2.3 39.8Z" stroke="#3C4E5F" stroke-width="0.25"/>
<path d="M2.2 46.9L1.8 46.6V47.1V51.7C1.8 52.2 2.1 52.7 2.6 53.1C3 53.6 3.7 54 4.6 54.4C6.4 55.1 8.9 55.7 12 55.7C15.1 55.7 17.6 55.2 19.4 54.4C20.3 54 21 53.6 21.5 53.2C22 52.8 22.3 52.3 22.3 51.8V47.2V46.7L21.9 47C19.9 48.5 16.3 49.4 12.1 49.4C7.7 49.3 4.2 48.4 2.2 46.9Z" stroke="#3C4E5F" stroke-width="0.25"/>
<path d="M13.3 31.1V31.3H13.5C16.5 31.5 19.1 32.1 20.9 33.1C22.7 34.1 23.7 35.3 23.7 36.7V50.4V50.7H24H36.8H37.1V50.4V9.2V9H36.8H13.5H13.2V9.3V31.1H13.3Z" stroke="#3C4E5F" stroke-width="0.5"/>
<path d="M2.2 54.9L1.8 54.6V55.1V58.6C1.8 59.1 2.1 59.6 2.6 60C3.1 60.4 3.8 60.9 4.7 61.2C6.5 61.9 9 62.5 12.1 62.5C15.2 62.5 17.8 62 19.5 61.2C20.4 60.8 21.1 60.4 21.5 60C22 59.6 22.2 59.1 22.2 58.6V55.1V54.6L21.8 54.9C19.8 56.4 16.2 57.3 12 57.3C7.7 57.2 4.2 56.3 2.2 54.9Z" stroke="#3C4E5F" stroke-width="0.25"/>
<path d="M38.5 50.5V50.8H38.8H61C61.6 50.8 62.3 50.3 62.3 49.5V9.2V9H62H38.7H38.4V9.3V50.5H38.5Z" stroke="#3C4E5F" stroke-width="0.5"/>
<path d="M22.1 36.7C22.1 36.2 21.8 35.7 21.3 35.3C20.8 34.9 20.1 34.4 19.2 34.1C17.4 33.4 14.9 32.8 11.8 32.8C8.7 32.8 6.2 33.3 4.4 34.1C3.5 34.5 2.8 34.9 2.3 35.3C1.8 35.7 1.5 36.2 1.5 36.7C1.5 37.2 1.8 37.7 2.3 38.1C3 38.5 3.7 39 4.6 39.3C6.4 40 8.9 40.6 12 40.6C15.1 40.6 17.6 40.1 19.4 39.3C20.3 38.9 21 38.5 21.5 38.1C21.8 37.7 22.1 37.2 22.1 36.7Z" stroke="#3C4E5F" stroke-width="0.25"/>
<path d="M58.4 5.1H35.6C35.2 5.1 34.8 4.9 34.8 4.6C34.8 4.5 34.9 4.3 35 4.3C35.1 4.2 35.3 4.2 35.6 4.2H58.4C58.6 4.2 58.8 4.2 59 4.3C59.1 4.4 59.2 4.5 59.2 4.6C59.2 4.7 59.1 4.9 59 4.9C58.8 5 58.6 5.1 58.4 5.1Z" fill="#3C4E5F"/>
<path d="M18.4 5.1H17.2C17 5.1 16.8 5.1 16.6 5C16.5 4.9 16.4 4.8 16.4 4.7C16.4 4.6 16.5 4.4 16.6 4.4C16.7 4.3 16.9 4.3 17.2 4.3H18.4C18.6 4.3 18.8 4.3 19 4.4C19.1 4.5 19.2 4.6 19.2 4.7C19.2 4.8 19.1 5 19 5C18.8 5 18.6 5.1 18.4 5.1Z" fill="#3C4E5F"/>
<path d="M23.1 5.1H21.9C21.7 5.1 21.5 5.1 21.3 5C21.2 4.9 21.1 4.8 21.1 4.7C21.1 4.6 21.2 4.4 21.3 4.4C21.4 4.3 21.6 4.3 21.9 4.3H23.1C23.3 4.3 23.5 4.3 23.7 4.4C23.8 4.5 23.9 4.6 23.9 4.7C23.9 4.8 23.8 5 23.7 5C23.5 5 23.3 5.1 23.1 5.1Z" fill="#3C4E5F"/>
<path d="M27.8 5.1H26.6C26.2 5.1 25.8 4.9 25.8 4.6C25.8 4.5 25.9 4.3 26 4.3C26.1 4.2 26.3 4.2 26.6 4.2H27.8C28 4.2 28.2 4.2 28.4 4.3C28.5 4.4 28.6 4.5 28.6 4.6C28.6 4.7 28.5 4.9 28.4 4.9C28.2 5 28 5.1 27.8 5.1Z" fill="#3C4E5F"/>
<path d="M52.7 16.8H53V16.5V14.5C53 14.3 53.1 14.1 53.2 13.9C53.3 13.8 53.5 13.7 53.8 13.7H58.4C58.9 13.7 59.2 14 59.2 14.4V20.4C59.2 20.6 59.1 20.8 59 21C58.9 21.1 58.7 21.2 58.4 21.2H53.8C53.6 21.2 53.4 21.1 53.2 21C53.1 20.9 53 20.7 53 20.4V18.4V18.1H52.7H51.1H50.8V18.4V28.8V29.1H51.1H52.7H53V28.8V26.8C53 26.6 53.1 26.4 53.2 26.2C53.3 26.1 53.5 26 53.8 26H58.4C58.6 26 58.8 26.1 59 26.2C59.1 26.3 59.2 26.5 59.2 26.8V32.8C59.2 33 59.1 33.2 59 33.4C58.9 33.5 58.7 33.6 58.4 33.6H53.8C53.6 33.6 53.4 33.5 53.2 33.4C53.1 33.3 53 33.1 53 32.8V30.8V30.5H52.7H51.1H50.8V30.8V41.1V41.4H51.1H52.7H53V41.1V39.1C53 38.9 53.1 38.7 53.2 38.5C53.3 38.4 53.5 38.3 53.8 38.3H58.4C58.6 38.3 58.8 38.4 59 38.5C59 38.8 59 39 59 39.2V45.2C59 45.4 58.9 45.6 58.8 45.8C58.7 45.9 58.5 46 58.2 46H53.6C53.4 46 53.2 45.9 53 45.8C52.9 45.7 52.8 45.5 52.8 45.2V43.2V43H52.5H49.9C49.7 43 49.5 42.9 49.3 42.8C49.2 42.7 49.1 42.5 49.1 42.2V30.9V30.6H48.8H47.2H46.9V30.9V32.9C46.9 33.1 46.8 33.3 46.7 33.5C46.6 33.6 46.4 33.7 46.1 33.7H41.5C41.3 33.7 41.1 33.6 40.9 33.5C40.8 33.4 40.7 33.2 40.7 32.9V26.9C40.7 26.7 40.8 26.5 40.9 26.3C41 26.2 41.2 26.1 41.5 26.1H46.1C46.3 26.1 46.5 26.2 46.7 26.3C46.8 26.4 46.9 26.6 46.9 26.9V28.9V29.2H47.2H48.8H49.1V28.9V17.6C49.1 17.4 49.2 17.2 49.3 17C49.4 16.9 49.6 16.8 49.9 16.8H52.7ZM45.3 32.1H45.6V31.8V27.8V27.5H45.3H42.7H42.4V27.8V31.8V32.1H42.7H45.3ZM54.7 40H54.4V40.3V44.3V44.6H54.7H57.3H57.6V44.3V40.3V40H57.3H54.7ZM54.7 27.6H54.4V27.9V31.9V32.2H54.7H57.3H57.6V31.9V27.9V27.6H57.3H54.7ZM57.3 19.7H57.6V19.4V15.4V15.1H57.3H54.7H54.4V15.4V19.4V19.7H54.7H57.3Z" fill="#3C4E5F" stroke="#3C4E5F" stroke-width="0.25"/>
<path d="M33.4 15.3H16.9C16.7 15.3 16.5 15.2 16.4 15.1C16.3 15 16.2 14.8 16.2 14.6C16.2 14.4 16.3 14.2 16.4 14C16.5 13.9 16.7 13.8 17 13.8H33.6C33.8 13.8 34 13.9 34.2 14C34.3 14.1 34.4 14.3 34.4 14.6C34.4 14.8 34.3 15 34.2 15.2C33.8 15.2 33.6 15.3 33.4 15.3Z" stroke="#3C4E5F" stroke-width="0.5" stroke-dasharray="0.5 0.5"/>
<path d="M16.9 20.3H33.5C33.9 20.3 34.3 20.6 34.3 21.1C34.3 21.3 34.2 21.5 34.1 21.7C34 21.8 33.8 21.9 33.5 21.9H16.9C16.7 21.9 16.5 21.8 16.3 21.7C16.2 21.6 16.1 21.4 16.1 21.1C16.1 20.8 16.2 20.7 16.3 20.5C16.4 20.4 16.6 20.3 16.9 20.3Z" stroke="#3C4E5F" stroke-width="0.5" stroke-dasharray="0.5 0.5"/>
<path d="M16.9 26.8H33.5C33.9 26.8 34.3 27.1 34.3 27.6C34.3 27.8 34.2 28 34.1 28.2C34 28.3 33.8 28.4 33.5 28.4H16.9C16.7 28.4 16.5 28.3 16.3 28.2C16.2 28.1 16.1 27.9 16.1 27.6C16.1 27.3 16.2 27.2 16.3 27C16.4 26.9 16.6 26.8 16.9 26.8Z" stroke="#3C4E5F" stroke-width="0.5" stroke-dasharray="0.5 0.5"/>
</g>
<defs>
<clipPath id="clip0">
<rect width="64" height="65" fill="white"/>
</clipPath>
</defs>
</svg>
