#############
Alerting APIs
#############


.. raw:: html

	<ul>
<li>
<ac:link>
<ri:page ri:content-title="Alerting" ri:version-at-save="37"></ri:page>
<ac:link-body><strong>Alerting</strong></ac:link-body>
</ac:link></li>
</ul>

.. toctree::
