^C:\USERS\NAZAR\DESKTOP\ELEKS\С++\TASKSCHEDULER\TASKSCHEDULER\STDAFX.CPP
/c /ZI /nologo /W3 /WX- /diagnostics:classic /Od /Oy- /D WIN32 /D _DEBUG /D _CONSOLE /D _UNICODE /D UNICODE /Gm /EHsc /RTC1 /MDd /GS /fp:precise /Zc:wchar_t /Zc:forScope /Zc:inline /Yc"stdafx.h" /Fp"DEBUG\TASKSCHEDULER.PCH" /Fo"DEBUG\\" /Fd"DEBUG\VC141.PDB" /Gd /TP /analyze- C:\USERS\NAZAR\DESKTOP\ELEKS\С++\TASKSCHEDULER\TASKSCHEDULER\STDAFX.CPP
^C:\USERS\NAZAR\DESKTOP\ELEKS\С++\TASKSCHEDULER\TASKSCHEDULER\TASKSCHEDULER.CPP
/c /ZI /nologo /W3 /WX- /diagnostics:classic /Od /Oy- /D WIN32 /D _DEBUG /D _CONSOLE /D _UNICODE /D UNICODE /Gm /EHsc /RTC1 /MDd /GS /fp:precise /Zc:wchar_t /Zc:forScope /Zc:inline /Yu"stdafx.h" /Fp"DEBUG\TASKSCHEDULER.PCH" /Fo"DEBUG\\" /Fd"DEBUG\VC141.PDB" /Gd /TP /analyze- C:\USERS\NAZAR\DESKTOP\ELEKS\С++\TASKSCHEDULER\TASKSCHEDULER\TASKSCHEDULER.CPP
^E:\ELEKS\С++\TASKSCHEDULER\TASKSCHEDULER\STDAFX.CPP
/c /ZI /nologo /W3 /WX- /diagnostics:classic /Od /Oy- /D WIN32 /D _DEBUG /D _CONSOLE /D _UNICODE /D UNICODE /Gm /EHsc /RTC1 /MDd /GS /fp:precise /Zc:wchar_t /Zc:forScope /Zc:inline /Yc"stdafx.h" /Fp"DEBUG\TASKSCHEDULER.PCH" /Fo"DEBUG\\" /Fd"DEBUG\VC141.PDB" /Gd /TP /analyze- E:\ELEKS\С++\TASKSCHEDULER\TASKSCHEDULER\STDAFX.CPP
^E:\ELEKS\С++\TASKSCHEDULER\TASKSCHEDULER\TASKSCHEDULER.CPP
/c /ZI /nologo /W3 /WX- /diagnostics:classic /Od /Oy- /D WIN32 /D _DEBUG /D _CONSOLE /D _UNICODE /D UNICODE /Gm /EHsc /RTC1 /MDd /GS /fp:precise /Zc:wchar_t /Zc:forScope /Zc:inline /Yu"stdafx.h" /Fp"DEBUG\TASKSCHEDULER.PCH" /Fo"DEBUG\\" /Fd"DEBUG\VC141.PDB" /Gd /TP /analyze- E:\ELEKS\С++\TASKSCHEDULER\TASKSCHEDULER\TASKSCHEDULER.CPP
^C:\USERS\НАЗАР\DOCUMENTS\GITHUB\XAMARIN_FORMS_MESSAGER\TASKSCHEDULER\TASKSCHEDULER\STDAFX.CPP
/c /ZI /nologo /W3 /WX- /diagnostics:classic /Od /Oy- /D WIN32 /D _DEBUG /D _CONSOLE /D _UNICODE /D UNICODE /Gm- /EHsc /RTC1 /MDd /GS /fp:precise /Zc:wchar_t /Zc:forScope /Zc:inline /Yc"stdafx.h" /Fp"DEBUG\TASKSCHEDULER.PCH" /Fo"DEBUG\\" /Fd"DEBUG\VC141.PDB" /Gd /TP /analyze- /FC C:\USERS\НАЗАР\DOCUMENTS\GITHUB\XAMARIN_FORMS_MESSAGER\TASKSCHEDULER\TASKSCHEDULER\STDAFX.CPP
^C:\USERS\НАЗАР\DOCUMENTS\GITHUB\XAMARIN_FORMS_MESSAGER\TASKSCHEDULER\TASKSCHEDULER\TASKSCHEDULER.CPP
/c /ZI /nologo /W3 /WX- /diagnostics:classic /Od /Oy- /D WIN32 /D _DEBUG /D _CONSOLE /D _UNICODE /D UNICODE /Gm- /EHsc /RTC1 /MDd /GS /fp:precise /Zc:wchar_t /Zc:forScope /Zc:inline /Yu"stdafx.h" /Fp"DEBUG\TASKSCHEDULER.PCH" /Fo"DEBUG\\" /Fd"DEBUG\VC141.PDB" /Gd /TP /analyze- /FC C:\USERS\НАЗАР\DOCUMENTS\GITHUB\XAMARIN_FORMS_MESSAGER\TASKSCHEDULER\TASKSCHEDULER\TASKSCHEDULER.CPP
