<svg data-social='vk' xmlns="http://www.w3.org/2000/svg" viewBox="0 0 55.8 55.8">
	<circle class="st5" cx="27.9" cy="27.9" r="27.9"/>
	<path class="st6" d="M44.01,20.31c-0.45-0.38-2.2-0.37-3.93-0.36c-1.77,0.01-3.52,0.02-3.93,0.18c-0.37,0.15-1.22,2.18-2.32,4.28c-1.24,2.37-2.78,4.66-3.75,4.64c-1.26-0.02-0.97-3.92-0.89-6.78c0.05-1.9-0.26-2.49-0.54-2.68c-0.67-0.45-2.5-0.89-2.5-0.89s-5.46-0.41-6.25,1.96c1.04,0.14,2.83-0.2,2.14,7.14c-0.03,0.36-0.84,3.38-3.39-0.71c-0.63-1.01-3.08-7.12-3.92-7.14c-2.83-0.08-5.61-0.19-6.6,0.36c-0.9,0.5,1.22,4.72,4.82,10.35c2.94,4.6,6.05,8.2,11.42,9.1c1,0.1,3.65,0.22,4.46-0.18c0.57-0.28-0.12-4.27,1.78-4.64c0.86-0.17,4.11,4.15,5.35,4.64c0.75,0.3,2.41,0.41,4.1,0.36c1.83-0.06,3.9,0.16,4.1-1.07c0.45-2.75-5.53-6.33-5.71-8.03c-0.13-1.22,2.19-3.47,3.39-5.18C43.34,23.59,44.93,21.09,44.01,20.31z"/>
</svg>
