11,0B,A7,00,00,00,12,9C,
11,0B,DB,00,00,00,12,9C,
11,0B,95,00,00,00,12,9C,
11,0B,C8,00,00,00,12,9C,
11,0B,AA,00,00,00,12,9C,
11,0B,9A,00,00,00,12,9C,
11,0B,90,00,00,00,12,9C,
11,0B,8E,00,00,00,12,9C,
11,0B,85,00,00,00,12,9C,
11,0B,86,00,00,00,12,9C,
11,0B,C1,00,00,00,12,9C,
11,0B,E8,00,00,00,12,9C,
11,0B,E9,00,00,00,12,9C,
11,0B,A8,00,00,00,12,9C,
11,0C,04,00,00,00,12,9C,
11,0C,08,00,00,00,12,9C,
11,0B,D1,00,00,00,12,9C,
11,0B,EE,00,00,00,12,9C,
11,0B,BF,00,00,00,12,9C,
11,0B,CB,00,00,00,12,9C,
11,0B,DC,00,00,00,12,9C,
11,0B,DA,00,00,00,12,9C,
11,0C,28,00,00,00,12,9C,
11,0B,F3,00,00,00,12,9C,
11,0B,F8,00,00,00,12,9C,
11,0C,2B,00,00,00,12,9C,
11,0B,E1,00,00,00,12,9C,
11,0B,F2,00,00,00,12,9C,
11,0C,18,00,00,00,12,9C,
11,0B,F0,00,00,00,12,9C,
11,0C,15,00,00,00,12,9C,
11,0B,F2,00,00,00,12,9C,
11,0B,C8,00,00,00,12,9C,
11,0B,F0,00,00,00,12,9C,
11,0C,0B,00,00,00,12,9C,
11,0C,10,00,00,00,12,9C,
11,0B,F7,00,00,00,12,9C,
11,0B,F8,00,00,00,12,9C,
11,0B,D8,00,00,00,12,9C,
11,0C,0D,00,00,00,12,9C,
11,0B,FA,00,00,00,12,9C,
11,0B,F3,00,00,00,12,9C,
11,0B,D5,00,00,00,12,9C,
11,0B,E6,00,00,00,12,9C,
11,0C,08,00,00,00,12,9C,
11,0B,EC,00,00,00,12,9C,
11,0C,14,00,00,00,12,9C,
11,0C,3F,00,00,00,12,9C,
11,0C,23,00,00,00,12,9C,
11,0C,2A,00,00,00,12,9C,
11,0C,3C,00,00,00,12,9D,
11,0C,1D,00,00,00,12,9E,
11,0C,65,00,00,00,12,9F,
11,0C,7C,00,00,00,12,A0,
11,0C,35,00,00,00,12,A1,
11,0C,4A,00,00,00,12,A1,
11,0C,73,00,00,00,12,A1,
11,0C,59,00,00,00,12,A1,
11,0C,65,00,00,00,12,A1,
11,0C,75,00,00,00,12,A1,
11,0C,3A,00,00,00,12,A1,
11,0C,47,00,00,00,12,A1,
11,0C,23,00,00,00,12,A1,
11,0B,DD,00,00,00,12,A1,
11,0B,FA,00,00,00,12,A1,
11,0C,10,00,00,00,12,A1,
11,0B,AB,00,00,00,12,A1,
11,0B,CD,00,00,00,12,A1,
11,0B,EF,00,00,00,12,A1,
11,0B,C4,00,00,00,12,A1,
11,0B,E2,00,00,00,12,A1,
11,0B,B3,00,00,00,12,A1,
11,0B,C4,00,00,00,12,A1,
11,0B,D2,00,00,00,12,A1,
11,0B,B1,00,00,00,12,A1,
11,0B,97,00,00,00,12,A1,
11,0B,9A,00,00,00,12,A1,
11,0B,81,00,00,00,12,A1,
11,0B,90,00,00,00,12,A1,
11,0B,98,00,00,00,12,A1,
11,0B,93,00,00,00,12,A1,
11,0B,95,00,00,00,12,A1,
11,0B,7E,00,00,00,12,A1,
11,0B,88,00,00,00,12,A1,
11,0B,79,00,00,00,12,A1,
11,0B,8A,00,00,00,12,A1,
11,0B,88,00,00,00,12,A1,
11,0B,72,00,00,00,12,A1,
11,0B,68,00,00,00,12,A1,
11,0B,80,00,00,00,12,A1,
11,0B,8E,00,00,00,12,A1,
11,0B,A4,00,00,00,12,A1,
11,0B,7C,00,00,00,12,A1,
11,0B,A6,00,00,00,12,A1,
11,0B,B8,00,00,00,12,A1,
11,0B,A9,00,00,00,12,A1,
11,0B,D3,00,00,00,12,A1,
11,0B,7D,00,00,00,12,A1,
11,0B,BB,00,00,00,12,A1,
11,0B,C1,00,00,00,12,A1,
11,0B,99,00,00,00,12,A1,
11,0B,BB,00,00,00,12,A1,
11,0B,91,00,00,00,12,A1,
11,0B,A3,00,00,00,12,A1,
11,0B,D8,00,00,00,12,A1,
11,0B,C2,00,00,00,12,A1,
11,0B,D4,00,00,00,12,A1,
11,0B,B0,00,00,00,12,A1,
11,0B,ED,00,00,00,12,A1,
11,0C,08,00,00,00,12,A1,
11,0B,D5,00,00,00,12,A1,
11,0B,FA,00,00,00,12,A1,
11,0C,11,00,00,00,12,A1,
11,0C,04,00,00,00,12,A1,
11,0B,D5,00,00,00,12,A1,
11,0B,F6,00,00,00,12,A1,
11,0B,57,00,00,00,12,A1,
11,0B,AD,00,00,00,12,A1,
11,0B,B6,00,00,00,12,A1,
11,0B,96,00,00,00,12,A1,
11,0B,C7,00,00,00,12,A1,
11,0B,D0,00,00,00,12,A1,
11,0B,E9,00,00,00,12,A1,
11,0C,06,00,00,00,12,A1,
11,0B,DA,00,00,00,12,A1,
21,0B,DC,00,00,00,12,A2,
21,0B,F0,00,00,00,12,A2,
21,0C,2A,00,00,00,12,A2,
21,0D,60,00,00,00,12,A2,
21,10,94,00,00,00,12,A2,
21,14,19,00,00,00,12,A3,
21,16,E1,00,00,8D,12,A4,
21,18,6A,00,00,FE,12,A7,
21,18,DE,00,01,6E,12,AA,
21,18,FC,00,01,EA,12,B0,
21,19,12,00,02,5F,12,B7,
21,19,3C,00,02,D3,12,C1,
21,19,AA,00,03,3D,12,CA,
21,1B,2D,00,03,A0,12,D7,
21,1C,A7,00,04,05,12,E3,
21,1E,54,00,04,72,12,F1,
21,1F,9F,00,04,E5,13,01,
21,20,7B,00,05,5B,13,11,
21,21,32,00,05,D4,13,24,
21,21,B6,00,06,52,13,3A,
21,1F,9F,00,06,CB,13,50,
21,1C,9F,00,07,31,13,68,
21,19,60,00,07,79,13,82,
21,18,62,00,07,9A,13,9D,
21,17,FE,00,07,B9,13,B8,
21,17,0F,00,07,C2,13,D3,
21,16,02,00,07,C6,13,EE,
21,14,87,00,07,CC,14,09,
21,12,D7,00,07,D9,14,24,
21,11,00,00,07,DB,14,3F,
21,0F,99,00,07,DE,14,5A,
21,0E,32,00,07,E1,14,75,
21,0D,94,00,07,DB,14,91,
21,0C,E5,00,07,D7,14,AC,
21,0C,67,00,07,C0,14,C7,
21,0C,1D,00,07,A7,14,E1,
21,0C,4A,00,07,93,14,FC,
21,0C,3F,00,07,8D,15,15,
21,0C,16,00,07,7A,15,2F,
21,0C,4D,00,07,71,15,49,
21,0C,91,00,07,67,15,62,
21,0C,C3,00,07,61,15,7C,
21,0C,D3,00,07,5D,15,94,
21,0C,F0,00,07,59,15,AE,
21,0D,00,00,07,5B,15,C6,
21,0C,FA,00,07,61,15,E0,
21,0C,B3,00,07,65,15,F8,
21,0C,C3,00,07,69,16,11,
21,0C,D7,00,07,66,16,29,
21,0C,AA,00,07,64,16,41,
21,0C,C9,00,07,4F,16,5A,
21,0C,F5,00,07,4A,16,72,
21,0D,09,00,07,4F,16,8A,
21,0D,FA,00,07,48,16,A1,
21,13,DB,00,07,46,16,BA,
21,19,15,00,07,62,16,D1,
21,1D,E1,00,07,79,16,E8,
21,1E,FC,00,07,B4,17,00,
21,1D,C9,00,07,EA,17,18,
21,1C,3D,00,08,34,17,32,
21,1A,C1,00,08,7B,17,4E,
21,19,04,00,08,BB,17,6B,
21,16,B3,00,08,D6,17,87,
21,14,34,00,08,E7,17,A5,
21,12,2E,00,08,E6,17,C2,
21,11,4C,00,08,E0,17,E0,
21,0F,ED,00,08,C3,17,FE,
21,0F,97,00,08,B3,18,1B,
21,0E,A2,00,08,9A,18,39,
21,0E,34,00,08,75,18,57,
21,0E,58,00,08,5C,18,73,
21,0D,95,00,08,3C,18,91,
21,0D,40,00,08,21,18,AD,
21,0D,21,00,08,0C,18,C8,
21,0C,E5,00,07,FD,18,E4,
21,0D,0B,00,07,EA,18,FF,
21,0D,1C,00,07,D4,19,1A,
21,0C,FD,00,07,B1,19,35,
21,0C,E7,00,07,88,19,50,
21,0C,E8,00,07,5D,19,6A,
21,0C,FD,00,07,20,19,84,
21,0D,08,00,06,E6,19,9B,
21,0C,C3,00,06,A6,19,B3,
21,0C,EA,00,06,62,19,C9,
21,0C,BB,00,06,11,19,DE,
21,0C,5D,00,05,C2,19,F3,
21,0B,E9,00,05,76,1A,06,
21,0B,A1,00,05,1F,1A,19,
21,0B,4E,00,04,C9,1A,29,
21,0A,C2,00,04,75,1A,38,
21,0A,92,00,04,23,1A,47,
21,0A,7B,00,03,CC,1A,55,
21,0A,05,00,03,76,1A,60,
11,0A,0A,00,03,25,1A,6B,
11,09,DB,00,02,DA,1A,74,
11,0A,37,00,02,A2,1A,7E,
11,0A,AD,00,02,71,1A,85,
11,0B,AF,00,02,51,1A,8C,
11,0C,57,00,02,38,1A,93,
11,0C,93,00,02,2C,1A,9A,
11,0C,8D,00,02,22,1A,A1,
11,0C,85,00,02,22,1A,A8,
11,0C,47,00,02,1E,1A,AE,
11,0C,1D,00,02,1C,1A,B5,
11,0B,FA,00,02,18,1A,BC,
11,0B,DD,00,02,16,1A,C1,
11,0B,DE,00,02,11,1A,C8,
11,0B,D5,00,02,0E,1A,CF,
11,0B,C3,00,02,09,1A,D5,
11,0B,CA,00,01,FE,1A,DC,
11,0B,BA,00,01,EE,1A,E2,
11,0B,B3,00,01,D4,1A,E7,
11,0B,B8,00,01,B5,1A,ED,
11,0B,A0,00,01,8E,1A,F1,
11,0B,B0,00,01,66,1A,F6,
11,0B,84,00,01,42,1A,F9,
11,0B,7D,00,01,1F,1A,FD,
11,0B,8F,00,00,FE,1A,FF,
11,0B,7D,00,00,DA,1B,00,
11,0B,77,00,00,C1,1B,02,
11,0B,5D,00,00,B0,1B,04,
11,0B,41,00,00,A4,1B,05,
11,0B,54,00,00,00,1B,06,
11,0B,66,00,00,00,1B,07,
11,0B,90,00,00,00,1B,08,
11,0B,91,00,00,00,1B,08,
11,0B,74,00,00,00,1B,08,
11,0B,88,00,00,00,1B,09,
11,0B,63,00,00,00,1B,09,
11,0B,61,00,00,00,1B,09,
11,0B,88,00,00,00,1B,09,
11,0B,71,00,00,00,1B,09,
11,0B,89,00,00,00,1B,0A,
11,0B,82,00,00,00,1B,0A,
11,0B,6C,00,00,00,1B,0A,
11,0B,A7,00,00,00,1B,0A,
11,0B,B4,00,00,00,1B,0A,
11,0B,B2,00,00,00,1B,0A,
11,0B,A7,00,00,00,1B,0A,
11,0B,A4,00,00,00,1B,0A,
11,0B,BA,00,00,00,1B,0A,
11,0B,99,00,00,00,1B,0A,
11,0B,94,00,00,00,1B,0A,
11,0B,8C,00,00,00,1B,0A,
11,0B,6D,00,00,00,1B,0B,
11,0B,7F,00,00,00,1B,0B,
11,0B,BF,00,00,00,1B,0B,
11,0B,B9,00,00,00,1B,0B,
21,0B,C2,00,00,00,1B,0C,
21,0B,CF,00,00,00,1B,0C,
21,0C,7A,00,00,00,1B,0C,
21,10,62,00,00,00,1B,0D,
21,15,52,00,00,73,1B,0E,
21,1A,2E,00,00,BD,1B,10,
21,1C,09,00,01,2C,1B,13,
21,1C,40,00,01,B2,1B,17,
21,1B,75,00,02,4F,1B,1D,
21,1A,B1,00,02,D9,1B,25,
21,1A,40,00,03,54,1B,30,
21,1A,10,00,03,C5,1B,3D,
21,19,DB,00,04,29,1B,49,
21,19,AD,00,04,7D,1B,58,
21,19,BE,00,04,CB,1B,68,
21,19,DE,00,05,17,1B,79,
21,19,F6,00,05,59,1B,8A,
21,1A,0D,00,05,92,1B,9C,
21,1A,71,00,05,CC,1B,B0,
21,1A,B1,00,06,08,1B,C5,
21,1B,0D,00,06,3C,1B,D9,
21,1B,4D,00,06,78,1B,EF,
21,1B,82,00,06,B1,1C,06,
21,1B,C5,00,06,DD,1C,1D,
21,1C,09,00,07,10,1C,35,
21,1C,3D,00,07,3F,1C,4D,
21,1C,9F,00,07,6C,1C,67,
21,1D,4F,00,07,8C,1C,81,
21,1D,90,00,07,BD,1C,9A,
21,1D,14,00,07,F1,1C,B5,
21,1C,55,00,08,26,1C,D2,
21,1B,7B,00,08,64,1C,EE,
21,1A,ED,00,08,95,1D,0C,
21,1A,B4,00,08,C7,1D,29,
21,1A,86,00,08,EE,1D,48,
21,1A,2E,00,09,1B,1D,67,
21,18,9B,00,09,41,1D,88,
21,17,1F,00,09,62,1D,A8,
21,15,52,00,09,7B,1D,C8,
21,14,06,00,09,8C,1D,EA,
21,13,2C,00,09,8B,1E,0C,
21,12,7B,00,09,8A,1E,2C,
21,11,AE,00,09,86,1E,4E,
21,10,EB,00,09,7A,1E,6F,
21,10,B0,00,09,6D,1E,90,
21,10,4B,00,09,58,1E,B1,
21,0F,C2,00,09,40,1E,D2,
21,0F,54,00,09,34,1E,F2,
21,0E,D9,00,09,1D,1F,11,
21,0E,4F,00,09,07,1F,31,
21,0E,20,00,09,02,1F,50,
21,0E,0D,00,08,EA,1F,6F,
21,0D,C6,00,08,E5,1F,8E,
21,0D,AF,00,08,C4,1F,AD,
21,0D,51,00,08,B9,1F,CB,
21,0D,4C,00,08,A9,1F,EA,
21,0D,3D,00,08,8D,20,08,
21,0D,8F,00,08,7F,20,25,
21,0D,65,00,08,73,20,43,
21,0D,5C,00,08,62,20,61,
21,0D,9D,00,08,52,20,7D,
21,0D,DB,00,08,40,20,99,
21,0E,57,00,08,32,20,B7,
21,0E,7F,00,08,26,20,D3,
21,0E,C6,00,08,15,20,EE,
21,0E,E0,00,08,0B,21,0B,
21,0E,E0,00,07,FD,21,27,
21,0E,9B,00,07,F4,21,42,
21,0E,CA,00,07,E7,21,5E,
21,10,EE,00,07,DA,21,79,
21,18,C9,00,07,D1,21,94,
21,1E,08,00,07,E5,21,AF,
21,20,8D,00,08,19,21,CA,
21,21,45,00,08,58,21,E7,
21,20,C0,00,08,A9,22,03,
21,1F,F2,00,08,FE,22,22,
21,1E,D2,00,09,53,22,41,
21,1B,E0,00,09,97,22,63,
21,19,02,00,09,CB,22,84,
21,16,84,00,09,F5,22,A7,
21,14,FE,00,0A,0A,22,C9,
21,13,E7,00,0A,18,22,ED,
21,13,2F,00,0A,1F,23,10,
21,12,2C,00,0A,22,23,33,
21,11,79,00,0A,12,23,56,
21,10,87,00,09,FC,23,7B,
21,10,29,00,09,D3,23,9C,
21,0F,4D,00,09,83,23,BF,
21,0E,A7,00,09,1D,23,E0,
21,0D,91,00,08,A4,23,FF,
21,0D,0D,00,08,20,24,1C,
21,0C,12,00,07,9B,24,37,
21,0B,93,00,07,29,24,51,
21,0B,2B,00,06,E7,24,69,
21,0B,26,00,06,C1,24,80,
21,0A,C6,00,06,B5,24,97,
21,0A,91,00,06,B7,24,AE,
21,0A,B4,00,06,B6,24,C4,
21,0A,EF,00,06,B7,24,DB,
21,0A,EA,00,06,B3,24,F2,
21,0B,AE,00,06,A2,25,08,
21,0C,D1,00,06,96,25,1D,
21,0F,E8,00,06,8B,25,33,
21,11,D3,00,06,92,25,49,
21,14,8D,00,06,8A,25,5D,
21,15,A9,00,06,8B,25,73,
21,16,13,00,06,92,25,87,
21,16,45,00,06,B7,25,9D,
21,17,66,00,06,C0,25,B2,
21,19,ED,00,06,CE,25,C8,
21,1C,71,00,06,E4,25,DE,
21,1E,1C,00,07,05,25,F5,
21,1F,4D,00,07,3C,26,0A,
21,1F,C2,00,07,7F,26,21,
21,20,3A,00,07,C9,26,3B,
21,21,AC,00,07,FD,26,53,
21,23,E1,00,08,43,26,6E,
21,25,46,00,08,83,26,89,
21,26,79,00,08,E1,26,A6,
21,27,3F,00,09,38,26,C3,
21,27,75,00,09,9A,26,E2,
21,27,AB,00,09,FB,27,04,
21,27,9E,00,0A,5D,27,26,
21,27,B9,00,0A,BC,27,4A,
21,27,DC,00,0B,23,27,70,
21,27,F8,00,0B,9C,27,97,
21,28,22,00,0C,02,27,BF,
21,28,69,00,0C,73,27,E9,
21,28,A2,00,0C,DE,28,15,
21,28,C6,00,0D,46,28,43,
21,29,08,00,0D,B0,28,72,
21,29,52,00,0E,18,28,A2,
21,29,8E,00,0E,79,28,D4,
21,29,EA,00,0E,E8,29,07,
21,2A,1F,00,0F,63,29,3B,
21,2A,4E,00,0F,CE,29,72,
21,2A,6D,00,10,30,29,A9,
21,2A,DD,00,10,7E,29,E3,
21,2A,FD,00,10,CA,2A,1C,
21,2B,56,00,11,21,2A,57,
21,2B,A1,00,11,6C,2A,95,
21,2B,E4,00,11,C8,2A,D3,
21,2C,39,00,12,22,2B,12,
21,2C,86,00,12,6E,2B,51,
21,2D,1B,00,12,C6,2B,92,
21,2D,59,00,13,02,2B,D4,
21,2D,D9,00,13,4C,2C,17,
21,2E,3F,00,13,A0,2C,5B,
21,2E,BA,00,13,EB,2C,A1,
21,2F,06,00,14,2D,2C,E7,
21,2F,23,00,14,69,2D,2F,
21,2D,90,00,14,AA,2D,77,
21,2B,0D,00,14,E6,2D,C0,
21,29,3C,00,15,24,2E,09,
21,28,0D,00,15,66,2E,54,
21,27,AB,00,15,BD,2E,9F,
21,27,AB,00,15,F3,2E,ED,
21,27,CE,00,16,38,2F,3B,
21,27,CE,00,16,83,2F,88,
21,27,EA,00,16,A1,2F,D9,
21,27,E3,00,16,DF,30,28,
21,28,05,00,17,1C,30,79,
21,28,14,00,17,56,30,CB,
21,28,29,00,17,79,31,1E,
21,28,53,00,17,AF,31,71,
21,27,A5,00,17,E9,31,C4,
21,26,6C,00,18,12,32,1A,
21,25,C1,00,18,43,32,6E,
21,24,FD,00,18,65,32,C5,
21,24,64,00,18,8C,33,1B,
21,23,EC,00,18,AD,33,72,
21,22,68,00,18,BA,33,CA,
21,1E,90,00,18,CC,34,21,
21,19,EA,00,18,D4,34,79,
21,16,FA,00,18,CE,34,D2,
21,15,DF,00,18,DB,35,29,
21,15,F2,00,18,DD,35,81,
21,16,77,00,18,D1,35,D9,
21,17,58,00,18,D7,36,32,
21,17,E7,00,18,DA,36,8A,
21,18,2E,00,18,D2,36,E1,
21,18,39,00,18,CF,37,39,
21,18,6A,00,18,C7,37,92,
21,18,81,00,18,CA,37,E9,
21,18,86,00,18,D0,38,41,
21,18,84,00,18,CF,38,99,
21,18,8E,00,18,C7,38,F0,
21,18,8E,00,18,D6,39,49,
21,18,96,00,18,DA,39,A0,
21,18,96,00,18,C8,39,F8,
21,18,A6,00,18,CD,3A,50,
21,19,A7,00,18,CB,3A,A7,
21,1C,2F,00,18,D9,3B,00,
21,1F,19,00,18,E0,3B,58,
21,21,ED,00,18,F1,3B,B0,
21,23,CB,00,19,0D,3C,09,
21,25,15,00,19,3F,3C,61,
21,25,A2,00,19,6C,3C,B9,
21,26,0C,00,19,8D,3D,14,
21,26,45,00,19,BF,3D,6E,
21,26,59,00,19,ED,3D,C9,
21,26,52,00,1A,16,3E,25,
21,26,45,00,1A,4D,3E,82,
21,26,3F,00,1A,6B,3E,DE,
21,26,3F,00,1A,AB,3F,3C,
21,26,3F,00,1A,CB,3F,9B,
21,26,4C,00,1B,04,3F,FA,
21,26,3F,00,1B,2A,40,59,
21,26,52,00,1B,60,40,B9,
21,26,59,00,1B,7F,41,19,
21,26,59,00,1B,B4,41,79,
21,26,72,00,1B,E5,41,DA,
21,26,59,00,1C,18,42,3C,
21,26,66,00,1C,35,42,9F,
21,26,1F,00,1C,65,43,03,
21,25,EC,00,1C,99,43,66,
21,25,34,00,1C,CB,43,CB,
21,22,53,00,1C,F0,44,2F,
21,1E,5C,00,1C,FC,44,94,
21,1B,AA,00,1C,FE,44,FA,
21,1A,31,00,1D,06,45,60,
21,18,81,00,1D,10,45,C7,
21,16,9F,00,1D,0B,46,2D,
21,14,D0,00,1D,10,46,93,
21,13,FD,00,1D,16,46,F9,
21,14,2D,00,1D,09,47,5F,
21,14,9C,00,1D,02,47,C5,
21,14,E9,00,1C,F8,48,2B,
21,15,48,00,1C,E9,48,91,
21,15,54,00,1C,EB,48,F7,
21,15,56,00,1C,EF,49,5D,
21,15,31,00,1C,E9,49,C2,
21,15,15,00,1C,DE,4A,28,
21,15,21,00,1C,EA,4A,8E,
21,15,35,00,1C,EB,4A,F3,
21,15,54,00,1C,DD,4B,59,
21,15,42,00,1C,CF,4B,BD,
21,14,EF,00,1C,C9,4C,23,
21,14,1F,00,1C,B7,4C,88,
21,13,C9,00,1C,C0,4C,ED,
21,13,19,00,1C,C3,4D,53,
21,12,51,00,1C,AE,4D,B7,
21,11,DD,00,1C,B2,4E,1C,
21,11,74,00,1C,A1,4E,81,
21,10,EC,00,1C,94,4E,E5,
21,10,C6,00,1C,97,4F,4A,
21,11,59,00,1C,88,4F,AD,
21,12,38,00,1C,7E,50,12,
21,14,9E,00,1C,66,50,77,
21,16,6A,00,1C,5D,50,DA,
21,17,AF,00,1C,6B,51,3D,
21,18,17,00,1C,63,51,A2,
21,18,4D,00,1C,64,52,05,
21,18,52,00,1C,5B,52,69,
21,18,55,00,1C,63,52,CC,
21,18,5A,00,1C,6E,53,31,
21,18,5F,00,1C,66,53,94,
21,18,5D,00,1C,62,53,F7,
21,18,62,00,1C,5A,54,5B,
21,18,55,00,1C,68,54,BF,
21,18,A6,00,1C,67,55,23,
21,1A,A5,00,1C,5D,55,86,
21,1C,C3,00,1C,61,55,E9,
21,1E,2C,00,1C,65,56,4E,
21,1F,7C,00,1C,82,56,B1,
21,20,C0,00,1C,8C,57,16,
21,21,CF,00,1C,94,57,79,
21,22,68,00,1C,AB,57,DE,
21,22,F0,00,1C,BB,58,43,
21,23,36,00,1C,D7,58,A7,
21,23,5C,00,1C,FB,59,0C,
21,23,51,00,1D,0C,59,72,
21,23,57,00,1D,24,59,D8,
21,23,36,00,1D,3D,5A,3E,
21,23,41,00,1D,4D,5A,A5,
21,23,1B,00,1D,58,5B,0B,
21,23,0B,00,1D,6E,5B,73,
21,23,16,00,1D,8D,5B,DA,
21,23,36,00,1D,A8,5C,43,
21,23,7D,00,1D,BB,5C,AA,
21,25,09,00,1D,CB,5D,13,
21,25,C7,00,1D,E9,5D,7B,
21,26,59,00,1E,12,5D,E5,
21,26,8C,00,1E,36,5E,4E,
21,26,99,00,1E,51,5E,B8,
21,26,A6,00,1E,6D,5F,23,
21,26,99,00,1E,91,5F,8D,
21,26,79,00,1E,AA,5F,F9,
21,26,72,00,1E,BE,60,64,
21,26,72,00,1E,E3,60,D1,
21,26,85,00,1E,FD,61,3D,
21,26,72,00,1F,1C,61,AA,
21,26,6C,00,1F,29,62,17,
21,26,5F,00,1F,41,62,85,
21,26,5F,00,1F,65,62,F3,
21,26,6C,00,1F,74,63,61,
21,26,6C,00,1F,80,63,CF,
21,26,59,00,1F,B0,64,3E,
21,26,4C,00,1F,D4,64,AD,
21,26,38,00,1F,E1,65,1D,
21,26,3F,00,1F,EB,65,8D,
21,26,32,00,1F,F5,65,FD,
21,26,3F,00,20,12,66,6D,
21,26,4C,00,20,38,66,DE,
21,26,4C,00,20,3A,67,50,
21,26,59,00,20,4F,67,C1,
21,26,52,00,20,64,68,33,
21,26,79,00,20,81,68,A5,
21,26,52,00,20,95,69,17,
21,26,72,00,20,B2,69,89,
21,26,72,00,20,BA,69,FC,
21,26,72,00,20,D7,6A,6F,
21,26,85,00,20,F9,6A,E3,
21,26,66,00,21,11,6B,56,
21,26,66,00,21,12,6B,CB,
21,26,12,00,21,25,6C,3F,
21,25,4C,00,21,36,6C,B4,
21,24,9F,00,21,4A,6D,29,
21,23,FD,00,21,63,6D,9D,
21,23,8E,00,21,75,6E,13,
21,23,7D,00,21,7C,6E,88,
21,23,78,00,21,80,6E,FE,
21,23,67,00,21,88,6F,74,
21,23,36,00,21,9C,6F,EA,
21,22,BB,00,21,B3,70,61,
21,22,3E,00,21,C4,70,D7,
21,21,ED,00,21,BE,71,4D,
21,21,59,00,21,C2,71,C5,
21,1F,0D,00,21,D1,72,3C,
21,1B,6E,00,21,CE,72,B2,
21,18,B9,00,21,C5,73,29,
21,17,EA,00,21,B6,73,A1,
21,18,31,00,21,A9,74,17,
21,19,39,00,21,99,74,8E,
21,1A,43,00,21,7D,75,04,
21,1B,6B,00,21,6F,75,7A,
21,1D,39,00,21,66,75,F0,
21,1E,E7,00,21,55,76,65,
21,20,A9,00,21,5A,76,DB,
21,22,01,00,21,57,77,4F,
21,22,BB,00,21,5F,77,C5,
21,23,31,00,21,70,78,3A,
21,23,62,00,21,76,78,B0,
21,23,78,00,21,76,79,26,
21,23,88,00,21,8B,79,9C,
21,23,7D,00,21,9D,7A,12,
21,23,6C,00,21,98,7A,88,
21,23,62,00,21,BA,7A,FE,
21,23,41,00,21,C1,7B,74,
21,23,3C,00,21,D0,7B,EB,
21,23,4C,00,21,E0,7C,61,
21,23,2B,00,21,E7,7C,D9,
21,23,4C,00,21,EF,7D,50,
21,23,2B,00,21,FA,7D,C7,
21,23,4C,00,22,08,7E,3F,
21,23,5C,00,22,10,7E,B7,
21,23,3C,00,22,1B,7F,2F,
21,23,4C,00,22,20,7F,A6,
21,23,06,00,22,28,80,1F,
21,22,2F,00,22,39,80,97,
21,20,BB,00,22,44,81,10,
21,1D,7D,00,22,47,81,89,
21,1A,49,00,22,4B,82,01,
21,18,B3,00,22,37,82,7A,
21,18,50,00,22,2B,82,F1,
21,18,D1,00,22,0D,83,6A,
21,19,4A,00,21,FD,83,E3,
21,19,96,00,21,F3,84,5A,
21,19,DB,00,21,DA,84,D1,
21,1A,31,00,21,CF,85,49,
21,1A,8F,00,21,D0,85,C0,
21,1B,2D,00,21,C1,86,37,
21,1B,D2,00,21,B3,86,AD,
21,1C,D2,00,21,A3,87,25,
21,1D,E5,00,21,93,87,9B,
21,1E,E7,00,21,96,88,11,
21,1F,73,00,21,9F,88,87,
21,1F,92,00,21,A7,88,FD,
21,1F,A3,00,21,AC,89,74,
21,1F,B0,00,21,B0,89,EA,
21,1F,8D,00,21,A6,8A,60,
21,1F,89,00,21,AC,8A,D7,
21,1F,96,00,21,AE,8B,4D,
21,1F,92,00,21,AB,8B,C3,
21,1F,26,00,21,B3,8C,3B,
21,1C,CB,00,21,AF,8C,B1,
21,1A,13,00,21,AF,8D,28,
21,18,33,00,21,AC,8D,9E,
21,17,51,00,21,A6,8E,14,
21,16,FF,00,21,8F,8E,8B,
21,17,18,00,21,7F,8F,01,
21,17,BB,00,21,75,8F,77,
21,18,D3,00,21,60,8F,ED,
21,1A,7A,00,21,4A,90,62,
21,1B,ED,00,21,49,90,D8,
21,1D,31,00,21,4C,91,4D,
21,1E,1C,00,21,52,91,C3,
21,1E,A9,00,21,52,92,37,
21,1E,CA,00,21,5F,92,AC,
21,1E,C2,00,21,5B,93,22,
21,1E,D2,00,21,4C,93,97,
21,1E,B9,00,21,59,94,0D,
21,1E,A5,00,21,5C,94,81,
21,1E,BE,00,21,63,94,F7,
21,1E,DA,00,21,67,95,6D,
21,1E,C6,00,21,70,95,E2,
21,1E,B5,00,21,82,96,58,
21,1E,B9,00,21,77,96,CE,
21,1E,78,00,21,7B,97,44,
21,1D,7D,00,21,81,97,BA,
21,1B,6E,00,21,94,98,30,
21,18,F7,00,21,8E,98,A6,
21,17,BB,00,21,7D,99,1C,
21,16,DE,00,21,77,99,92,
21,16,D1,00,21,6C,9A,08,
21,17,7E,00,21,5A,9A,7E,
21,18,8E,00,21,3B,9A,F4,
21,19,85,00,21,42,9B,69,
21,1A,64,00,21,34,9B,DD,
21,1B,54,00,21,2D,9C,52,
21,1D,4C,00,21,38,9C,C8,
21,1E,E7,00,21,3C,9D,3D,
21,20,16,00,21,4C,9D,B1,
21,20,A0,00,21,4E,9E,26,
21,20,D8,00,21,51,9E,9C,
21,20,EF,00,21,68,9F,11,
21,20,EB,00,21,74,9F,87,
21,20,D3,00,21,89,9F,FD,
21,20,B7,00,21,9E,A0,73,
21,20,A0,00,21,A2,A0,E9,
21,20,84,00,21,B3,A1,5F,
21,20,96,00,21,B8,A1,D5,
21,20,5F,00,21,BF,A2,4C,
21,1F,09,00,21,C1,A2,C3,
21,1B,AD,00,21,B8,A3,39,
21,19,36,00,21,CB,A3,B1,
21,17,D6,00,21,CD,A4,28,
21,17,C5,00,21,E2,A4,9F,
21,18,33,00,21,DB,A5,15,
21,18,E6,00,21,D9,A5,8D,
21,19,77,00,21,D1,A6,04,
21,1A,0A,00,21,C1,A6,7B,
21,1A,95,00,21,C1,A6,F3,
21,1A,ED,00,21,C8,A7,69,
21,1B,27,00,21,CA,A7,E0,
21,1B,44,00,21,CE,A8,57,
21,1B,75,00,21,D0,A8,CF,
21,1C,32,00,21,C5,A9,45,
21,1D,71,00,21,D6,A9,BC,
21,1E,84,00,21,D1,AA,33,
21,1F,B0,00,21,D2,AA,A9,
21,20,EB,00,21,E2,AB,21,
21,22,44,00,21,EB,AB,98,
21,22,F0,00,22,04,AC,0F,
21,23,E7,00,22,15,AC,87,
21,25,27,00,22,37,AC,FF,
21,26,99,00,22,47,AD,77,
21,27,90,00,22,66,AD,EF,
21,27,CE,00,22,91,AE,69,
21,28,37,00,22,B2,AE,E2,
21,28,94,00,22,D4,AF,5C,
21,29,08,00,23,05,AF,D6,
21,29,70,00,23,28,B0,51,
21,29,9D,00,23,52,B0,CD,
21,29,BB,00,23,77,B1,49,
21,29,CB,00,23,9F,B1,C6,
21,29,D3,00,23,D5,B2,43,
21,29,F1,00,23,FA,B2,C1,
21,29,EA,00,24,2B,B3,40,
21,29,E2,00,24,51,B3,BE,
21,29,DA,00,24,75,B4,3F,
21,29,EA,00,24,A1,B4,BE,
21,29,E2,00,24,BF,B5,3F,
21,29,D3,00,25,08,B5,C1,
21,29,EA,00,25,24,B6,43,
21,29,E2,00,25,54,B6,C5,
21,29,D3,00,25,6F,B7,49,
21,29,AC,00,25,A0,B7,CD,
21,29,9D,00,25,C6,B8,51,
21,29,AC,00,25,EE,B8,D6,
21,29,95,00,26,19,B9,5C,
21,29,A5,00,26,3A,B9,E2,
21,29,95,00,26,56,BA,68,
21,29,9D,00,26,83,BA,EF,
21,29,70,00,26,AF,BB,78,
21,29,59,00,26,D0,BB,FF,
21,29,0F,00,26,F2,BC,88,
21,28,F9,00,27,10,BD,12,
21,28,A9,00,27,33,BD,9C,
21,28,61,00,27,53,BE,26,
21,28,05,00,27,82,BE,B0,
21,27,C7,00,27,9A,BF,3B,
21,27,AB,00,27,B8,BF,C7,
21,27,89,00,27,D2,C0,53,
21,27,75,00,27,F3,C0,E0,
21,27,6E,00,28,0E,C1,6D,
21,27,5A,00,28,22,C1,F9,
21,27,3F,00,28,4D,C2,87,
21,27,09,00,28,66,C3,15,
21,26,D4,00,28,82,C3,A5,
21,26,06,00,28,93,C4,33,
21,23,E1,00,28,B4,C4,C2,
21,20,CA,00,28,BD,C5,53,
21,1D,F4,00,28,CA,C5,E2,
21,1C,47,00,28,D0,C6,73,
21,1B,BE,00,28,C8,C7,02,
21,1C,4A,00,28,C6,C7,93,
21,1D,DD,00,28,B4,C8,22,
21,1F,B9,00,28,B1,C8,B3,
21,20,88,00,28,AD,C9,42,
21,20,F4,00,28,B3,C9,D1,
21,21,37,00,28,BB,CA,62,
21,21,37,00,28,BE,CA,F1,
21,21,3C,00,28,CB,CB,81,
21,21,37,00,28,CE,CC,11,
21,20,FE,00,28,DA,CC,A1,
21,20,2D,00,28,DE,CD,31,
21,1F,96,00,28,DB,CD,C2,
21,1F,55,00,28,EB,CE,51,
21,1F,3B,00,28,E6,CE,E2,
21,1F,11,00,28,D5,CF,73,
21,1F,11,00,28,ED,D0,03,
21,1F,19,00,28,E6,D0,93,
21,1F,22,00,28,E3,D1,23,
21,1F,1E,00,28,ED,D1,B4,
21,1F,0D,00,28,F3,D2,43,
21,1F,15,00,28,EC,D2,D4,
21,1F,22,00,28,E7,D3,65,
21,1F,1E,00,28,F0,D3,F5,
21,1F,11,00,28,E9,D4,86,
21,1F,22,00,28,E3,D5,17,
21,1F,44,00,28,F1,D5,A7,
21,1F,F7,00,29,06,D6,38,
21,21,24,00,28,FC,D6,C9,
21,22,62,00,28,F8,D7,58,
21,23,51,00,29,0A,D7,EA,
21,23,D0,00,29,08,D8,7B,
21,23,E7,00,29,1E,D9,0B,
21,23,EC,00,29,3C,D9,9C,
21,23,A4,00,29,49,DA,2E,
21,22,9C,00,29,5B,DA,C0,
21,1F,E5,00,29,62,DB,51,
21,1D,AE,00,29,7D,DB,E3,
21,1C,8A,00,29,5B,DC,76,
21,1B,C8,00,29,46,DD,08,
21,1A,F6,00,29,54,DD,9A,
21,1A,A8,00,29,52,DE,2C,
21,1A,67,00,29,3C,DE,BD,
21,1A,19,00,29,2E,DF,4F,
21,19,82,00,29,11,DF,E1,
21,18,BB,00,29,09,E0,71,
21,18,15,00,29,02,E1,03,
21,17,7E,00,28,ED,E1,94,
21,16,F8,00,28,DB,E2,25,
21,16,84,00,28,C6,E2,B4,
21,16,38,00,28,AD,E3,45,
21,15,E3,00,28,8D,E3,D4,
21,15,7C,00,28,86,E4,63,
21,15,3A,00,28,79,E4,F3,
21,14,F8,00,28,65,E5,82,
21,14,CC,00,28,49,E6,10,
21,15,96,00,28,2F,E6,9F,
21,16,AA,00,28,35,E7,2D,
21,17,13,00,28,2F,E7,BB,
21,18,10,00,28,05,E8,49,
21,1A,64,00,27,E1,E8,D6,
21,1C,83,00,27,E1,E9,63,
21,1E,1C,00,27,E3,E9,F1,
21,1E,08,00,27,D9,EA,7D,
21,1D,C9,00,27,C0,EB,09,
21,1D,B2,00,27,B0,EB,95,
21,1D,B2,00,27,B2,EC,22,
21,1D,A3,00,27,AB,EC,AF,
21,1D,88,00,27,B1,ED,3A,
21,1D,79,00,27,A9,ED,C7,
21,1D,8C,00,27,B2,EE,52,
21,1D,D9,00,27,A6,EE,DF,
21,1E,F8,00,27,AB,EF,6A,
21,20,1F,00,27,A0,EF,F7,
21,21,1F,00,27,AB,F0,82,
21,21,B1,00,27,AD,F1,0F,
21,22,1B,00,27,B1,F1,9A,
21,22,2A,00,27,B9,F2,27,
21,22,25,00,27,C3,F2,B2,
21,22,34,00,27,CE,F3,3F,
21,22,2A,00,27,DB,F3,CB,
21,21,FC,00,27,E1,F4,58,
21,21,F7,00,27,EE,F4,E5,
21,22,06,00,28,00,F5,71,
21,22,16,00,28,06,F5,FF,
21,22,01,00,28,0F,F6,8C,
21,22,0C,00,28,11,F7,1A,
21,22,01,00,28,24,F7,A7,
21,21,D4,00,28,2E,F8,35,
21,21,E3,00,28,3E,F8,C3,
21,21,D4,00,28,3B,F9,51,
21,21,D4,00,28,3D,F9,DF,
21,21,DE,00,28,49,FA,6D,
21,21,BB,00,28,49,FA,FB,
21,21,99,00,28,58,FB,89,
21,21,6C,00,28,5F,FC,17,
21,20,F9,00,28,60,FC,A6,
21,20,4D,00,28,66,FD,34,
21,1F,E1,00,28,73,FD,C3,
21,1F,A7,00,28,6B,FE,51,
21,1F,77,00,28,67,FE,E1,
21,1F,62,00,28,70,FF,6F,
21,1F,4D,00,28,75,FF,FE,
21,1E,E7,00,28,6F,00,8C,
21,1D,48,00,28,73,01,1B,
21,1C,2B,00,28,6B,01,A9,
21,1B,5A,00,28,61,02,39,
21,1A,99,00,28,52,02,C7,
21,1A,19,00,28,44,03,56,
21,19,8A,00,28,44,03,E4,
21,19,3E,00,28,36,04,72,
21,18,62,00,28,21,05,00,
21,17,B3,00,28,00,05,8E,
21,17,1A,00,27,C7,06,1C,
21,16,63,00,27,84,06,A9,
21,15,D4,00,27,3A,07,34,
21,15,2B,00,26,E3,07,BF,
21,14,C3,00,26,9C,08,48,
21,14,42,00,26,7A,08,D1,
21,13,EC,00,26,63,09,59,
21,13,9F,00,26,4D,09,E1,
21,13,56,00,26,45,0A,68,
21,13,14,00,26,2E,0A,EE,
21,12,CD,00,25,E3,0B,75,
21,12,7E,00,25,7D,0B,FB,
21,12,11,00,25,1E,0C,80,
21,11,D9,00,24,B5,0D,03,
21,12,7D,00,24,49,0D,85,
21,12,38,00,23,D7,0E,05,
21,11,EC,00,23,6C,0E,84,
21,11,9F,00,22,FE,0F,01,
21,11,30,00,22,81,0F,7C,
21,11,A0,00,22,13,0F,F6,
21,12,42,00,21,A5,10,6F,
21,12,72,00,21,3A,10,E5,
21,12,45,00,20,EC,11,59,
21,12,40,00,20,A8,11,CE,
21,12,61,00,20,75,12,40,
21,11,FA,00,20,4B,12,B2,
21,11,BA,00,20,1B,13,24,
21,11,84,00,1F,F8,13,95,
21,11,54,00,1F,CD,14,05,
21,11,27,00,1F,9B,14,76,
21,10,DA,00,1F,93,14,E5,
21,10,F0,00,1F,7D,15,53,
21,10,CD,00,1F,4E,15,C3,
21,10,B3,00,1F,45,16,31,
21,10,70,00,1F,34,16,9F,
21,10,94,00,1F,1B,17,0D,
21,10,87,00,1F,0A,17,7B,
21,10,86,00,1F,08,17,E7,
21,10,89,00,1F,06,18,55,
21,10,A5,00,1E,F6,18,C2,
21,10,6F,00,1E,EA,19,2F,
21,10,66,00,1E,E5,19,9B,
21,10,5C,00,1E,DA,1A,08,
21,10,7B,00,1E,CC,1A,75,
21,10,60,00,1E,BE,1A,E1,
21,10,89,00,1E,BF,1B,4E,
21,10,C5,00,1E,A9,1B,B9,
21,11,90,00,1E,A6,1C,26,
21,12,93,00,1E,AA,1C,91,
21,13,6D,00,1E,9C,1C,FE,
21,14,68,00,1E,93,1D,69,
21,16,20,00,1E,89,1D,D5,
21,17,FE,00,1E,93,1E,40,
21,18,86,00,1E,9A,1E,AD,
21,18,AB,00,1E,AA,1F,18,
21,19,1A,00,1E,B4,1F,83,
21,19,A7,00,1E,B6,1F,EF,
21,1A,10,00,1E,BF,20,5B,
21,1A,52,00,1E,C8,20,C7,
21,1A,80,00,1E,DC,21,33,
21,1A,6D,00,1E,F1,21,A0,
21,1A,7D,00,1E,FC,22,0D,
21,1A,77,00,1F,0E,22,79,
21,1A,64,00,1F,2A,22,E7,
21,1A,4C,00,1F,38,23,C3,
21,1A,3D,00,1F,3C,23,C3,
21,1A,40,00,1F,47,24,31,
21,1A,4F,00,1F,57,24,9F,
21,1A,4C,00,1F,6D,25,0D,
21,1A,52,00,1F,7A,25,EB,
21,1A,43,00,1F,7F,25,EB,
21,1A,49,00,1F,97,26,5B,
21,1A,52,00,1F,AF,26,CA,
21,1A,58,00,1F,B5,27,39,
21,1A,64,00,1F,C5,27,A9,
21,1A,7A,00,1F,C9,28,18,
21,1A,71,00,1F,D9,28,89,
21,1A,6A,00,1F,F6,28,F8,
21,1A,6A,00,1F,FD,29,69,
21,1A,6D,00,20,15,29,D9,
21,1A,77,00,20,19,2A,4A,
21,1A,7D,00,20,29,2A,BB,
21,1A,4C,00,20,34,2B,2D,
21,1A,16,00,20,38,2B,9D,
21,19,A1,00,20,4C,2C,0F,
21,19,20,00,20,4A,2C,81,
21,18,B6,00,20,60,2C,F3,
21,18,3E,00,20,6A,2D,65,
21,17,70,00,20,78,2D,D7,
21,16,84,00,20,74,2E,49,
21,15,D2,00,20,78,2E,BB,
21,14,96,00,20,7A,2F,2F,
21,14,08,00,20,85,2F,A1,
21,13,2F,00,20,91,30,14,
21,12,B5,00,20,7D,30,86,
21,12,38,00,20,43,30,F8,
21,11,E2,00,20,08,31,6A,
21,11,DA,00,1F,C8,31,DC,
21,11,65,00,1F,90,32,4B,
21,11,1B,00,1F,3D,32,BB,
21,10,A2,00,1E,D9,33,29,
21,10,1F,00,1E,8A,33,95,
21,0F,F4,00,1E,2D,34,01,
21,0F,44,00,1D,B7,34,6C,
21,0E,F0,00,1D,3E,34,D5,
21,0E,8A,00,1C,CF,35,3B,
21,0E,91,00,1C,63,35,A1,
21,0E,62,00,1C,37,36,04,
21,0E,B7,00,1C,1A,36,67,
21,0E,58,00,1C,00,36,C9,
21,0E,74,00,1B,E2,37,2D,
21,0E,8C,00,1B,DD,37,8F,
21,0E,B9,00,1B,CC,37,F1,
21,0E,96,00,1B,B5,38,51,
21,0E,B7,00,1B,A0,38,B3,
21,0E,E3,00,1B,8F,39,14,
21,0F,1B,00,1B,7C,39,75,
21,0E,DD,00,1B,5F,39,D5,
21,0E,B6,00,1B,4D,3A,36,
21,0E,C9,00,1B,3A,3A,96,
21,0E,7F,00,1B,1A,3A,F6,
21,0E,98,00,1B,06,3B,56,
21,0E,AB,00,1A,F9,3B,B6,
21,0E,7E,00,1A,D4,3C,16,
21,0E,B3,00,1A,DF,3C,75,
21,0E,9D,00,1A,B9,3C,D4,
21,0E,DA,00,1A,A6,3D,92,
21,0E,F6,00,1A,77,3D,EF,
21,0E,CF,00,1A,6F,3E,4D,
21,0E,AF,00,1A,50,3E,AB,
21,0E,C9,00,1A,2D,3F,07,
21,0E,F4,00,1A,0E,3F,65,
21,0F,03,00,19,F6,3F,C0,
21,0E,B8,00,19,AE,40,1B,
21,0E,83,00,19,64,40,76,
21,0E,7A,00,19,0B,40,CE,
21,0E,56,00,18,A5,41,26,
21,0E,17,00,18,54,41,7C,
21,0D,B1,00,17,E6,41,D2,
21,0D,37,00,17,84,42,25,
21,0C,EA,00,17,29,42,76,
21,0D,EC,00,16,D0,42,C8,
21,0E,19,00,16,90,43,17,
21,0E,53,00,16,59,43,66,
21,0F,30,00,16,34,43,B5,
21,0F,16,00,16,13,44,03,
21,0F,60,00,15,DE,44,50,
21,0F,2E,00,15,AF,44,9E,
21,0F,2B,00,15,89,44,EA,
21,0F,03,00,15,69,45,35,
21,0E,9F,00,15,54,45,82,
21,0E,C2,00,15,48,45,CD,
21,0E,90,00,15,39,46,18,
21,0E,70,00,15,35,46,63,
21,0E,28,00,15,37,46,AE,
21,0D,D8,00,15,38,46,F9,
21,0D,C6,00,15,23,47,44,
21,0D,B7,00,15,1C,47,8F,
21,0D,B3,00,15,1D,47,DA,
21,0D,DD,00,15,17,48,23,
21,0D,CE,00,15,11,48,6E,
21,0E,B6,00,15,08,48,B9,
21,0E,98,00,15,0D,49,03,
21,0E,B0,00,15,0B,49,4E,
21,0E,E4,00,15,11,49,98,
21,0E,EC,00,15,11,49,E3,
21,0E,AC,00,15,0F,4A,2E,
21,0E,E3,00,14,FE,4A,77,
21,0F,28,00,15,03,4A,C2,
21,0F,54,00,15,01,4B,0C,
21,0F,D8,00,15,07,4B,57,
21,10,5C,00,15,01,4B,A1,
21,11,C1,00,14,F4,4B,EA,
21,13,74,00,14,EF,4C,35,
21,14,7A,00,14,F0,4C,7F,
21,14,F1,00,14,F8,4C,C9,
21,14,56,00,14,F2,4D,12,
21,13,98,00,14,F5,4D,5D,
21,12,C6,00,15,00,4D,A7,
21,12,51,00,14,F9,4D,F1,
21,11,67,00,14,F4,4E,3C,
21,11,0C,00,15,03,4E,85,
21,0F,FF,00,14,E3,4E,CF,
21,0F,BE,00,14,A7,4F,19,
21,0F,01,00,14,5D,4F,62,
21,0E,B9,00,14,27,4F,A9,
21,0E,64,00,13,E7,4F,F0,
21,0E,1F,00,13,9C,50,36,
21,0D,CA,00,13,44,50,7A,
21,0D,1D,00,12,E5,50,BD,
21,0D,0A,00,12,91,50,FF,
21,0C,59,00,12,25,51,3F,
21,0C,42,00,11,CE,51,7E,
21,0C,17,00,11,79,51,BD,
21,0C,44,00,11,0F,51,FA,
21,0C,C2,00,10,B2,52,35,
21,0D,75,00,10,3E,52,6E,
21,0D,B9,00,0F,DC,52,A8,
21,0E,A6,00,0F,9D,52,DF,
21,0E,E7,00,0F,71,53,15,
21,0E,F2,00,0F,4D,53,4A,
21,0E,B1,00,0F,37,53,80,
21,0E,37,00,0F,1B,53,B6,
21,0D,E5,00,0F,00,53,EA,
21,0D,90,00,0E,D5,54,1E,
21,0D,6A,00,0E,B3,54,53,
21,0D,3C,00,0E,92,54,86,
21,0D,29,00,0E,6C,54,B9,
21,0D,09,00,0E,49,54,EC,
21,0C,BA,00,0E,1F,55,1D,
21,0C,5C,00,0D,F2,55,4F,
21,0C,8C,00,0D,CC,55,7F,
21,0C,3A,00,0D,B0,55,B0,
21,0C,0D,00,0D,90,55,E0,
21,0C,39,00,0D,7B,56,0F,
21,0C,35,00,0D,59,56,3E,
21,0C,26,00,0D,36,56,6D,
21,0B,F8,00,0D,06,56,9B,
21,0B,DD,00,0C,E5,56,C8,
21,0B,C6,00,0C,BD,56,F5,
21,0B,CD,00,0C,8E,57,21,
21,0B,DE,00,0C,56,57,4D,
21,0B,F6,00,0C,1A,57,78,
21,0B,E6,00,0B,EB,57,A2,
21,0B,97,00,0B,AA,57,CA,
21,0B,9F,00,0B,8B,57,F3,
21,0B,93,00,0B,7A,58,1B,
21,0B,55,00,0B,6A,58,43,
21,0B,5B,00,0B,51,58,6C,
21,0B,79,00,0B,56,58,93,
21,0B,73,00,0B,4D,58,BB,
21,0B,6D,00,0B,50,58,E2,
21,0B,66,00,0B,47,59,09,
21,0B,2D,00,0B,3C,59,31,
21,0B,23,00,0B,41,59,58,
21,0B,03,00,0B,32,59,7F,
21,0B,15,00,0B,27,59,A6,
21,0B,59,00,0B,27,59,CD,
21,0B,7C,00,0B,1B,59,F4,
21,0B,F7,00,0B,12,5A,1B,
21,0F,25,00,0B,0F,5A,42,
21,12,E5,00,0B,0B,5A,68,
21,17,CC,00,0B,09,5A,8F,
21,19,77,00,0A,FC,5A,B5,
21,18,7E,00,0B,0C,5A,DC,
21,19,07,00,0B,17,5B,03,
21,1B,AA,00,0B,20,5B,2A,
21,1C,B9,00,0B,44,5B,51,
21,1D,1B,00,0B,5E,5B,78,
21,1D,2E,00,0B,7F,5B,A0,
21,1D,26,00,0B,9F,5B,C8,
21,1D,2E,00,0B,C8,5B,F2,
21,1D,17,00,0B,EC,5C,1A,
21,1D,17,00,0C,09,5C,45,
21,1D,1F,00,0C,30,5C,6F,
21,1D,35,00,0C,52,5C,9A,
21,1D,57,00,0C,77,5C,C6,
21,1D,90,00,0C,91,5C,F1,
21,1D,C6,00,0C,B0,5D,1E,
21,1D,E5,00,0C,D6,5D,4B,
21,1D,F0,00,0C,E7,5D,78,
21,1D,E1,00,0D,08,5D,A5,
21,1D,66,00,0D,10,5D,D3,
21,1C,4A,00,0D,27,5E,02,
21,1B,16,00,0D,3E,5E,30,
21,1A,13,00,0D,43,5E,5F,
21,19,5D,00,0D,41,5E,8E,
21,18,CB,00,0D,34,5E,BB,
21,18,52,00,0D,2E,5E,EA,
21,17,AF,00,0D,22,5F,18,
21,16,BF,00,0D,10,5F,47,
21,16,AF,00,0D,00,5F,75,
21,15,C4,00,0C,ED,5F,A1,
21,15,4C,00,0C,CF,5F,CF,
21,15,0A,00,0C,B7,5F,FB,
21,14,6E,00,0C,AE,60,27,
21,14,2D,00,0C,90,60,54,
21,13,EE,00,0C,7C,60,80,
21,13,E8,00,0C,71,60,AB,
21,13,92,00,0C,62,60,D7,
21,13,84,00,0C,41,61,02,
21,13,68,00,0C,2A,61,2D,
21,13,59,00,0C,1B,61,57,
21,13,12,00,0C,0A,61,82,
21,12,E2,00,0B,F4,61,AC,
21,12,AC,00,0B,E0,61,D5,
21,12,A7,00,0B,CF,61,FF,
21,12,93,00,0B,B7,62,29,
21,12,B2,00,0B,A9,62,51,
21,12,7A,00,0B,96,62,79,
21,12,74,00,0B,8C,62,A3,
21,12,55,00,0B,75,62,CB,
21,11,E8,00,0B,60,62,F2,
21,12,08,00,0B,51,63,1B,
21,11,C4,00,0B,3E,63,42,
21,11,65,00,0B,28,63,69,
21,11,16,00,0B,17,63,90,
21,10,FA,00,0B,03,63,B7,
21,10,80,00,0A,EC,63,DC,
21,10,66,00,0A,D1,64,03,
21,0F,E4,00,0A,B2,64,29,
21,0F,FB,00,0A,95,64,4D,
21,0F,9A,00,0A,66,64,73,
21,0F,9D,00,0A,28,64,97,
21,0F,98,00,09,DE,64,BA,
21,0F,22,00,09,82,64,DC,
21,0E,C4,00,09,1F,64,FC,
21,0D,EF,00,08,AA,65,1D,
21,0D,88,00,08,46,65,3A,
21,0D,66,00,08,04,65,55,
21,0C,81,00,07,D3,65,70,
21,0C,2B,00,07,BB,65,8B,
21,0C,80,00,07,A7,65,A6,
21,0C,A2,00,07,9C,65,C1,
21,0C,46,00,07,89,65,DB,
21,0C,87,00,07,6D,65,F5,
21,0C,72,00,07,4E,66,0E,
21,0C,74,00,07,23,66,28,
21,0C,B5,00,06,EB,66,40,
21,0C,CB,00,06,A9,66,57,
21,0C,B5,00,06,63,66,6E,
21,0D,05,00,06,13,66,84,
21,0C,D3,00,05,BC,66,98,
21,0C,24,00,05,75,66,AB,
21,0B,B3,00,05,2A,66,BD,
21,0B,60,00,04,E2,66,CF,
21,0B,38,00,04,9C,66,DF,
21,0A,F3,00,04,5F,66,EE,
21,0A,A0,00,04,1B,66,FC,
21,0A,74,00,03,D4,67,09,
21,0A,42,00,03,8D,67,16,
21,0A,33,00,03,49,67,21,
11,0A,27,00,03,04,67,2C,
11,0A,38,00,02,BE,67,35,
11,0A,63,00,02,77,67,3C,
11,0A,D7,00,02,37,67,45,
11,0B,86,00,01,FB,67,4A,
11,0B,DD,00,01,C1,67,50,
11,0C,16,00,01,9B,67,54,
11,0C,1B,00,01,7F,67,59,
11,0B,FA,00,01,6B,67,5D,
11,0C,01,00,01,5D,67,61,
11,0B,E9,00,01,4F,67,64,
11,0B,E6,00,01,41,67,69,
11,0B,D9,00,01,2F,67,6C,
11,0B,DB,00,01,1F,67,6F,
11,0B,E5,00,01,0F,67,72,
11,0C,02,00,00,FD,67,75,
11,0B,DE,00,00,ED,67,76,
11,0B,D4,00,00,DD,67,79,
11,0B,CD,00,00,CB,67,7B,
11,0B,BB,00,00,BD,67,7D,
11,0B,FA,00,00,B0,67,7E,
11,0B,FB,00,00,A3,67,7F,
11,0B,E5,00,00,00,67,80,
11,0B,D7,00,00,00,67,81,
11,0B,E6,00,00,00,67,82,
11,0B,CA,00,00,49,67,83,
11,0B,9E,00,00,82,67,84,
11,0B,BA,00,00,93,67,86,
11,0B,C7,00,00,9C,67,86,
11,0B,BB,00,00,9E,67,88,
11,0B,AD,00,00,A2,67,8A,
11,0B,B2,00,00,A5,67,8B,
11,0B,9F,00,00,A7,67,8D,
11,0B,90,00,00,AD,67,8F,
11,0B,AD,00,00,B1,67,90,
11,0B,9E,00,00,B3,67,91,
11,0B,93,00,00,B5,67,92,
11,0B,B3,00,00,B7,67,94,
11,0B,BC,00,00,B7,67,96,
11,0B,B6,00,00,BB,67,99,
11,0B,B5,00,00,BB,67,9A,
11,0B,AB,00,00,BE,67,9C,
11,0B,78,00,00,C2,67,9E,
11,0B,96,00,00,C2,67,9F,
11,0B,B5,00,00,C8,67,A1,
11,0B,96,00,00,CD,67,A3,
11,0B,A9,00,00,CE,67,A6,
11,0B,C4,00,00,D3,67,A7,
11,0B,A3,00,00,D5,67,A9,
11,0B,85,00,00,DB,67,AC,
11,0B,9A,00,00,DF,67,AE,
11,0B,B6,00,00,E4,67,B1,
11,0B,AC,00,00,EB,67,B2,
11,0B,C9,00,00,EF,67,B5,
11,0B,EB,00,00,F4,67,B7,
11,0B,CD,00,00,F7,67,BA,
11,0B,AB,00,00,FC,67,BD,
11,0B,B4,00,00,FF,67,BF,
11,0B,B7,00,01,00,67,C2,
11,0B,8A,00,01,00,67,C5,
11,0B,BE,00,01,00,67,C8,
11,0B,CC,00,01,00,67,CB,
11,0B,D7,00,01,00,67,CC,
11,0B,D5,00,01,00,67,CF,
11,0B,D5,00,01,00,67,D2,
11,0B,C5,00,01,00,67,D5,
11,0B,BC,00,01,00,67,D7,
11,0B,AB,00,01,00,67,DA,
11,0B,AF,00,01,00,67,DD,
11,0B,A1,00,00,FE,67,E0,
11,0B,A1,00,00,FE,67,E2,
11,0B,C7,00,00,FA,67,E5,
11,0B,DE,00,00,FA,67,E8,
11,0B,DB,00,00,F5,67,E9,
11,0B,D9,00,00,F0,67,EC,
11,0B,B9,00,00,E7,67,EE,
11,0B,9F,00,00,DC,67,F1,
11,0B,B2,00,00,D1,67,F3,
11,0B,BC,00,00,C5,67,F4,
11,0B,EB,00,00,B9,67,F6,
11,0B,BD,00,00,AC,67,F8,
11,0B,C5,00,00,9B,67,F8,
11,0B,9E,00,00,00,67,FA,
11,0B,89,00,00,00,67,FA,
11,0B,C2,00,00,00,67,FA,
11,0B,B5,00,00,00,67,FB,
11,0B,BB,00,00,00,67,FB,
11,0B,B7,00,00,00,67,FB,
11,0B,C8,00,00,00,67,FB,
11,0B,C0,00,00,00,67,FB,
11,0B,9D,00,00,00,67,FB,
11,0B,AA,00,00,00,67,FB,
11,0B,D5,00,00,00,67,FB,
11,0B,CC,00,00,00,67,FB,
11,0B,B0,00,00,00,67,FB,
11,0B,AD,00,00,00,67,FB,
11,0B,B9,00,00,00,67,FB,
11,0B,B8,00,00,00,67,FB,
11,0B,CA,00,00,00,67,FB,
11,0B,BA,00,00,00,67,FB,
11,0B,C1,00,00,00,67,FB,
11,0B,C2,00,00,00,67,FB,
11,0B,8F,00,00,00,67,FB,
11,0B,A3,00,00,00,67,FB,
11,0B,B1,00,00,00,67,FB,
11,0B,AA,00,00,00,67,FB,
11,0B,B0,00,00,00,67,FB,
11,0B,9F,00,00,00,67,FB,
11,0B,A5,00,00,00,67,FB,
11,0B,9D,00,00,00,67,FB,
11,0B,A3,00,00,00,67,FB,
11,0B,CF,00,00,00,67,FB,
11,0B,AE,00,00,00,67,FB,
11,0B,D3,00,00,00,67,FB,
11,0B,D9,00,00,00,67,FB,
11,0B,B9,00,00,00,67,FB,
11,0B,DB,00,00,00,67,FB,
11,0B,CB,00,00,00,67,FB,
11,0B,BE,00,00,00,67,FB,
11,0B,C8,00,00,00,67,FB,
11,0B,CD,00,00,00,67,FB,
11,0B,A0,00,00,00,67,FB,
11,0B,CD,00,00,00,67,FB,
11,0B,CD,00,00,00,67,FB,
11,0B,CE,00,00,00,67,FB,
11,0B,BF,00,00,00,67,FB,
11,0B,D3,00,00,00,67,FB,
11,0B,D4,00,00,00,67,FB,
11,0B,B0,00,00,00,67,FB,
11,0B,CB,00,00,00,67,FB,
11,0B,C2,00,00,00,67,FB,
11,0B,D9,00,00,00,67,FB,
11,0B,F6,00,00,00,67,FB,
11,0B,E1,00,00,00,67,FB,
11,0B,B0,00,00,00,67,FB,
11,0B,86,00,00,00,67,FB,
11,0B,BD,00,00,00,67,FB,
11,0B,EC,00,00,00,67,FB,
11,0B,D3,00,00,00,67,FB,
11,0B,C4,00,00,00,67,FB,
11,0B,EB,00,00,00,67,FB,
11,0B,C2,00,00,00,67,FB,
11,0B,D8,00,00,00,67,FB,
11,0B,D5,00,00,00,67,FB,
11,0B,BF,00,00,00,67,FB,
11,0B,BD,00,00,00,67,FB,
11,0B,C1,00,00,00,67,FB,
11,0B,8C,00,00,00,67,FB,
11,0B,87,00,00,00,67,FB,
11,0B,A4,00,00,00,67,FB,
11,0B,95,00,00,00,67,FB,
11,0B,98,00,00,00,67,FB,
11,0B,8C,00,00,00,67,FB,
11,0B,87,00,00,00,67,FB,
11,0B,86,00,00,00,67,FB,
11,0B,9A,00,00,00,67,FB,
11,0B,B3,00,00,00,67,FB,
11,0B,8E,00,00,00,67,FB,
11,0B,5D,00,00,00,67,FB,
11,0B,48,00,00,00,67,FB,
11,0B,76,00,00,00,67,FB,
11,0B,95,00,00,00,67,FB,
11,0B,CF,00,00,00,67,FB,
11,0B,CD,00,00,00,67,FB,
11,0C,16,00,00,00,67,FB,
11,0C,07,00,00,00,67,FB,
11,0B,D2,00,00,00,67,FB,
11,0C,06,00,00,00,67,FB,
11,0B,92,00,00,00,67,FB,
11,0B,C7,00,00,00,67,FB,
11,0B,E7,00,00,00,67,FB,
11,0B,AE,00,00,00,67,FB,
11,0B,9C,00,00,00,67,FB,
11,0B,B7,00,00,00,67,FB,
11,0B,5C,00,00,00,67,FB,
11,0B,A6,00,00,00,67,FB,
11,0B,95,00,00,00,67,FB,
11,0B,6E,00,00,00,67,FB,
11,0B,A4,00,00,00,67,FB,
11,0B,87,00,00,00,67,FB,
11,0B,92,00,00,00,67,FB,
11,0B,99,00,00,00,67,FB,
11,0B,A3,00,00,00,67,FB,
11,0B,A1,00,00,00,67,FB,
11,0B,69,00,00,00,67,FB,
11,0B,A0,00,00,00,67,FB,
11,0B,98,00,00,00,67,FB,
11,0B,CE,00,00,00,67,FB,
11,0B,E6,00,00,00,67,FB,
11,0B,A4,00,00,00,67,FB,
11,0B,CF,00,00,00,67,FB,
11,0B,A6,00,00,00,67,FB,
11,0B,C5,00,00,00,67,FB,
11,0B,B3,00,00,00,67,FB,
11,0B,C2,00,00,00,67,FB,
11,0B,F5,00,00,00,67,FB,
11,0B,F1,00,00,00,67,FB,
11,0B,D7,00,00,00,67,FB,
11,0B,BB,00,00,00,67,FB,
11,0B,BA,00,00,00,67,FB,
11,0B,C1,00,00,00,67,FB,
11,0B,C2,00,00,00,67,FB,
11,0B,92,00,00,00,67,FB,
11,0B,A0,00,00,00,67,FB,
11,0B,AA,00,00,00,67,FB,
11,0B,8F,00,00,00,67,FB,
11,0B,A1,00,00,00,67,FB,
11,0B,B2,00,00,00,67,FB,
11,0B,A0,00,00,00,67,FB,
11,0B,C4,00,00,00,67,FB,
11,0B,C8,00,00,00,67,FB,
11,0B,A3,00,00,00,67,FB,
11,0B,98,00,00,00,67,FB,
11,0B,BC,00,00,00,67,FB,
11,0B,E5,00,00,00,67,FB,
11,0B,AB,00,00,00,67,FB,
11,0B,9F,00,00,00,67,FB,
11,0B,C5,00,00,00,67,FB,
11,0B,AB,00,00,00,67,FB,
11,0B,CB,00,00,00,67,FB,
11,0B,BF,00,00,00,67,FB,
11,0B,AC,00,00,00,67,FB,
11,0B,CE,00,00,00,67,FB,
11,0B,A3,00,00,00,67,FB,
11,0B,A9,00,00,00,67,FB,
11,0B,BC,00,00,00,67,FB,
11,0B,BC,00,00,00,67,FB,
11,0B,AB,00,00,00,67,FB,
11,0B,9C,00,00,00,67,FB,
11,0B,C8,00,00,00,67,FB,
11,0B,8C,00,00,00,67,FB,
11,0B,9F,00,00,00,67,FB,
11,0B,B3,00,00,00,67,FB,
11,0B,A7,00,00,00,67,FB,
11,0B,9F,00,00,00,67,FB,
11,0B,9D,00,00,00,67,FB,
11,0B,C7,00,00,00,67,FB,
11,0B,6E,00,00,00,67,FB,
11,0B,AF,00,00,00,67,FB,
11,0B,C6,00,00,00,67,FB,
11,0B,95,00,00,00,67,FB,
11,0B,AF,00,00,00,67,FB,
11,0B,C0,00,00,00,67,FB,
11,0B,B0,00,00,00,67,FB,
11,0B,BD,00,00,00,67,FB,
11,0B,DB,00,00,00,67,FB,
11,0B,AB,00,00,00,67,FB,
11,0B,FD,00,00,00,67,FB,
11,0B,B4,00,00,00,67,FB,
11,0B,9A,00,00,00,67,FB,
11,0B,8E,00,00,00,67,FB,
11,0B,D5,00,00,00,67,FB,
11,0B,BA,00,00,00,67,FB,
11,0B,90,00,00,00,67,FB,
11,0B,DB,00,00,00,67,FB,
11,0B,9F,00,00,00,67,FB,
11,0B,A9,00,00,00,67,FB,
11,0B,BD,00,00,00,67,FB,
11,0B,F6,00,00,00,67,FB,
11,0B,D3,00,00,00,67,FB,
11,0B,B2,00,00,00,67,FB,
11,0B,F4,00,00,00,67,FB,
11,0B,86,00,00,00,67,FB,
11,0B,D3,00,00,00,67,FB,
11,0B,CD,00,00,00,67,FB,
11,0B,DB,00,00,00,67,FB,
11,0B,EA,00,00,00,67,FB,
11,0B,C1,00,00,00,67,FB,
11,0B,ED,00,00,00,67,FB,
11,0B,A4,00,00,00,67,FB,
11,0B,B3,00,00,00,67,FB,
11,0B,D5,00,00,00,67,FB,
11,0B,D9,00,00,00,67,FB,
11,0B,B3,00,00,00,67,FB,
11,0B,82,00,00,00,67,FB,
11,0B,B5,00,00,00,67,FB,
11,0B,CE,00,00,00,67,FB,
11,0B,D3,00,00,00,67,FB,
11,0C,0B,00,00,00,67,FB,
11,0B,A9,00,00,00,67,FB,
11,0B,AC,00,00,00,67,FB,
11,0B,CD,00,00,00,67,FB,
11,0B,CE,00,00,00,67,FB,
11,0B,CD,00,00,00,67,FB,
11,0B,D2,00,00,00,67,FB,
11,0B,E4,00,00,00,67,FB,
11,0B,CC,00,00,00,67,FB,
11,0B,D9,00,00,00,67,FB,
11,0B,CD,00,00,00,67,FB,
11,0B,C5,00,00,00,67,FB,
11,0B,D9,00,00,00,67,FB,
11,0B,C4,00,00,00,67,FB,
11,0B,E3,00,00,00,67,FB,
11,0B,CA,00,00,00,67,FB,
11,0B,83,00,00,00,67,FB,
11,0B,A3,00,00,00,67,FB,
11,0B,7C,00,00,00,67,FB,
11,0B,87,00,00,00,67,FB,
11,0B,A7,00,00,00,67,FB,
11,0B,B9,00,00,00,67,FB,
11,0B,A0,00,00,00,67,FB,
11,0B,9D,00,00,00,67,FB,
11,0B,C0,00,00,00,67,FB,
11,0B,F9,00,00,00,67,FB,
11,0B,C5,00,00,00,67,FB,
11,0C,0B,00,00,00,67,FB,
11,0B,90,00,00,00,67,FB,
11,0B,9D,00,00,00,67,FB,
11,0B,B0,00,00,00,67,FB,
11,0B,97,00,00,00,67,FB,
11,0B,CA,00,00,00,67,FB,
11,0B,95,00,00,00,67,FB,
11,0B,A4,00,00,00,67,FB,
11,0B,C7,00,00,00,67,FB,
11,0B,AC,00,00,00,67,FB,
11,0B,93,00,00,00,67,FB,
11,0B,BB,00,00,00,67,FB,
11,0B,EE,00,00,00,67,FB,
11,0B,AE,00,00,00,67,FB,
11,0B,BF,00,00,00,67,FB,
11,0B,AC,00,00,00,67,FB,
11,0B,A4,00,00,00,67,FB,
11,0B,A0,00,00,00,67,FB,
11,0B,C2,00,00,00,67,FB,
11,0B,95,00,00,00,67,FB,
11,0B,6F,00,00,00,67,FB,
11,0B,90,00,00,00,67,FB,
11,0B,D7,00,00,00,67,FB,
11,0B,BF,00,00,00,67,FB,
11,0B,E6,00,00,00,67,FB,
11,0B,D8,00,00,00,67,FB,
11,0B,C4,00,00,00,67,FB,
11,0B,D8,00,00,00,67,FB,
11,0B,68,00,00,00,67,FB,
11,0B,88,00,00,00,67,FB,
11,0B,90,00,00,00,67,FB,
11,0B,A8,00,00,00,67,FB,
11,0B,98,00,00,00,67,FB,
11,0B,D0,00,00,00,67,FB,
11,0B,C5,00,00,00,67,FB,
11,0B,EA,00,00,00,67,FB,
11,0B,D3,00,00,00,67,FB,
11,0B,FE,00,00,00,67,FB,
11,0B,DE,00,00,00,67,FB,
11,0B,CC,00,00,00,67,FB,
11,0B,CB,00,00,00,67,FB,
11,0B,CD,00,00,00,67,FB,
11,0B,96,00,00,00,67,FB,
11,0B,B5,00,00,00,67,FB,
11,0B,CE,00,00,00,67,FB,
11,0B,BA,00,00,00,67,FB,
11,0B,B5,00,00,00,67,FB,
11,0B,B9,00,00,00,67,FB,
11,0B,DC,00,00,00,67,FB,
11,0B,C8,00,00,00,67,FB,
11,0B,CD,00,00,00,67,FB,
11,0B,D0,00,00,00,67,FB,
11,0B,A9,00,00,00,67,FB,
11,0B,BB,00,00,00,67,FB,
11,0B,C2,00,00,00,67,FB,
11,0B,9F,00,00,00,67,FB,
11,0B,B9,00,00,00,67,FB,
11,0B,BB,00,00,00,67,FB,
11,0B,93,00,00,00,67,FB,
11,0B,CE,00,00,00,67,FB,
11,0B,9A,00,00,00,67,FB,
11,0B,B2,00,00,00,67,FB,
11,0B,D5,00,00,00,67,FB,
11,0B,AC,00,00,00,67,FB,
11,0B,B8,00,00,00,67,FB,
11,0B,87,00,00,00,67,FB,
11,0B,99,00,00,00,67,FB,
11,0B,B2,00,00,00,67,FB,
11,0B,A4,00,00,00,67,FB,
11,0B,BA,00,00,00,67,FB,
11,0B,B2,00,00,00,67,FB,
11,0B,BE,00,00,00,67,FB,
11,0B,C1,00,00,00,67,FB,
11,0B,AA,00,00,00,67,FB,
11,0B,D2,00,00,00,67,FB,
11,0B,7D,00,00,00,67,FB,
11,0B,97,00,00,00,67,FB,
11,0B,A9,00,00,00,67,FB,
11,0B,BE,00,00,00,67,FB,
11,0B,B1,00,00,00,67,FB,
11,0B,D8,00,00,00,67,FB,
11,0B,92,00,00,00,67,FB,
11,0B,C8,00,00,00,67,FB,
11,0B,E0,00,00,00,67,FB,
11,0B,B8,00,00,00,67,FB,
11,0B,CA,00,00,00,67,FB,
11,0B,D8,00,00,00,67,FB,
11,0B,9B,00,00,00,67,FB,
11,0B,BF,00,00,00,67,FB,
11,0B,C7,00,00,00,67,FB,
11,0B,92,00,00,00,67,FB,
11,0B,90,00,00,00,67,FB,
11,0B,97,00,00,00,67,FB,
11,0B,BF,00,00,00,67,FB,
11,0C,04,00,00,00,67,FB,
11,0B,CC,00,00,00,67,FB,
11,0B,F3,00,00,00,67,FB,
11,0B,D5,00,00,00,67,FB,
11,0B,70,00,00,00,67,FB,
11,0B,CD,00,00,00,67,FB,
11,0B,D5,00,00,00,67,FB,
11,0B,BB,00,00,00,67,FB,
11,0B,B6,00,00,00,67,FB,
11,0B,8A,00,00,00,67,FB,
11,0B,B0,00,00,00,67,FB,
11,0B,BF,00,00,00,67,FB,
11,0B,B6,00,00,00,67,FB,
11,0B,C0,00,00,00,67,FB,
11,0B,95,00,00,00,67,FB,
11,0B,CD,00,00,00,67,FB,
11,0B,BE,00,00,00,67,FB,
11,0B,BE,00,00,00,67,FB,
11,0B,EC,00,00,00,67,FB,
11,0B,92,00,00,00,67,FB,
11,0B,BB,00,00,00,67,FB,
11,0B,A1,00,00,00,67,FB,
11,0B,75,00,00,00,67,FB,
11,0B,95,00,00,00,67,FB,
11,0B,95,00,00,00,67,FB,
11,0B,BC,00,00,00,67,FB,
11,0B,E8,00,00,00,67,FB,
11,0B,F1,00,00,00,67,FB,
11,0B,C4,00,00,00,67,FB,
11,0B,D0,00,00,00,67,FB,
11,0B,AE,00,00,00,67,FB,
11,0B,C5,00,00,00,67,FB,
11,0B,B9,00,00,00,67,FB,
11,0B,C4,00,00,00,67,FB,
11,0B,B4,00,00,00,67,FB,
11,0B,B2,00,00,00,67,FB,
11,0B,B2,00,00,00,67,FB,
11,0B,B2,00,00,00,67,FB,
11,0B,B9,00,00,00,67,FB,
11,0B,CE,00,00,00,67,FB,
11,0B,C8,00,00,00,67,FB,
11,0B,E0,00,00,00,67,FB,
11,0B,A9,00,00,00,67,FB,
11,0B,75,00,00,00,67,FB,
11,0B,CE,00,00,00,67,FB,
11,0B,9A,00,00,00,67,FB,
11,0B,AC,00,00,00,67,FB,
11,0B,95,00,00,00,67,FB,
11,0B,BD,00,00,00,67,FB,
11,0B,EA,00,00,00,67,FB,
11,0B,F2,00,00,00,67,FB,
11,0C,0A,00,00,00,67,FB,
11,0B,F5,00,00,00,67,FB,
11,0B,BD,00,00,00,67,FB,
11,0B,D5,00,00,00,67,FB,
11,0B,9A,00,00,00,67,FB,
11,0B,A9,00,00,00,67,FB,
11,0B,AC,00,00,00,67,FB,
11,0B,A8,00,00,00,67,FB,
11,0B,CC,00,00,00,67,FB,
11,0B,C2,00,00,00,67,FB,
11,0B,BA,00,00,00,67,FB,
11,0B,DE,00,00,00,67,FB,
11,0B,C4,00,00,00,67,FB,
11,0B,C2,00,00,00,67,FB,
11,0B,D3,00,00,00,67,FB,
11,0B,B4,00,00,00,67,FB,
11,0B,A1,00,00,00,67,FB,
11,0B,AD,00,00,00,67,FB,
11,0B,D1,00,00,00,67,FB,
11,0B,C4,00,00,00,67,FB,
11,0B,B2,00,00,00,67,FB,
11,0B,CA,00,00,00,67,FB,
11,0B,CB,00,00,00,67,FB,
11,0B,C8,00,00,00,67,FB,
11,0B,C7,00,00,00,67,FB,
11,0B,B8,00,00,00,67,FB,
11,0B,D1,00,00,00,67,FB,
11,0B,B6,00,00,00,67,FB,
11,0B,BC,00,00,00,67,FB,
11,0B,C7,00,00,00,67,FB,
11,0B,7C,00,00,00,67,FB,
11,0B,A9,00,00,00,67,FB,
11,0B,BB,00,00,00,67,FB,
11,0B,A9,00,00,00,67,FB,
11,0B,C7,00,00,00,67,FB,
11,0B,E5,00,00,00,67,FB,
11,0B,D0,00,00,00,67,FB,
11,0B,E8,00,00,00,67,FB,
11,0B,92,00,00,00,67,FB,
11,0B,C5,00,00,00,67,FB,
11,0B,FF,00,00,00,67,FB,
11,0B,FF,00,00,00,67,FB,
11,0B,EB,00,00,00,67,FB,
21,0B,B7,00,00,00,67,FB,
21,0B,D8,00,00,00,67,FB,
21,0C,05,00,00,00,67,FB,
21,0C,A1,00,00,00,67,FB,
21,0D,AF,00,00,00,67,FC,
21,0F,9E,00,00,49,67,FD,
21,12,7A,00,00,97,67,FF,
21,14,32,00,00,DE,68,01,
21,15,76,00,01,27,68,02,
21,16,D5,00,01,86,68,07,
21,18,4A,00,01,E3,68,0C,
21,19,E1,00,02,49,68,12,
21,1B,CB,00,02,B8,68,19,
21,1D,B2,00,03,33,68,23,
21,1F,19,00,03,BB,68,2E,
21,20,1F,00,04,4D,68,3A,
21,20,96,00,04,DD,68,49,
21,21,02,00,05,68,68,59,
21,21,3C,00,05,F4,68,6C,
21,21,94,00,06,71,68,81,
21,22,01,00,06,EA,68,98,
21,22,5D,00,07,60,68,AF,
21,22,DB,00,07,CA,68,C8,
21,23,26,00,08,39,68,E3,
21,23,88,00,08,9A,69,00,
21,23,C5,00,08,F7,69,1F,
21,24,0E,00,09,47,69,3E,
21,24,53,00,09,8B,69,5E,
21,23,67,00,09,D8,69,80,
21,22,8C,00,0A,22,69,A1,
21,21,AC,00,0A,72,69,C4,
21,20,D3,00,0A,C7,69,E9,
21,20,64,00,0B,0E,6A,0E,
21,20,09,00,0B,48,6A,35,
21,1E,FC,00,0B,8E,6A,5C,
21,1D,A7,00,0B,B9,6A,85,
21,1C,16,00,0B,E3,6A,AE,
21,1A,E7,00,0C,07,6A,D8,
21,1A,BE,00,0C,21,6B,02,
21,1B,8C,00,0C,27,6B,2D,
21,1C,4E,00,0C,34,6B,58,
21,1C,E4,00,0C,48,6B,83,
21,1D,57,00,0C,5E,6B,AE,
21,1E,04,00,0C,72,6B,D9,
21,1F,04,00,0C,93,6C,04,
21,1F,B0,00,0C,B5,6C,30,
21,1F,B9,00,0C,DC,6C,5C,
21,1F,A7,00,0D,0B,6C,89,
21,1F,A3,00,0D,42,6C,B6,
21,1F,B9,00,0D,5D,6C,E5,
21,1F,A3,00,0D,95,6D,14,
21,1F,D4,00,0D,C1,6D,43,
21,1F,E9,00,0D,FA,6D,74,
21,1F,FB,00,0E,26,6D,A5,
21,20,1B,00,0E,54,6D,D7,
21,20,0D,00,0E,7D,6E,09,
21,1F,89,00,0E,AB,6E,3C,
21,1E,14,00,0E,C5,6E,6F,
21,1C,E4,00,0E,E5,6E,A3,
21,1B,E3,00,0E,FA,6E,D7,
21,1A,DD,00,0F,09,6F,0C,
21,19,33,00,0F,14,6F,40,
21,17,1D,00,0F,17,6F,74,
21,15,B1,00,0F,1A,6F,AA,
21,14,11,00,0F,30,6F,DE,
21,12,59,00,0F,37,70,14,
21,10,1E,00,0F,30,70,4A,
21,0E,BA,00,0F,31,70,7E,
21,0D,FB,00,0F,2A,70,B4,
21,0E,DC,00,0F,25,70,E9,
21,10,D2,00,0F,22,71,1E,
21,13,51,00,0F,21,71,53,
21,15,70,00,0F,1D,71,88,
21,17,AF,00,0F,29,71,BD,
21,18,FC,00,0F,33,71,F3,
21,19,7C,00,0F,45,72,27,
21,19,96,00,0F,54,72,5D,
21,19,A7,00,0F,70,72,94,
21,19,96,00,0F,81,72,CA,
21,19,6E,00,0F,96,72,FF,
21,19,55,00,0F,A7,73,36,
21,19,2B,00,0F,BA,73,6D,
21,19,04,00,0F,CE,73,A4,
21,17,E3,00,0F,E6,73,DD,
21,15,D8,00,0F,F9,74,15,
21,13,E8,00,10,08,74,4D,
21,11,F5,00,10,18,74,86,
21,0F,FD,00,10,22,74,BE,
21,0E,C2,00,10,2A,74,F6,
21,0E,30,00,10,1F,75,2F,
21,0D,4E,00,10,2E,75,68,
21,0C,E9,00,10,21,75,A1,
21,0C,72,00,10,18,75,D9,
21,0B,BA,00,10,10,76,13,
21,0B,90,00,0F,EA,76,4B,
21,0B,50,00,0F,DF,76,82,
21,0A,C6,00,0F,C7,76,BA,
21,0A,A4,00,0F,A1,76,F1,
21,0A,E0,00,0F,99,77,28,
21,0B,B4,00,0F,8F,77,5F,
21,0B,E6,00,0F,72,77,96,
21,0C,4F,00,0F,62,77,CC,
21,0D,90,00,0F,43,78,02,
21,0D,AA,00,0F,44,78,37,
21,0E,07,00,0F,37,78,6D,
21,0E,8F,00,0F,29,78,A3,
21,0E,62,00,0F,23,78,D8,
21,0F,20,00,0F,0D,79,0D,
21,0F,39,00,0F,04,79,41,
21,0F,6A,00,0E,F6,79,75,
21,0F,FC,00,0E,E9,79,AB,
21,11,AB,00,0E,D8,79,DF,
21,15,4A,00,0E,D1,7A,12,
21,18,8E,00,0E,CA,7A,47,
21,19,74,00,0E,E2,7A,7B,
21,19,D8,00,0E,F5,7A,AE,
21,1A,10,00,0F,16,7A,E4,
21,1A,25,00,0F,1A,7B,18,
21,1A,58,00,0F,29,7B,4C,
21,1A,5E,00,0F,47,7B,82,
21,1A,AB,00,0F,77,7B,B8,
21,1A,D4,00,0F,9E,7B,ED,
21,1A,FA,00,0F,BD,7C,24,
21,1B,3A,00,0F,DA,7C,5B,
21,1C,13,00,0F,F6,7C,92,
21,1D,84,00,10,1B,7C,CB,
21,1F,40,00,10,53,7D,04,
21,20,A9,00,10,78,7D,3D,
21,21,45,00,10,A4,7D,76,
21,22,1B,00,10,DE,7D,B1,
21,22,B6,00,11,14,7D,EC,
21,22,BB,00,11,4B,7E,29,
21,22,D6,00,11,85,7E,65,
21,22,F6,00,11,A7,7E,A3,
21,22,F6,00,11,DA,7E,E2,
21,23,06,00,12,12,7F,1F,
21,23,06,00,12,44,7F,60,
21,23,10,00,12,77,7F,A0,
21,22,EB,00,12,9C,7F,E0,
21,22,B1,00,12,D0,80,22,
21,21,F2,00,12,FC,80,65,
21,21,7B,00,13,22,80,A7,
21,20,FE,00,13,56,80,EB,
21,1F,BD,00,13,8B,81,2F,
21,1E,F8,00,13,A4,81,74,
21,1E,44,00,13,DC,81,B9,
21,1D,6E,00,13,D7,81,FF,
21,1C,67,00,14,01,82,46,
21,19,FE,00,14,1B,82,8C,
21,17,68,00,14,2A,82,D3,
21,15,19,00,14,2A,83,1B,
21,13,AC,00,14,29,83,62,
21,12,A3,00,14,48,83,A9,
21,11,D7,00,14,5C,83,F1,
21,11,0C,00,14,46,84,38,
21,10,71,00,14,3E,84,81,
21,0F,98,00,14,1E,84,C8,
21,0E,EA,00,14,1C,85,0F,
21,0E,3A,00,14,14,85,56,
21,0D,B6,00,14,1D,85,9D,
21,0D,15,00,14,17,85,E4,
21,0D,2A,00,14,04,86,2B,
21,0D,3D,00,13,F9,86,72,
21,10,44,00,13,F9,86,B9,
21,12,29,00,13,FB,87,00,
21,12,C4,00,13,E4,87,45,
21,12,C1,00,13,DB,87,8C,
21,11,FC,00,13,D8,87,D2,
21,11,69,00,13,D9,88,18,
21,10,38,00,13,D6,88,5F,
21,0F,86,00,13,D6,88,A4,
21,0F,22,00,13,CC,88,EA,
21,0E,58,00,13,CD,89,31,
21,0E,1B,00,13,C6,89,77,
21,0D,D3,00,13,B7,89,BC,
21,0D,A6,00,13,A2,8A,02,
21,0D,A2,00,13,86,8A,48,
21,0C,BE,00,13,79,8A,8C,
21,0C,A6,00,13,55,8A,D2,
21,0D,0C,00,13,28,8B,16,
21,0C,E0,00,13,00,8B,5A,
21,0C,B7,00,12,DE,8B,9D,
21,0C,FB,00,12,BC,8B,E0,
21,0D,19,00,12,8D,8C,22,
21,0D,44,00,12,68,8C,64,
21,0D,14,00,12,3C,8C,A4,
21,0D,0C,00,12,16,8C,E4,
21,0D,2D,00,11,DE,8D,25,
21,0D,5B,00,11,B2,8D,64,
21,0D,CD,00,11,85,8D,A3,
21,0E,3D,00,11,57,8D,E0,
21,0E,EA,00,11,34,8E,1D,
21,0F,81,00,11,1D,8E,5A,
21,10,0F,00,11,05,8E,97,
21,10,AB,00,10,F5,8E,D2,
21,10,CD,00,10,C4,8F,0E,
21,10,FB,00,10,95,8F,49,
21,10,E0,00,10,70,8F,84,
21,10,86,00,10,46,8F,BE,
21,10,7B,00,10,27,8F,F6,
21,10,33,00,0F,FC,90,30,
21,10,42,00,0F,E2,90,68,
21,0F,CF,00,0F,C2,90,A0,
21,0F,B2,00,0F,A1,90,D7,
21,0F,8B,00,0F,8A,91,0E,
21,0F,9E,00,0F,84,91,45,
21,0F,98,00,0F,6F,91,7C,
21,0F,3A,00,0F,51,91,B2,
21,0F,72,00,0F,3F,91,E8,
21,0F,4B,00,0F,31,92,1D,
21,0F,7A,00,0F,19,92,53,
21,0F,1B,00,0F,0D,92,89,
21,0F,12,00,0E,FA,92,BD,
21,0E,F6,00,0E,E9,92,F3,
21,0F,2D,00,0E,DB,93,27,
21,0F,2B,00,0E,CD,93,5B,
21,0F,0C,00,0E,B3,93,8E,
21,0E,F1,00,0E,89,93,C3,
21,0E,F9,00,0E,78,93,F6,
21,0E,A5,00,0E,6F,94,29,
21,0E,D6,00,0E,5F,94,5C,
21,0E,C9,00,0E,6B,94,8F,
21,0E,C8,00,0E,53,94,C2,
21,0E,C2,00,0E,2D,94,F3,
21,0E,98,00,0E,0E,95,25,
21,0E,B6,00,0D,F0,95,57,
21,0E,54,00,0D,D1,95,88,
21,0E,74,00,0D,CD,95,B9,
21,0E,74,00,0D,B5,95,E9,
21,0E,23,00,0D,A8,96,19,
21,0D,F9,00,0D,97,96,4A,
21,0E,00,00,0D,78,96,79,
21,0D,E5,00,0D,66,96,A8,
21,0D,7D,00,0D,4B,96,D7,
21,0D,C2,00,0D,2B,97,06,
21,0D,47,00,0D,13,97,35,
21,0D,72,00,0C,FB,97,62,
21,0D,66,00,0C,F2,97,90,
21,0C,B3,00,0C,E2,97,BE,
21,0C,D8,00,0C,B9,97,EB,
21,0C,C5,00,0C,86,98,18,
21,0D,00,00,0C,4D,98,43,
21,0D,02,00,0C,1B,98,6E,
21,0C,D3,00,0B,F5,98,99,
21,0C,8D,00,0B,E1,98,C2,
21,0C,89,00,0B,D5,98,EC,
21,0C,5E,00,0B,CE,99,16,
21,0C,2E,00,0B,BF,99,3F,
21,0C,6C,00,0B,BD,99,69,
21,0D,31,00,0B,CB,99,91,
21,0E,01,00,0B,BF,99,BB,
21,0F,60,00,0B,AF,99,E3,
21,0F,CC,00,0B,A8,9A,0D,
21,0F,A3,00,0B,A1,9A,35,
21,0F,9B,00,0B,83,9A,5F,
21,0F,2B,00,0B,73,9A,86,
21,0E,DC,00,0B,65,9A,AE,
21,0E,7B,00,0B,64,9A,D7,
21,0E,12,00,0B,5E,9A,FF,
21,0D,90,00,0B,52,9B,26,
21,0D,29,00,0B,2F,9B,4D,
21,0C,89,00,0B,3F,9B,75,
21,0C,36,00,0B,1A,9B,9C,
21,0B,B2,00,0B,11,9B,C3,
21,0B,20,00,0A,EB,9B,EA,
21,0B,1C,00,0A,BA,9C,10,
21,0A,E6,00,0A,74,9C,36,
21,0A,B5,00,0A,02,9C,5A,
21,0A,9B,00,09,A5,9C,7E,
21,0A,D0,00,09,3F,9C,A0,
21,0A,AE,00,08,E2,9C,BF,
21,0A,A4,00,08,9E,9C,DD,
21,0A,ED,00,08,71,9C,FA,
21,0B,16,00,08,4E,9D,17,
21,0B,3A,00,08,42,9D,33,
21,0B,3B,00,08,20,9D,4E,
21,0B,81,00,08,04,9D,68,
21,0B,8D,00,07,F3,9D,83,
21,0B,A7,00,07,FA,9D,9C,
21,0B,E3,00,07,E9,9D,B6,
21,0B,FC,00,07,D5,9D,CE,
21,0C,45,00,07,BF,9D,E5,
21,0C,6C,00,07,BA,9D,FE,
21,0C,70,00,07,AC,9E,16,
21,0C,A0,00,07,A0,9E,2D,
21,0C,87,00,07,9E,9E,44,
21,0C,6F,00,07,90,9E,5B,
21,0C,B3,00,07,8E,9E,71,
21,0F,66,00,07,8B,9E,86,
21,12,B0,00,07,84,9E,9C,
21,15,0B,00,07,7F,9E,B2,
21,16,DE,00,07,76,9E,C7,
21,18,A9,00,07,76,9E,DD,
21,1A,CA,00,07,97,9E,F4,
21,1E,54,00,07,A4,9F,0A,
21,20,3F,00,07,DF,9F,1F,
21,20,D3,00,08,0F,9F,36,
21,20,44,00,08,53,9F,4F,
21,1F,80,00,08,80,9F,66,
21,1F,0D,00,08,D4,9F,7F,
21,1E,B9,00,08,F2,9F,9A,
21,1E,A9,00,09,22,9F,B5,
21,1E,70,00,09,4E,9F,D3,
21,1E,00,00,09,7D,9F,EF,
21,1D,66,00,09,9C,A0,0D,
21,1C,CE,00,09,C1,A0,2B,
21,1C,71,00,09,E7,A0,4A,
21,1C,21,00,0A,0F,A0,6A,
21,1B,A6,00,0A,31,A0,8C,
21,1B,13,00,0A,53,A0,AD,
21,1A,92,00,0A,64,A0,CF,
21,1A,58,00,0A,8D,A0,F2,
21,1A,52,00,0A,C6,A1,16,
21,1A,AB,00,0A,F6,A1,3B,
21,1B,00,00,0B,26,A1,62,
21,1A,DD,00,0B,37,A1,87,
21,1A,DA,00,0B,66,A1,B0,
21,1A,E7,00,0B,9B,A1,D7,
21,1A,EA,00,0B,BF,A1,FF,
21,1B,0A,00,0B,D3,A2,29,
21,1B,1A,00,0B,F2,A2,52,
21,1B,20,00,0C,03,A2,7C,
21,1A,F6,00,0C,06,A2,A6,
21,19,F8,00,0C,11,A2,D1,
21,18,C3,00,0C,29,A2,FA,
21,17,AA,00,0C,3F,A3,25,
21,16,D5,00,0C,5A,A3,50,
21,16,5B,00,0C,70,A3,7B,
21,16,36,00,0C,7E,A3,A6,
21,16,38,00,0C,85,A3,D3,
21,16,38,00,0C,95,A3,FE,
21,15,74,00,0C,99,A4,2A,
21,14,26,00,0C,A8,A4,56,
21,12,BD,00,0C,A2,A4,83,
21,11,C0,00,0C,AE,A4,AF,
21,10,EE,00,0C,B0,A4,DD,
21,10,16,00,0C,A8,A5,09,
21,0F,42,00,0C,9B,A5,35,
21,0E,B9,00,0C,94,A5,62,
21,0E,3A,00,0C,7A,A5,8E,
21,0D,D7,00,0C,6A,A5,B9,
21,0D,58,00,0C,4C,A5,E5,
21,0D,13,00,0C,21,A6,10,
21,0C,CC,00,0B,D1,A6,3A,
21,0B,FD,00,0B,8F,A6,64,
21,0B,DF,00,0B,30,A6,8D,
21,0B,B4,00,0A,CF,A6,B4,
21,0B,83,00,0A,5B,A6,DA,
21,0A,C0,00,09,E9,A7,00,
21,0B,01,00,09,70,A7,21,
21,0B,16,00,08,DF,A7,43,
21,0B,28,00,08,5C,A7,62,
21,0B,9F,00,07,D9,A7,80,
21,0C,01,00,07,7B,A7,9B,
21,0C,00,00,07,25,A7,B4,
21,0C,10,00,06,CF,A7,CD,
21,0C,4B,00,06,8F,A7,E4,
21,0C,68,00,06,40,A7,FB,
21,0C,A2,00,05,F0,A8,10,
21,0C,8C,00,05,B3,A8,25,
21,0C,19,00,05,6F,A8,38,
21,0B,77,00,05,2A,A8,4B,
21,0B,15,00,04,EE,A8,5B,
21,0B,03,00,04,C8,A8,6D,
21,0A,C1,00,04,A3,A8,7C,
21,0A,94,00,04,93,A8,8C,
21,0A,5C,00,04,8D,A8,9B,
21,0A,77,00,04,89,A8,AA,
21,0A,92,00,04,7E,A8,BA,
21,0A,CA,00,04,79,A8,C9,
21,0A,EC,00,04,7A,A8,D8,
21,0B,05,00,04,75,A8,E7,
21,0B,1A,00,04,6D,A8,F6,
21,0B,01,00,04,69,A9,05,
21,0B,05,00,04,68,A9,14,
21,0B,21,00,04,65,A9,23,
21,0B,7E,00,04,61,A9,32,
21,0C,AD,00,04,5C,A9,40,
21,0D,F7,00,04,5B,A9,4F,
21,0F,EF,00,04,57,A9,5E,
21,10,AC,00,04,53,A9,6D,
21,11,6D,00,04,58,A9,8A,
21,14,98,00,04,63,A9,99,
21,18,FA,00,04,82,A9,A8,
21,1C,AE,00,04,B2,A9,B7,
21,1F,33,00,05,04,A9,C7,
21,20,4D,00,05,6F,A9,D9,
21,20,EF,00,05,D8,A9,EC,
21,21,4A,00,06,4D,AA,01,
21,21,63,00,06,C1,AA,17,
21,21,63,00,07,29,AA,2F,
21,21,80,00,07,90,AA,49,
21,21,A3,00,07,F0,AA,64,
21,21,F7,00,08,42,AA,80,
21,22,44,00,08,92,AA,9E,
21,22,8C,00,08,DF,AA,BD,
21,22,BB,00,09,1D,AA,DC,
21,22,6D,00,09,5E,AA,FC,
21,21,DE,00,09,A5,AB,1E,
21,21,4F,00,09,F2,AB,40,
21,20,B7,00,0A,2F,AB,63,
21,1F,DC,00,0A,73,AB,87,
21,1E,8C,00,0A,BC,AB,AB,
21,1D,90,00,0A,EA,AB,D1,
21,1C,EF,00,0B,1E,AB,F8,
21,1C,78,00,0B,41,AC,1F,
21,1C,21,00,0B,63,AC,47,
21,1B,D5,00,0B,84,AC,70,
21,1A,E7,00,0B,AB,AC,98,
21,19,20,00,0B,B5,AC,C0,
21,18,4D,00,0B,B3,AC,EA,
21,17,B1,00,0B,B9,AD,12,
21,17,08,00,0B,A9,AD,3C,
21,16,1C,00,0B,B0,AD,66,
21,14,E5,00,0B,A2,AD,8E,
21,13,E0,00,0B,8B,AD,B8,
21,13,19,00,0B,86,AD,E0,
21,12,A6,00,0B,67,AE,08,
21,12,1C,00,0B,4F,AE,2F,
21,11,BD,00,0B,33,AE,56,
21,11,37,00,0B,17,AE,7D,
21,10,DC,00,0B,00,AE,A4,
21,10,49,00,0A,E8,AE,CB,
21,10,00,00,0A,DB,AE,F1,
21,0F,B9,00,0A,CE,AF,17,
21,0F,FD,00,0A,AB,AF,3C,
21,0F,CF,00,0A,8E,AF,61,
21,0F,6C,00,0A,7E,AF,86,
21,0F,9A,00,0A,62,AF,AB,
21,0F,2E,00,0A,53,AF,CF,
21,0F,4B,00,0A,43,AF,F2,
21,0F,5A,00,0A,2B,B0,16,
21,0E,C9,00,0A,0F,B0,39,
21,0F,22,00,09,F8,B0,5C,
21,0F,27,00,09,F4,B0,7F,
21,0F,1E,00,09,E8,B0,A2,
21,0F,2D,00,09,CE,B0,C4,
21,0F,02,00,09,BE,B0,E6,
21,0E,D0,00,09,A8,B1,07,
21,0E,CE,00,09,8B,B1,29,
21,0E,E8,00,09,7A,B1,4B,
21,0E,D7,00,09,62,B1,6B,
21,0E,BD,00,09,53,B1,8B,
21,0E,C2,00,09,34,B1,AC,
21,0E,5E,00,09,2D,B1,CC,
21,0F,12,00,09,1F,B1,EB,
21,0F,B8,00,09,11,B2,0B,
21,11,5F,00,09,05,B2,2A,
21,13,FA,00,08,F7,B2,49,
21,17,32,00,09,02,B2,68,
21,18,A6,00,09,0C,B2,89,
21,19,74,00,09,1C,B2,A8,
21,19,F0,00,09,3C,B2,C7,
21,1A,28,00,09,5B,B2,E7,
21,1A,5E,00,09,84,B3,09,
21,1A,6A,00,09,AB,B3,2A,
21,1A,80,00,09,CB,B3,4C,
21,1A,89,00,09,F1,B3,6F,
21,1A,95,00,0A,0D,B3,92,
21,1A,A8,00,0A,30,B3,B5,
21,1A,C7,00,0A,4A,B3,D9,
21,1A,E7,00,0A,69,B3,FE,
21,1A,FD,00,0A,86,B4,22,
21,1B,2D,00,0A,A8,B4,46,
21,1C,16,00,0A,C9,B4,6C,
21,1D,14,00,0A,E9,B4,92,
21,1E,28,00,0B,18,B4,B9,
21,1F,85,00,0B,3F,B4,E0,
21,20,68,00,0B,73,B5,07,
21,20,D3,00,0B,AA,B5,2F,
21,21,07,00,0B,E1,B5,59,
21,21,37,00,0C,16,B5,82,
21,21,45,00,0C,54,B5,AD,
21,21,11,00,0C,92,B5,DA,
21,20,D8,00,0C,CD,B6,06,
21,20,BB,00,0C,FE,B6,32,
21,20,48,00,0D,2E,B6,61,
21,1F,6A,00,0D,62,B6,8F,
21,1E,A9,00,0D,75,B6,BE,
21,1E,10,00,0D,8C,B6,EE,
21,1D,97,00,0D,98,B7,1D,
21,1C,91,00,0D,A7,B7,4E,
21,1B,2D,00,0D,AB,B7,7E,
21,18,1C,00,0D,C2,B7,AE,
21,15,1F,00,0D,D3,B7,DF,
21,12,75,00,0D,D4,B8,0F,
21,11,27,00,0D,D5,B8,3F,
21,0F,AF,00,0D,CA,B8,71,
21,0E,F8,00,0D,C1,B8,A1,
21,0E,7F,00,0D,B6,B8,D2,
21,0E,3D,00,0D,A6,B9,01,
21,0D,A2,00,0D,A5,B9,31,
21,0D,2F,00,0D,8D,B9,61,
21,0C,C7,00,0D,76,B9,90,
21,0C,70,00,0D,5C,B9,BF,
21,0C,16,00,0D,39,B9,EE,
21,0C,35,00,0D,29,BA,1D,
21,0C,A4,00,0D,32,BA,4B,
21,0C,CB,00,0D,33,BA,7A,
21,0C,49,00,0D,3E,BA,A8,
21,0C,9D,00,0D,23,BA,D7,
21,0D,4E,00,0D,07,BB,04,
21,0D,35,00,0C,E8,BB,32,
21,0D,B6,00,0C,E6,BB,60,
21,0D,7A,00,0C,CB,BB,8C,
21,0D,44,00,0C,F8,BB,BA,
21,0D,69,00,0C,CE,BB,E6,
21,0D,4E,00,0C,AF,BC,12,
21,0D,69,00,0C,8D,BC,3F,
21,0D,40,00,0C,56,BC,6B,
21,0C,FE,00,0C,1C,BC,96,
21,0C,CD,00,0B,DE,BC,C0,
21,0C,9A,00,0B,67,BC,E9,
21,0C,BB,00,0A,F2,BD,10,
21,0C,57,00,0A,84,BD,36,
21,0C,38,00,0A,03,BD,59,
21,0C,59,00,09,A2,BD,7B,
21,0C,34,00,09,2D,BD,9C,
21,0C,64,00,08,BE,BD,BB,
21,0C,89,00,08,44,BD,D9,
21,0C,5F,00,07,CC,BD,F4,
21,0C,53,00,07,5C,BE,0E,
21,0C,14,00,06,F0,BE,27,
21,0C,15,00,06,7A,BE,3D,
21,0B,FF,00,05,FF,BE,53,
21,0B,DC,00,05,88,BE,66,
21,0B,9D,00,05,17,BE,79,
21,0B,29,00,04,9E,BE,89,
21,0A,79,00,04,21,BE,97,
21,0A,42,00,03,9B,BE,A3,
11,09,DE,00,03,07,BE,AE,
11,09,96,00,02,72,BE,B6,
11,09,6C,00,01,ED,BE,BC,
11,09,AB,00,01,7A,BE,C0,
11,0A,36,00,01,22,BE,C3,
11,0B,54,00,00,E8,BE,C5,
11,0C,03,00,00,BF,BE,C7,
11,0C,6C,00,00,A8,BE,C7,
11,0C,65,00,00,98,BE,C9,
11,0C,66,00,00,00,BE,C9,
11,0C,54,00,00,00,BE,CB,
11,0C,57,00,00,00,BE,CB,
11,0C,26,00,00,00,BE,CB,
11,0C,0A,00,00,00,BE,CC,
11,0C,03,00,00,00,BE,CC,
11,0B,ED,00,00,00,BE,CC,
11,0B,EF,00,00,00,BE,CC,
11,0B,F2,00,00,00,BE,CC,
11,0B,EF,00,00,00,BE,CC,
11,0B,F7,00,00,00,BE,CC,
11,0C,0C,00,00,00,BE,CC,
11,0C,05,00,00,00,BE,CC,
11,0C,1B,00,00,00,BE,CD,
11,0C,16,00,00,00,BE,CD,
11,0C,09,00,00,00,BE,CD,
11,0C,0F,00,00,00,BE,CD,
11,0C,00,00,00,00,BE,CD,
11,0B,F3,00,00,00,BE,CD,
11,0B,F8,00,00,00,BE,CE,
11,0C,10,00,00,00,BE,CE,
11,0B,FF,00,00,00,BE,CE,
11,0B,E5,00,00,00,BE,CE,
11,0B,FD,00,00,00,BE,CE,
11,0C,08,00,00,00,BE,CF,
11,0B,F8,00,00,00,BE,CF,
11,0B,FE,00,00,00,BE,CF,
11,0C,10,00,00,00,BE,D0,
11,0B,F2,00,00,00,BE,D0,
11,0C,0D,00,00,00,BE,D0,
11,0C,0A,00,00,00,BE,D1,
11,0C,28,00,00,00,BE,D1,
11,0C,28,00,00,00,BE,D1,
11,0C,2D,00,00,00,BE,D2,
11,0C,17,00,00,00,BE,D2,
11,0C,0D,00,00,00,BE,D2,
11,0C,31,00,00,00,BE,D2,
11,0C,40,00,00,00,BE,D2,
11,0C,5A,00,00,00,BE,D2,
11,0C,59,00,00,00,BE,D2,
11,0C,45,00,00,00,BE,D2,
11,0C,31,00,00,00,BE,D2,
11,0C,44,00,00,00,BE,D2,
11,0B,FC,00,00,00,BE,D2,
11,0C,2E,00,00,00,BE,D2,
11,0C,11,00,00,00,BE,D2,
11,0C,14,00,00,00,BE,D2,
11,0C,2B,00,00,00,BE,D2,
11,0C,1F,00,00,00,BE,D2,
11,0C,1B,00,00,00,BE,D2,
11,0C,2B,00,00,00,BE,D2,
11,0C,35,00,00,00,BE,D2,
11,0C,24,00,00,00,BE,D2,
11,0C,0B,00,00,00,BE,D2,
11,0C,03,00,00,00,BE,D2,
11,0C,01,00,00,00,BE,D2,
11,0C,15,00,00,00,BE,D2,
11,0B,EE,00,00,00,BE,D2,
11,0C,10,00,00,00,BE,D2,
11,0C,1C,00,00,00,BE,D2,
11,0B,FF,00,00,00,BE,D2,
11,0C,19,00,00,00,BE,D2,
11,0C,2B,00,00,00,BE,D2,
11,0C,16,00,00,00,BE,D2,
11,0C,24,00,00,00,BE,D2,
11,0C,3D,00,00,00,BE,D2,
11,0C,42,00,00,00,BE,D2,
11,0C,4B,00,00,00,BE,D2,
11,0C,3E,00,00,00,BE,D2,
11,0C,32,00,00,00,BE,D2,
11,0C,54,00,00,00,BE,D2,
11,0C,41,00,00,00,BE,D2,
11,0C,3C,00,00,00,BE,D2,
11,0C,3E,00,00,00,BE,D2,
11,0C,0F,00,00,00,BE,D2,
11,0C,2F,00,00,00,BE,D2,
11,0C,37,00,00,00,BE,D2,
11,0C,30,00,00,00,BE,D2,
11,0C,26,00,00,00,BE,D2,
11,0C,1F,00,00,00,BE,D2,
11,0C,08,00,00,00,BE,D2,
11,0C,16,00,00,00,BE,D2,
11,0C,29,00,00,00,BE,D2,
11,0C,03,00,00,00,BE,D2,
11,0C,01,00,00,00,BE,D2,
11,0C,2B,00,00,00,BE,D2,
11,0C,33,00,00,00,BE,D2,
11,0C,34,00,00,00,BE,D2,
11,0C,0F,00,00,00,BE,D2,
11,0C,26,00,00,00,BE,D2,
11,0C,42,00,00,00,BE,D2,
11,0C,2B,00,00,00,BE,D2,
11,0C,23,00,00,00,BE,D2,
11,0C,3A,00,00,00,BE,D2,
11,0C,44,00,00,00,BE,D2,
11,0C,14,00,00,00,BE,D2,
11,0C,08,00,00,00,BE,D2,
11,0B,FB,00,00,00,BE,D2,
11,0C,20,00,00,00,BE,D2,
11,0C,1D,00,00,00,BE,D2,
11,0C,18,00,00,00,BE,D2,
11,0C,2D,00,00,00,BE,D2,
11,0B,C9,00,00,00,BE,D2,
11,0B,B9,00,00,00,BE,D2,
11,0B,D0,00,00,00,BE,D2,
11,0B,99,00,00,00,BE,D2,
11,0B,C7,00,00,00,BE,D2,
11,0B,D0,00,00,00,BE,D2,
11,0B,EF,00,00,00,BE,D2,
11,0C,0D,00,00,00,BE,D2,
11,0C,3F,00,00,00,BE,D2,
11,0C,24,00,00,00,BE,D2,
11,0C,35,00,00,00,BE,D2,
11,0C,5D,00,00,00,BE,D2,
11,0C,4B,00,00,00,BE,D2,
11,0C,22,00,00,00,BE,D2,
11,0C,58,00,00,00,BE,D2,
11,0C,22,00,00,00,BE,D2,
11,0C,38,00,00,00,BE,D2,
11,0C,31,00,00,00,BE,D2,
11,0C,1F,00,00,00,BE,D2,
11,0C,20,00,00,00,BE,D2,
11,0C,10,00,00,00,BE,D2,
11,0C,3A,00,00,00,BE,D2,
11,0C,3C,00,00,00,BE,D2,
11,0B,F5,00,00,00,BE,D2,
11,0C,04,00,00,00,BE,D2,
11,0C,31,00,00,00,BE,D2,
11,0B,FE,00,00,00,BE,D2,
11,0C,0A,00,00,00,BE,D2,
11,0C,4B,00,00,00,BE,D2,
11,0C,58,00,00,00,BE,D2,
11,0C,28,00,00,00,BE,D2,
11,0C,49,00,00,00,BE,D2,
11,0C,6B,00,00,00,BE,D2,
11,0C,22,00,00,00,BE,D2,
11,0C,3D,00,00,00,BE,D2,
11,0C,2B,00,00,00,BE,D2,
11,0C,57,00,00,00,BE,D2,
11,0C,45,00,00,00,BE,D2,
11,0C,00,00,00,00,BE,D2,
11,0C,1E,00,00,00,BE,D2,
11,0B,FA,00,00,00,BE,D2,
11,0B,A3,00,00,00,BE,D2,
11,0B,C4,00,00,00,BE,D2,
11,0B,CB,00,00,00,BE,D2,
11,0B,C8,00,00,00,BE,D2,
11,0B,C5,00,00,00,BE,D2,
11,0B,96,00,00,00,BE,D2,
11,0B,AD,00,00,00,BE,D2,
11,0B,A1,00,00,00,BE,D2,
11,0B,AE,00,00,00,BE,D2,
11,0B,92,00,00,00,BE,D2,
11,0B,8B,00,00,00,BE,D2,
11,0B,83,00,00,00,BE,D2,
11,0B,79,00,00,00,BE,D2,
11,0B,B4,00,00,00,BE,D2,
11,0B,93,00,00,00,BE,D2,
11,0B,97,00,00,00,BE,D2,
11,0B,C5,00,00,00,BE,D2,
11,0B,AE,00,00,00,BE,D2,
11,0B,C7,00,00,00,BE,D2,
11,0B,C1,00,00,00,BE,D2,
11,0B,C4,00,00,00,BE,D2,
11,0B,6F,00,00,00,BE,D2,
11,0B,90,00,00,00,BE,D2,
11,0B,8A,00,00,00,BE,D2,
11,0B,86,00,00,00,BE,D2,
11,0B,7E,00,00,00,BE,D2,
11,0B,A8,00,00,00,BE,D2,
11,0B,B8,00,00,00,BE,D2,
11,0B,85,00,00,00,BE,D2,
11,0B,C7,00,00,00,BE,D2,
11,0B,A5,00,00,00,BE,D2,
11,0B,5A,00,00,00,BE,D2,
11,0B,9A,00,00,00,BE,D2,
11,0B,9F,00,00,00,BE,D2,
11,0B,B9,00,00,00,BE,D2,
11,0B,9D,00,00,00,BE,D2,
11,0B,8C,00,00,00,BE,D2,
11,0B,A2,00,00,00,BE,D2,
11,0B,95,00,00,00,BE,D2,
11,0B,A7,00,00,00,BE,D2,
11,0B,EA,00,00,00,BE,D2,
11,0B,B2,00,00,00,BE,D2,
11,0B,C5,00,00,00,BE,D2,
11,0B,E5,00,00,00,BE,D2,
11,0B,C4,00,00,00,BE,D2,
11,0B,D0,00,00,00,BE,D2,
11,0B,BD,00,00,00,BE,D2,
11,0B,BD,00,00,00,BE,D2,
11,0B,B3,00,00,00,BE,D2,
11,0B,9C,00,00,00,BE,D2,
