    1  diff cacert.pem PTC_Root_CA.cer 
    2  node -version
    3  node -version
    4  node
    5  node
    6  nmp install -g @angular/cli@latest
    7  node
    8   install -g @angular/cli@latest
    9  npm  install -g @angular/cli@latest
   10  cd ../
   11  mkdir Angular9
   12  cd Angular9/
   13  ng new my-first-app
   14  ng server
   15  ng serve
   16  ll
   17  cd my-first-app/
   18  ng serve
   19  npm  install --save bootstrap@3
   20  npn audit fix
   21  npm audit fix
   22  ng serve
   23  ng serve
   24  ng serve
   25  ng g c servers
   26  ng g c servers
   27  ng serve
   28  ls -a
   29  find . -name graddle.properties
   30  ll
   31  cat id_rsa.pub
   32   ssh-keygen -t rsa -b 4096 -C nshaikh@ptc.com
   33  cat /d/Users/nshaikh/.ssh/id_rsa.pub
   34  grep -rl TypeDefinitionLoader_InheritedEVLCs_TestIntegration Met*
   35  grep -rl TypeDefinitionLoader_InheritedEVLCs_TestIntegration *
   36  grep -rl "dn" *
   37  grep -rl "dn" *
   38  grep -rl "ufi" *
   39  grep -rl "ufid" *
   40  grep -rl "WTorg" *
   41  grep -rl "WTOrg" *
   42  grep -rl "WTPri" *
   43  ssh-keygen -t rsa -b 4096 -C "nshaikh@ptc.com"
   44  ssh-keygen -t rsa -b 4096 -C "nshaikh@ptc.com"
   45  cd /d/rsaKey/
   46  ll
   47  cat runDeckSShKey.pub 
   48  ssh  linux134351.rd-plm.bdns.ptc.com
   49  cat runDeckSShKey
   50  pwd
   51  pwd
   52  cd /dev/
   53  cd /d
   54  mkdir rsaKey
   55  cd rsaKey/
   56  pwd
   57  ll
   58  ssh -i runDeckSShKey centos@linux134351.rd-plm.bdns.ptc.com
   59  ssh -i runDeckSShKey.pub centos@linux134351.rd-plm.bdns.ptc.com
   60  ssh -i /d/rsaKey/runDeckSShKey centos@linux134351.rd-plm.bdns.ptc.com
   61  ll
   62  cat runDeckSShKey.pub 
   63  ssh -i /d/rsaKey/runDeckSShKey centos@linux134351.rd-plm.bdns.ptc.com
   64  ssh -i runDeckSShKey centos@linux134351.rd-plm.bdns.ptc.com
   65   ssh-keygen -t rsa -b 4096 -C nshaikh@ptc.com
   66  ll
   67  cat rsaKey
   68  cat rsaKey.pub 
   69  ll
   70  ssh -i rsaKey centos@linux134351.rd-plm.bdns.ptc.com
   71  ssh -i rsaKey centos@linux134351.rd-plm.bdns.ptc.com
   72  ping linux134351.rd-plm.bdns.ptc.com
   73  ssh -i rsaKey centos@linux134351.rd-plm.bdns.ptc.com
   74  ssh -i rsaKey centos@linux134351.rd-plm.bdns.ptc.com
   75  pwd
   76  ssh -i rsaKey centos@linux134351.rd-plm.bdns.ptc.com
   77  vi a.js
   78  node a.js 
   79  mkdir 11Steps
   80  mkdir ~/11steps
   81  cd ~/11steps
   82  pwd
   83  git clone https://github.com/burrsutter/9stepsawesome
   84  mkdir bin
   85  cd bin
   86  curl -Lo minikube https://storage.googleapis.com/minikube/releases/v1.7.2/minikube-darwin-amd64
   87  chmod +x minikube
   88  ./minikube version
   89  ll
   90  chmod +x minikube
   91  curl -Lo minikube https://storage.googleapis.com/minikube/releases/v1.7.2/minikube-linux-amd64
   92  chmod +x minikube
   93  ./minikube version
   94  ll
   95  cd minikube 
   96  file minikube 
   97  rm -rf minikube 
   98  pwd
   99  curl -Lo minikube https://storage.googleapis.com/minikube/releases/v1.7.2/minikube-linux-amd64
  100  ll
  101  chmod 777 minikube 
  102  ./minikube version
  103  bash minikube 
  104  minibuke start
  105  minibuke status
  106  vi Loader.txt
  107  grep -rl "taskFormTemplate.xml" *
  108  ll
  109  less MethodServer-2008051123-27139-log4j.log.2020-08-05_01 
  110  node -version
  111  node --version
  112  npm install -g typescript
  113  cp preference.licenseNotification.Jaguar.xml BKP_preference.licenseNotification.Jaguar.xml
  114  fast
  115  fast -u
  116  du -sh * | egrep 'G
  117  |M'
  118  ping vagrant.ptcnet.ptc.com
  119  cd d:\users\nshaikh\.x2go
  120  cd Users/nshaikh/.x2go/
  121  df -h
  122  pwd
  123  df -h
  124  cd D:/InstalledSoftware/Git
  125  du -sh * | egrep 'G
  126  du -sh * | egrep 'G|M'
  127  less UpgradeManagerLog4j-12260.log 
  128  grep -A 1 "wt.org.WTUser" a.xml > user.xml
  129  less user.xml 
  130  grep -A1 "wt.org.WTUser" a.xml > user.xml
  131  less user.xml 
  132  grep -A 1 "wt.org.WTUser" a.xml 
  133  grep -A 1 "wt.org.WTUser" b.xml > user.xml
  134  less user.xml 
  135  grep -A 1 "wt.org.WTUser" c.xml > userLib.xml
  136  grep -A 1 "wt.org.WTUser" cLib.xml > userLib.xml
  137  grep -A 1 "wt.org.WTGroup" cLib.xml > userLib.xml
  138  grep -A 1 "wt.org.WTUser" cLib.xml > userLib.xml
  139  grep -A 1 "wt.org.WTUser" cLib.xml > userLibGrp.xml
  140  grep -A 1 "wt.org.WTGroup" cLib.xml > userLibGrp.xml
  141  ll
  142  less MethodServer-2009120637-59426-log4j.log 
  143  less MethodServer-2009120637-59426-log4j.log 
  144  less MethodServer-2009120637-59426-log4j.log 
  145  pwd
  146  cd ../../
  147  ll
  148  cd v2/
  149  ll
  150  cd ../../temp/
  151  grep -rl "WTGroup" *
  152  grep -rl "WTOrg" *
  153  less TemplateOutputFile_13.xml
  154  less TemplateOutputFile_13.xml
  155  less TemplateOutputFile_4.xml
  156  ll
  157  less UpgradeManagerLog4j-58687.log
  158  less MethodServer-2009101550-67790-
  159  less MethodServer-2009101550-67790-log4j.log 
  160  grep -rl "franck.warin" *
  161  less MethodServer-2009101550-67790-log4j.log 
  162  less MethodServer-2009101550-67790-log4j.log 
  163  grep -rl "Error in method" *
  164  less MethodServer-2009101550-67790-log4j.log 
  165  less MethodServer-2009101550-67790-log4j.log 
  166  less MethodServer-2009101550-67790-log4j.log 
  167  ssh-keygen -t rsa -b 4096 -C nshaikh@ptc.com
  168  ssh -i rsaKey.key centos@utfVM-142424
  169  ssh -i rsaKey.key windchill@utfVM-142424
  170  ssh -i rsaKey.key windchill@10.228.180.140
  171  ll
  172  cat rsaKey.key
  173  cat rsaKey.key.pub 
  174  ssh -i rsaKey.key windchill@10.228.180.102
  175  ll
  176  rm *_ja.xml
  177  ll
  178  ll | wc
  179  less createProjectTemplateUIDefault.xml
  180  less customerOrganizationTemplate.xml
  181  grep -rl "isInternal=/"false/"" *
  182  grep -rl "isInternal=\"false\"" *
  183  grep -A1 "isInternal=\"false\"" * > change.xml
  184  grep -A1 "isInternal=\"false\"" * > change.xml
  185  rm change.xml
  186  grep -A1 "isInternal=\"false\"" * > change.xml
  187  grep -rl "siteExternal" *
  188  grep -rl "orgExternal" *
  189  less enterpriseOrganizationTemplate.xml
  190  ssh matt@10.232.245.47
  191  ping 10.232.245.47
  192  du -sh * | egrep 'G|M'
  193  cd VirtualBox\ VMs/
  194  ll
  195  du -sh * | egrep 'G|M'
  196  cd windchillvm_default_1575012252170_89310
  197  ll
  198  du -sh * | egrep 'G|M'
  199  du -sh * | egrep 'G|M'
  200  ping kali
  201  ping 10.0.2.7
  202  ping 10.1.1.130
  203  node -version
  204  node version
  205  node --version
  206  cd /c/FROM_D/Study/NodeJs/weatherApp
  207  node httpRequest.js 
  208  fast
  209  fast 
  210  fast 
  211  fast -f
  212  fast -u
  213  fast -u
  214  fast -u
  215  fast -u
  216  find . -name StandardOrganizationServicesManager.java *
  217  find . -name StandardOrganizationServicesManager.java 
  218  less ./noDS/InterOps/backup_20200831212712/jaguar_175/jaguar_175/wcmod/modules/OrgSvcs/src/wt/org/StandardOrganizationServicesManager.java
  219  less ./noDS/InterOps/jaguar_191/wcmod/modules/OrgSvcs/src/wt/org/StandardOrganizationServicesManager.java
  220  less ./noDS/PJL/july13/OrgSvcs/src/wt/org/StandardOrganizationServicesManager.java
  221  less ./noDS/PJL/StandardOrganizationServicesManager.java
  222  less ./spr/jaguar_241_SPR_10146162_InternalDisonnectedPrincipals/wcmod/modules/OrgSvcs/src/wt/org/StandardOrganizationServicesManager.java
  223  grep -rl "(DirContext.getDatabaseRepository().equalsIgnoreCase(service) || service == null" *
  224  pwd
  225  exit
  226  node -v
  227  mkdir botUsingNodeJS
  228  mdkir node
  229  mkdir node
  230  cd node/
  231  npm init
  232  ll
  233  cd ../botUsingNodeJS/nodes/
  234  ll
  235  node bot.js 
  236  node bot.js 
  237  node bot.js 
  238  node bot.js 
  239  node bot.js 
  240  node bot.js 
  241  pwd
  242  cd ../
  243  mkdir EchoBot
  244  cd EchoBot/
  245  npm init
  246  ll
  247  ll
  248  nodemon bot.js 
  249  nodemon bot.js 
  250  nodemon bot.js 
  251  cd ../
  252  mkdir MediaBot
  253  npm init -y
  254  cd MediaBot/
  255  npm init -y
  256  nodemon mediaBot.js 
  257  cd ../
  258  mkdir APIBot
  259  cd APIBot/
  260  npm init -y
  261  cd ../MediaBot/
  262  nodemon mediaBot.js 
  263  cd -
  264  ll
  265  nodemon apiBot.js 
  266  python -v
  267  python v
  268  python 
  269  nodemon apiBot.js 
  270  ll
  271  nodemon apiBot.js 
  272  PWD
  273  grep -rl "*pdf" *
  274  find -iname '*.pdf'
  275  vi forMysql.yaml
  276  mkdir servicesPort
  277  cd servicesPort/
  278  touch clusterPod.yaml
  279  fast -u
  280  fast -u
  281  fast -u
  282  fast -u
  283  fast -u
  284  ls
  285  ls
  286  nodemon mediaBot.js 
  287  cd ../APIBot/
  288  nodemon mediaBot.js 
  289  ll
  290  nodemon apiBot.js 
  291  fast -u
  292  cd s
  293  src
  294  cd src/
  295  ll
  296  node npm-main.js 
  297  cd ..
  298  node npm-main.js 
  299  npm start
  300  npm install
  301  cd - ; node npm-main.js 
  302  cd ../../../
  303  rm -rf mapjs-master*
  304  ll
  305  cd mapjs-master/
  306  ll
  307  rm -rf *
  308  git clone git@gitlab.rd-services.aws.ptc.com:snowball/core/cubemanss.git
  309  minikube version
  310  minikube status
  311  minikube start --vm-driver="hyper-v" --hyperv-virtual-switch="minikube"
  312  minikube start --vm-driver="hyper-v" --hyperv-virtual-switch="minikube"
  313  minikube delete
  314  minikube start --vm-driver="hyper-v" --hyperv-virtual-switch="minikube"
  315  minikube start --vm-driver="hyperv" --hyperv-virtual-switch="minikube"
  316  minikube status
  317  cd ..
  318  ll
  319  mv  04_04_Rolling_updates SKIP_04_04_Rolling_updates
  320  ll
  321  cd 05_01_RealWorld
  322  ll
  323  kubectl apply -f guestbook.yaml 
  324  kubectl get services
  325  minikube frontend
  326  kubectl apply -f https://raw.githubusercontent.com/kubernetes/dashboard/v2.0.0-rc6/aio/deploy/recommended.yaml
  327  kubectl get all -n kubernetes-dashboard
  328  kubectl proxy
  329  curl -Lo minikube https://storage.googleapis.com/minikube/releases/latest/minikube-linux-amd64
  330  chmod +x ./minikube
  331  sudo mv ./minikube /usr/local/bin/
  332  mv ./minikube /usr/local/bin/
  333  cd /usr/
  334  ll
  335  cd -
  336  minikube
  337  minikube status
  338  docker version
  339  docker version
  340  CD /c/FROM_D/Study/K8S/
  341  cd /c/FROM_D/Study/K8S/
  342  vi 12FactorApp.txt
  343  vi 12FactorApp.txt
  344  docker version
  345  kubectl version
  346  minikube start --driver="hyperv" --virtual-switch="minikube"
  347  minikube start --driver="hyperv" --hyperv-virtual-switch="minikube"
  348  minikube start --driver="hyperv" --hyperv-virtual-switch="minikube"
  349  minikube start --vm-driver="hyperv" --hyperv-virtual-switch="minikube"
  350  minikube start --vm-driver="hyperv" --hyperv-virtual-switch="minikube"
  351  install hyperv
  352  docker pull ci-images-docker.artifacts-na.rd-services.aws.ptc.com/mongo:latest
  353  mkdir Gitlab
  354  cd Gitlab/
  355  mkdir Project001
  356  cd Project001/
  357  ll
  358  cd ..
  359  git config --global user.name "Naeem Shaikh"
  360  git config --global user.name
  361  git config --global user.email "nayem.smj01@gmail.com"
  362  git config --global user.email 
  363  git config --global -list
  364  git config --global --list
  365  cd Project001/
  366  ll
  367  git init
  368  ll -a
  369  git status
  370  vi ReadMe.txt
  371  git status
  372  git add .
  373  git commit -m "1st gitlab commit"
  374  git push -u "https://gitlab.com/nayem.smj01/testproject-01" master
  375  cd
  376  cd -
  377  cd
  378  ll
  379  ls -a
  380  ssh-keygen
  381  touch /d/Study_D/Gitlab/keys/sshKey
  382  mkdir -p /d/Study_D/Gitlab/keys/
  383  touch /d/Study_D/Gitlab/keys/sshKey
  384  ssh-keygen
  385  cd /d/Study_D/Gitlab/keys/
  386  ll
  387  cat sshKey.pub
  388  cd -
  389  cd /d/Study_D/Gitlab/k
  390  cd /d/Study_D/Gitlab/
  391  cd Project001/
  392  git push -u "https://gitlab.com/nayem.smj01/testproject-01" master
  393  git push -u origin master
  394  git push -u "https://gitlab.com/nayem.smj01/testproject-01" master
  395  git push -u "https://gitlab.com/nayem.smj01/testproject-01" master
  396   git config --system --unset credential.helper
  397  git config --system --unset credential.helper
  398  cd ../
  399  mkdir Project002
  400  cd Project002
  401  git clone https://gitlab.com/nayem.smj01/testproject-01.git
  402  vi temp.txt
  403  git st
  404  git status
  405  ll
  406  mv temp.txt testproject-01/
  407  cd testproject-01/
  408  git st
  409  git status
  410  git add .
  411  git commit -m "1st gitlab commit"
  412  git push
  413  git push -u "https://gitlab.com/nayem.smj01/testproject-01.git" master
  414  cat ../../keys/sshKey.pub 
  415  ll
  416  git push -u "https://gitlab.com/nayem.smj01/testproject-01.git" master
  417  git push -u "git@gitlab.com:nayem.smj01/testproject-01.git" master
  418  git conifg --global user.name
  419  git config --global user.name
  420  git config --global user.email
  421  git config  user.name "nayem.smj01" --replace-all
  422  git config  user.email "nayem.smj01@gmail.com" --replace-all
  423  git push -u "https://gitlab.com/nayem.smj01/testproject-01.git" master
  424  git config  user.email "nayem.smj01@gmail.com" --replace-all
  425  git config  user.name "Naeem Shaikh" --replace-all
  426  git push -u "https://gitlab.com/nayem.smj01/testproject-01.git" master
  427  LL
  428  ll
  429  ll -a
  430  cd .git/
  431  ll
  432  cd config 
  433  rm config 
  434  cd ..
  435  git pull
  436  git pull origin master
  437  git pull -u origin master
  438  git pull -u "https://gitlab.com/nayem.smj01/testproject-01.git" master
  439  cd ../../
  440  git clone https://gitlab.com/nayem.smj01/testproject-01.git
  441  cd testproject-01/ ; history > at.txt
