<?xml version="1.0" encoding="UTF-8"?>
<!DOCTYPE suite SYSTEM "http://testng.org/testng-1.0.dtd">
<suite name="Failed suite [Tests]" guice-stage="DEVELOPMENT" verbose="0">
  <test name="primerTest(failed)">
    <classes>
      <class name="HomeTest">
        <methods>
          <include name="homeTest"/>
        </methods>
      </class> <!-- HomeTest -->
      <class name="LoginTest">
        <methods>
          <include name="loginTest"/>
          <include name="setUpDriver"/>
        </methods>
      </class> <!-- LoginTest -->
    </classes>
  </test> <!-- primerTest(failed) -->
</suite> <!-- Failed suite [Tests] -->
