-------------------------------------------------------------------------------
Test set: BingSearchTests
-------------------------------------------------------------------------------
Tests run: 3, Failures: 0, Errors: 0, Skipped: 0, Time elapsed: 22.915 s - in BingSearchTests
