12:47:41|Info|CalculatorManager.EvaluateExpressions => CalculatorManager.getProcessor => ProcessorFactory.GetProcessorInstance|Text file processor initiated
12:47:41|Info|TextFileProcessor.Execute => TextFileProcessor.getExpressionsResult => ExpressionExecutor.Execute|7/7+2 = 3
12:47:41|Info|TextFileProcessor.Execute => TextFileProcessor.getExpressionsResult => ExpressionExecutor.Execute|3*5/2 = 7.5
12:47:41|Info|TextFileProcessor.Execute => TextFileProcessor.getExpressionsResult => ExpressionExecutor.Execute|1-3+2+7-2 = -9
12:47:41|Info|TextFileProcessor.Execute => TextFileProcessor.getExpressionsResult => ExpressionExecutor.Execute|5.2*7/3.5 = 10.4
12:47:41|Info|TextFileProcessor.Execute => TextFileProcessor.getExpressionsResult => ExpressionExecutor.Execute|7+9 = 16
12:47:41|Info|TextFileProcessor.Execute => TextFileProcessor.getExpressionsResult => ExpressionExecutor.Execute|-2-2 = -4
12:47:41|Info|TextFileProcessor.Execute => TextFileProcessor.getExpressionsResult => ExpressionExecutor.Execute|55.6 = 55.6
12:47:41|Info|TextFileProcessor.Execute => TextFileProcessor.getExpressionsResult => ExpressionExecutor.Execute|394.7788+20*14 = 674.7788
12:47:41|Error|TextFileProcessor.Execute => TextFileProcessor.getExpressionsResult => ExpressionExecutor.Execute|abc = Invalid Expression 
12:47:41|Error|TextFileProcessor.Execute => TextFileProcessor.getExpressionsResult => ExpressionExecutor.Execute|[1234] = Invalid Expression 
12:47:41|Error|TextFileProcessor.Execute => TextFileProcessor.getExpressionsResult => ExpressionExecutor.Execute|23&21 = Invalid Expression 
12:47:41|Info|TextFileProcessor.Execute => TextFileProcessor.getExpressionsResult => ExpressionExecutor.Execute|21-.2 = 20.8
12:47:41|Error|TextFileProcessor.Execute => TextFileProcessor.getExpressionsResult => ExpressionExecutor.Execute|5.2/0 = Invalid Expression as encountered divide by zero.
