12:49:13|Info|CalculatorManager.EvaluateExpressions => CalculatorManager.getProcessor => ProcessorFactory.GetProcessorInstance|Argument processor initiated
12:49:13|Info|CalculatorManager.EvaluateExpressions => ArgumentProcessor.Execute => ExpressionExecutor.Execute|3.55*17.2/12 = 5.088333333333333
12:49:13|Info|CalculatorManager.EvaluateExpressions => CalculatorManager.getProcessor => ProcessorFactory.GetProcessorInstance|Argument processor initiated
12:49:13|Info|CalculatorManager.EvaluateExpressions => ArgumentProcessor.Execute => ExpressionExecutor.Execute|18-18/6 = 15
12:49:13|Info|CalculatorManager.EvaluateExpressions => CalculatorManager.getProcessor => ProcessorFactory.GetProcessorInstance|Argument processor initiated
12:49:13|Error|CalculatorManager.EvaluateExpressions => ArgumentProcessor.Execute => ExpressionExecutor.Execute|2**90 = Invalid Expression 
12:49:13|Info|CalculatorManager.EvaluateExpressions => CalculatorManager.getProcessor => ProcessorFactory.GetProcessorInstance|Text file processor initiated
12:49:13|Info|TextFileProcessor.Execute => TextFileProcessor.getExpressionsResult => ExpressionExecutor.Execute|7/7+2 = 3
12:49:13|Info|TextFileProcessor.Execute => TextFileProcessor.getExpressionsResult => ExpressionExecutor.Execute|3*5/2 = 7.5
12:49:13|Info|TextFileProcessor.Execute => TextFileProcessor.getExpressionsResult => ExpressionExecutor.Execute|1-3+2+7-2 = -9
12:49:13|Info|TextFileProcessor.Execute => TextFileProcessor.getExpressionsResult => ExpressionExecutor.Execute|5.2*7/3.5 = 10.4
12:49:13|Info|TextFileProcessor.Execute => TextFileProcessor.getExpressionsResult => ExpressionExecutor.Execute|7+9 = 16
12:49:13|Info|TextFileProcessor.Execute => TextFileProcessor.getExpressionsResult => ExpressionExecutor.Execute|-2-2 = -4
12:49:13|Info|TextFileProcessor.Execute => TextFileProcessor.getExpressionsResult => ExpressionExecutor.Execute|55.6 = 55.6
12:49:13|Info|TextFileProcessor.Execute => TextFileProcessor.getExpressionsResult => ExpressionExecutor.Execute|394.7788+20*14 = 674.7788
12:49:13|Error|TextFileProcessor.Execute => TextFileProcessor.getExpressionsResult => ExpressionExecutor.Execute|abc = Invalid Expression 
12:49:13|Error|TextFileProcessor.Execute => TextFileProcessor.getExpressionsResult => ExpressionExecutor.Execute|[1234] = Invalid Expression 
12:49:13|Error|TextFileProcessor.Execute => TextFileProcessor.getExpressionsResult => ExpressionExecutor.Execute|23&21 = Invalid Expression 
12:49:13|Info|TextFileProcessor.Execute => TextFileProcessor.getExpressionsResult => ExpressionExecutor.Execute|21-.2 = 20.8
12:49:13|Error|TextFileProcessor.Execute => TextFileProcessor.getExpressionsResult => ExpressionExecutor.Execute|5.2/0 = Invalid Expression as encountered divide by zero.
