{
  "images" : [
    {
      "filename" : "s_history.png",
      "idiom" : "universal",
      "scale" : "1x"
    },
    {
      "filename" : "s_history@2x.png",
      "idiom" : "universal",
      "scale" : "2x"
    },
    {
      "filename" : "s_history@3x.png",
      "idiom" : "universal",
      "scale" : "3x"
    }
  ],
  "info" : {
    "author" : "xcode",
    "version" : 1
  }
}
