{
    "$schema": "https://docs.renovatebot.com/renovate-schema.json",
    "extends": [
      "config:base"
    ],
    "bumpVersion": "minor",
    "regexManagers": [
      {
        "fileMatch": ["(^|/)Chart\\.yaml$"],
        "matchStrings": [
          "#\\s?renovate: image=(?<depName>.*?)\\s?appVersion:\\s?\\\"?(?<currentValue>[\\w+\\.\\-]*)",
          "#\\s?renovate: image=(?<depName>.*?)\\s?version:\\s?\\\"?(?<currentValue>[\\w+\\.\\-]*)"
        ],
        "datasourceTemplate": "docker"
      }
    ],
    "packageRules": [
      {
        "matchPackagePatterns": [
          "*"
        ],
        "matchUpdateTypes": [
          "minor",
          "patch"
        ],
        "groupName": "all non-major dependencies",
        "groupSlug": "all-minor-patch",
        "automerge": true,
        "ignoreTests": true
      }
    ]
  }