{
  "devFiles": [],
  "pages": {
    "/1privacy-policy": [
      "static/runtime/webpack-89179faa512dd01fbb62.js",
      "static/css/commons.4edb1a43.chunk.css",
      "static/chunks/commons.fed509acf0a5806a0688.js",
      "static/css/styles.a080b58f.chunk.css",
      "static/chunks/styles.52eb12d9e7724196324a.js",
      "static/runtime/main-0a28cce113a267801947.js"
    ],
    "/about": [
      "static/runtime/webpack-89179faa512dd01fbb62.js",
      "static/css/commons.4edb1a43.chunk.css",
      "static/chunks/commons.fed509acf0a5806a0688.js",
      "static/css/styles.a080b58f.chunk.css",
      "static/chunks/styles.52eb12d9e7724196324a.js",
      "static/runtime/main-0a28cce113a267801947.js"
    ],
    "/cart": [
      "static/runtime/webpack-89179faa512dd01fbb62.js",
      "static/css/commons.4edb1a43.chunk.css",
      "static/chunks/commons.fed509acf0a5806a0688.js",
      "static/css/styles.a080b58f.chunk.css",
      "static/chunks/styles.52eb12d9e7724196324a.js",
      "static/runtime/main-0a28cce113a267801947.js"
    ],
    "/cart1": [
      "static/runtime/webpack-89179faa512dd01fbb62.js",
      "static/css/commons.4edb1a43.chunk.css",
      "static/chunks/commons.fed509acf0a5806a0688.js",
      "static/runtime/main-0a28cce113a267801947.js"
    ],
    "/checkout": [
      "static/runtime/webpack-89179faa512dd01fbb62.js",
      "static/css/commons.4edb1a43.chunk.css",
      "static/chunks/commons.fed509acf0a5806a0688.js",
      "static/css/styles.a080b58f.chunk.css",
      "static/chunks/styles.52eb12d9e7724196324a.js",
      "static/runtime/main-0a28cce113a267801947.js"
    ],
    "/checkout1": [
      "static/runtime/webpack-89179faa512dd01fbb62.js",
      "static/css/commons.4edb1a43.chunk.css",
      "static/chunks/commons.fed509acf0a5806a0688.js",
      "static/runtime/main-0a28cce113a267801947.js"
    ],
    "/contact": [
      "static/runtime/webpack-89179faa512dd01fbb62.js",
      "static/css/commons.4edb1a43.chunk.css",
      "static/chunks/commons.fed509acf0a5806a0688.js",
      "static/css/styles.a080b58f.chunk.css",
      "static/chunks/styles.52eb12d9e7724196324a.js",
      "static/runtime/main-0a28cce113a267801947.js"
    ],
    "/index": [
      "static/runtime/webpack-89179faa512dd01fbb62.js",
      "static/css/commons.4edb1a43.chunk.css",
      "static/chunks/commons.fed509acf0a5806a0688.js",
      "static/css/styles.a080b58f.chunk.css",
      "static/chunks/styles.52eb12d9e7724196324a.js",
      "static/runtime/main-0a28cce113a267801947.js"
    ],
    "/join-us": [
      "static/runtime/webpack-89179faa512dd01fbb62.js",
      "static/css/commons.4edb1a43.chunk.css",
      "static/chunks/commons.fed509acf0a5806a0688.js",
      "static/css/styles.a080b58f.chunk.css",
      "static/chunks/styles.52eb12d9e7724196324a.js",
      "static/runtime/main-0a28cce113a267801947.js"
    ],
    "/join-us1": [
      "static/runtime/webpack-89179faa512dd01fbb62.js",
      "static/css/commons.4edb1a43.chunk.css",
      "static/chunks/commons.fed509acf0a5806a0688.js",
      "static/css/styles.a080b58f.chunk.css",
      "static/chunks/styles.52eb12d9e7724196324a.js",
      "static/runtime/main-0a28cce113a267801947.js"
    ],
    "/mainCategory": [
      "static/runtime/webpack-89179faa512dd01fbb62.js",
      "static/css/commons.4edb1a43.chunk.css",
      "static/chunks/commons.fed509acf0a5806a0688.js",
      "static/css/styles.a080b58f.chunk.css",
      "static/chunks/styles.52eb12d9e7724196324a.js",
      "static/runtime/main-0a28cce113a267801947.js"
    ],
    "/paymentSuccess": [
      "static/runtime/webpack-89179faa512dd01fbb62.js",
      "static/css/commons.4edb1a43.chunk.css",
      "static/chunks/commons.fed509acf0a5806a0688.js",
      "static/css/styles.a080b58f.chunk.css",
      "static/chunks/styles.52eb12d9e7724196324a.js",
      "static/runtime/main-0a28cce113a267801947.js"
    ],
    "/paymentSuccess1": [
      "static/runtime/webpack-89179faa512dd01fbb62.js",
      "static/css/commons.4edb1a43.chunk.css",
      "static/chunks/commons.fed509acf0a5806a0688.js",
      "static/runtime/main-0a28cce113a267801947.js"
    ],
    "/privacy-policy": [
      "static/runtime/webpack-89179faa512dd01fbb62.js",
      "static/css/commons.4edb1a43.chunk.css",
      "static/chunks/commons.fed509acf0a5806a0688.js",
      "static/css/styles.a080b58f.chunk.css",
      "static/chunks/styles.52eb12d9e7724196324a.js",
      "static/runtime/main-0a28cce113a267801947.js"
    ],
    "/product": [
      "static/runtime/webpack-89179faa512dd01fbb62.js",
      "static/css/commons.4edb1a43.chunk.css",
      "static/chunks/commons.fed509acf0a5806a0688.js",
      "static/css/styles.a080b58f.chunk.css",
      "static/chunks/styles.52eb12d9e7724196324a.js",
      "static/runtime/main-0a28cce113a267801947.js"
    ],
    "/productCategory": [
      "static/runtime/webpack-89179faa512dd01fbb62.js",
      "static/css/commons.4edb1a43.chunk.css",
      "static/chunks/commons.fed509acf0a5806a0688.js",
      "static/css/styles.a080b58f.chunk.css",
      "static/chunks/styles.52eb12d9e7724196324a.js",
      "static/runtime/main-0a28cce113a267801947.js"
    ],
    "/subCategory": [
      "static/runtime/webpack-89179faa512dd01fbb62.js",
      "static/css/commons.4edb1a43.chunk.css",
      "static/chunks/commons.fed509acf0a5806a0688.js",
      "static/css/styles.a080b58f.chunk.css",
      "static/chunks/styles.52eb12d9e7724196324a.js",
      "static/runtime/main-0a28cce113a267801947.js"
    ],
    "/terms-conditions": [
      "static/runtime/webpack-89179faa512dd01fbb62.js",
      "static/css/commons.4edb1a43.chunk.css",
      "static/chunks/commons.fed509acf0a5806a0688.js",
      "static/css/styles.a080b58f.chunk.css",
      "static/chunks/styles.52eb12d9e7724196324a.js",
      "static/runtime/main-0a28cce113a267801947.js"
    ],
    "/terms-conditions1": [
      "static/runtime/webpack-89179faa512dd01fbb62.js",
      "static/css/commons.4edb1a43.chunk.css",
      "static/chunks/commons.fed509acf0a5806a0688.js",
      "static/css/styles.a080b58f.chunk.css",
      "static/chunks/styles.52eb12d9e7724196324a.js",
      "static/runtime/main-0a28cce113a267801947.js"
    ],
    "/thankyou": [
      "static/runtime/webpack-89179faa512dd01fbb62.js",
      "static/css/commons.4edb1a43.chunk.css",
      "static/chunks/commons.fed509acf0a5806a0688.js",
      "static/css/styles.a080b58f.chunk.css",
      "static/chunks/styles.52eb12d9e7724196324a.js",
      "static/runtime/main-0a28cce113a267801947.js"
    ],
    "/thankyou1": [
      "static/runtime/webpack-89179faa512dd01fbb62.js",
      "static/css/commons.4edb1a43.chunk.css",
      "static/chunks/commons.fed509acf0a5806a0688.js",
      "static/css/styles.a080b58f.chunk.css",
      "static/chunks/styles.52eb12d9e7724196324a.js",
      "static/runtime/main-0a28cce113a267801947.js"
    ],
    "/_app": [
      "static/runtime/webpack-89179faa512dd01fbb62.js",
      "static/css/commons.4edb1a43.chunk.css",
      "static/chunks/commons.fed509acf0a5806a0688.js",
      "static/runtime/main-0a28cce113a267801947.js"
    ],
    "/_error": [
      "static/runtime/webpack-89179faa512dd01fbb62.js",
      "static/css/commons.4edb1a43.chunk.css",
      "static/chunks/commons.fed509acf0a5806a0688.js",
      "static/runtime/main-0a28cce113a267801947.js"
    ],
    "/": [
      "static/runtime/webpack-89179faa512dd01fbb62.js",
      "static/css/commons.4edb1a43.chunk.css",
      "static/chunks/commons.fed509acf0a5806a0688.js",
      "static/css/styles.a080b58f.chunk.css",
      "static/chunks/styles.52eb12d9e7724196324a.js",
      "static/runtime/main-0a28cce113a267801947.js"
    ]
  }
}