<svg width="16" height="24" viewBox="0 0 16 24" fill="none" xmlns="http://www.w3.org/2000/svg">
<g id="ic/wine-glass-half">
<g id="ic/wine-glass-half_2">
<path id="oversized-wine-glass" d="M8 0C6.02882 0 2.08646 0 2.08646 0C1.67097 0 1.29671 0.234905 1.14272 0.592731C0.41811 2.27513 0 4.01069 0 5.40598C0 9.22984 3.12518 12.3758 7.13672 12.7753V20.9864C4.41874 21.1925 2.33516 22.3121 2.33516 22.875C2.33516 23.4968 4.87141 24 8.00037 24C8 22 8 2 8 0Z" fill="#EDC277"/>
</g>
</g>
</svg>
