<svg width="24" height="24" viewBox="0 0 24 24" fill="none" xmlns="http://www.w3.org/2000/svg">
<path d="M20.9844 0H6.90393C7.35016 0.589417 7.625 1.31488 7.625 2.10938V2.8125H23.0938V2.10938C23.0938 0.944458 22.1493 0 20.9844 0Z" fill="#CBCFD1"/>
<path d="M10.4375 7.78125H9.03125V9.1875H7.625V7.78125H6.21875V12H10.4375V7.78125Z" fill="#CBCFD1"/>
<path d="M10.4375 16.2188H9.03125V17.625H7.625V16.2188H6.21875V20.4375H10.4375V16.2188Z" fill="#CBCFD1"/>
<path fill-rule="evenodd" clip-rule="evenodd" d="M4.10938 0C2.94446 0 2 0.944458 2 2.10938V24H20.2812V4.21875H6.21875V2.10938C6.21875 0.944458 5.27429 0 4.10938 0ZM11.8438 21.8438H4.8125V14.8125H11.8438V21.8438ZM17.4688 6.375H13.25V7.78125H17.4688V6.375ZM13.25 9.1875H16.0625V10.5938H13.25V9.1875ZM17.4688 14.8125H13.25V16.2188H17.4688V14.8125ZM13.25 17.625H16.0625V19.0312H13.25V17.625ZM11.8438 13.4062V6.375H4.8125V13.4062H11.8438Z" fill="#CBCFD1"/>
</svg>
