<svg width="24" height="24" viewBox="0 0 24 24" fill="none" xmlns="http://www.w3.org/2000/svg">
<g id="ic/shopping_cart">
<path id="shopping-cart" fill-rule="evenodd" clip-rule="evenodd" d="M21 16L21.5 14H7.99999L5.49999 2.00012H0V4H3.99999L6.49999 16H21ZM9.99999 12H22L24 4H7.99999L9.99999 12ZM10.5 17.7145C11.7427 17.7145 12.75 18.6738 12.75 19.8571C12.75 21.0405 11.7427 21.9999 10.5 21.9999C9.25738 21.9999 8.24998 21.0405 8.24998 19.8571C8.24998 18.6738 9.25738 17.7145 10.5 17.7145ZM20.25 19.8571C20.25 18.6738 19.2427 17.7145 18 17.7145C16.7574 17.7145 15.75 18.6738 15.75 19.8571C15.75 21.0405 16.7574 21.9999 18 21.9999C19.2427 21.9999 20.25 21.0405 20.25 19.8571Z" fill="#EDC277"/>
</g>
</svg>
