<svg width="24" height="24" viewBox="0 0 24 24" fill="none" xmlns="http://www.w3.org/2000/svg">
<path d="M11.4142 6.34352L10 7.75773L14.2426 12.0004L10 16.243L11.4142 17.6572L17.0711 12.0004L11.4142 6.34352Z" fill="#CBCFD1"/>
</svg>
