<svg width="19" height="18" viewBox="0 0 19 18" fill="none" xmlns="http://www.w3.org/2000/svg">
<path fill-rule="evenodd" clip-rule="evenodd" d="M12.46 11.0303H13.25L18.24 16.0303L16.75 17.5203L11.75 12.5303V11.7403L11.48 11.4603C10.34 12.4403 8.86 13.0303 7.25 13.0303C3.66 13.0303 0.75 10.1203 0.75 6.53027C0.75 2.94027 3.66 0.0302734 7.25 0.0302734C10.84 0.0302734 13.75 2.94027 13.75 6.53027C13.75 8.14027 13.16 9.62027 12.18 10.7603L12.46 11.0303ZM2.75 6.53027C2.75 9.02027 4.76 11.0303 7.25 11.0303C9.74 11.0303 11.75 9.02027 11.75 6.53027C11.75 4.04027 9.74 2.03027 7.25 2.03027C4.76 2.03027 2.75 4.04027 2.75 6.53027Z" fill="#CBCFD1"/>
</svg>
