<svg width="24" height="24" viewBox="0 0 24 24" fill="none" xmlns="http://www.w3.org/2000/svg">
<path fill-rule="evenodd" clip-rule="evenodd" d="M17 2H6V10H16C17.1046 10 18 10.8954 18 12V18C18 19.1046 17.1046 20 16 20H6V22H22V7H19C17.8954 7 17 6.10457 17 5V2ZM4 2V10H2C0.895431 10 0 10.8954 0 12V18C0 19.1046 0.89543 20 2 20H4V22C4 23.1046 4.89543 24 6 24H22C23.1046 24 24 23.1046 24 22V5L19 0H6C4.89543 0 4 0.89543 4 2ZM14.5752 16.3438C14.7217 16.1152 14.8018 15.8525 14.8154 15.5557H13.793C13.7852 15.7979 13.7188 15.9746 13.5938 16.0859C13.4688 16.1973 13.2881 16.2529 13.0518 16.2529C12.7725 16.2529 12.5752 16.1553 12.46 15.96C12.3467 15.7646 12.29 15.4395 12.29 14.9844V14.6826C12.2959 14.2627 12.3584 13.957 12.4775 13.7656C12.5967 13.5742 12.7842 13.4785 13.04 13.4785C13.292 13.4785 13.4795 13.5352 13.6025 13.6484C13.7256 13.7617 13.791 13.9482 13.7988 14.208H14.8242C14.7812 13.7295 14.6025 13.3545 14.2881 13.083C13.9736 12.8096 13.5576 12.6729 13.04 12.6729C12.6807 12.6729 12.3643 12.7588 12.0908 12.9307C11.8174 13.1006 11.6074 13.3428 11.4609 13.6572C11.3164 13.9697 11.2441 14.335 11.2441 14.7529V14.9639C11.2441 15.6299 11.4053 16.1455 11.7275 16.5107C12.0498 16.876 12.4912 17.0586 13.0518 17.0586C13.3916 17.0586 13.6934 16.9961 13.957 16.8711C14.2227 16.7461 14.4287 16.5703 14.5752 16.3438ZM10.834 14.9551C10.834 15.3711 10.7568 15.7393 10.6025 16.0596C10.4482 16.3799 10.2285 16.627 9.94336 16.8008C9.66016 16.9727 9.33691 17.0586 8.97363 17.0586C8.61035 17.0586 8.28809 16.9756 8.00684 16.8096C7.72559 16.6416 7.50586 16.4023 7.34766 16.0918C7.19141 15.7812 7.10938 15.4248 7.10156 15.0225V14.7822C7.10156 14.3643 7.17773 13.9961 7.33008 13.6777C7.48438 13.3574 7.7041 13.1104 7.98926 12.9365C8.27637 12.7627 8.60254 12.6758 8.96777 12.6758C9.3291 12.6758 9.65137 12.7617 9.93457 12.9336C10.2178 13.1055 10.4375 13.3506 10.5938 13.6689C10.752 13.9854 10.832 14.3486 10.834 14.7588V14.9551ZM9.78809 14.7764C9.78809 14.3525 9.7168 14.0312 9.57422 13.8125C9.43359 13.5918 9.23145 13.4814 8.96777 13.4814C8.45215 13.4814 8.17969 13.8682 8.15039 14.6416L8.14746 14.9551C8.14746 15.373 8.2168 15.6943 8.35547 15.9189C8.49414 16.1436 8.7002 16.2559 8.97363 16.2559C9.2334 16.2559 9.43359 16.1455 9.57422 15.9248C9.71484 15.7041 9.78613 15.3867 9.78809 14.9727V14.7764ZM3.34277 17V12.7344H4.7168C5.09375 12.7344 5.43262 12.8203 5.7334 12.9922C6.03418 13.1621 6.26855 13.4033 6.43652 13.7158C6.60645 14.0264 6.69238 14.375 6.69434 14.7617V14.958C6.69434 15.3486 6.61133 15.6992 6.44531 16.0098C6.28125 16.3184 6.04883 16.5605 5.74805 16.7363C5.44922 16.9102 5.11523 16.998 4.74609 17H3.34277ZM4.37109 13.5283V16.209H4.72852C5.02344 16.209 5.25 16.1045 5.4082 15.8955C5.56641 15.6846 5.64551 15.3721 5.64551 14.958V14.7734C5.64551 14.3613 5.56641 14.0508 5.4082 13.8418C5.25 13.6328 5.01953 13.5283 4.7168 13.5283H4.37109Z" fill="#CBCFD1"/>
</svg>
