<svg width="24" height="24" viewBox="0 0 24 24" fill="none" xmlns="http://www.w3.org/2000/svg">
<path fill-rule="evenodd" clip-rule="evenodd" d="M17 2H6V10H16C17.1046 10 18 10.8954 18 12V18C18 19.1046 17.1046 20 16 20H6V22H22V7H19C17.8954 7 17 6.10457 17 5V2ZM4 2V10H2C0.895431 10 0 10.8954 0 12V18C0 19.1046 0.89543 20 2 20H4V22C4 23.1046 4.89543 24 6 24H22C23.1046 24 24 23.1046 24 22V5L19 0H6C4.89543 0 4 0.89543 4 2ZM4.81641 15.5527V17H3.78809V12.7344H5.49023C5.81641 12.7344 6.10449 12.7949 6.35449 12.916C6.60645 13.0352 6.80078 13.2061 6.9375 13.4287C7.07617 13.6494 7.14551 13.9004 7.14551 14.1816C7.14551 14.5977 6.99609 14.9307 6.69727 15.1807C6.40039 15.4287 5.99219 15.5527 5.47266 15.5527H4.81641ZM4.81641 14.7588H5.49023C5.68945 14.7588 5.84082 14.709 5.94434 14.6094C6.0498 14.5098 6.10254 14.3691 6.10254 14.1875C6.10254 13.9883 6.04883 13.8291 5.94141 13.71C5.83398 13.5908 5.6875 13.5303 5.50195 13.5283H4.81641V14.7588ZM7.69629 17V12.7344H9.07031C9.44727 12.7344 9.78613 12.8203 10.0869 12.9922C10.3877 13.1621 10.6221 13.4033 10.79 13.7158C10.96 14.0264 11.0459 14.375 11.0479 14.7617V14.958C11.0479 15.3486 10.9648 15.6992 10.7988 16.0098C10.6348 16.3184 10.4023 16.5605 10.1016 16.7363C9.80273 16.9102 9.46875 16.998 9.09961 17H7.69629ZM8.72461 13.5283V16.209H9.08203C9.37695 16.209 9.60352 16.1045 9.76172 15.8955C9.91992 15.6846 9.99902 15.3721 9.99902 14.958V14.7734C9.99902 14.3613 9.91992 14.0508 9.76172 13.8418C9.60352 13.6328 9.37305 13.5283 9.07031 13.5283H8.72461ZM12.6035 15.3008H14.2617V14.5098H12.6035V13.5283H14.4287V12.7344H11.5752V17H12.6035V15.3008Z" fill="#CBCFD1"/>
</svg>
