<svg width="24" height="24" viewBox="0 0 24 24" fill="none" xmlns="http://www.w3.org/2000/svg">
<path fill-rule="evenodd" clip-rule="evenodd" d="M2 3H22V5H2V3ZM2 11H22V13H2V11ZM22 19H2V21H22V19Z" fill="#CBCFD1"/>
</svg>
